22:53:57 concurrency/actors/types PASSED C 0:19.510 - R 0:00.121
22:53:57 concurrency/actors/static PASSED C 0:19.622 - R 0:00.072
22:53:57 exceptions/type-check PASSED C 0:00.683 - R n/a
22:53:57 concurrency/actors/inline PASSED C 0:19.852 - R 0:00.037
22:53:57 concurrency/actors/inherit PASSED C 0:19.936 - R 0:00.273
22:53:57 ...urrency/waitfor/lexical_priority PASSED C 0:12.699 - R 0:00.038
22:53:57 concurrency/waitfor/recurse PASSED C 0:12.153 - R 0:00.170
22:53:57 ctrl-flow/break-misc PASSED C 0:06.709 - R 0:00.021
22:53:57 copyfile PASSED C 0:07.530 - R 0:00.028
22:53:57 ...fied_locking/mcs_block_spin_lock PASSED C 0:14.796 - R 0:00.035
22:53:57 ctrl-flow/fallthrough PASSED C 0:06.779 - R 0:00.022
22:53:57 exceptions/try-leave-catch PASSED C 0:01.794 - R 0:00.040
22:53:57 counter PASSED C 0:07.254 - R 0:00.074
22:53:57 ctrl-flow/ifwhileCtl PASSED C 0:06.967 - R 0:00.047
22:53:57 expression PASSED C 0:01.552 - R 0:00.043
22:53:57 concurrency/preempt PASSED C 0:14.225 - R 0:05.955
22:53:57 ctrl-flow/goto PASSED C 0:07.316 - R 0:00.042
22:53:57 ctrl-flow/loop_else PASSED C 0:07.066 - R 0:00.022
22:53:57 ...nified_locking/simple_owner_lock PASSED C 0:14.938 - R 0:00.127
22:53:57 coroutine/devicedriver PASSED C 0:08.637 - R 0:00.024
22:53:57 global-monomorph PASSED C 0:01.619 - R 0:00.023
22:53:57 concurrency/unified_locking/mcs PASSED C 0:14.773 - R 0:01.182
22:53:57 coroutine/fibonacci PASSED C 0:08.561 - R 0:00.073
22:53:57 coroutine/raii PASSED C 0:08.349 - R 0:00.037
22:53:57 concurrency/waitfor/statment PASSED C 0:13.098 - R 0:00.039
22:53:57 coroutine/fmtLines PASSED C 0:08.653 - R 0:00.131
22:53:57 exceptions/message PASSED C 0:03.285 - R 0:00.021
22:53:57 ...rrency/pthread/pthread_demo_lock PASSED C 0:12.462 - R 0:07.721
22:53:57 identParamDeclarator PASSED C 0:01.621 - R 0:00.041
22:53:57 coroutine/runningTotal PASSED C 0:08.554 - R 0:00.048
22:53:57 init1-ERROR PASSED C 0:00.816 - R n/a
22:53:57 identFuncDeclarator PASSED C 0:01.773 - R 0:00.043
22:53:57 coroutine/pingpong PASSED C 0:09.534 - R 0:00.037
22:53:57 init1 PASSED C 0:01.510 - R 0:00.038
22:53:57 enum_tests/anonymous PASSED C 0:06.999 - R 0:00.044
22:53:57 ctrl-flow/loop_else-WRN1 PASSED C 0:08.256 - R 0:00.002
22:53:57 concurrency/waituntil/timeout PASSED C 0:08.035 - R 0:03.078
22:53:57 configs/parsebools PASSED C 0:10.453 - R 0:00.421
22:53:57 enum_tests/stringEnum PASSED C 0:06.882 - R 0:00.039
22:53:57 include/vector-sequence PASSED C 0:02.193 - R 0:00.073
22:53:57 enum_tests/enumInlineValue PASSED C 0:07.736 - R 0:00.076
22:53:57 enum_tests/typedIntEnum PASSED C 0:06.919 - R 0:00.023
22:53:57 enum_tests/voidEnum PASSED C 0:06.855 - R 0:00.019
22:53:57 enum_tests/input PASSED C 0:07.766 - R 0:00.042
22:53:57 limits PASSED C 0:01.688 - R 0:00.069
22:53:57 configs/usage PASSED C 0:11.383 - R 0:00.038
22:53:57 configs/parseconfig PASSED C 0:11.395 - R 0:00.120
22:53:57 concurrency/waitfor/when PASSED C 0:15.365 - R 0:00.071
22:53:57 include/vector-collections PASSED C 0:03.287 - R 0:00.022
22:53:57 ...ency/waituntil/channel_zero_size PASSED C 0:13.805 - R 0:00.830
22:53:57 linking/nostdlib PASSED C 0:01.546 - R 0:00.038
22:53:57 nested-types-ERR1 PASSED C 0:00.175 - R n/a
22:53:57 nested-types-ERR2 PASSED C 0:00.353 - R n/a
22:53:57 coroutine/prodcons PASSED C 0:11.632 - R 0:00.022
22:53:57 exceptions/data-except PASSED C 0:07.041 - R 0:00.026
22:53:57 exceptions/conditional PASSED C 0:07.585 - R 0:00.021
22:53:57 div PASSED C 0:09.576 - R 0:00.036
22:53:57 ctrl-flow/loopctrl PASSED C 0:10.154 - R 0:00.037
22:53:57 linkonce PASSED C 0:01.866 - R 0:00.019
22:53:57 opt-params PASSED C 0:00.117 - R n/a
22:53:57 exceptions/finally PASSED C 0:07.309 - R 0:00.039
22:53:57 enum_tests/position PASSED C 0:09.231 - R 0:00.022
22:53:57 exceptions/defaults PASSED C 0:07.639 - R 0:00.129
22:53:57 concurrency/waituntil/one_chan PASSED C 0:14.234 - R 0:00.524
22:53:57 nested-types PASSED C 0:01.566 - R 0:00.020
22:53:57 maybe PASSED C 0:02.020 - R 0:00.037
22:53:57 enum_tests/planet PASSED C 0:09.415 - R 0:00.035
22:53:57 exceptions/interact PASSED C 0:07.476 - R 0:00.026
22:53:57 exceptions/conditional-threads PASSED C 0:08.291 - R 0:00.020
22:53:57 exceptions/cancel/coroutine PASSED C 0:08.580 - R 0:00.021
22:53:57 exceptions/trash PASSED C 0:07.022 - R 0:00.073
22:53:57 exceptions/polymorphic PASSED C 0:07.444 - R 0:00.024
22:53:57 exceptions/resume PASSED C 0:07.416 - R 0:00.069
22:53:57 nowarn/array PASSED C 0:01.751 - R 0:00.045
22:53:57 polybits PASSED C 0:00.404 - R n/a
22:53:57 nowarn/no-autogen PASSED C 0:01.560 - R 0:00.040
22:53:57 exceptions/terminate PASSED C 0:07.524 - R 0:00.040
22:53:57 nowarn/exception PASSED C 0:01.915 - R 0:00.020
22:53:57 generator/fibonacci PASSED C 0:06.796 - R 0:00.028
22:53:57 exceptions/virtual-poly PASSED C 0:07.150 - R 0:00.043
22:53:57 generator/fmtLines PASSED C 0:06.970 - R 0:00.040
22:53:57 numericConstants PASSED C 0:01.597 - R 0:00.024
22:53:57 nowarn/printf-sizeof PASSED C 0:01.750 - R 0:00.070
22:53:57 exceptions/finally-threads PASSED C 0:08.524 - R 0:00.039
22:53:57 concurrency/channels/daisy_chain PASSED C 0:16.710 - R 0:10.131
22:53:57 operators PASSED C 0:01.614 - R 0:00.041
22:53:57 fstream_test PASSED C 0:07.263 - R 0:00.037
22:53:57 nowarn/zero-thunk PASSED C 0:01.701 - R 0:00.070
22:53:57 exceptions/defaults-threads PASSED C 0:08.992 - R 0:00.036
22:53:57 generator/suspend_then PASSED C 0:07.178 - R 0:00.041
22:53:57 poly-bare-assn PASSED C 0:01.522 - R 0:00.041
22:53:57 concurrency/waituntil/channels PASSED C 0:15.183 - R 0:02.083
22:53:57 concurrency/channels/churn PASSED C 0:16.975 - R 0:10.073
22:53:57 device/cpu PASSED C 0:11.379 - R 0:00.273
22:53:57 genericUnion PASSED C 0:07.187 - R 0:00.035
22:53:57 concurrency/channels/hot_potato PASSED C 0:17.036 - R 0:10.065
22:53:57 poly-d-cycle PASSED C 0:01.688 - R 0:00.027
22:53:57 raii/ctor-autogen-ERR1 PASSED C 0:00.923 - R n/a
22:53:57 hello PASSED C 0:06.887 - R 0:00.037
22:53:57 poly-many-arsz PASSED C 0:01.539 - R 0:00.038
22:53:57 nowarn/unused PASSED C 0:02.245 - R 0:00.043
22:53:57 poly-member PASSED C 0:01.565 - R 0:00.020
22:53:57 linking/exception-nothreads PASSED C 0:05.164 - R 0:00.022
22:53:57 poly-o-cycle PASSED C 0:01.612 - R 0:00.021
22:53:57 poly-selection PASSED C 0:01.576 - R 0:00.039
22:53:57 identity PASSED C 0:07.079 - R 0:00.020
22:53:57 quasiKeyword PASSED C 0:01.623 - R 0:00.019
22:53:57 raii/partial-ERR1 PASSED C 0:00.880 - R n/a
22:53:57 typedefRedef-ERR1 PASSED C 0:00.223 - R n/a
22:53:57 poly-self-cycle PASSED C 0:01.825 - R 0:00.019
22:53:57 concurrency/channels/ping_pong PASSED C 0:17.617 - R 0:10.080
22:53:57 concurrency/channels/contend PASSED C 0:17.596 - R 0:10.128
22:53:57 exceptions/resume-threads PASSED C 0:08.989 - R 0:00.022
22:53:57 concurrency/channels/pub_sub PASSED C 0:17.761 - R 0:10.060
22:53:57 forall PASSED C 0:08.345 - R 0:00.021
22:53:57 var-assert PASSED C 0:00.227 - R n/a
22:53:57 exceptions/terminate-threads PASSED C 0:09.049 - R 0:00.024
22:53:57 include/vector-fstream PASSED C 0:07.017 - R 0:00.020
22:53:57 concurrency/channels/big_elems PASSED C 0:17.595 - R 0:10.514
22:53:57 raii/ctor-autogen PASSED C 0:02.120 - R 0:00.021
22:53:57 raii/partial PASSED C 0:01.651 - R 0:00.039
22:53:57 raii/init_once PASSED C 0:01.925 - R 0:00.070
22:53:57 exceptions/virtual-cast PASSED C 0:09.177 - R 0:00.045
22:53:57 raii/typeof-member PASSED C 0:01.637 - R 0:00.071
22:53:57 io/eofType PASSED C 0:06.986 - R 0:00.073
22:53:57 switch PASSED C 0:01.592 - R 0:00.019
22:53:57 tuple/tupleCast PASSED C 0:01.658 - R 0:00.020
22:53:57 tuple/tupleMember PASSED C 0:01.693 - R 0:00.021
22:53:57 linking/exception-withthreads PASSED C 0:06.792 - R 0:00.040
22:53:57 concurrency/futures/future_except PASSED C 0:28.955 - R 0:00.075
22:53:57 typedefRedef PASSED C 0:01.608 - R 0:00.038
22:53:57 concurrency/waituntil/basic_else PASSED C 0:19.939 - R 0:00.038
22:53:57 tuple/tupleFunction PASSED C 0:01.939 - R 0:00.036
22:53:57 simpleGenericTriple PASSED C 0:02.247 - R 0:00.077
22:53:57 smart-pointers PASSED C 0:02.214 - R 0:00.081
22:53:57 variableDeclarator PASSED C 0:01.568 - R 0:00.021
22:53:57 withconflict PASSED C 0:00.897 - R n/a
22:53:57 typeof PASSED C 0:01.697 - R 0:00.070
22:53:57 result PASSED C 0:02.413 - R 0:00.021
22:53:57 exceptions/cancel/thread PASSED C 0:11.982 - R 0:00.038
22:53:57 exceptions/fibonacci_nonlocal PASSED C 0:11.565 - R 0:00.025
22:53:57 tuple/tuplePolymorphism PASSED C 0:02.156 - R 0:00.024
22:53:57 meta/fork+exec PASSED C 0:05.529 - R 0:00.275
22:53:57 warnings/self-assignment PASSED C 0:01.379 - R 0:00.003
22:53:57 voidPtr PASSED C 0:01.503 - R 0:00.074
22:53:57 exceptions/cor_resumer PASSED C 0:11.975 - R 0:00.025
22:53:57 linking/mangling/anon PASSED C 0:07.039 - R 0:00.041
22:53:57 concurrency/channels/zero_size PASSED C 0:19.777 - R 0:10.060
22:53:57 KRfunctions PASSED C 0:01.412 - R 0:00.005
22:53:57 errors/completeType PASSED C 0:00.845 - R n/a
22:53:57 ...collections/dimexpr-match-c-ERRS PASSED C 0:01.110 - R n/a
22:53:57 function-operator PASSED C 0:10.676 - R 0:00.025
22:53:57 include/stdincludes PASSED C 0:09.884 - R 0:00.077
22:53:57 attributes PASSED C 0:01.590 - R 0:00.003
22:53:57 declarationSpecifier PASSED C 0:01.464 - R 0:00.002
22:53:57 ...llections/dimexpr-match-cfa-ERRS PASSED C 0:01.708 - R n/a
22:53:57 list/dlist-insert-remove PASSED C 0:07.392 - R 0:00.041
22:53:57 functions PASSED C 0:01.374 - R 0:00.002
22:53:57 extension PASSED C 0:01.397 - R 0:00.001
22:53:57 raii/memberCtors-ERR1 PASSED C 0:04.283 - R n/a
22:53:57 gccExtensions PASSED C 0:01.280 - R 0:00.004
22:53:57 literals PASSED C 0:07.335 - R 0:00.021
22:53:57 meta/arch PASSED C 0:00.833 - R n/a
22:53:57 list/dlist2-insert-remove PASSED C 0:07.732 - R 0:00.022
22:53:57 raii/dtor-early-exit-ERR2 PASSED C 0:05.042 - R n/a
22:53:57 exceptions/pingpong_nonlocal PASSED C 0:12.792 - R 0:00.021
22:53:57 raii/dtor-early-exit-ERR1 PASSED C 0:05.292 - R n/a
22:53:57 linking/io-acquire PASSED C 0:09.184 - R 0:00.021
22:53:57 linking/nothreads PASSED C 0:09.141 - R 0:00.021
22:53:57 concurrency/waituntil/locks PASSED C 0:18.283 - R 0:02.827
22:53:57 arithmeticConversions PASSED C 0:03.194 - R 0:00.019
22:53:57 zero_one-ERR1 PASSED C 0:03.747 - R n/a
22:53:57 linking/weakso_nothd PASSED C 0:09.288 - R 0:00.019
22:53:57 alloc2 PASSED C 0:32.662 - R 0:00.019
22:53:57 tuple/tupleVariadic PASSED C 0:05.424 - R 0:00.036
22:53:57 io/manipulatorsInput-uchunk PASSED C 0:10.907 - R 0:00.067
22:53:57 io/io PASSED C 0:11.437 - R 0:00.036
22:53:57 raii/boxed-types PASSED C 0:07.016 - R 0:00.019
22:53:57 polymorphism PASSED C 0:07.258 - R 0:00.022
22:53:57 quotedKeyword PASSED C 0:07.200 - R 0:00.019
22:53:57 raii/globals PASSED C 0:06.900 - R 0:00.037
22:53:57 meta/dumpable PASSED C 0:09.703 - R 0:00.036
22:53:57 sizeof PASSED C 0:06.770 - R 0:00.020
22:53:57 shortCircuit PASSED C 0:07.149 - R 0:00.019
22:53:57 concurrency/unified_locking/locks PASSED C 0:16.144 - R 0:12.573
22:53:57 io/io-acquire-in PASSED C 0:12.589 - R 0:00.037
22:53:57 strstream PASSED C 0:07.320 - R 0:00.019
22:53:57 references PASSED C 0:07.506 - R 0:00.020
22:53:57 raii/memberCtors PASSED C 0:08.075 - R 0:00.021
22:53:57 io/io-acquire-out PASSED C 0:12.739 - R 0:00.035
22:53:57 tuplearray PASSED C 0:07.310 - R 0:00.021
22:53:57 io/io-acquire PASSED C 0:13.148 - R 0:00.035
22:53:57 malloc PASSED C 0:11.061 - R 0:00.019
22:53:57 tuple/tupleAssign PASSED C 0:07.671 - R 0:00.018
22:53:57 concurrency/preempt2 PASSED C 0:13.310 - R 0:20.474
22:53:57 io/io-acquire2 PASSED C 0:13.093 - R 0:00.036
22:53:57 heap PASSED C 0:10.418 - R 0:04.437
22:53:57 linking/withthreads PASSED C 0:11.975 - R 0:00.019
22:53:57 zero_one PASSED C 0:07.056 - R 0:00.018
22:53:57 raii/dtor-early-exit PASSED C 0:09.303 - R 0:00.020
22:53:57 userLiterals PASSED C 0:07.997 - R 0:00.018
22:53:57 io/manipulatorsOutput4 PASSED C 0:13.853 - R 0:00.036
22:53:57 vector PASSED C 0:08.486 - R 0:00.018
22:53:57 time PASSED C 0:09.191 - R 0:00.020
22:53:57 sum PASSED C 0:09.604 - R 0:00.036
22:53:57 io/away_fair PASSED C 0:15.348 - R 0:00.034
22:53:57 minmax PASSED C 0:13.315 - R 0:00.021
22:53:57 swap PASSED C 0:10.176 - R 0:00.021
22:53:57 io/many_read PASSED C 0:15.472 - R 0:00.036
22:53:57 vector_math/vec2_double PASSED C 0:09.887 - R 0:00.019
22:53:57 vector_math/vec2_uint PASSED C 0:09.986 - R 0:00.019
22:53:57 abs PASSED C 0:09.158 - R 0:00.019
22:53:57 searchsort PASSED C 0:11.054 - R 0:00.036
22:53:57 concurrency/waituntil/channel_close PASSED C 0:19.453 - R 0:10.050
22:53:57 ato PASSED C 0:09.934 - R 0:00.019
22:53:57 random PASSED C 0:09.069 - R 0:00.021
22:53:57 io/comp_fair PASSED C 0:18.022 - R 0:00.036
22:53:57 concurrency/waituntil/futures PASSED C 0:30.031 - R 0:00.019
22:53:57 io/comp_basic PASSED C 0:18.533 - R 0:00.035
22:53:57 vector_math/vec2_ldouble PASSED C 0:09.662 - R 0:00.018
22:53:57 exceptions/hotpotato_checked PASSED C 0:10.984 - R 0:00.019
22:53:57 gmp PASSED C 0:11.082 - R 0:00.035
22:53:57 io/manipulatorsInput PASSED C 0:11.067 - R 0:00.036
22:53:57 ...collections/array-md-sbscr-cases PASSED C 0:11.955 - R 0:00.018
22:53:57 exceptions/hotpotato PASSED C 0:11.497 - R 0:00.019
22:53:57 exceptions/cardgame PASSED C 0:12.313 - R 0:00.018
22:53:57 bitmanip3 PASSED C 0:13.191 - R 0:00.035
22:53:57 bitmanip1 PASSED C 0:13.417 - R 0:00.036
22:53:57 math PASSED C 0:12.827 - R 0:00.019
22:53:57 io/manipulatorsOutput2 PASSED C 0:13.330 - R 0:00.019
22:53:57 include/includes PASSED C 0:23.341 - R 0:00.018
22:53:57 mathX PASSED C 0:14.171 - R 0:00.035
22:53:57 bitmanip2 PASSED C 0:14.874 - R 0:00.035
22:53:57 concurrency/waituntil/all_types PASSED C 0:35.822 - R 0:00.217
22:53:57 PRNG PASSED C 0:16.612 - R 0:00.370
22:53:57 vector_math/vec3_int PASSED C 0:17.695 - R 0:00.018
22:53:57 vector_math/vec4_int PASSED C 0:18.554 - R 0:00.024
22:53:57 vector_math/vec2_float PASSED C 0:18.891 - R 0:00.020
22:53:57 vector_math/vec4_float PASSED C 0:19.401 - R 0:00.036
22:53:57 vector_math/vec3_float PASSED C 0:20.089 - R 0:00.018
22:53:57 vector_math/vec2_int PASSED C 0:20.446 - R 0:00.018
22:53:57 io/manipulatorsOutput1 PASSED C 0:21.449 - R 0:00.022
22:53:57 io/io-acquire-no-io PASSED C 0:12.421 - R 0:17.646
22:53:57 rational PASSED C 0:29.571 - R 0:00.018
22:53:57 concurrency/waituntil/repeat_close PASSED C 0:15.421 - R 0:30.029
22:53:57 ...ency/unified_locking/futex_mutex PASSED C 0:16.706 - R 0:35.991
22:53:57 io/manipulatorsOutput3 PASSED C 0:30.380 - R 0:00.022
22:53:57 .../unified_locking/spin_queue_lock PASSED C 0:14.938 - R 0:49.139
22:53:57 ...urrency/unified_locking/mcs_spin PASSED C 0:14.393 - R 0:57.768
22:53:57374 passes, 1 failures, 0 timeouts, 0 cancelled, 0 other
22:53:57Tests took 1:18.855
22:53:57make: *** [Makefile:986: all-local] Error 1
22:53:57[Pipeline] }
22:53:57[Pipeline] // dir
22:53:57[Pipeline] }
22:53:57[Pipeline] // stage
22:53:57[Pipeline] echo
22:53:57Archiving core dumps
22:53:57[Pipeline] dir
22:53:57Running in /var/lib/jenkins/workspace/Cforall_master@tmp
22:53:57[Pipeline] {
22:53:57[Pipeline] fileExists
22:53:57[Pipeline] sh
22:53:57+ /var/lib/jenkins/workspace/Cforall_master/tools/jenkins/archive-gen.sh
22:53:57[Pipeline] archiveArtifacts
22:53:57Archiving artifacts
22:53:57Recording fingerprints
22:53:57[Pipeline] }
22:53:57[Pipeline] // dir
22:53:57[Pipeline] }
22:53:57[Pipeline] // wrap
22:53:57[Pipeline] }
22:53:57[Pipeline] // node
22:53:57[Pipeline] echo
22:53:57hudson.AbortException: script returned exit code 2
22:53:57[Pipeline] node
22:53:57Running on Brokk 4 in /var/lib/jenkins/workspace/Cforall_master
22:53:57[Pipeline] {
22:53:57[Pipeline] echo
22:53:57Notifying users of result
22:53:57[Pipeline] echo
22:53:57Reusing previously constructed message
22:53:57[Pipeline] echo
22:53:57Would send email to: cforall@lists.uwaterloo.ca
22:53:57[Pipeline] echo
22:53:57With title: [cforall git][BUILD# 3929 - FAILURE] - branch master
22:53:57[Pipeline] echo
22:53:57Content:
22:53:57<p>This is an automated email from the Jenkins build machine. It was
22:53:57generated because of a git hooks/post-receive script following
22:53:57a ref change which was pushed to the C∀ repository.</p>
22:53:5722:53:57<p>- Status --------------------------------------------------------------</p>
22:53:5722:53:57<p>BUILD# 3929 - FAILURE</p>
22:53:57<p>Check console output at https://cforall.uwaterloo.ca/jenkins/job/Cforall/job/master/3929/ to view the results.</p>
22:53:5722:53:57<p>- Changes -------------------------------------------------------------</p>
22:53:5722:53:57<pre>
22:53:57The branch master has been updated.
22:53:57 from 880968bf0c0545a6330ce6fb2a90567fd5f026cb (commit)
22:53:57</pre>
22:53:5722:53:57<p>- Log -----------------------------------------------------------------</p>
22:53:5722:53:57<pre>
22:53:5722:53:57</pre>
22:53:5722:53:57<p>-----------------------------------------------------------------------</p>
22:53:57<pre>
22:53:57Summary of changes:
22:53:5722:53:57</pre>
22:53:5722:53:57[Pipeline] }
22:53:57[Pipeline] // node
22:53:57[Pipeline] echo
22:53:57Build Completed
22:53:57[Pipeline] End of Pipeline
22:53:57ERROR: script returned exit code 2
22:53:57Finished: FAILURE
[Pipeline] error
[Pipeline] }
22:53:57Failed in branch gcc_11_arm64_new
22:59:45Build Cforall » master #3930 completed: SUCCESS
[Pipeline] echo
22:59:45SUCCESS
[Pipeline] }
23:00:17Build Cforall » master #3927 completed: SUCCESS
[Pipeline] echo
23:00:17SUCCESS
[Pipeline] }
23:00:49Build Cforall » master #3925 completed: SUCCESS
[Pipeline] echo
23:00:49SUCCESS
[Pipeline] }
23:02:16Build Cforall » master #3932 completed: SUCCESS
[Pipeline] echo
23:02:16SUCCESS
[Pipeline] }
23:02:18Build Cforall » master #3928 completed: SUCCESS
[Pipeline] echo
23:02:18SUCCESS
[Pipeline] }
23:03:53Build Cforall » master #3934 completed: SUCCESS
[Pipeline] echo
23:03:53SUCCESS
[Pipeline] }
23:04:26Build Cforall » master #3935 completed: SUCCESS
[Pipeline] echo
23:04:26SUCCESS
[Pipeline] }
23:11:06Build Cforall » master #3933 completed: SUCCESS
[Pipeline] echo
23:11:06SUCCESS
[Pipeline] }
23:14:33Build Cforall » master #3926 completed: SUCCESS
[Pipeline] echo
23:14:33SUCCESS
[Pipeline] }
23:28:36Build Cforall » master #3931 completed: SUCCESS
[Pipeline] echo
23:28:36SUCCESS
[Pipeline] }
[Pipeline] // parallel
[Pipeline] }
[Pipeline] // stage
[Pipeline] }
[Pipeline] // wrap
[Pipeline] echo
error caught
[Pipeline] node
Running on Brokk 4 in /var/lib/jenkins/workspace/Cforall_Full_Build
[Pipeline] {
[Pipeline] echo
notifying users
[Pipeline] emailext
Sending email to: cforall@lists.uwaterloo.ca
[Pipeline] }
[Pipeline] // node
[Pipeline] }
[Pipeline] // node
[Pipeline] End of Pipeline
ERROR: FAILURE
Finished: FAILURE