Started by timer
Running as Jenkins Build User
Obtained Jenkins/FullBuild from git cforall@plg.uwaterloo.ca:software/cfa/cfa-cc
[Pipeline] Start of Pipeline
[Pipeline] node
Running on Brokk 3 in /var/lib/jenkins/workspace/Cforall_Full_Build
[Pipeline] {
[Pipeline] checkout
The recommended git tool is: NONE
using credential git_key_aug2025
Fetching changes from the remote Git repository
Checking out Revision 880968bf0c0545a6330ce6fb2a90567fd5f026cb (refs/remotes/origin/master)
Commit message: "remove uw-ethesis.pdf from repository"
> git rev-parse --resolve-git-dir /var/lib/jenkins/workspace/Cforall_Full_Build/.git # timeout=10
> git config remote.origin.url cforall@plg.uwaterloo.ca:software/cfa/cfa-cc # timeout=10
Fetching upstream changes from cforall@plg.uwaterloo.ca:software/cfa/cfa-cc
> git --version # timeout=10
> git --version # 'git version 2.43.0'
using GIT_SSH to set credentials Git key use to connect to the cforall git repo (August 2025)
Verifying host key using known hosts file
> git fetch --tags --force --progress -- cforall@plg.uwaterloo.ca:software/cfa/cfa-cc +refs/heads/*:refs/remotes/origin/* # timeout=10
> git rev-parse refs/remotes/origin/master^{commit} # timeout=10
> git config core.sparsecheckout # timeout=10
> git checkout -f 880968bf0c0545a6330ce6fb2a90567fd5f026cb # timeout=10
> git rev-list --no-walk e2563b2a147d3a25fbf6bfab7e5e5efc06c56824 # timeout=10
[Pipeline] wrap
[Pipeline] {
[Pipeline] stage
[Pipeline] { (Build)
[Pipeline] parallel
[Pipeline] { (Branch: gcc_10_x86_new)
[Pipeline] { (Branch: gcc_11_x86_new)
[Pipeline] { (Branch: gcc_12_x86_new)
[Pipeline] { (Branch: gcc_9_x64_new)
[Pipeline] { (Branch: gcc_10_x64_new)
[Pipeline] { (Branch: gcc_11_x64_new)
[Pipeline] { (Branch: gcc_12_x64_new)
[Pipeline] { (Branch: gcc_10_arm64_new)
[Pipeline] { (Branch: gcc_11_arm64_new)
[Pipeline] { (Branch: gcc_12_arm64_new)
[Pipeline] { (Branch: clang_x64_new)
[Pipeline] sleep
22:47:03No need to sleep any longer
[Pipeline] sleep
22:47:03No need to sleep any longer
[Pipeline] sleep
22:47:03Sleeping for 2 min 0 sec
[Pipeline] sleep
22:47:03Sleeping for 4 min 0 sec
[Pipeline] sleep
22:47:03Sleeping for 2 min 0 sec
[Pipeline] sleep
22:47:03No need to sleep any longer
[Pipeline] sleep
22:47:03Sleeping for 4 min 0 sec
[Pipeline] sleep
22:47:03No need to sleep any longer
[Pipeline] sleep
22:47:03No need to sleep any longer
[Pipeline] sleep
22:47:03Sleeping for 3 min 0 sec
[Pipeline] sleep
22:47:03No need to sleep any longer
[Pipeline] build
22:47:03Scheduling project: Cforall » master[Pipeline] build
22:47:03Scheduling project: Cforall » master[Pipeline] build
22:47:03Scheduling project: Cforall » master[Pipeline] build
22:47:03Scheduling project: Cforall » master[Pipeline] build
22:47:03Scheduling project: Cforall » master[Pipeline] build
22:47:03Scheduling project: Cforall » master22:47:09Starting building: Cforall » master #392922:47:09Starting building: Cforall » master #392622:47:09Starting building: Cforall » master #393022:47:0922:47:09Starting building: Cforall » master #3928Starting building: Cforall » master #392522:47:09Starting building: Cforall » master #3927[Pipeline] build
22:49:03Scheduling project: Cforall » master[Pipeline] build
22:49:03Scheduling project: Cforall » master22:49:09Starting building: Cforall » master #393222:49:09Starting building: Cforall » master #3931[Pipeline] build
22:50:03Scheduling project: Cforall » master22:50:09Starting building: Cforall » master #3933[Pipeline] build
22:51:03Scheduling project: Cforall » master[Pipeline] build
22:51:03Scheduling project: Cforall » master22:51:09Starting building: Cforall » master #393522:51:09Starting building: Cforall » master #393422:53:56Build Cforall » master #3929 completed: FAILURE
[Pipeline] echo
22:53:56FAILURE
[Pipeline] sh
22:53:57+ wget -q -O - https://cforall.uwaterloo.ca/jenkins/job/Cforall/job/master/3929/consoleText22:53:57Started by upstream project "Cforall_Full_Build" build number 436
22:53:57originally caused by:
22:53:57 Started by timer
22:53:57Running as Jenkins Build User
22:53:57 > git rev-parse --resolve-git-dir /var/lib/jenkins/caches/git-914b6fdde163b7e17ee75d99ca23f18a/.git # timeout=10
22:53:57Setting origin to cforall@plg.uwaterloo.ca:software/cfa/cfa-cc
22:53:57 > git config remote.origin.url cforall@plg.uwaterloo.ca:software/cfa/cfa-cc # timeout=10
22:53:57Fetching origin...
22:53:57Fetching upstream changes from origin
22:53:57 > git --version # timeout=10
22:53:57 > git --version # 'git version 2.43.0'
22:53:57 > git config --get remote.origin.url # timeout=10
22:53:57using GIT_SSH to set credentials Git key use to connect to the cforall git repo (August 2025)
22:53:57Verifying host key using known hosts file
22:53:57 > git fetch --no-tags --force --progress -- origin +refs/heads/*:refs/remotes/origin/* # timeout=10
22:53:57Seen branch in repository origin/ADT
22:53:57Seen branch in repository origin/aaron-thesis
22:53:57Seen branch in repository origin/arm-eh
22:53:57Seen branch in repository origin/ast-experimental
22:53:57Seen branch in repository origin/cleanup-dtors
22:53:57Seen branch in repository origin/ctor
22:53:57Seen branch in repository origin/deferred_resn
22:53:57Seen branch in repository origin/demangler
22:53:57Seen branch in repository origin/enum
22:53:57Seen branch in repository origin/forall-pointer-decay
22:53:57Seen branch in repository origin/gc_noraii
22:53:57Seen branch in repository origin/jacob/cs343-translation
22:53:57Seen branch in repository origin/jenkins-sandbox
22:53:57Seen branch in repository origin/master
22:53:57Seen branch in repository origin/memory
22:53:57Seen branch in repository origin/new-ast
22:53:57Seen branch in repository origin/new-ast-unique-expr
22:53:57Seen branch in repository origin/new-env
22:53:57Seen branch in repository origin/no_list
22:53:57Seen branch in repository origin/persistent-indexer
22:53:57Seen branch in repository origin/pthread-emulation
22:53:57Seen branch in repository origin/qualifiedEnum
22:53:57Seen branch in repository origin/resolv-new
22:53:57Seen branch in repository origin/string
22:53:57Seen branch in repository origin/stuck-waitfor-destruct
22:53:57Seen branch in repository origin/with_gc
22:53:57Seen 26 remote branches
22:53:57Obtained Jenkinsfile from 880968bf0c0545a6330ce6fb2a90567fd5f026cb
22:53:57[Pipeline] Start of Pipeline
22:53:57[Pipeline] node
22:53:57Running on Algol in /var/lib/jenkins/workspace/Cforall_master
22:53:57[Pipeline] {
22:53:57[Pipeline] wrap
22:53:57[Pipeline] {
22:53:57[Pipeline] properties
22:53:57WARNING: Unknown parameter(s) found for class type 'hudson.model.ChoiceParameterDefinition': defaultValue
22:53:57WARNING: Unknown parameter(s) found for class type 'hudson.model.ChoiceParameterDefinition': defaultValue
22:53:57[Pipeline] checkout
22:53:57The recommended git tool is: NONE
22:53:57using credential git_key_aug2025
22:53:57Fetching changes from the remote Git repository
22:53:57Cleaning workspace
22:53:57Fetching without tags
22:53:57Checking out Revision 880968bf0c0545a6330ce6fb2a90567fd5f026cb (master)
22:53:57Commit message: "remove uw-ethesis.pdf from repository"
22:53:57[Pipeline] load
22:53:57[Pipeline] { (Jenkins/tools.groovy)
22:53:57[Pipeline] }
22:53:57[Pipeline] // load
22:53:57[Pipeline] echo
22:53:57Compiler : gcc-11 (g++-11/gcc-11)
22:53:57Architecture : arm64
22:53:57Arc Flags : --host=aarch64
22:53:57Run All Tests : true
22:53:57Run Benchmark : true
22:53:57Build Documentation : false
22:53:57Publish : true
22:53:57Silent : true
22:53:5722:53:57[Pipeline] }
22:53:57[Pipeline] // wrap
22:53:57[Pipeline] }
22:53:57[Pipeline] // node
22:53:57[Pipeline] node
22:53:57Running on Algol in /var/lib/jenkins/workspace/Cforall_master
22:53:57[Pipeline] {
22:53:57[Pipeline] wrap
22:53:57[Pipeline] {
22:53:57[Pipeline] pwd
22:53:57[Pipeline] pwd
22:53:57 > git rev-parse --resolve-git-dir /var/lib/jenkins/workspace/Cforall_master/.git # timeout=10
22:53:57 > git config remote.origin.url cforall@plg.uwaterloo.ca:software/cfa/cfa-cc # timeout=10
22:53:57 > git rev-parse --verify HEAD # timeout=10
22:53:57Resetting working tree
22:53:57 > git reset --hard # timeout=10
22:53:57 > git clean -fdx # timeout=10
22:53:57Fetching upstream changes from cforall@plg.uwaterloo.ca:software/cfa/cfa-cc
22:53:57 > git --version # timeout=10
22:53:57 > git --version # 'git version 2.43.0'
22:53:57using GIT_SSH to set credentials Git key use to connect to the cforall git repo (August 2025)
22:53:57Verifying host key using known hosts file
22:53:57 > git fetch --no-tags --force --progress -- cforall@plg.uwaterloo.ca:software/cfa/cfa-cc +refs/heads/*:refs/remotes/origin/* # timeout=10
22:53:57 > git config core.sparsecheckout # timeout=10
22:53:57 > git checkout -f 880968bf0c0545a6330ce6fb2a90567fd5f026cb # timeout=10
22:53:57 > git rev-list --no-walk 880968bf0c0545a6330ce6fb2a90567fd5f026cb # timeout=10
22:53:57[Pipeline] echo
22:53:57 -------- Cleanup --------
22:53:57[Pipeline] stage
22:53:57[Pipeline] { (Cleanup)
22:53:57[Pipeline] dir
22:53:57Running in /var/lib/jenkins/workspace/Cforall_master@tmp
22:53:57[Pipeline] {
22:53:57[Pipeline] deleteDir
22:53:57[Pipeline] }
22:53:57[Pipeline] // dir
22:53:57[Pipeline] }
22:53:57[Pipeline] // stage
22:53:57[Pipeline] echo
22:53:57 -------- Checkout --------
22:53:57[Pipeline] stage
22:53:57[Pipeline] { (Checkout)
22:53:57[Pipeline] checkout
22:53:57The recommended git tool is: NONE
22:53:57using credential git_key_aug2025
22:53:57Fetching changes from the remote Git repository
22:53:57Cleaning workspace
22:53:57Fetching without tags
22:53:57 > git rev-parse --resolve-git-dir /var/lib/jenkins/workspace/Cforall_master/.git # timeout=10
22:53:57 > git config remote.origin.url cforall@plg.uwaterloo.ca:software/cfa/cfa-cc # timeout=10
22:53:57 > git rev-parse --verify HEAD # timeout=10
22:53:57Resetting working tree
22:53:57 > git reset --hard # timeout=10
22:53:57 > git clean -fdx # timeout=10
22:53:57Fetching upstream changes from cforall@plg.uwaterloo.ca:software/cfa/cfa-cc
22:53:57 > git --version # timeout=10
22:53:57 > git --version # 'git version 2.43.0'
22:53:57using GIT_SSH to set credentials Git key use to connect to the cforall git repo (August 2025)
22:53:57Verifying host key using known hosts file
22:53:57 > git fetch --no-tags --force --progress -- cforall@plg.uwaterloo.ca:software/cfa/cfa-cc +refs/heads/*:refs/remotes/origin/* # timeout=10
22:53:57Checking out Revision 880968bf0c0545a6330ce6fb2a90567fd5f026cb (master)
22:53:57Commit message: "remove uw-ethesis.pdf from repository"
22:53:57[Pipeline] echo
22:53:57Constructing new git message
22:53:57[Pipeline] sh
22:53:57 > git config core.sparsecheckout # timeout=10
22:53:57 > git checkout -f 880968bf0c0545a6330ce6fb2a90567fd5f026cb # timeout=10
22:53:57+ git rev-list 880968bf0c0545a6330ce6fb2a90567fd5f026cb..880968bf0c0545a6330ce6fb2a90567fd5f026cb
22:53:57[Pipeline] sh
22:53:57+ git cat-file -t 880968bf0c0545a6330ce6fb2a90567fd5f026cb
22:53:57[Pipeline] sh
22:53:57+ git rev-list --format=short 880968bf0c0545a6330ce6fb2a90567fd5f026cb...880968bf0c0545a6330ce6fb2a90567fd5f026cb
22:53:57[Pipeline] sh
22:53:57+ git diff --stat --color 880968bf0c0545a6330ce6fb2a90567fd5f026cb 880968bf0c0545a6330ce6fb2a90567fd5f026cb
22:53:57[Pipeline] echo
22:53:5722:53:57<p>- Changes -------------------------------------------------------------</p>
22:53:5722:53:57<pre>
22:53:57The branch master has been updated.
22:53:57 from 880968bf0c0545a6330ce6fb2a90567fd5f026cb (commit)
22:53:57</pre>
22:53:5722:53:57<p>- Log -----------------------------------------------------------------</p>
22:53:5722:53:57<pre>
22:53:5722:53:57</pre>
22:53:5722:53:57<p>-----------------------------------------------------------------------</p>
22:53:57<pre>
22:53:57Summary of changes:
22:53:5722:53:57</pre>
22:53:5722:53:57[Pipeline] }
22:53:57[Pipeline] // stage
22:53:57[Pipeline] echo
22:53:57 -------- Build : configure --------
22:53:57[Pipeline] stage
22:53:57[Pipeline] { (Build : configure)
22:53:57[Pipeline] dir
22:53:57Running in /var/lib/jenkins/workspace/Cforall_master
22:53:57[Pipeline] {
22:53:57[Pipeline] sh
22:53:57+ ./autogen.sh
22:53:57Running aclocal in root
22:53:57Running libtoolize in root
22:53:57libtoolize: putting auxiliary files in AC_CONFIG_AUX_DIR, 'automake'.
22:53:57libtoolize: linking file 'automake/ltmain.sh'
22:53:57libtoolize: putting macros in AC_CONFIG_MACRO_DIRS, 'automake'.
22:53:57libtoolize: linking file 'automake/libtool.m4'
22:53:57libtoolize: linking file 'automake/ltoptions.m4'
22:53:57libtoolize: linking file 'automake/ltsugar.m4'
22:53:57libtoolize: linking file 'automake/ltversion.m4'
22:53:57libtoolize: linking file 'automake/lt~obsolete.m4'
22:53:57Running autoconf in root
22:53:57Running automake in root
22:53:57configure.ac:223: installing 'automake/compile'
22:53:57configure.ac:138: installing 'automake/config.guess'
22:53:57configure.ac:138: installing 'automake/config.sub'
22:53:57configure.ac:17: installing 'automake/install-sh'
22:53:57benchmark/Makefile.am: installing 'automake/depcomp'
22:53:57parallel-tests: installing 'automake/test-driver'
22:53:57configure.ac: installing 'automake/ylwrap'
22:53:57Running aclocal in libcfa
22:53:57Running libtoolize in libcfa
22:53:57libtoolize: putting auxiliary files in AC_CONFIG_AUX_DIR, 'automake'.
22:53:57libtoolize: linking file 'automake/ltmain.sh'
22:53:57libtoolize: putting macros in AC_CONFIG_MACRO_DIRS, 'automake'.
22:53:57libtoolize: linking file 'automake/libtool.m4'
22:53:57libtoolize: linking file 'automake/ltoptions.m4'
22:53:57libtoolize: linking file 'automake/ltsugar.m4'
22:53:57libtoolize: linking file 'automake/ltversion.m4'
22:53:57libtoolize: linking file 'automake/lt~obsolete.m4'
22:53:57Running autoconf in libcfa
22:53:57Running automake in libcfa
22:53:57configure.ac:119: installing 'automake/compile'
22:53:57configure.ac:119: installing 'automake/config.guess'
22:53:57configure.ac:119: installing 'automake/config.sub'
22:53:57configure.ac:12: installing 'automake/install-sh'
22:53:57src/Makefile.am: installing 'automake/depcomp'
22:53:57[Pipeline] }
22:53:57[Pipeline] // dir
22:53:57[Pipeline] dir
22:53:57Running in /var/lib/jenkins/workspace/Cforall_master@tmp
22:53:57[Pipeline] {
22:53:57[Pipeline] sh
22:53:57+ /var/lib/jenkins/workspace/Cforall_master/configure CXX=g++-11 CC=gcc-11 --host=aarch64 AR=gcc-ar RANLIB=gcc-ranlib --with-target-hosts=host:debug,host:nodebug --quiet --prefix=/var/lib/jenkins/workspace/Cforall_master@tmp
22:53:57[Pipeline] sh
22:53:57+ nproc
22:53:57+ make -j 96 --no-print-directory configure-libcfa
22:53:57libcfa/arm64-debug/config.data
22:53:57Configuring libcfa (/var/lib/jenkins/workspace/Cforall_master/libcfa/configure) with ''CXX=g++-11' 'CC=gcc-11' 'AR=gcc-ar' 'RANLIB=gcc-ranlib' '--prefix=/var/lib/jenkins/workspace/Cforall_master@tmp' DRIVER_DIR=/var/lib/jenkins/workspace/Cforall_master@tmp/driver/ ARCHITECTURE=arm64 CONFIGURATION=debug CFA_VERSION=1:0:0' from /var/lib/jenkins/workspace/Cforall_master@tmp / libcfa/arm64-debug/
22:53:57libcfa/arm64-nodebug/config.data
22:53:57Configuring libcfa (/var/lib/jenkins/workspace/Cforall_master/libcfa/configure) with ''CXX=g++-11' 'CC=gcc-11' 'AR=gcc-ar' 'RANLIB=gcc-ranlib' '--prefix=/var/lib/jenkins/workspace/Cforall_master@tmp' DRIVER_DIR=/var/lib/jenkins/workspace/Cforall_master@tmp/driver/ ARCHITECTURE=arm64 CONFIGURATION=nodebug CFA_VERSION=1:0:0' from /var/lib/jenkins/workspace/Cforall_master@tmp / libcfa/arm64-nodebug/
22:53:57checking whether make supports nested variables... checking whether make supports nested variables... yes
22:53:57checking for a BSD-compatible install... yes
22:53:57checking for a BSD-compatible install... /usr/bin/install -c
22:53:57checking whether build environment is sane... /usr/bin/install -c
22:53:57checking whether build environment is sane... yes
22:53:57yes
22:53:57checking for a race-free mkdir -p... checking for a race-free mkdir -p... /usr/bin/mkdir -p
22:53:57checking for gawk... /usr/bin/mkdir -p
22:53:57gawk
22:53:57checking whether make sets $(MAKE)... checking for gawk... gawk
22:53:57checking whether make sets $(MAKE)... yes
22:53:57yes
22:53:57checking for distributated build... no
22:53:57checking for distributated build... no
22:53:57checking build system type... checking build system type... aarch64-unknown-linux-gnu
22:53:57checking host system type... aarch64-unknown-linux-gnu
22:53:57checking how to print strings... aarch64-unknown-linux-gnu
22:53:57checking host system type... aarch64-unknown-linux-gnu
22:53:57checking how to print strings... printf
22:53:57checking whether make supports the include directive... printf
22:53:57checking whether make supports the include directive... yes (GNU style)
22:53:57checking for gcc... gcc-11
22:53:57yes (GNU style)
22:53:57checking for gcc... gcc-11
22:53:57checking whether the C compiler works... checking whether the C compiler works... yes
22:53:57checking for C compiler default output file name... a.out
22:53:57checking for suffix of executables... yes
22:53:57checking for C compiler default output file name... a.out
22:53:57checking for suffix of executables...
22:53:57checking whether we are cross compiling...
22:53:57checking whether we are cross compiling... no
22:53:57checking for suffix of object files... no
22:53:57checking for suffix of object files... o
22:53:57checking whether the compiler supports GNU C... o
22:53:57checking whether the compiler supports GNU C... yes
22:53:57checking whether gcc-11 accepts -g... yes
22:53:57checking whether gcc-11 accepts -g... yes
22:53:57checking for gcc-11 option to enable C11 features... yes
22:53:57checking for gcc-11 option to enable C11 features... none needed
22:53:57checking whether gcc-11 understands -c and -o together... none needed
22:53:57checking whether gcc-11 understands -c and -o together... yes
22:53:57checking dependency style of gcc-11... yes
22:53:57checking dependency style of gcc-11... gcc3
22:53:57checking for a sed that does not truncate output... /usr/bin/sed
22:53:57checking for grep that handles long lines and -e... /usr/bin/grep
22:53:57checking for egrep... /usr/bin/grep -E
22:53:57checking for fgrep... gcc3
22:53:57checking for a sed that does not truncate output... /usr/bin/grep -F
22:53:57checking for ld used by gcc-11... /usr/bin/sed
22:53:57checking for grep that handles long lines and -e... /usr/bin/ld
22:53:57checking if the linker (/usr/bin/ld) is GNU ld... /usr/bin/grep
22:53:57checking for egrep... yes
22:53:57checking for BSD- or MS-compatible name lister (nm)... /usr/bin/grep -E
22:53:57checking for fgrep... /usr/bin/grep -F
22:53:57checking for ld used by gcc-11... /usr/bin/nm -B
22:53:57checking the name lister (/usr/bin/nm -B) interface... /usr/bin/ld
22:53:57checking if the linker (/usr/bin/ld) is GNU ld... yes
22:53:57checking for BSD- or MS-compatible name lister (nm)... /usr/bin/nm -B
22:53:57checking the name lister (/usr/bin/nm -B) interface... BSD nm
22:53:57checking whether ln -s works... yes
22:53:57checking the maximum length of command line arguments... 1572864
22:53:57checking how to convert aarch64-unknown-linux-gnu file names to aarch64-unknown-linux-gnu format... func_convert_file_noop
22:53:57checking how to convert aarch64-unknown-linux-gnu file names to toolchain format... func_convert_file_noop
22:53:57checking for /usr/bin/ld option to reload object files... -r
22:53:57checking for file... file
22:53:57checking for objdump... objdump
22:53:57checking how to recognize dependent libraries... pass_all
22:53:57checking for dlltool... no
22:53:57checking how to associate runtime and link libraries... printf %s\n
22:53:57checking for archiver @FILE support... BSD nm
22:53:57checking whether ln -s works... yes
22:53:57checking the maximum length of command line arguments... 1572864
22:53:57checking how to convert aarch64-unknown-linux-gnu file names to aarch64-unknown-linux-gnu format... func_convert_file_noop
22:53:57checking how to convert aarch64-unknown-linux-gnu file names to toolchain format... func_convert_file_noop
22:53:57checking for /usr/bin/ld option to reload object files... -r
22:53:57checking for file... file
22:53:57checking for objdump... objdump
22:53:57checking how to recognize dependent libraries... pass_all
22:53:57checking for dlltool... no
22:53:57checking how to associate runtime and link libraries... printf %s\n
22:53:57checking for archiver @FILE support... @
22:53:57checking for strip... strip
22:53:57checking for ranlib... gcc-ranlib
22:53:57checking command to parse /usr/bin/nm -B output from gcc-11 object... @
22:53:57checking for strip... strip
22:53:57checking for ranlib... gcc-ranlib
22:53:57checking command to parse /usr/bin/nm -B output from gcc-11 object... ok
22:53:57checking for sysroot... no
22:53:57checking for a working dd... /usr/bin/dd
22:53:57checking how to truncate binary pipes... /usr/bin/dd bs=4096 count=1
22:53:57checking for mt... mt
22:53:57checking if mt is a manifest tool... no
22:53:57checking for stdio.h... yes
22:53:57checking for stdlib.h... ok
22:53:57checking for sysroot... no
22:53:57checking for a working dd... /usr/bin/dd
22:53:57checking how to truncate binary pipes... /usr/bin/dd bs=4096 count=1
22:53:57checking for mt... mt
22:53:57checking if mt is a manifest tool... yes
22:53:57checking for string.h... no
22:53:57checking for stdio.h... yes
22:53:57checking for inttypes.h... yes
22:53:57checking for stdlib.h... yes
22:53:57checking for stdint.h... yes
22:53:57checking for string.h... yes
22:53:57checking for strings.h... yes
22:53:57checking for inttypes.h... yes
22:53:57checking for sys/stat.h... yes
22:53:57checking for stdint.h... yes
22:53:57checking for sys/types.h... yes
22:53:57checking for strings.h... yes
22:53:57checking for unistd.h... yes
22:53:57checking for sys/stat.h... yes
22:53:57checking for dlfcn.h... yes
22:53:57checking for sys/types.h... yes
22:53:57checking for objdir... .libs
22:53:57yes
22:53:57checking for unistd.h... yes
22:53:57checking for dlfcn.h... checking if gcc-11 supports -fno-rtti -fno-exceptions... yes
22:53:57checking for objdir... .libs
22:53:57no
22:53:57checking for gcc-11 option to produce PIC... -fPIC -DPIC
22:53:57checking if gcc-11 PIC flag -fPIC -DPIC works... yes
22:53:57checking if gcc-11 static flag -static works... checking if gcc-11 supports -fno-rtti -fno-exceptions... no
22:53:57checking for gcc-11 option to produce PIC... -fPIC -DPIC
22:53:57checking if gcc-11 PIC flag -fPIC -DPIC works... yes
22:53:57checking if gcc-11 supports -c -o file.o... yes
22:53:57checking if gcc-11 static flag -static works... yes
22:53:57checking if gcc-11 supports -c -o file.o... (cached) yes
22:53:57checking whether the gcc-11 linker (/usr/bin/ld) supports shared libraries... yes
22:53:57checking whether -lc should be explicitly linked in... no
22:53:57checking dynamic linker characteristics... yes
22:53:57checking if gcc-11 supports -c -o file.o... yes
22:53:57checking if gcc-11 supports -c -o file.o... (cached) yes
22:53:57checking whether the gcc-11 linker (/usr/bin/ld) supports shared libraries... yes
22:53:57checking whether -lc should be explicitly linked in... GNU/Linux ld.so
22:53:57checking how to hardcode library paths into programs... immediate
22:53:57checking whether stripping libraries is possible... yes
22:53:57checking if libtool supports shared libraries... yes
22:53:57checking whether to build shared libraries... yes
22:53:57checking whether to build static libraries... no
22:53:57no
22:53:57checking dynamic linker characteristics... checking whether the compiler supports GNU C++... yes
22:53:57checking whether g++-11 accepts -g... yes
22:53:57checking for g++-11 option to enable C++11 features... GNU/Linux ld.so
22:53:57checking how to hardcode library paths into programs... immediate
22:53:57checking whether stripping libraries is possible... yes
22:53:57checking if libtool supports shared libraries... yes
22:53:57checking whether to build shared libraries... yes
22:53:57checking whether to build static libraries... no
22:53:57checking whether the compiler supports GNU C++... yes
22:53:57checking whether g++-11 accepts -g... none needed
22:53:57checking dependency style of g++-11... yes
22:53:57checking for g++-11 option to enable C++11 features... gcc3
22:53:57checking how to run the C++ preprocessor... g++-11 -E
22:53:57none needed
22:53:57checking dependency style of g++-11... gcc3
22:53:57checking how to run the C++ preprocessor... g++-11 -E
22:53:57checking for ld used by g++-11... /usr/bin/ld
22:53:57checking if the linker (/usr/bin/ld) is GNU ld... yes
22:53:57checking whether the g++-11 linker (/usr/bin/ld) supports shared libraries... yes
22:53:57checking for g++-11 option to produce PIC... -fPIC -DPIC
22:53:57checking if g++-11 PIC flag -fPIC -DPIC works... checking for ld used by g++-11... /usr/bin/ld
22:53:57checking if the linker (/usr/bin/ld) is GNU ld... yes
22:53:57checking whether the g++-11 linker (/usr/bin/ld) supports shared libraries... yes
22:53:57yes
22:53:57checking if g++-11 static flag -static works... yes
22:53:57checking if g++-11 supports -c -o file.o... checking for g++-11 option to produce PIC... -fPIC -DPIC
22:53:57checking if g++-11 PIC flag -fPIC -DPIC works... yes
22:53:57checking if g++-11 supports -c -o file.o... (cached) yes
22:53:57checking whether the g++-11 linker (/usr/bin/ld) supports shared libraries... yes
22:53:57checking dynamic linker characteristics... (cached) GNU/Linux ld.so
22:53:57checking how to hardcode library paths into programs... immediate
22:53:57checking for gcc... (cached) gcc-11
22:53:57yes
22:53:57checking if g++-11 static flag -static works... checking whether the compiler supports GNU C... (cached) yes
22:53:57checking whether gcc-11 accepts -g... (cached) yes
22:53:57checking for gcc-11 option to enable C11 features... (cached) none needed
22:53:57checking whether gcc-11 understands -c and -o together... (cached) yes
22:53:57checking dependency style of gcc-11... (cached) gcc3
22:53:57checking dependency style of gcc-11... gcc3
22:53:57checking whether make sets $(MAKE)... (cached) yes
22:53:57checking for linux/rseq.h... yes
22:53:57checking if g++-11 supports -c -o file.o... yes
22:53:57checking for rseq_available in -lrseq... yes
22:53:57checking if g++-11 supports -c -o file.o... (cached) yes
22:53:57checking whether the g++-11 linker (/usr/bin/ld) supports shared libraries... yes
22:53:57checking dynamic linker characteristics... (cached) GNU/Linux ld.so
22:53:57checking how to hardcode library paths into programs... immediate
22:53:57checking for gcc... (cached) gcc-11
22:53:57no
22:53:57checking for gcc-11 options needed to detect all undeclared functions... checking whether the compiler supports GNU C... (cached) yes
22:53:57checking whether gcc-11 accepts -g... (cached) yes
22:53:57checking for gcc-11 option to enable C11 features... (cached) none needed
22:53:57checking whether gcc-11 understands -c and -o together... (cached) yes
22:53:57checking dependency style of gcc-11... (cached) gcc3
22:53:57checking dependency style of gcc-11... none needed
22:53:57checking for linux/io_uring.h... gcc3
22:53:57checking whether make sets $(MAKE)... (cached) yes
22:53:57checking for linux/rseq.h... yes
22:53:57checking for liburing.h... yes
22:53:57checking for rseq_available in -lrseq... no
22:53:57checking whether IORING_OP_NOP is declared... no
22:53:57checking for gcc-11 options needed to detect all undeclared functions... yes
22:53:57checking whether IORING_OP_READV is declared... yes
22:53:57checking whether IORING_OP_WRITEV is declared... none needed
22:53:57checking for linux/io_uring.h... yes
22:53:57checking whether IORING_OP_FSYNC is declared... yes
22:53:57checking for liburing.h... yes
22:53:57checking whether IORING_OP_READ_FIXED is declared... no
22:53:57checking whether IORING_OP_NOP is declared... yes
22:53:57checking whether IORING_OP_WRITE_FIXED is declared... yes
22:53:57checking whether IORING_OP_READV is declared... yes
22:53:57checking whether IORING_OP_POLL_ADD is declared... yes
22:53:57checking whether IORING_OP_WRITEV is declared... yes
22:53:57checking whether IORING_OP_POLL_REMOVE is declared... yes
22:53:57yes
22:53:57checking whether IORING_OP_FSYNC is declared... checking whether IORING_OP_SYNC_FILE_RANGE is declared... yes
22:53:57yes
22:53:57checking whether IORING_OP_READ_FIXED is declared... checking whether IORING_OP_SENDMSG is declared... yes
22:53:57yes
22:53:57checking whether IORING_OP_RECVMSG is declared... checking whether IORING_OP_WRITE_FIXED is declared... yes
22:53:57yes
22:53:57checking whether IORING_OP_TIMEOUT is declared... checking whether IORING_OP_POLL_ADD is declared... yes
22:53:57yes
22:53:57checking whether IORING_OP_TIMEOUT_REMOVE is declared... checking whether IORING_OP_POLL_REMOVE is declared... yes
22:53:57checking whether IORING_OP_ACCEPT is declared... yes
22:53:57checking whether IORING_OP_SYNC_FILE_RANGE is declared... yes
22:53:57checking whether IORING_OP_ASYNC_CANCEL is declared... yes
22:53:57checking whether IORING_OP_SENDMSG is declared... yes
22:53:57checking whether IORING_OP_LINK_TIMEOUT is declared... yes
22:53:57checking whether IORING_OP_RECVMSG is declared... yes
22:53:57checking whether IORING_OP_CONNECT is declared... yes
22:53:57checking whether IORING_OP_TIMEOUT is declared... yes
22:53:57checking whether IORING_OP_FALLOCATE is declared... yes
22:53:57checking whether IORING_OP_TIMEOUT_REMOVE is declared... yes
22:53:57yes
22:53:57checking whether IORING_OP_OPENAT is declared... checking whether IORING_OP_ACCEPT is declared... yes
22:53:57checking whether IORING_OP_CLOSE is declared... yes
22:53:57checking whether IORING_OP_ASYNC_CANCEL is declared... yes
22:53:57checking whether IORING_OP_FILES_UPDATE is declared... yes
22:53:57checking whether IORING_OP_LINK_TIMEOUT is declared... yes
22:53:57checking whether IORING_OP_STATX is declared... yes
22:53:57checking whether IORING_OP_CONNECT is declared... yes
22:53:57checking whether IORING_OP_READ is declared... yes
22:53:57checking whether IORING_OP_FALLOCATE is declared... yes
22:53:57checking whether IORING_OP_WRITE is declared... yes
22:53:57checking whether IORING_OP_OPENAT is declared... yes
22:53:57checking whether IORING_OP_FADVISE is declared... yes
22:53:57checking whether IORING_OP_CLOSE is declared... yes
22:53:57checking whether IORING_OP_MADVISE is declared... yes
22:53:57checking whether IORING_OP_FILES_UPDATE is declared... yes
22:53:57checking whether IORING_OP_SEND is declared... yes
22:53:57checking whether IORING_OP_STATX is declared... yes
22:53:57checking whether IORING_OP_RECV is declared... yes
22:53:57checking whether IORING_OP_READ is declared... yes
22:53:57checking whether IORING_OP_OPENAT2 is declared... yes
22:53:57checking whether IORING_OP_WRITE is declared... yes
22:53:57checking whether IORING_OP_EPOLL_CTL is declared... yes
22:53:57checking whether IORING_OP_FADVISE is declared... yes
22:53:57checking whether IORING_OP_SPLICE is declared... yes
22:53:57checking whether IORING_OP_MADVISE is declared... yes
22:53:57checking whether IORING_OP_PROVIDE_BUFFERS is declared... yes
22:53:57checking whether IORING_OP_SEND is declared... yes
22:53:57checking whether IORING_OP_REMOVE_BUFFER is declared... yes
22:53:57checking whether IORING_OP_RECV is declared... no
22:53:57checking whether IORING_OP_TEE is declared... yes
22:53:57checking whether IORING_OP_OPENAT2 is declared... yes
22:53:57checking whether IOSQE_FIXED_FILE is declared... yes
22:53:57checking whether IORING_OP_EPOLL_CTL is declared... yes
22:53:57checking whether IOSQE_IO_DRAIN is declared... yes
22:53:57checking whether IORING_OP_SPLICE is declared... yes
22:53:57checking whether IOSQE_IO_LINK is declared... yes
22:53:57checking whether IORING_OP_PROVIDE_BUFFERS is declared... yes
22:53:57checking whether IOSQE_IO_HARDLINK is declared... yes
22:53:57checking whether IORING_OP_REMOVE_BUFFER is declared... yes
22:53:57checking whether IOSQE_ASYNC is declared... no
22:53:57checking whether IORING_OP_TEE is declared... yes
22:53:57checking whether IOSQE_BUFFER_SELECT is declared... yes
22:53:57checking whether IOSQE_FIXED_FILE is declared... yes
22:53:57checking whether SPLICE_F_FD_IN_FIXED is declared... yes
22:53:57checking whether IOSQE_IO_DRAIN is declared... yes
22:53:57checking whether IORING_SETUP_ATTACH_WQ is declared... yes
22:53:57checking whether IOSQE_IO_LINK is declared... yes
22:53:57checking whether IORING_REGISTER_IOWQ_MAX_WORKERS is declared... yes
22:53:57checking whether IOSQE_IO_HARDLINK is declared... yes
22:53:57checking for preadv2... yes
22:53:57checking whether IOSQE_ASYNC is declared... yes
22:53:57checking whether IOSQE_BUFFER_SELECT is declared... yes
22:53:57checking for pwritev2... yes
22:53:57checking whether SPLICE_F_FD_IN_FIXED is declared... yes
22:53:57yes
22:53:57checking whether IORING_SETUP_ATTACH_WQ is declared... checking that generated files are newer than configure... done
22:53:57configure: creating ./config.status
22:53:57yes
22:53:57checking whether IORING_REGISTER_IOWQ_MAX_WORKERS is declared... yes
22:53:57checking for preadv2... yes
22:53:57checking for pwritev2... yes
22:53:57checking that generated files are newer than configure... done
22:53:57configure: creating ./config.status
22:53:57config.status: creating Makefile
22:53:57config.status: creating src/Makefile
22:53:57config.status: creating prelude/Makefile
22:53:57config.status: creating src/concurrency/io/call.cfa
22:53:57/var/lib/jenkins/workspace/Cforall_master/libcfa/src/concurrency/io/call.cfa.in:144: SyntaxWarning: invalid escape sequence '\('
22:53:57 sig = re.search("(.*) (.*)\((.*)\)", signature)
22:53:57config.status: creating prelude/defines.hfa
22:53:57config.status: creating Makefile
22:53:57config.status: executing depfiles commands
22:53:57config.status: creating src/Makefile
22:53:57config.status: creating prelude/Makefile
22:53:57config.status: creating src/concurrency/io/call.cfa
22:53:57config.status: executing libtool commands
22:53:57Cforall library configuraton completed. Type "make -j 8 install".
22:53:57/var/lib/jenkins/workspace/Cforall_master/libcfa/src/concurrency/io/call.cfa.in:144: SyntaxWarning: invalid escape sequence '\('
22:53:57 sig = re.search("(.*) (.*)\((.*)\)", signature)
22:53:57config.status: creating prelude/defines.hfa
22:53:57config.status: executing depfiles commands
22:53:57config.status: executing libtool commands
22:53:57Cforall library configuraton completed. Type "make -j 8 install".
22:53:57[Pipeline] }
22:53:57[Pipeline] // dir
22:53:57[Pipeline] }
22:53:57[Pipeline] // stage
22:53:57[Pipeline] echo
22:53:57 -------- Build : cfa-cpp --------
22:53:57[Pipeline] stage
22:53:57[Pipeline] { (Build : cfa-cpp)
22:53:57[Pipeline] dir
22:53:57Running in /var/lib/jenkins/workspace/Cforall_master@tmp
22:53:57[Pipeline] {
22:53:57[Pipeline] sh
22:53:57+ nproc
22:53:57+ make -j 96 --no-print-directory -C driver
22:53:57 CXX as.o
22:53:57 CXX cc1.o
22:53:57 CXX cfa.o
22:53:57 CXXLD as
22:53:57 CXXLD cc1
22:53:57 CXXLD cfa
22:53:57[Pipeline] sh
22:53:57+ nproc
22:53:57+ make -j 96 --no-print-directory -C src
22:53:57 YACC Parser/parser.cc
22:53:57updating Parser/parser.output
22:53:57updating Parser/parser.hh
22:53:57make all-am
22:53:57 CXX main.o
22:53:57 CXX CompilationState.o
22:53:57 CXX MakeLibCfa.o
22:53:57 LEX Parser/lex.cc
22:53:57 CXX AST/Attribute.o
22:53:57 CXX AST/Copy.o
22:53:57 CXX AST/Create.o
22:53:57 CXX AST/Decl.o
22:53:57 CXX AST/DeclReplacer.o
22:53:57 CXX AST/Expr.o
22:53:57 CXX AST/GenericSubstitution.o
22:53:57 CXX AST/Init.o
22:53:57 CXX AST/Inspect.o
22:53:57 CXX AST/LinkageSpec.o
22:53:57 CXX AST/Node.o
22:53:57 CXX AST/Pass.o
22:53:57 CXX AST/Print.o
22:53:57 CXX AST/Stmt.o
22:53:57 CXX AST/SymbolTable.o
22:53:57 CXX AST/Type.o
22:53:57 CXX AST/TypeEnvironment.o
22:53:57 CXX AST/TypeSubstitution.o
22:53:57 CXX AST/Util.o
22:53:57 CXX CodeGen/CodeGenerator.o
22:53:57 CXX CodeGen/GenType.o
22:53:57 CXX CodeGen/OperatorTable.o
22:53:57 CXX CodeGen/FixMain.o
22:53:57 CXX CodeGen/FixNames.o
22:53:57 CXX CodeGen/Generate.o
22:53:57 CXX CodeGen/LinkOnce.o
22:53:57 CXX Concurrency/Actors.o
22:53:57 CXX Concurrency/Corun.o
22:53:57 CXX Concurrency/Keywords.o
22:53:57 CXX Concurrency/Waitfor.o
22:53:57 CXX Concurrency/Waituntil.o
22:53:57 CXX Common/Assert.o
22:53:57 CXX Common/CodeLocationTools.o
22:53:57 CXX Common/DeclStats.o
22:53:57 CXX Common/Eval.o
22:53:57 CXX Common/Examine.o
22:53:57 CXX Common/Indenter.o
22:53:57 CXX Common/ResolvProtoDump.o
22:53:57 CXX Common/SemanticError.o
22:53:57 CXX Common/Stats/Counter.o
22:53:57 CXX Common/Stats/Heap.o
22:53:57 CXX Common/Stats/ResolveTime.o
22:53:57 CXX Common/Stats/Stats.o
22:53:57 CXX Common/Stats/Time.o
22:53:57 CXX Common/Symbol.o
22:53:57 CXX Common/UniqueName.o
22:53:57 CXX Common/DebugMalloc.o
22:53:57 CXX ControlStruct/ExceptDecl.o
22:53:57 CXX ControlStruct/ExceptTranslate.o
22:53:57 CXX ControlStruct/FixLabels.o
22:53:57 CXX ControlStruct/HoistControlDecls.o
22:53:57 CXX ControlStruct/LabelGenerator.o
22:53:57 CXX ControlStruct/MultiLevelExit.o
22:53:57 CXX ControlStruct/TranslateEnumRange.o
22:53:57 CXX GenPoly/GenPoly.o
22:53:57 CXX GenPoly/Lvalue2.o
22:53:57 CXX GenPoly/Box.o
22:53:57 CXX GenPoly/FindFunction.o
22:53:57 CXX GenPoly/InstantiateGeneric.o
22:53:57 CXX GenPoly/Lvalue.o
22:53:57 CXX GenPoly/ScrubTypeVars.o
22:53:57 CXX GenPoly/Specialize.o
22:53:57 CXX InitTweak/GenInit.o
22:53:57 CXX InitTweak/InitTweak.o
22:53:57 CXX InitTweak/FixGlobalInit.o
22:53:57 CXX InitTweak/FixInit.o
22:53:57 CXX Parser/DeclarationNode.o
22:53:57 CXX Parser/ExpressionNode.o
22:53:57 CXX Parser/InitializerNode.o
22:53:57 CXX Parser/ParseNode.o
22:53:57 CXX Parser/parser.o
22:53:57 CXX Parser/RunParser.o
22:53:57 CXX Parser/StatementNode.o
22:53:57 CXX Parser/TypeData.o
22:53:57 CXX Parser/TypedefTable.o
22:53:57 CXX ResolvExpr/AdjustExprType.o
22:53:57 CXX ResolvExpr/Candidate.o
22:53:57 CXX ResolvExpr/CandidateFinder.o
22:53:57 CXX ResolvExpr/CastCost.o
22:53:57 CXX ResolvExpr/CommonType.o
22:53:57 CXX ResolvExpr/ConversionCost.o
22:53:57 CXX ResolvExpr/CurrentObject.o
22:53:57 CXX ResolvExpr/ExplodedArg.o
22:53:57 CXX ResolvExpr/FindOpenVars.o
22:53:57 CXX ResolvExpr/PolyCost.o
22:53:57 CXX ResolvExpr/PtrsAssignable.o
22:53:57 CXX ResolvExpr/PtrsCastable.o
22:53:57 CXX ResolvExpr/RenameVars.o
22:53:57 CXX ResolvExpr/Resolver.o
22:53:57 CXX ResolvExpr/ResolveTypeof.o
22:53:57 CXX ResolvExpr/SatisfyAssertions.o
22:53:57 CXX ResolvExpr/SpecCost.o
22:53:57 CXX ResolvExpr/Unify.o
22:53:57 CXX ResolvExpr/CandidatePrinter.o
22:53:57In file included from /usr/include/aarch64-linux-gnu/c++/11/bits/os_defines.h:39,
22:53:57 from /usr/include/aarch64-linux-gnu/c++/11/bits/c++config.h:586,
22:53:57 from /usr/include/c++/11/cstdio:41,
22:53:57 from /var/lib/jenkins/workspace/Cforall_master/src/Parser/parser.yy:41:
22:53:57/usr/include/features.h:415:4: warning: #warning _FORTIFY_SOURCE requires GCC 4.1 or later [-Wcpp]
22:53:57 415 | # warning _FORTIFY_SOURCE requires GCC 4.1 or later
22:53:57 | ^~~~~~~
22:53:57 CXX ResolvExpr/EraseWith.o
22:53:57 CXX SymTab/FixFunction.o
22:53:57 CXX SymTab/GenImplicitCall.o
22:53:57 CXX SymTab/Mangler.o
22:53:57 CXX SymTab/ManglerCommon.o
22:53:57 CXX Tuples/Explode.o
22:53:57 CXX Tuples/TupleAssignment.o
22:53:57 CXX Tuples/TupleExpansion.o
22:53:57 CXX Tuples/Tuples.o
22:53:57 CXX Validate/Autogen.o
22:53:57 CXX Validate/CheckAssertions.o
22:53:57 CXX Validate/CompoundLiteral.o
22:53:57 CXX Validate/EliminateTypedef.o
22:53:57 CXX Validate/EnumAndPointerDecay.o
22:53:57 CXX Validate/FindSpecialDecls.o
22:53:57 CXX Validate/FixQualifiedTypes.o
22:53:57 CXX Validate/FixReturnTypes.o
22:53:57 CXX Validate/ForallPointerDecay.o
22:53:57 CXX Validate/GenericParameter.o
22:53:57 CXX Validate/HoistStruct.o
22:53:57 CXX Validate/HoistTypeDecls.o
22:53:57 CXX Validate/ImplementEnumFunc.o
22:53:57 CXX Validate/InitializerLength.o
22:53:57 CXX Validate/LabelAddressFixer.o
22:53:57 CXX Validate/LinkInstanceTypes.o
22:53:57 CXX Validate/ReplaceTypedef.o
22:53:57 CXX Validate/ReturnCheck.o
22:53:57 CXX Validate/VerifyCtorDtorAssign.o
22:53:57 CXX Virtual/ExpandCasts.o
22:53:57 CXX Virtual/Tables.o
22:53:57 CXX Virtual/VirtualDtor.o
22:53:57 CXX Parser/lex.o
22:53:57 CXXLD ../driver/cfa-cpp
22:53:57[Pipeline] }
22:53:57[Pipeline] // dir
22:53:57[Pipeline] }
22:53:57[Pipeline] // stage
22:53:57[Pipeline] echo
22:53:57 -------- Build : libcfa(debug) --------
22:53:57[Pipeline] stage
22:53:57[Pipeline] { (Build : libcfa(debug))
22:53:57[Pipeline] dir
22:53:57Running in /var/lib/jenkins/workspace/Cforall_master@tmp
22:53:57[Pipeline] {
22:53:57[Pipeline] sh
22:53:57+ nproc
22:53:57+ make -j 96 --no-print-directory -C libcfa/arm64-debug
22:53:57Making all in prelude
22:53:57mkdir .deps
22:53:57touch .deps/builtins.Po
22:53:57(CDPATH="${ZSH_VERSION+.}:" && cd /var/lib/jenkins/workspace/Cforall_master/libcfa && /bin/bash '/var/lib/jenkins/workspace/Cforall_master/libcfa/automake/missing' autoheader)
22:53:57rm -f stamp-h1
22:53:57touch /var/lib/jenkins/workspace/Cforall_master/libcfa/prelude/defines.hfa.in
22:53:57cd .. && /bin/bash ./config.status prelude/defines.hfa
22:53:57config.status: creating prelude/defines.hfa
22:53:57config.status: prelude/defines.hfa is unchanged
22:53:57make all-am
22:53:57 GEN gcc-builtins.c
22:53:57 GEN builtins.cfa
22:53:57 GEN prelude.cfa
22:53:57 GEN extras.cfa
22:53:57 GEN extras.cfa
22:53:57 GEN gcc-builtins.cfa
22:53:57 GEN bootloader.c
22:53:57Making all in src
22:53:57 CFA common.lo
22:53:57 CFA fstream.lo
22:53:57 CFA heap.lo
22:53:57 CFA iostream.lo
22:53:57 CFA iterator.lo
22:53:57 CFA limits.lo
22:53:57 CFA math.lo
22:53:57 CFA memory.lo
22:53:57 CFA parseargs.lo
22:53:57 CFA parseconfig.lo
22:53:57 CFA rational.lo
22:53:57 CFA stdlib.lo
22:53:57 CFA strstream.lo
22:53:57 CFA time.lo
22:53:57 CFA assert.lo
22:53:57 CFA bits/debug.lo
22:53:57 CC exception.lo
22:53:57 CFA interpose.lo
22:53:57 CFA prelude-inline.lo
22:53:57 CFA startup.lo
22:53:57 CC virtual.lo
22:53:57 GEN prelude.lo
22:53:57 CFA interpose_thread.lo
22:53:57 CPPAS concurrency/CtxSwitch-arm64.lo
22:53:57 CC concurrency/invoke.lo
22:53:57 CFA concurrency/io.lo
22:53:57 CFA concurrency/kernel/startup.lo
22:53:57 CFA concurrency/preemption.lo
22:53:57 CFA concurrency/ready_queue.lo
22:53:57 CFA concurrency/stats.lo
22:53:57 CFA concurrency/pthread.lo
22:53:57 CFA bits/weakso_locks.lo
22:53:57 CFA algorithms/range_iterator.lo
22:53:57 CFA collections/maybe.lo
22:53:57 CFA collections/pair.lo
22:53:57 CFA collections/result.lo
22:53:57 CFA collections/string.lo
22:53:57 CFA collections/string_res.lo
22:53:57 CFA collections/vector.lo
22:53:57 CFA device/cpu.lo
22:53:57 CFA concurrency/alarm.lo
22:53:57 CFA concurrency/coroutine.lo
22:53:57 CFA concurrency/exception.lo
22:53:57 CFA concurrency/kernel.lo
22:53:57 CFA concurrency/kernel/cluster.lo
22:53:57 CFA concurrency/locks.lo
22:53:57 CFA concurrency/monitor.lo
22:53:57 CFA concurrency/mutex.lo
22:53:57 CFA concurrency/select.lo
22:53:57 CFA concurrency/thread.lo
22:53:57 CFA concurrency/cofor.lo
22:53:57 CFA concurrency/clib/cfathread.lo
22:53:57 CFA concurrency/io/setup.lo
22:53:57 CFA concurrency/io/call.lo
22:53:57/usr/include/linux/io_uring.h:83:43: warning: 'packed' attribute ignored for field of type 'union __io_uring_sqe____anonymous65' [-Wattributes]
22:53:57 83 | } __attribute__((packed));
22:53:57 | ^
22:53:57/usr/include/linux/io_uring.h:83:43: warning: 'packed' attribute ignored for field of type 'union __io_uring_sqe____anonymous53' [-Wattributes]
22:53:57 83 | } __attribute__((packed));
22:53:57 | ^
22:53:57/usr/include/linux/io_uring.h:83:43: warning: 'packed' attribute ignored for field of type 'union __io_uring_sqe____anonymous129' [-Wattributes]
22:53:57 83 | } __attribute__((packed));
22:53:57 | ^
22:53:57 CCLD libcfa.la
22:53:57/usr/bin/ld: warning: .libs/common.o: requires executable stack (because the .note.GNU-stack section is executable)
22:53:57/usr/include/linux/io_uring.h:83:43: warning: 'packed' attribute ignored for field of type 'union __io_uring_sqe____anonymous119' [-Wattributes]
22:53:57 83 | } __attribute__((packed));
22:53:57 | ^
22:53:57/usr/include/linux/io_uring.h:83:43: warning: 'packed' attribute ignored for field of type 'union __io_uring_sqe____anonymous119' [-Wattributes]
22:53:57 83 | } __attribute__((packed));
22:53:57 | ^
22:53:57/usr/include/linux/io_uring.h:83:43: warning: 'packed' attribute ignored for field of type 'union __io_uring_sqe____anonymous32' [-Wattributes]
22:53:57 83 | } __attribute__((packed));
22:53:57 | ^
22:53:57/usr/include/linux/io_uring.h:83:43: warning: 'packed' attribute ignored for field of type 'union __io_uring_sqe____anonymous97' [-Wattributes]
22:53:57 83 | } __attribute__((packed));
22:53:57 | ^
22:53:57 CCLD libcfathread.la
22:53:57/usr/bin/ld: warning: concurrency/.libs/alarm.o: requires executable stack (because the .note.GNU-stack section is executable)
22:53:57make[1]: Nothing to be done for 'all-am'.
22:53:57[Pipeline] }
22:53:57[Pipeline] // dir
22:53:57[Pipeline] }
22:53:57[Pipeline] // stage
22:53:57[Pipeline] echo
22:53:57 -------- Build : libcfa(nodebug) --------
22:53:57[Pipeline] stage
22:53:57[Pipeline] { (Build : libcfa(nodebug))
22:53:57[Pipeline] dir
22:53:57Running in /var/lib/jenkins/workspace/Cforall_master@tmp
22:53:57[Pipeline] {
22:53:57[Pipeline] sh
22:53:57+ nproc
22:53:57+ make -j 96 --no-print-directory -C libcfa/arm64-nodebug
22:53:57Making all in prelude
22:53:57mkdir .deps
22:53:57touch .deps/builtins.Po
22:53:57cd .. && /bin/bash ./config.status prelude/defines.hfa
22:53:57config.status: creating prelude/defines.hfa
22:53:57config.status: prelude/defines.hfa is unchanged
22:53:57make all-am
22:53:57 GEN gcc-builtins.c
22:53:57 GEN builtins.cfa
22:53:57 GEN prelude.cfa
22:53:57 GEN extras.cfa
22:53:57 GEN extras.cfa
22:53:57 GEN gcc-builtins.cfa
22:53:57 GEN bootloader.c
22:53:57Making all in src
22:53:57 CFA common.lo
22:53:57 CFA fstream.lo
22:53:57 CFA heap.lo
22:53:57 CFA iostream.lo
22:53:57 CFA iterator.lo
22:53:57 CFA limits.lo
22:53:57 CFA math.lo
22:53:57 CFA memory.lo
22:53:57 CFA parseargs.lo
22:53:57 CFA parseconfig.lo
22:53:57 CFA rational.lo
22:53:57 CFA stdlib.lo
22:53:57 CFA strstream.lo
22:53:57 CFA time.lo
22:53:57 CFA assert.lo
22:53:57 CFA bits/debug.lo
22:53:57 CC exception.lo
22:53:57 CFA interpose.lo
22:53:57 CFA prelude-inline.lo
22:53:57 CFA startup.lo
22:53:57 CC virtual.lo
22:53:57 GEN prelude.lo
22:53:57 CFA interpose_thread.lo
22:53:57 CFA concurrency/preemption.lo
22:53:57 CFA concurrency/ready_queue.lo
22:53:57 CFA concurrency/stats.lo
22:53:57 CFA concurrency/pthread.lo
22:53:57 CFA bits/weakso_locks.lo
22:53:57 CFA algorithms/range_iterator.lo
22:53:57 CFA collections/maybe.lo
22:53:57 CFA collections/pair.lo
22:53:57 CFA collections/result.lo
22:53:57 CFA collections/string.lo
22:53:57 CFA collections/string_res.lo
22:53:57 CFA collections/vector.lo
22:53:57 CFA device/cpu.lo
22:53:57 CFA concurrency/alarm.lo
22:53:57 CFA concurrency/coroutine.lo
22:53:57 CFA concurrency/exception.lo
22:53:57 CFA concurrency/kernel.lo
22:53:57 CFA concurrency/kernel/cluster.lo
22:53:57 CFA concurrency/locks.lo
22:53:57 CFA concurrency/monitor.lo
22:53:57 CFA concurrency/mutex.lo
22:53:57 CFA concurrency/select.lo
22:53:57 CFA concurrency/thread.lo
22:53:57 CFA concurrency/cofor.lo
22:53:57 CFA concurrency/clib/cfathread.lo
22:53:57 CPPAS concurrency/CtxSwitch-arm64.lo
22:53:57 CC concurrency/invoke.lo
22:53:57 CFA concurrency/io.lo
22:53:57 CFA concurrency/io/setup.lo
22:53:57 CFA concurrency/io/call.lo
22:53:57 CFA concurrency/kernel/startup.lo
22:53:57/var/lib/jenkins/workspace/Cforall_master/libcfa/src/exception.c: In function '__cfaehm_allocate_exception':
22:53:57/var/lib/jenkins/workspace/Cforall_master/libcfa/src/exception.c:142:17: warning: ignoring return value of 'write' declared with attribute 'warn_unused_result' [-Wunused-result]
22:53:57 142 | write( 2, "abort2\n", 7 );
22:53:57 | ^~~~~~~~~~~~~~~~~~~~~~~~~
22:53:57/var/lib/jenkins/workspace/Cforall_master/libcfa/src/exception.c: In function '__cfaehm_exception_cleanup':
22:53:57/var/lib/jenkins/workspace/Cforall_master/libcfa/src/exception.c:127:17: warning: ignoring return value of 'write' declared with attribute 'warn_unused_result' [-Wunused-result]
22:53:57 127 | write( 2, "abort1\n", 7 );
22:53:57 | ^~~~~~~~~~~~~~~~~~~~~~~~~
22:53:57/var/lib/jenkins/workspace/Cforall_master/libcfa/src/exception.c: In function '__cfaehm_cancel_stack':
22:53:57/var/lib/jenkins/workspace/Cforall_master/libcfa/src/exception.c:230:9: warning: ignoring return value of 'write' declared with attribute 'warn_unused_result' [-Wunused-result]
22:53:57 230 | write( 2, "abort3\n", 7 );
22:53:57 | ^~~~~~~~~~~~~~~~~~~~~~~~~
22:53:57/var/lib/jenkins/workspace/Cforall_master/libcfa/src/exception.c: In function '__cfaehm_begin_unwind':
22:53:57/var/lib/jenkins/workspace/Cforall_master/libcfa/src/exception.c:252:17: warning: ignoring return value of 'write' declared with attribute 'warn_unused_result' [-Wunused-result]
22:53:57 252 | write( 2, "abort4\n", 7 );
22:53:57 | ^~~~~~~~~~~~~~~~~~~~~~~~~
22:53:57/var/lib/jenkins/workspace/Cforall_master/libcfa/src/exception.c:278:17: warning: ignoring return value of 'write' declared with attribute 'warn_unused_result' [-Wunused-result]
22:53:57 278 | write( 2, "abort5\n", 7 );
22:53:57 | ^~~~~~~~~~~~~~~~~~~~~~~~~
22:53:57/var/lib/jenkins/workspace/Cforall_master/libcfa/src/exception.c: In function '__cfaehm_rethrow_terminate':
22:53:57/var/lib/jenkins/workspace/Cforall_master/libcfa/src/exception.c:308:9: warning: ignoring return value of 'write' declared with attribute 'warn_unused_result' [-Wunused-result]
22:53:57 308 | write( 2, "abort7\n", 7 );
22:53:57 | ^~~~~~~~~~~~~~~~~~~~~~~~~
22:53:57/var/lib/jenkins/workspace/Cforall_master/libcfa/src/exception.c: In function '__cfaehm_rethrow_adapter':
22:53:57/var/lib/jenkins/workspace/Cforall_master/libcfa/src/exception.c:300:9: warning: ignoring return value of 'write' declared with attribute 'warn_unused_result' [-Wunused-result]
22:53:57 300 | write( 2, "abort6\n", 7 );
22:53:57 | ^~~~~~~~~~~~~~~~~~~~~~~~~
22:53:57/usr/include/linux/io_uring.h:83:43: warning: 'packed' attribute ignored for field of type 'union __io_uring_sqe____anonymous65' [-Wattributes]
22:53:57 83 | } __attribute__((packed));
22:53:57 | ^
22:53:57/usr/include/aarch64-linux-gnu/bits/socket2.h:70:94: warning: '_X12_constructorFv_U26__anonymous___SOCKADDR_ARGU26__anonymous___SOCKADDR_ARG_autogen___1' is static but used in inline function 'recvfrom' which is not static
22:53:57 70 | return __recvfrom_chk (__fd, __buf, __n, sz, __flags, __addr, __addr_len);
22:53:57 | ^
22:53:57/usr/include/aarch64-linux-gnu/bits/socket2.h:70:124: warning: '_X11_destructorFv_U26__anonymous___SOCKADDR_ARG_autogen___1' is static but used in inline function 'recvfrom' which is not static
22:53:57 70 | return __recvfrom_chk (__fd, __buf, __n, sz, __flags, __addr, __addr_len);
22:53:57 | ^
22:53:57/usr/include/aarch64-linux-gnu/bits/socket2.h:68:103: warning: '_X12_constructorFv_U26__anonymous___SOCKADDR_ARGU26__anonymous___SOCKADDR_ARG_autogen___1' is static but used in inline function 'recvfrom' which is not static
22:53:57 68 | return __recvfrom_chk_warn (__fd, __buf, __n, sz, __flags, __addr,
22:53:57 | ^
22:53:57/usr/include/aarch64-linux-gnu/bits/socket2.h:68:128: warning: '_X11_destructorFv_U26__anonymous___SOCKADDR_ARG_autogen___1' is static but used in inline function 'recvfrom' which is not static
22:53:57 68 | return __recvfrom_chk_warn (__fd, __buf, __n, sz, __flags, __addr,
22:53:57 | ^
22:53:57/usr/include/aarch64-linux-gnu/bits/socket2.h:66:96: warning: '_X12_constructorFv_U26__anonymous___SOCKADDR_ARGU26__anonymous___SOCKADDR_ARG_autogen___1' is static but used in inline function 'recvfrom' which is not static
22:53:57 66 | return __recvfrom_alias (__fd, __buf, __n, __flags, __addr, __addr_len);
22:53:57 | ^
22:53:57/usr/include/aarch64-linux-gnu/bits/socket2.h:66:128: warning: '_X11_destructorFv_U26__anonymous___SOCKADDR_ARG_autogen___1' is static but used in inline function 'recvfrom' which is not static
22:53:57 66 | return __recvfrom_alias (__fd, __buf, __n, __flags, __addr, __addr_len);
22:53:57 | ^
22:53:57/usr/include/linux/io_uring.h:83:43: warning: 'packed' attribute ignored for field of type 'union __io_uring_sqe____anonymous129' [-Wattributes]
22:53:57 83 | } __attribute__((packed));
22:53:57 | ^
22:53:57/usr/include/aarch64-linux-gnu/bits/socket2.h:70:95: warning: '_X12_constructorFv_U26__anonymous___SOCKADDR_ARGU26__anonymous___SOCKADDR_ARG_autogen___1' is static but used in inline function 'recvfrom' which is not static
22:53:57 70 | return __recvfrom_chk (__fd, __buf, __n, sz, __flags, __addr, __addr_len);
22:53:57 | ^
22:53:57/usr/include/aarch64-linux-gnu/bits/socket2.h:70:125: warning: '_X11_destructorFv_U26__anonymous___SOCKADDR_ARG_autogen___1' is static but used in inline function 'recvfrom' which is not static
22:53:57 70 | return __recvfrom_chk (__fd, __buf, __n, sz, __flags, __addr, __addr_len);
22:53:57 | ^
22:53:57/usr/include/aarch64-linux-gnu/bits/socket2.h:68:104: warning: '_X12_constructorFv_U26__anonymous___SOCKADDR_ARGU26__anonymous___SOCKADDR_ARG_autogen___1' is static but used in inline function 'recvfrom' which is not static
22:53:57 68 | return __recvfrom_chk_warn (__fd, __buf, __n, sz, __flags, __addr,
22:53:57 | ^
22:53:57/usr/include/aarch64-linux-gnu/bits/socket2.h:68:129: warning: '_X11_destructorFv_U26__anonymous___SOCKADDR_ARG_autogen___1' is static but used in inline function 'recvfrom' which is not static
22:53:57 68 | return __recvfrom_chk_warn (__fd, __buf, __n, sz, __flags, __addr,
22:53:57 | ^
22:53:57/usr/include/aarch64-linux-gnu/bits/socket2.h:66:97: warning: '_X12_constructorFv_U26__anonymous___SOCKADDR_ARGU26__anonymous___SOCKADDR_ARG_autogen___1' is static but used in inline function 'recvfrom' which is not static
22:53:57 66 | return __recvfrom_alias (__fd, __buf, __n, __flags, __addr, __addr_len);
22:53:57 | ^
22:53:57/usr/include/aarch64-linux-gnu/bits/socket2.h:66:129: warning: '_X11_destructorFv_U26__anonymous___SOCKADDR_ARG_autogen___1' is static but used in inline function 'recvfrom' which is not static
22:53:57 66 | return __recvfrom_alias (__fd, __buf, __n, __flags, __addr, __addr_len);
22:53:57 | ^
22:53:57/usr/include/linux/io_uring.h:83:43: warning: 'packed' attribute ignored for field of type 'union __io_uring_sqe____anonymous53' [-Wattributes]
22:53:57 83 | } __attribute__((packed));
22:53:57 | ^
22:53:57/usr/include/aarch64-linux-gnu/bits/socket2.h:70:95: warning: '_X12_constructorFv_U26__anonymous___SOCKADDR_ARGU26__anonymous___SOCKADDR_ARG_autogen___1' is static but used in inline function 'recvfrom' which is not static
22:53:57 70 | return __recvfrom_chk (__fd, __buf, __n, sz, __flags, __addr, __addr_len);
22:53:57 | ^
22:53:57/usr/include/aarch64-linux-gnu/bits/socket2.h:70:125: warning: '_X11_destructorFv_U26__anonymous___SOCKADDR_ARG_autogen___1' is static but used in inline function 'recvfrom' which is not static
22:53:57 70 | return __recvfrom_chk (__fd, __buf, __n, sz, __flags, __addr, __addr_len);
22:53:57 | ^
22:53:57/usr/include/aarch64-linux-gnu/bits/socket2.h:68:104: warning: '_X12_constructorFv_U26__anonymous___SOCKADDR_ARGU26__anonymous___SOCKADDR_ARG_autogen___1' is static but used in inline function 'recvfrom' which is not static
22:53:57 68 | return __recvfrom_chk_warn (__fd, __buf, __n, sz, __flags, __addr,
22:53:57 | ^
22:53:57/usr/include/aarch64-linux-gnu/bits/socket2.h:68:129: warning: '_X11_destructorFv_U26__anonymous___SOCKADDR_ARG_autogen___1' is static but used in inline function 'recvfrom' which is not static
22:53:57 68 | return __recvfrom_chk_warn (__fd, __buf, __n, sz, __flags, __addr,
22:53:57 | ^
22:53:57/usr/include/aarch64-linux-gnu/bits/socket2.h:66:97: warning: '_X12_constructorFv_U26__anonymous___SOCKADDR_ARGU26__anonymous___SOCKADDR_ARG_autogen___1' is static but used in inline function 'recvfrom' which is not static
22:53:57 66 | return __recvfrom_alias (__fd, __buf, __n, __flags, __addr, __addr_len);
22:53:57 | ^
22:53:57/usr/include/aarch64-linux-gnu/bits/socket2.h:66:129: warning: '_X11_destructorFv_U26__anonymous___SOCKADDR_ARG_autogen___1' is static but used in inline function 'recvfrom' which is not static
22:53:57 66 | return __recvfrom_alias (__fd, __buf, __n, __flags, __addr, __addr_len);
22:53:57 | ^
22:53:57/usr/include/linux/io_uring.h:83:43: warning: 'packed' attribute ignored for field of type 'union __io_uring_sqe____anonymous119' [-Wattributes]
22:53:57 83 | } __attribute__((packed));
22:53:57 | ^
22:53:57/usr/include/aarch64-linux-gnu/bits/socket2.h:70:95: warning: '_X12_constructorFv_U26__anonymous___SOCKADDR_ARGU26__anonymous___SOCKADDR_ARG_autogen___1' is static but used in inline function 'recvfrom' which is not static
22:53:57 70 | return __recvfrom_chk (__fd, __buf, __n, sz, __flags, __addr, __addr_len);
22:53:57 | ^
22:53:57/usr/include/aarch64-linux-gnu/bits/socket2.h:70:125: warning: '_X11_destructorFv_U26__anonymous___SOCKADDR_ARG_autogen___1' is static but used in inline function 'recvfrom' which is not static
22:53:57 70 | return __recvfrom_chk (__fd, __buf, __n, sz, __flags, __addr, __addr_len);
22:53:57 | ^
22:53:57/usr/include/aarch64-linux-gnu/bits/socket2.h:68:104: warning: '_X12_constructorFv_U26__anonymous___SOCKADDR_ARGU26__anonymous___SOCKADDR_ARG_autogen___1' is static but used in inline function 'recvfrom' which is not static
22:53:57 68 | return __recvfrom_chk_warn (__fd, __buf, __n, sz, __flags, __addr,
22:53:57 | ^
22:53:57/usr/include/aarch64-linux-gnu/bits/socket2.h:68:129: warning: '_X11_destructorFv_U26__anonymous___SOCKADDR_ARG_autogen___1' is static but used in inline function 'recvfrom' which is not static
22:53:57 68 | return __recvfrom_chk_warn (__fd, __buf, __n, sz, __flags, __addr,
22:53:57 | ^
22:53:57/usr/include/aarch64-linux-gnu/bits/socket2.h:66:97: warning: '_X12_constructorFv_U26__anonymous___SOCKADDR_ARGU26__anonymous___SOCKADDR_ARG_autogen___1' is static but used in inline function 'recvfrom' which is not static
22:53:57 66 | return __recvfrom_alias (__fd, __buf, __n, __flags, __addr, __addr_len);
22:53:57 | ^
22:53:57/usr/include/aarch64-linux-gnu/bits/socket2.h:66:129: warning: '_X11_destructorFv_U26__anonymous___SOCKADDR_ARG_autogen___1' is static but used in inline function 'recvfrom' which is not static
22:53:57 66 | return __recvfrom_alias (__fd, __buf, __n, __flags, __addr, __addr_len);
22:53:57 | ^
22:53:57/usr/include/linux/io_uring.h:83:43: warning: 'packed' attribute ignored for field of type 'union __io_uring_sqe____anonymous119' [-Wattributes]
22:53:57 83 | } __attribute__((packed));
22:53:57 | ^
22:53:57/usr/include/aarch64-linux-gnu/bits/socket2.h:70:95: warning: '_X12_constructorFv_U26__anonymous___SOCKADDR_ARGU26__anonymous___SOCKADDR_ARG_autogen___1' is static but used in inline function 'recvfrom' which is not static
22:53:57 70 | return __recvfrom_chk (__fd, __buf, __n, sz, __flags, __addr, __addr_len);
22:53:57 | ^
22:53:57/usr/include/aarch64-linux-gnu/bits/socket2.h:70:125: warning: '_X11_destructorFv_U26__anonymous___SOCKADDR_ARG_autogen___1' is static but used in inline function 'recvfrom' which is not static
22:53:57 70 | return __recvfrom_chk (__fd, __buf, __n, sz, __flags, __addr, __addr_len);
22:53:57 | ^
22:53:57/usr/include/aarch64-linux-gnu/bits/socket2.h:68:104: warning: '_X12_constructorFv_U26__anonymous___SOCKADDR_ARGU26__anonymous___SOCKADDR_ARG_autogen___1' is static but used in inline function 'recvfrom' which is not static
22:53:57 68 | return __recvfrom_chk_warn (__fd, __buf, __n, sz, __flags, __addr,
22:53:57 | ^
22:53:57/usr/include/aarch64-linux-gnu/bits/socket2.h:68:129: warning: '_X11_destructorFv_U26__anonymous___SOCKADDR_ARG_autogen___1' is static but used in inline function 'recvfrom' which is not static
22:53:57 68 | return __recvfrom_chk_warn (__fd, __buf, __n, sz, __flags, __addr,
22:53:57 | ^
22:53:57/usr/include/aarch64-linux-gnu/bits/socket2.h:66:97: warning: '_X12_constructorFv_U26__anonymous___SOCKADDR_ARGU26__anonymous___SOCKADDR_ARG_autogen___1' is static but used in inline function 'recvfrom' which is not static
22:53:57 66 | return __recvfrom_alias (__fd, __buf, __n, __flags, __addr, __addr_len);
22:53:57 | ^
22:53:57/usr/include/aarch64-linux-gnu/bits/socket2.h:66:129: warning: '_X11_destructorFv_U26__anonymous___SOCKADDR_ARG_autogen___1' is static but used in inline function 'recvfrom' which is not static
22:53:57 66 | return __recvfrom_alias (__fd, __buf, __n, __flags, __addr, __addr_len);
22:53:57 | ^
22:53:57 CCLD libcfa.la
22:53:57/usr/bin/ld: warning: .libs/common.o: requires executable stack (because the .note.GNU-stack section is executable)
22:53:57/usr/include/linux/io_uring.h:83:43: warning: 'packed' attribute ignored for field of type 'union __io_uring_sqe____anonymous32' [-Wattributes]
22:53:57 83 | } __attribute__((packed));
22:53:57 | ^
22:53:57/usr/include/aarch64-linux-gnu/bits/socket2.h:70:94: warning: '_X12_constructorFv_U26__anonymous___SOCKADDR_ARGU26__anonymous___SOCKADDR_ARG_autogen___1' is static but used in inline function 'recvfrom' which is not static
22:53:57 70 | return __recvfrom_chk (__fd, __buf, __n, sz, __flags, __addr, __addr_len);
22:53:57 | ^
22:53:57/usr/include/aarch64-linux-gnu/bits/socket2.h:70:124: warning: '_X11_destructorFv_U26__anonymous___SOCKADDR_ARG_autogen___1' is static but used in inline function 'recvfrom' which is not static
22:53:57 70 | return __recvfrom_chk (__fd, __buf, __n, sz, __flags, __addr, __addr_len);
22:53:57 | ^
22:53:57/usr/include/aarch64-linux-gnu/bits/socket2.h:68:103: warning: '_X12_constructorFv_U26__anonymous___SOCKADDR_ARGU26__anonymous___SOCKADDR_ARG_autogen___1' is static but used in inline function 'recvfrom' which is not static
22:53:57 68 | return __recvfrom_chk_warn (__fd, __buf, __n, sz, __flags, __addr,
22:53:57 | ^
22:53:57/usr/include/aarch64-linux-gnu/bits/socket2.h:68:128: warning: '_X11_destructorFv_U26__anonymous___SOCKADDR_ARG_autogen___1' is static but used in inline function 'recvfrom' which is not static
22:53:57 68 | return __recvfrom_chk_warn (__fd, __buf, __n, sz, __flags, __addr,
22:53:57 | ^
22:53:57/usr/include/aarch64-linux-gnu/bits/socket2.h:66:96: warning: '_X12_constructorFv_U26__anonymous___SOCKADDR_ARGU26__anonymous___SOCKADDR_ARG_autogen___1' is static but used in inline function 'recvfrom' which is not static
22:53:57 66 | return __recvfrom_alias (__fd, __buf, __n, __flags, __addr, __addr_len);
22:53:57 | ^
22:53:57/usr/include/aarch64-linux-gnu/bits/socket2.h:66:128: warning: '_X11_destructorFv_U26__anonymous___SOCKADDR_ARG_autogen___1' is static but used in inline function 'recvfrom' which is not static
22:53:57 66 | return __recvfrom_alias (__fd, __buf, __n, __flags, __addr, __addr_len);
22:53:57 | ^
22:53:57/usr/include/linux/io_uring.h:83:43: warning: 'packed' attribute ignored for field of type 'union __io_uring_sqe____anonymous97' [-Wattributes]
22:53:57 83 | } __attribute__((packed));
22:53:57 | ^
22:53:57/usr/include/aarch64-linux-gnu/bits/socket2.h:70:95: warning: '_X12_constructorFv_U26__anonymous___SOCKADDR_ARGU26__anonymous___SOCKADDR_ARG_autogen___1' is static but used in inline function 'recvfrom' which is not static
22:53:57 70 | return __recvfrom_chk (__fd, __buf, __n, sz, __flags, __addr, __addr_len);
22:53:57 | ^
22:53:57/usr/include/aarch64-linux-gnu/bits/socket2.h:70:125: warning: '_X11_destructorFv_U26__anonymous___SOCKADDR_ARG_autogen___1' is static but used in inline function 'recvfrom' which is not static
22:53:57 70 | return __recvfrom_chk (__fd, __buf, __n, sz, __flags, __addr, __addr_len);
22:53:57 | ^
22:53:57/usr/include/aarch64-linux-gnu/bits/socket2.h:68:104: warning: '_X12_constructorFv_U26__anonymous___SOCKADDR_ARGU26__anonymous___SOCKADDR_ARG_autogen___1' is static but used in inline function 'recvfrom' which is not static
22:53:57 68 | return __recvfrom_chk_warn (__fd, __buf, __n, sz, __flags, __addr,
22:53:57 | ^
22:53:57/usr/include/aarch64-linux-gnu/bits/socket2.h:68:129: warning: '_X11_destructorFv_U26__anonymous___SOCKADDR_ARG_autogen___1' is static but used in inline function 'recvfrom' which is not static
22:53:57 68 | return __recvfrom_chk_warn (__fd, __buf, __n, sz, __flags, __addr,
22:53:57 | ^
22:53:57/usr/include/aarch64-linux-gnu/bits/socket2.h:66:97: warning: '_X12_constructorFv_U26__anonymous___SOCKADDR_ARGU26__anonymous___SOCKADDR_ARG_autogen___1' is static but used in inline function 'recvfrom' which is not static
22:53:57 66 | return __recvfrom_alias (__fd, __buf, __n, __flags, __addr, __addr_len);
22:53:57 | ^
22:53:57/usr/include/aarch64-linux-gnu/bits/socket2.h:66:129: warning: '_X11_destructorFv_U26__anonymous___SOCKADDR_ARG_autogen___1' is static but used in inline function 'recvfrom' which is not static
22:53:57 66 | return __recvfrom_alias (__fd, __buf, __n, __flags, __addr, __addr_len);
22:53:57 | ^
22:53:57 CCLD libcfathread.la
22:53:57/usr/bin/ld: warning: concurrency/.libs/coroutine.o: requires executable stack (because the .note.GNU-stack section is executable)
22:53:57make[1]: Nothing to be done for 'all-am'.
22:53:57[Pipeline] }
22:53:57[Pipeline] // dir
22:53:57[Pipeline] }
22:53:57[Pipeline] // stage
22:53:57[Pipeline] echo
22:53:57 -------- Build : install --------
22:53:57[Pipeline] stage
22:53:57[Pipeline] { (Build : install)
22:53:57[Pipeline] dir
22:53:57Running in /var/lib/jenkins/workspace/Cforall_master@tmp
22:53:57[Pipeline] {
22:53:57[Pipeline] sh
22:53:57+ nproc
22:53:57+ make -j 96 --no-print-directory install
22:53:57Making install in driver
22:53:57make install-exec-hook
22:53:57 /usr/bin/install -c cfa '/var/lib/jenkins/workspace/Cforall_master@tmp/bin//cfa'
22:53:57 /usr/bin/mkdir -p '/var/lib/jenkins/workspace/Cforall_master@tmp/lib/cfa/'
22:53:57 /bin/bash ../libtool --mode=install /usr/bin/install -c as cc1 '/var/lib/jenkins/workspace/Cforall_master@tmp/lib/cfa/'
22:53:57libtool: install: /usr/bin/install -c as /var/lib/jenkins/workspace/Cforall_master@tmp/lib/cfa/as
22:53:57libtool: install: /usr/bin/install -c cc1 /var/lib/jenkins/workspace/Cforall_master@tmp/lib/cfa/cc1
22:53:57Making install in src
22:53:57make install-am
22:53:57make[3]: Nothing to be done for 'install-exec-am'.
22:53:57 /usr/bin/mkdir -p '/var/lib/jenkins/workspace/Cforall_master@tmp/lib/cfa/'
22:53:57 /bin/bash ../libtool --mode=install /usr/bin/install -c ../driver/cfa-cpp '/var/lib/jenkins/workspace/Cforall_master@tmp/lib/cfa/'
22:53:57libtool: install: /usr/bin/install -c ../driver/cfa-cpp /var/lib/jenkins/workspace/Cforall_master@tmp/lib/cfa/cfa-cpp
22:53:57Making install in .
22:53:57(CDPATH="${ZSH_VERSION+.}:" && cd /var/lib/jenkins/workspace/Cforall_master && /bin/bash '/var/lib/jenkins/workspace/Cforall_master/automake/missing' autoheader)
22:53:57rm -f stamp-h1
22:53:57touch /var/lib/jenkins/workspace/Cforall_master/src/config.h.in
22:53:57cd . && /bin/bash ./config.status config.h
22:53:57config.status: creating config.h
22:53:57config.status: config.h is unchanged
22:53:57make[2]: Nothing to be done for 'install-exec-am'.
22:53:57 /usr/bin/mkdir -p '/var/lib/jenkins/workspace/Cforall_master@tmp/share/man/man1'
22:53:57 /usr/bin/install -c -m 644 /var/lib/jenkins/workspace/Cforall_master/doc/man/cfa.1 '/var/lib/jenkins/workspace/Cforall_master@tmp/share/man/man1'
22:53:57Making install in libcfa/arm64-debug
22:53:57Making install in prelude
22:53:57make[3]: Nothing to be done for 'install-exec-am'.
22:53:57 /usr/bin/mkdir -p '/var/lib/jenkins/workspace/Cforall_master@tmp/lib/cfa/arm64-debug/'
22:53:57 /usr/bin/install -c -m 644 gcc-builtins.cfa builtins.cfa extras.cfa prelude.cfa bootloader.c defines.hfa '/var/lib/jenkins/workspace/Cforall_master@tmp/lib/cfa/arm64-debug/'
22:53:57Making install in src
22:53:57 /usr/bin/mkdir -p '/var/lib/jenkins/workspace/Cforall_master@tmp/lib/cfa/arm64-debug/'
22:53:57 /bin/bash ../libtool --mode=install /usr/bin/install -c libcfa.la libcfathread.la '/var/lib/jenkins/workspace/Cforall_master@tmp/lib/cfa/arm64-debug/'
22:53:57 /usr/bin/mkdir -p '/var/lib/jenkins/workspace/Cforall_master@tmp/include/cfa/'
22:53:57 /usr/bin/mkdir -p '/var/lib/jenkins/workspace/Cforall_master@tmp/include/cfa//stdhdr/sys'
22:53:57 /usr/bin/install -c -m 644 /var/lib/jenkins/workspace/Cforall_master/libcfa/src/stdhdr/sys/mman.h /var/lib/jenkins/workspace/Cforall_master/libcfa/src/stdhdr/sys/time.h /var/lib/jenkins/workspace/Cforall_master/libcfa/src/stdhdr/sys/socket.h '/var/lib/jenkins/workspace/Cforall_master@tmp/include/cfa//stdhdr/sys'
22:53:57 /usr/bin/mkdir -p '/var/lib/jenkins/workspace/Cforall_master@tmp/include/cfa//algorithms'
22:53:57 /usr/bin/install -c -m 644 /var/lib/jenkins/workspace/Cforall_master/libcfa/src/algorithms/range_iterator.hfa '/var/lib/jenkins/workspace/Cforall_master@tmp/include/cfa//algorithms'
22:53:57 /usr/bin/mkdir -p '/var/lib/jenkins/workspace/Cforall_master@tmp/include/cfa//concurrency/kernel'
22:53:57 /usr/bin/install -c -m 644 /var/lib/jenkins/workspace/Cforall_master/libcfa/src/concurrency/kernel/cluster.hfa /var/lib/jenkins/workspace/Cforall_master/libcfa/src/concurrency/kernel/fwd.hfa '/var/lib/jenkins/workspace/Cforall_master@tmp/include/cfa//concurrency/kernel'
22:53:57 /usr/bin/install -c -m 644 /var/lib/jenkins/workspace/Cforall_master/libcfa/src/common.hfa /var/lib/jenkins/workspace/Cforall_master/libcfa/src/fstream.hfa /var/lib/jenkins/workspace/Cforall_master/libcfa/src/heap.hfa /var/lib/jenkins/workspace/Cforall_master/libcfa/src/iostream.hfa /var/lib/jenkins/workspace/Cforall_master/libcfa/src/iterator.hfa /var/lib/jenkins/workspace/Cforall_master/libcfa/src/limits.hfa /var/lib/jenkins/workspace/Cforall_master/libcfa/src/math.hfa /var/lib/jenkins/workspace/Cforall_master/libcfa/src/memory.hfa /var/lib/jenkins/workspace/Cforall_master/libcfa/src/parseargs.hfa /var/lib/jenkins/workspace/Cforall_master/libcfa/src/parseconfig.hfa /var/lib/jenkins/workspace/Cforall_master/libcfa/src/rational.hfa /var/lib/jenkins/workspace/Cforall_master/libcfa/src/stdlib.hfa /var/lib/jenkins/workspace/Cforall_master/libcfa/src/strstream.hfa /var/lib/jenkins/workspace/Cforall_master/libcfa/src/time.hfa /var/lib/jenkins/workspace/Cforall_master/libcfa/src/Exception.hfa /var/lib/jenkins/workspace/Cforall_master/libcfa/src/bitmanip.hfa /var/lib/jenkins/workspace/Cforall_master/libcfa/src/clock.hfa /var/lib/jenkins/workspace/Cforall_master/libcfa/src/exception.hfa /var/lib/jenkins/workspace/Cforall_master/libcfa/src/exception.h /var/lib/jenkins/workspace/Cforall_master/libcfa/src/gmp.hfa /var/lib/jenkins/workspace/Cforall_master/libcfa/src/math.trait.hfa /var/lib/jenkins/workspace/Cforall_master/libcfa/src/raii.hfa /var/lib/jenkins/workspace/Cforall_master/libcfa/src/time_t.hfa /var/lib/jenkins/workspace/Cforall_master/libcfa/src/virtual_dtor.hfa '/var/lib/jenkins/workspace/Cforall_master@tmp/include/cfa//.'
22:53:57 /usr/bin/mkdir -p '/var/lib/jenkins/workspace/Cforall_master@tmp/include/cfa//concurrency'
22:53:57 /usr/bin/install -c -m 644 /var/lib/jenkins/workspace/Cforall_master/libcfa/src/concurrency/iofwd.hfa /var/lib/jenkins/workspace/Cforall_master/libcfa/src/concurrency/barrier.hfa /var/lib/jenkins/workspace/Cforall_master/libcfa/src/concurrency/alarm.hfa /var/lib/jenkins/workspace/Cforall_master/libcfa/src/concurrency/coroutine.hfa /var/lib/jenkins/workspace/Cforall_master/libcfa/src/concurrency/exception.hfa /var/lib/jenkins/workspace/Cforall_master/libcfa/src/concurrency/kernel.hfa /var/lib/jenkins/workspace/Cforall_master/libcfa/src/concurrency/locks.hfa /var/lib/jenkins/workspace/Cforall_master/libcfa/src/concurrency/monitor.hfa /var/lib/jenkins/workspace/Cforall_master/libcfa/src/concurrency/mutex.hfa /var/lib/jenkins/workspace/Cforall_master/libcfa/src/concurrency/select.hfa /var/lib/jenkins/workspace/Cforall_master/libcfa/src/concurrency/thread.hfa /var/lib/jenkins/workspace/Cforall_master/libcfa/src/concurrency/cofor.hfa /var/lib/jenkins/workspace/Cforall_master/libcfa/src/concurrency/invoke.h /var/lib/jenkins/workspace/Cforall_master/libcfa/src/concurrency/future.hfa /var/lib/jenkins/workspace/Cforall_master/libcfa/src/concurrency/once.hfa /var/lib/jenkins/workspace/Cforall_master/libcfa/src/concurrency/mutex_stmt.hfa /var/lib/jenkins/workspace/Cforall_master/libcfa/src/concurrency/channel.hfa /var/lib/jenkins/workspace/Cforall_master/libcfa/src/concurrency/actor.hfa '/var/lib/jenkins/workspace/Cforall_master@tmp/include/cfa//concurrency'
22:53:57 /usr/bin/mkdir -p '/var/lib/jenkins/workspace/Cforall_master@tmp/include/cfa//concurrency/clib'
22:53:57 /usr/bin/install -c -m 644 /var/lib/jenkins/workspace/Cforall_master/libcfa/src/concurrency/clib/cfathread.h '/var/lib/jenkins/workspace/Cforall_master@tmp/include/cfa//concurrency/clib'
22:53:57 /usr/bin/mkdir -p '/var/lib/jenkins/workspace/Cforall_master@tmp/include/cfa//device'
22:53:57 /usr/bin/install -c -m 644 /var/lib/jenkins/workspace/Cforall_master/libcfa/src/device/cpu.hfa '/var/lib/jenkins/workspace/Cforall_master@tmp/include/cfa//device'
22:53:57 /usr/bin/mkdir -p '/var/lib/jenkins/workspace/Cforall_master@tmp/include/cfa//stdhdr/libltdl'
22:53:57 /usr/bin/install -c -m 644 /var/lib/jenkins/workspace/Cforall_master/libcfa/src/stdhdr/libltdl/lt_dlloader.h '/var/lib/jenkins/workspace/Cforall_master@tmp/include/cfa//stdhdr/libltdl'
22:53:57 /usr/bin/mkdir -p '/var/lib/jenkins/workspace/Cforall_master@tmp/include/cfa//vec'
22:53:57 /usr/bin/install -c -m 644 /var/lib/jenkins/workspace/Cforall_master/libcfa/src/vec/vec.hfa /var/lib/jenkins/workspace/Cforall_master/libcfa/src/vec/vec2.hfa /var/lib/jenkins/workspace/Cforall_master/libcfa/src/vec/vec3.hfa /var/lib/jenkins/workspace/Cforall_master/libcfa/src/vec/vec4.hfa '/var/lib/jenkins/workspace/Cforall_master@tmp/include/cfa//vec'
22:53:57libtool: install: /usr/bin/install -c .libs/libcfa.so.1.0.0 /var/lib/jenkins/workspace/Cforall_master@tmp/lib/cfa/arm64-debug/libcfa.so.1.0.0
22:53:57 /usr/bin/mkdir -p '/var/lib/jenkins/workspace/Cforall_master@tmp/include/cfa//bits'
22:53:57 /usr/bin/install -c -m 644 /var/lib/jenkins/workspace/Cforall_master/libcfa/src/bits/weakso_locks.hfa /var/lib/jenkins/workspace/Cforall_master/libcfa/src/bits/algorithm.hfa /var/lib/jenkins/workspace/Cforall_master/libcfa/src/bits/align.hfa /var/lib/jenkins/workspace/Cforall_master/libcfa/src/bits/collections.hfa /var/lib/jenkins/workspace/Cforall_master/libcfa/src/bits/debug.hfa /var/lib/jenkins/workspace/Cforall_master/libcfa/src/bits/defs.hfa /var/lib/jenkins/workspace/Cforall_master/libcfa/src/bits/locks.hfa /var/lib/jenkins/workspace/Cforall_master/libcfa/src/bits/collection.hfa /var/lib/jenkins/workspace/Cforall_master/libcfa/src/bits/stack.hfa /var/lib/jenkins/workspace/Cforall_master/libcfa/src/bits/queue.hfa /var/lib/jenkins/workspace/Cforall_master/libcfa/src/bits/sequence.hfa /var/lib/jenkins/workspace/Cforall_master/libcfa/src/bits/atomic.hfa /var/lib/jenkins/workspace/Cforall_master/libcfa/src/bits/random.hfa '/var/lib/jenkins/workspace/Cforall_master@tmp/include/cfa//bits'
22:53:57libtool: install: (cd /var/lib/jenkins/workspace/Cforall_master@tmp/lib/cfa/arm64-debug && { ln -s -f libcfa.so.1.0.0 libcfa.so.1 || { rm -f libcfa.so.1 && ln -s libcfa.so.1.0.0 libcfa.so.1; }; })
22:53:57 /usr/bin/mkdir -p '/var/lib/jenkins/workspace/Cforall_master@tmp/include/cfa//stdhdr'
22:53:57 /usr/bin/install -c -m 644 /var/lib/jenkins/workspace/Cforall_master/libcfa/src/stdhdr/stdalign.h /var/lib/jenkins/workspace/Cforall_master/libcfa/src/stdhdr/stdio.h /var/lib/jenkins/workspace/Cforall_master/libcfa/src/stdhdr/malloc.h /var/lib/jenkins/workspace/Cforall_master/libcfa/src/stdhdr/time.h /var/lib/jenkins/workspace/Cforall_master/libcfa/src/stdhdr/signal.h /var/lib/jenkins/workspace/Cforall_master/libcfa/src/stdhdr/stdbool.h /var/lib/jenkins/workspace/Cforall_master/libcfa/src/stdhdr/unistd.h /var/lib/jenkins/workspace/Cforall_master/libcfa/src/stdhdr/stdatomic.h /var/lib/jenkins/workspace/Cforall_master/libcfa/src/stdhdr/stdint.h /var/lib/jenkins/workspace/Cforall_master/libcfa/src/stdhdr/gmp.h /var/lib/jenkins/workspace/Cforall_master/libcfa/src/stdhdr/locale.h /var/lib/jenkins/workspace/Cforall_master/libcfa/src/stdhdr/string.h /var/lib/jenkins/workspace/Cforall_master/libcfa/src/stdhdr/fenv.h /var/lib/jenkins/workspace/Cforall_master/libcfa/src/stdhdr/wchar.h /var/lib/jenkins/workspace/Cforall_master/libcfa/src/stdhdr/tgmath.h /var/lib/jenkins/workspace/Cforall_master/libcfa/src/stdhdr/math.h /var/lib/jenkins/workspace/Cforall_master/libcfa/src/stdhdr/pthread.h /var/lib/jenkins/workspace/Cforall_master/libcfa/src/stdhdr/complex.h /var/lib/jenkins/workspace/Cforall_master/libcfa/src/stdhdr/wctype.h /var/lib/jenkins/workspace/Cforall_master/libcfa/src/stdhdr/unwind.h /var/lib/jenkins/workspace/Cforall_master/libcfa/src/stdhdr/float.h /var/lib/jenkins/workspace/Cforall_master/libcfa/src/stdhdr/stdarg.h /var/lib/jenkins/workspace/Cforall_master/libcfa/src/stdhdr/stdlib.h /var/lib/jenkins/workspace/Cforall_master/libcfa/src/stdhdr/iso646.h /var/lib/jenkins/workspace/Cforall_master/libcfa/src/stdhdr/stddef.h /var/lib/jenkins/workspace/Cforall_master/libcfa/src/stdhdr/stdnoreturn.h /var/lib/jenkins/workspace/Cforall_master/libcfa/src/stdhdr/assert.h /var/lib/jenkins/workspace/Cforall_master/libcfa/src/stdhdr/ctype.h /var/lib/jenkins/workspace/Cforall_master/libcfa/src/stdhdr/errno.h /var/lib/jenkins/workspace/Cforall_master/libcfa/src/stdhdr/threads.h /var/lib/jenkins/workspace/Cforall_master/libcfa/src/stdhdr/uchar.h /var/lib/jenkins/workspace/Cforall_master/libcfa/src/stdhdr/inttypes.h /var/lib/jenkins/workspace/Cforall_master/libcfa/src/stdhdr/limits.h /var/lib/jenkins/workspace/Cforall_master/libcfa/src/stdhdr/setjmp.h '/var/lib/jenkins/workspace/Cforall_master@tmp/include/cfa//stdhdr'
22:53:57 /usr/bin/mkdir -p '/var/lib/jenkins/workspace/Cforall_master@tmp/include/cfa//collections'
22:53:57libtool: install: (cd /var/lib/jenkins/workspace/Cforall_master@tmp/lib/cfa/arm64-debug && { ln -s -f libcfa.so.1.0.0 libcfa.so || { rm -f libcfa.so && ln -s libcfa.so.1.0.0 libcfa.so; }; })
22:53:57 /usr/bin/install -c -m 644 /var/lib/jenkins/workspace/Cforall_master/libcfa/src/collections/maybe.hfa /var/lib/jenkins/workspace/Cforall_master/libcfa/src/collections/pair.hfa /var/lib/jenkins/workspace/Cforall_master/libcfa/src/collections/result.hfa /var/lib/jenkins/workspace/Cforall_master/libcfa/src/collections/string.hfa /var/lib/jenkins/workspace/Cforall_master/libcfa/src/collections/string_res.hfa /var/lib/jenkins/workspace/Cforall_master/libcfa/src/collections/vector.hfa /var/lib/jenkins/workspace/Cforall_master/libcfa/src/collections/array.hfa /var/lib/jenkins/workspace/Cforall_master/libcfa/src/collections/list.hfa /var/lib/jenkins/workspace/Cforall_master/libcfa/src/collections/list2.hfa /var/lib/jenkins/workspace/Cforall_master/libcfa/src/collections/lockfree.hfa /var/lib/jenkins/workspace/Cforall_master/libcfa/src/collections/string_sharectx.hfa /var/lib/jenkins/workspace/Cforall_master/libcfa/src/collections/vector2.hfa '/var/lib/jenkins/workspace/Cforall_master@tmp/include/cfa//collections'
22:53:57libtool: install: /usr/bin/install -c .libs/libcfa.lai /var/lib/jenkins/workspace/Cforall_master@tmp/lib/cfa/arm64-debug/libcfa.la
22:53:57libtool: install: /usr/bin/install -c .libs/libcfathread.so.1.0.0 /var/lib/jenkins/workspace/Cforall_master@tmp/lib/cfa/arm64-debug/libcfathread.so.1.0.0
22:53:57libtool: install: (cd /var/lib/jenkins/workspace/Cforall_master@tmp/lib/cfa/arm64-debug && { ln -s -f libcfathread.so.1.0.0 libcfathread.so.1 || { rm -f libcfathread.so.1 && ln -s libcfathread.so.1.0.0 libcfathread.so.1; }; })
22:53:57libtool: install: (cd /var/lib/jenkins/workspace/Cforall_master@tmp/lib/cfa/arm64-debug && { ln -s -f libcfathread.so.1.0.0 libcfathread.so || { rm -f libcfathread.so && ln -s libcfathread.so.1.0.0 libcfathread.so; }; })
22:53:57libtool: install: /usr/bin/install -c .libs/libcfathread.lai /var/lib/jenkins/workspace/Cforall_master@tmp/lib/cfa/arm64-debug/libcfathread.la
22:53:57libtool: warning: remember to run 'libtool --finish /var/lib/jenkins/workspace/Cforall_master@tmp/lib/cfa/arm64-debug/'
22:53:57make[3]: Nothing to be done for 'install-exec-am'.
22:53:57make[3]: Nothing to be done for 'install-data-am'.
22:53:57Making install in libcfa/arm64-nodebug
22:53:57Making install in prelude
22:53:57make[3]: Nothing to be done for 'install-exec-am'.
22:53:57 /usr/bin/mkdir -p '/var/lib/jenkins/workspace/Cforall_master@tmp/lib/cfa/arm64-nodebug/'
22:53:57 /usr/bin/install -c -m 644 gcc-builtins.cfa builtins.cfa extras.cfa prelude.cfa bootloader.c defines.hfa '/var/lib/jenkins/workspace/Cforall_master@tmp/lib/cfa/arm64-nodebug/'
22:53:57Making install in src
22:53:57 /usr/bin/mkdir -p '/var/lib/jenkins/workspace/Cforall_master@tmp/lib/cfa/arm64-nodebug/'
22:53:57 /bin/bash ../libtool --mode=install /usr/bin/install -c libcfa.la libcfathread.la '/var/lib/jenkins/workspace/Cforall_master@tmp/lib/cfa/arm64-nodebug/'
22:53:57 /usr/bin/mkdir -p '/var/lib/jenkins/workspace/Cforall_master@tmp/include/cfa/'
22:53:57 /usr/bin/mkdir -p '/var/lib/jenkins/workspace/Cforall_master@tmp/include/cfa//stdhdr/sys'
22:53:57 /usr/bin/install -c -m 644 /var/lib/jenkins/workspace/Cforall_master/libcfa/src/stdhdr/sys/mman.h /var/lib/jenkins/workspace/Cforall_master/libcfa/src/stdhdr/sys/time.h /var/lib/jenkins/workspace/Cforall_master/libcfa/src/stdhdr/sys/socket.h '/var/lib/jenkins/workspace/Cforall_master@tmp/include/cfa//stdhdr/sys'
22:53:57 /usr/bin/mkdir -p '/var/lib/jenkins/workspace/Cforall_master@tmp/include/cfa//algorithms'
22:53:57 /usr/bin/install -c -m 644 /var/lib/jenkins/workspace/Cforall_master/libcfa/src/algorithms/range_iterator.hfa '/var/lib/jenkins/workspace/Cforall_master@tmp/include/cfa//algorithms'
22:53:57 /usr/bin/mkdir -p '/var/lib/jenkins/workspace/Cforall_master@tmp/include/cfa//concurrency/kernel'
22:53:57 /usr/bin/install -c -m 644 /var/lib/jenkins/workspace/Cforall_master/libcfa/src/concurrency/kernel/cluster.hfa /var/lib/jenkins/workspace/Cforall_master/libcfa/src/concurrency/kernel/fwd.hfa '/var/lib/jenkins/workspace/Cforall_master@tmp/include/cfa//concurrency/kernel'
22:53:57 /usr/bin/install -c -m 644 /var/lib/jenkins/workspace/Cforall_master/libcfa/src/common.hfa /var/lib/jenkins/workspace/Cforall_master/libcfa/src/fstream.hfa /var/lib/jenkins/workspace/Cforall_master/libcfa/src/heap.hfa /var/lib/jenkins/workspace/Cforall_master/libcfa/src/iostream.hfa /var/lib/jenkins/workspace/Cforall_master/libcfa/src/iterator.hfa /var/lib/jenkins/workspace/Cforall_master/libcfa/src/limits.hfa /var/lib/jenkins/workspace/Cforall_master/libcfa/src/math.hfa /var/lib/jenkins/workspace/Cforall_master/libcfa/src/memory.hfa /var/lib/jenkins/workspace/Cforall_master/libcfa/src/parseargs.hfa /var/lib/jenkins/workspace/Cforall_master/libcfa/src/parseconfig.hfa /var/lib/jenkins/workspace/Cforall_master/libcfa/src/rational.hfa /var/lib/jenkins/workspace/Cforall_master/libcfa/src/stdlib.hfa /var/lib/jenkins/workspace/Cforall_master/libcfa/src/strstream.hfa /var/lib/jenkins/workspace/Cforall_master/libcfa/src/time.hfa /var/lib/jenkins/workspace/Cforall_master/libcfa/src/Exception.hfa /var/lib/jenkins/workspace/Cforall_master/libcfa/src/bitmanip.hfa /var/lib/jenkins/workspace/Cforall_master/libcfa/src/clock.hfa /var/lib/jenkins/workspace/Cforall_master/libcfa/src/exception.hfa /var/lib/jenkins/workspace/Cforall_master/libcfa/src/exception.h /var/lib/jenkins/workspace/Cforall_master/libcfa/src/gmp.hfa /var/lib/jenkins/workspace/Cforall_master/libcfa/src/math.trait.hfa /var/lib/jenkins/workspace/Cforall_master/libcfa/src/raii.hfa /var/lib/jenkins/workspace/Cforall_master/libcfa/src/time_t.hfa /var/lib/jenkins/workspace/Cforall_master/libcfa/src/virtual_dtor.hfa '/var/lib/jenkins/workspace/Cforall_master@tmp/include/cfa//.'
22:53:57 /usr/bin/mkdir -p '/var/lib/jenkins/workspace/Cforall_master@tmp/include/cfa//concurrency'
22:53:57 /usr/bin/install -c -m 644 /var/lib/jenkins/workspace/Cforall_master/libcfa/src/concurrency/iofwd.hfa /var/lib/jenkins/workspace/Cforall_master/libcfa/src/concurrency/barrier.hfa /var/lib/jenkins/workspace/Cforall_master/libcfa/src/concurrency/alarm.hfa /var/lib/jenkins/workspace/Cforall_master/libcfa/src/concurrency/coroutine.hfa /var/lib/jenkins/workspace/Cforall_master/libcfa/src/concurrency/exception.hfa /var/lib/jenkins/workspace/Cforall_master/libcfa/src/concurrency/kernel.hfa /var/lib/jenkins/workspace/Cforall_master/libcfa/src/concurrency/locks.hfa /var/lib/jenkins/workspace/Cforall_master/libcfa/src/concurrency/monitor.hfa /var/lib/jenkins/workspace/Cforall_master/libcfa/src/concurrency/mutex.hfa /var/lib/jenkins/workspace/Cforall_master/libcfa/src/concurrency/select.hfa /var/lib/jenkins/workspace/Cforall_master/libcfa/src/concurrency/thread.hfa /var/lib/jenkins/workspace/Cforall_master/libcfa/src/concurrency/cofor.hfa /var/lib/jenkins/workspace/Cforall_master/libcfa/src/concurrency/invoke.h /var/lib/jenkins/workspace/Cforall_master/libcfa/src/concurrency/future.hfa /var/lib/jenkins/workspace/Cforall_master/libcfa/src/concurrency/once.hfa /var/lib/jenkins/workspace/Cforall_master/libcfa/src/concurrency/mutex_stmt.hfa /var/lib/jenkins/workspace/Cforall_master/libcfa/src/concurrency/channel.hfa /var/lib/jenkins/workspace/Cforall_master/libcfa/src/concurrency/actor.hfa '/var/lib/jenkins/workspace/Cforall_master@tmp/include/cfa//concurrency'
22:53:57 /usr/bin/mkdir -p '/var/lib/jenkins/workspace/Cforall_master@tmp/include/cfa//concurrency/clib'
22:53:57 /usr/bin/install -c -m 644 /var/lib/jenkins/workspace/Cforall_master/libcfa/src/concurrency/clib/cfathread.h '/var/lib/jenkins/workspace/Cforall_master@tmp/include/cfa//concurrency/clib'
22:53:57 /usr/bin/mkdir -p '/var/lib/jenkins/workspace/Cforall_master@tmp/include/cfa//device'
22:53:57 /usr/bin/install -c -m 644 /var/lib/jenkins/workspace/Cforall_master/libcfa/src/device/cpu.hfa '/var/lib/jenkins/workspace/Cforall_master@tmp/include/cfa//device'
22:53:57 /usr/bin/mkdir -p '/var/lib/jenkins/workspace/Cforall_master@tmp/include/cfa//stdhdr/libltdl'
22:53:57 /usr/bin/install -c -m 644 /var/lib/jenkins/workspace/Cforall_master/libcfa/src/stdhdr/libltdl/lt_dlloader.h '/var/lib/jenkins/workspace/Cforall_master@tmp/include/cfa//stdhdr/libltdl'
22:53:57libtool: install: /usr/bin/install -c .libs/libcfa.so.1.0.0 /var/lib/jenkins/workspace/Cforall_master@tmp/lib/cfa/arm64-nodebug/libcfa.so.1.0.0
22:53:57 /usr/bin/mkdir -p '/var/lib/jenkins/workspace/Cforall_master@tmp/include/cfa//vec'
22:53:57 /usr/bin/install -c -m 644 /var/lib/jenkins/workspace/Cforall_master/libcfa/src/vec/vec.hfa /var/lib/jenkins/workspace/Cforall_master/libcfa/src/vec/vec2.hfa /var/lib/jenkins/workspace/Cforall_master/libcfa/src/vec/vec3.hfa /var/lib/jenkins/workspace/Cforall_master/libcfa/src/vec/vec4.hfa '/var/lib/jenkins/workspace/Cforall_master@tmp/include/cfa//vec'
22:53:57 /usr/bin/mkdir -p '/var/lib/jenkins/workspace/Cforall_master@tmp/include/cfa//bits'
22:53:57 /usr/bin/install -c -m 644 /var/lib/jenkins/workspace/Cforall_master/libcfa/src/bits/weakso_locks.hfa /var/lib/jenkins/workspace/Cforall_master/libcfa/src/bits/algorithm.hfa /var/lib/jenkins/workspace/Cforall_master/libcfa/src/bits/align.hfa /var/lib/jenkins/workspace/Cforall_master/libcfa/src/bits/collections.hfa /var/lib/jenkins/workspace/Cforall_master/libcfa/src/bits/debug.hfa /var/lib/jenkins/workspace/Cforall_master/libcfa/src/bits/defs.hfa /var/lib/jenkins/workspace/Cforall_master/libcfa/src/bits/locks.hfa /var/lib/jenkins/workspace/Cforall_master/libcfa/src/bits/collection.hfa /var/lib/jenkins/workspace/Cforall_master/libcfa/src/bits/stack.hfa /var/lib/jenkins/workspace/Cforall_master/libcfa/src/bits/queue.hfa /var/lib/jenkins/workspace/Cforall_master/libcfa/src/bits/sequence.hfa /var/lib/jenkins/workspace/Cforall_master/libcfa/src/bits/atomic.hfa /var/lib/jenkins/workspace/Cforall_master/libcfa/src/bits/random.hfa '/var/lib/jenkins/workspace/Cforall_master@tmp/include/cfa//bits'
22:53:57libtool: install: (cd /var/lib/jenkins/workspace/Cforall_master@tmp/lib/cfa/arm64-nodebug && { ln -s -f libcfa.so.1.0.0 libcfa.so.1 || { rm -f libcfa.so.1 && ln -s libcfa.so.1.0.0 libcfa.so.1; }; })
22:53:57 /usr/bin/mkdir -p '/var/lib/jenkins/workspace/Cforall_master@tmp/include/cfa//stdhdr'
22:53:57 /usr/bin/install -c -m 644 /var/lib/jenkins/workspace/Cforall_master/libcfa/src/stdhdr/stdalign.h /var/lib/jenkins/workspace/Cforall_master/libcfa/src/stdhdr/stdio.h /var/lib/jenkins/workspace/Cforall_master/libcfa/src/stdhdr/malloc.h /var/lib/jenkins/workspace/Cforall_master/libcfa/src/stdhdr/time.h /var/lib/jenkins/workspace/Cforall_master/libcfa/src/stdhdr/signal.h /var/lib/jenkins/workspace/Cforall_master/libcfa/src/stdhdr/stdbool.h /var/lib/jenkins/workspace/Cforall_master/libcfa/src/stdhdr/unistd.h /var/lib/jenkins/workspace/Cforall_master/libcfa/src/stdhdr/stdatomic.h /var/lib/jenkins/workspace/Cforall_master/libcfa/src/stdhdr/stdint.h /var/lib/jenkins/workspace/Cforall_master/libcfa/src/stdhdr/gmp.h /var/lib/jenkins/workspace/Cforall_master/libcfa/src/stdhdr/locale.h /var/lib/jenkins/workspace/Cforall_master/libcfa/src/stdhdr/string.h /var/lib/jenkins/workspace/Cforall_master/libcfa/src/stdhdr/fenv.h /var/lib/jenkins/workspace/Cforall_master/libcfa/src/stdhdr/wchar.h /var/lib/jenkins/workspace/Cforall_master/libcfa/src/stdhdr/tgmath.h /var/lib/jenkins/workspace/Cforall_master/libcfa/src/stdhdr/math.h /var/lib/jenkins/workspace/Cforall_master/libcfa/src/stdhdr/pthread.h /var/lib/jenkins/workspace/Cforall_master/libcfa/src/stdhdr/complex.h /var/lib/jenkins/workspace/Cforall_master/libcfa/src/stdhdr/wctype.h /var/lib/jenkins/workspace/Cforall_master/libcfa/src/stdhdr/unwind.h /var/lib/jenkins/workspace/Cforall_master/libcfa/src/stdhdr/float.h /var/lib/jenkins/workspace/Cforall_master/libcfa/src/stdhdr/stdarg.h /var/lib/jenkins/workspace/Cforall_master/libcfa/src/stdhdr/stdlib.h /var/lib/jenkins/workspace/Cforall_master/libcfa/src/stdhdr/iso646.h /var/lib/jenkins/workspace/Cforall_master/libcfa/src/stdhdr/stddef.h /var/lib/jenkins/workspace/Cforall_master/libcfa/src/stdhdr/stdnoreturn.h /var/lib/jenkins/workspace/Cforall_master/libcfa/src/stdhdr/assert.h /var/lib/jenkins/workspace/Cforall_master/libcfa/src/stdhdr/ctype.h /var/lib/jenkins/workspace/Cforall_master/libcfa/src/stdhdr/errno.h /var/lib/jenkins/workspace/Cforall_master/libcfa/src/stdhdr/threads.h /var/lib/jenkins/workspace/Cforall_master/libcfa/src/stdhdr/uchar.h /var/lib/jenkins/workspace/Cforall_master/libcfa/src/stdhdr/inttypes.h /var/lib/jenkins/workspace/Cforall_master/libcfa/src/stdhdr/limits.h /var/lib/jenkins/workspace/Cforall_master/libcfa/src/stdhdr/setjmp.h '/var/lib/jenkins/workspace/Cforall_master@tmp/include/cfa//stdhdr'
22:53:57libtool: install: (cd /var/lib/jenkins/workspace/Cforall_master@tmp/lib/cfa/arm64-nodebug && { ln -s -f libcfa.so.1.0.0 libcfa.so || { rm -f libcfa.so && ln -s libcfa.so.1.0.0 libcfa.so; }; })
22:53:57 /usr/bin/mkdir -p '/var/lib/jenkins/workspace/Cforall_master@tmp/include/cfa//collections'
22:53:57 /usr/bin/install -c -m 644 /var/lib/jenkins/workspace/Cforall_master/libcfa/src/collections/maybe.hfa /var/lib/jenkins/workspace/Cforall_master/libcfa/src/collections/pair.hfa /var/lib/jenkins/workspace/Cforall_master/libcfa/src/collections/result.hfa /var/lib/jenkins/workspace/Cforall_master/libcfa/src/collections/string.hfa /var/lib/jenkins/workspace/Cforall_master/libcfa/src/collections/string_res.hfa /var/lib/jenkins/workspace/Cforall_master/libcfa/src/collections/vector.hfa /var/lib/jenkins/workspace/Cforall_master/libcfa/src/collections/array.hfa /var/lib/jenkins/workspace/Cforall_master/libcfa/src/collections/list.hfa /var/lib/jenkins/workspace/Cforall_master/libcfa/src/collections/list2.hfa /var/lib/jenkins/workspace/Cforall_master/libcfa/src/collections/lockfree.hfa /var/lib/jenkins/workspace/Cforall_master/libcfa/src/collections/string_sharectx.hfa /var/lib/jenkins/workspace/Cforall_master/libcfa/src/collections/vector2.hfa '/var/lib/jenkins/workspace/Cforall_master@tmp/include/cfa//collections'
22:53:57libtool: install: /usr/bin/install -c .libs/libcfa.lai /var/lib/jenkins/workspace/Cforall_master@tmp/lib/cfa/arm64-nodebug/libcfa.la
22:53:57libtool: install: /usr/bin/install -c .libs/libcfathread.so.1.0.0 /var/lib/jenkins/workspace/Cforall_master@tmp/lib/cfa/arm64-nodebug/libcfathread.so.1.0.0
22:53:57libtool: install: (cd /var/lib/jenkins/workspace/Cforall_master@tmp/lib/cfa/arm64-nodebug && { ln -s -f libcfathread.so.1.0.0 libcfathread.so.1 || { rm -f libcfathread.so.1 && ln -s libcfathread.so.1.0.0 libcfathread.so.1; }; })
22:53:57libtool: install: (cd /var/lib/jenkins/workspace/Cforall_master@tmp/lib/cfa/arm64-nodebug && { ln -s -f libcfathread.so.1.0.0 libcfathread.so || { rm -f libcfathread.so && ln -s libcfathread.so.1.0.0 libcfathread.so; }; })
22:53:57libtool: install: /usr/bin/install -c .libs/libcfathread.lai /var/lib/jenkins/workspace/Cforall_master@tmp/lib/cfa/arm64-nodebug/libcfathread.la
22:53:57libtool: warning: remember to run 'libtool --finish /var/lib/jenkins/workspace/Cforall_master@tmp/lib/cfa/arm64-nodebug/'
22:53:57make[3]: Nothing to be done for 'install-exec-am'.
22:53:57make[3]: Nothing to be done for 'install-data-am'.
22:53:57[Pipeline] }
22:53:57[Pipeline] // dir
22:53:57[Pipeline] }
22:53:57[Pipeline] // stage
22:53:57[Pipeline] sh
22:53:57+ free -h
22:53:57 total used free shared buff/cache available
22:53:57Mem: 502Gi 7.4Gi 489Gi 3.5Mi 8.5Gi 495Gi
22:53:57Swap: 127Gi 0B 127Gi
22:53:57[Pipeline] sh
22:53:57+ ulimit -a
22:53:57time(seconds) unlimited
22:53:57file(blocks) unlimited
22:53:57data(kbytes) unlimited
22:53:57stack(kbytes) 8192
22:53:57coredump(blocks) 0
22:53:57memory(kbytes) unlimited
22:53:57locked memory(kbytes) 65876424
22:53:57process 2058180
22:53:57nofiles 1048576
22:53:57vmemory(kbytes) unlimited
22:53:57locks unlimited
22:53:57rtprio 0
22:53:57[Pipeline] echo
22:53:57 -------- Test: Debug --------
22:53:57[Pipeline] stage
22:53:57[Pipeline] { (Test: Debug)
22:53:57[Pipeline] dir
22:53:57Running in /var/lib/jenkins/workspace/Cforall_master@tmp
22:53:57[Pipeline] {
22:53:57[Pipeline] sh
22:53:57+ nproc
22:53:57+ make -j 96 --no-print-directory -C tests timeout=600 global-timeout=14400 tests debug=yes archive-errors=/var/lib/jenkins/workspace/Cforall_master@tmp/tests/crashes/full-debug
22:53:57Running 375 tests on 96 cores (arm64 - debug)
22:53:57 array-ERR2 PASSED C 0:00.114 - R n/a
22:53:57 array-ERR3 PASSED C 0:00.174 - R n/a
22:53:57 ...ollections/language-dim-mismatch PASSED C 0:00.383 - R n/a
22:53:57 concurrency/mainError PASSED C 0:00.452 - R n/a
22:53:57 concurrency/keywordErrors PASSED C 0:00.633 - R n/a
22:53:57 castError PASSED C 0:00.938 - R n/a
22:53:57 array-collections/symtab-collision PASSED C 0:00.980 - R n/a
22:53:57 array-collections/safety-summary PASSED C 0:01.189 - R n/a
22:53:57 concurrency/ctor-check PASSED C 0:01.199 - R n/a
22:53:57 attr-priority PASSED C 0:01.489 - R 0:00.002
22:53:57 array-ERR1 PASSED C 0:01.529 - R n/a
22:53:57 castReturn PASSED C 0:01.726 - R 0:00.045
22:53:57 array PASSED C 0:01.787 - R 0:00.021
22:53:57 array-collections/c-dependent PASSED C 0:01.749 - R 0:00.127
22:53:57 array-collections/array-raii-c PASSED C 0:01.943 - R 0:00.040
22:53:57 cast PASSED C 0:01.881 - R 0:00.126
22:53:57 array-collections/dimexpr-match-c PASSED C 0:02.144 - R 0:00.039
22:53:57 builtins/sync PASSED C 0:02.078 - R 0:00.130
22:53:57 concurrency/clib_tls PASSED C 0:02.728 - R 0:00.038
22:53:57 array-collections/array-sbscr-types PASSED C 0:02.846 - R 0:00.040
22:53:57 ...ns/vector-err-retn-perm-it-byval PASSED C 0:02.972 - R n/a
22:53:57 array-collections/dimexpr-match-cfa PASSED C 0:03.062 - R 0:00.021
22:53:57 array-collections/boxed PASSED C 0:03.135 - R 0:00.041
22:53:57 concurrency/clib PASSED C 0:02.887 - R 0:00.273
22:53:57 array-collections/array-basic PASSED C 0:03.183 - R 0:00.024
22:53:57 ...ns/vector-err-pass-perm-it-byval PASSED C 0:03.339 - R n/a
22:53:57 collections/string-operator-ERR15 PASSED C 0:05.380 - R n/a
22:53:57 collections/string-operator-ERR09 PASSED C 0:05.400 - R n/a
22:53:57 collections/string-operator-ERR13 PASSED C 0:05.433 - R n/a
22:53:57 collections/string-operator-ERR16 PASSED C 0:05.468 - R n/a
22:53:57 avl_test PASSED C 0:05.535 - R 0:00.023
22:53:57 collections/string-operator-ERR11 PASSED C 0:05.685 - R n/a
22:53:57 ...urrency/pthread/pthread_key_test PASSED C 0:04.148 - R 0:00.037
22:53:57 alloc-ERROR PASSED C 0:06.054 - R n/a
22:53:57 collections/vector-demo PASSED C 0:06.267 - R 0:00.020
22:53:57 algorithms/range_test PASSED C 0:06.672 - R 0:00.021
22:53:57 complex PASSED C 0:07.123 - R 0:00.024
22:53:57 array-collections/array-raii-cfa PASSED C 0:07.369 - R 0:00.039
22:53:57 collections/string-gc PASSED C 0:07.653 - R 0:00.039
22:53:57 array-collections/accordion PASSED C 0:07.743 - R 0:00.039
22:53:57 collections/string-istream PASSED C 0:08.202 - R 0:00.038
22:53:57 concurrency/futures/basic PASSED C 0:08.945 - R 0:00.122
22:53:57 concurrency/cluster PASSED C 0:09.019 - R 0:00.072
22:53:57 concurrency/futures/abandon PASSED C 0:09.145 - R 0:00.172
22:53:57 concurrency/park/start_parked PASSED C 0:08.492 - R 0:00.123
22:53:57 collections/string-compare PASSED C 0:09.706 - R 0:00.021
22:53:57 concurrency/park/contention PASSED C 0:08.904 - R 0:00.272
22:53:57 collections/multi_list PASSED C 0:09.789 - R 0:00.024
22:53:57 collections/stack PASSED C 0:10.152 - R 0:00.039
22:53:57 collections/string-ostream PASSED C 0:10.342 - R 0:00.022
22:53:57 collections/sequence PASSED C 0:10.574 - R 0:00.021
22:53:57 collections/string-operator PASSED C 0:10.689 - R 0:00.028
22:53:57 concurrency/cofor PASSED C 0:10.776 - R 0:00.043
22:53:57 collections/string-ctx-manage PASSED C 0:10.840 - R 0:00.028
22:53:57 collections/queue PASSED C 0:10.903 - R 0:00.024
22:53:57 collections/string-istream-manip PASSED C 0:11.144 - R 0:00.224
22:53:57 ...ections/string-overwrite-noshare PASSED C 0:11.938 - R 0:00.073
22:53:57 concurrency/examples/gortn PASSED C 0:12.008 - R 0:00.125
22:53:57 collections/string-overwrite PASSED C 0:12.029 - R 0:00.222
22:53:57 concurrency/examples/matrixSum PASSED C 0:12.101 - R 0:00.127
22:53:57 concurrency/join PASSED C 0:12.169 - R 0:00.073
22:53:57 concurrency/coroutineYield PASSED C 0:12.523 - R 0:00.179
22:53:57 concurrency/migrate PASSED C 0:12.634 - R 0:00.235
22:53:57 concurrency/examples/datingService PASSED C 0:12.954 - R 0:00.072
22:53:57 const-init PASSED C 0:01.601 - R 0:00.074
22:53:57 alloc PASSED C 0:13.092 - R 0:00.124
22:53:57 ...rrency/pthread/pthread_cond_test PASSED C 0:11.895 - R 0:00.128
22:53:57 ...rrency/pthread/pthread_attr_test PASSED C 0:12.209 - R 0:00.123
22:53:57 ...pthread/pthread_demo_create_join PASSED C 0:12.146 - R 0:00.038
22:53:57 const-ref PASSED C 0:01.653 - R 0:00.079
22:53:57 ...rrency/pthread/pthread_once_test PASSED C 0:12.150 - R 0:00.072
22:53:57 collections/string-api-coverage PASSED C 0:14.357 - R 0:00.038
22:53:57 concurrency/park/force_preempt PASSED C 0:13.623 - R 0:00.435
22:53:57 ...ions/string-api-coverage-noshare PASSED C 0:14.726 - R 0:00.132
22:53:57 concurrency/futures/wait_any PASSED C 0:14.778 - R 0:00.228
22:53:57 concurrency/barrier/last PASSED C 0:14.780 - R 0:00.331
22:53:57 concurrency/once PASSED C 0:14.567 - R 0:00.328
22:53:57 concurrency/examples/quickSort PASSED C 0:15.338 - R 0:00.036
22:53:57 concurrency/waitfor/parse PASSED C 0:07.674 - R 0:00.038
22:53:57 concurrency/mutexstmt/tuple PASSED C 0:15.406 - R 0:00.039
22:53:57 concurrency/readyQ/leader_spin PASSED C 0:12.088 - R 0:01.530
22:53:57 ctrl-flow/labelledExit PASSED C 0:01.543 - R 0:00.040
22:53:57 concurrency/barrier/order PASSED C 0:15.619 - R 0:00.179
22:53:57 concurrency/suspend_then PASSED C 0:12.860 - R 0:00.076
22:53:57 ctrl-flow/loop-inc PASSED C 0:01.516 - R 0:00.069
22:53:57 concurrency/signal/wait PASSED C 0:13.038 - R 0:00.592
22:53:57 concurrency/lockfree_stack PASSED C 0:12.106 - R 0:04.752
22:53:57 enum_tests/lvalue PASSED C 0:00.915 - R n/a
22:53:57 alloc2 PASSED C 0:17.102 - R 0:00.072
22:53:57 enum PASSED C 0:01.722 - R 0:00.040
22:53:57 ...cy/unified_locking/pthread_locks PASSED C 0:10.938 - R 0:00.828
22:53:57 concurrency/thread PASSED C 0:14.125 - R 0:00.119
22:53:57 .../unified_locking/block_spin_lock PASSED C 0:14.070 - R 0:00.124
22:53:57 errors/declaration PASSED C 0:00.144 - R n/a
22:53:57 concurrency/sleep PASSED C 0:13.443 - R 0:01.231
22:53:57 errors/scope-type PASSED C 0:00.216 - R n/a
22:53:57 concurrency/waitfor/else PASSED C 0:10.593 - R 0:00.121
22:53:57 concurrency/actors/poison PASSED C 0:17.786 - R 0:00.122
22:53:57 errors/signature PASSED C 0:00.305 - R n/a
22:53:57 concurrency/mutexstmt/monitors PASSED C 0:09.771 - R 0:08.107
22:53:57 concurrency/actors/inline PASSED C 0:17.731 - R 0:00.286
22:53:57 concurrency/actors/static PASSED C 0:17.889 - R 0:00.270
22:53:57 ...ncy/unified_locking/timeout_lock PASSED C 0:10.867 - R 0:01.227
22:53:57 designations PASSED C 0:02.889 - R 0:00.126
22:53:57 ...ency/unified_locking/exp_backoff PASSED C 0:14.830 - R 0:00.172
22:53:57 enum_tests/inc-dec PASSED C 0:02.388 - R 0:00.076
22:53:57 concurrency/barrier/generation PASSED C 0:15.277 - R 0:03.083
22:53:57 concurrency/readyQ/barrier_sleeper PASSED C 0:14.191 - R 0:02.180
22:53:57 .../unified_locking/fast_block_lock PASSED C 0:14.829 - R 0:00.329
22:53:57 errors/scope PASSED C 0:01.014 - R n/a
22:53:57 concurrency/actors/inherit PASSED C 0:18.344 - R 0:00.120
22:53:57 concurrency/actors/pingpong PASSED C 0:18.289 - R 0:00.178
22:53:57 concurrency/actors/types PASSED C 0:18.370 - R 0:00.126
22:53:57 enum_tests/funcEnum PASSED C 0:02.673 - R 0:00.128
22:53:57 concurrency/actors/executor PASSED C 0:18.537 - R 0:00.178
22:53:57 concurrency/futures/typed PASSED C 0:18.648 - R 0:00.326
22:53:57 eval PASSED C 0:01.520 - R 0:00.038
22:53:57 concurrency/waitfor/barge PASSED C 0:12.120 - R 0:01.075
22:53:57 copyfile PASSED C 0:07.242 - R 0:00.122
22:53:57 ...urrency/waitfor/lexical_priority PASSED C 0:12.250 - R 0:00.074
22:53:57 enum_tests/structEnum PASSED C 0:02.649 - R 0:00.070
22:53:57 exceptions/try-ctrl-flow PASSED C 0:00.551 - R n/a
22:53:57 ...fied_locking/mcs_block_spin_lock PASSED C 0:14.521 - R 0:00.128
22:53:57 ...nified_locking/simple_owner_lock PASSED C 0:14.284 - R 0:00.223
22:53:57 exceptions/type-check PASSED C 0:00.649 - R n/a
22:53:57 concurrency/actors/matrixMultiply PASSED C 0:18.633 - R 0:01.687
22:53:57 counter PASSED C 0:07.156 - R 0:00.123
22:53:57 ctrl-flow/break-misc PASSED C 0:07.091 - R 0:00.042
22:53:57 ctrl-flow/fallthrough PASSED C 0:07.038 - R 0:00.042
22:53:57 ctrl-flow/ifwhileCtl PASSED C 0:06.856 - R 0:00.038
22:53:57 coroutine/fibonacci PASSED C 0:08.508 - R 0:00.074
22:53:57 configs/parsebools PASSED C 0:09.777 - R 0:00.278
22:53:57 concurrency/signal/block PASSED C 0:12.818 - R 0:06.148
22:53:57 exceptions/try-leave-catch PASSED C 0:01.608 - R 0:00.069
22:53:57 coroutine/fmtLines PASSED C 0:08.926 - R 0:00.122
22:53:57 concurrency/signal/disjoint PASSED C 0:13.174 - R 0:05.939
22:53:57 exceptions/message PASSED C 0:02.914 - R 0:00.073
22:53:57 coroutine/runningTotal PASSED C 0:08.573 - R 0:00.036
22:53:57 configs/parseconfig PASSED C 0:10.709 - R 0:00.125
22:53:57 ctrl-flow/loop_else PASSED C 0:06.943 - R 0:00.039
22:53:57 coroutine/pingpong PASSED C 0:09.069 - R 0:00.124
22:53:57 expression PASSED C 0:01.947 - R 0:00.069
22:53:57 configs/usage PASSED C 0:11.059 - R 0:00.072
22:53:57 ctrl-flow/goto PASSED C 0:08.273 - R 0:00.071
22:53:57 coroutine/raii PASSED C 0:09.001 - R 0:00.071
22:53:57 concurrency/waitfor/statment PASSED C 0:13.986 - R 0:00.126
22:53:57 global-monomorph PASSED C 0:01.504 - R 0:00.125
22:53:57 coroutine/devicedriver PASSED C 0:10.304 - R 0:00.072
22:53:57 concurrency/waitfor/when PASSED C 0:13.012 - R 0:00.524
22:53:57 ctrl-flow/loop_else-WRN1 PASSED C 0:07.890 - R 0:00.004
22:53:57 init1-ERROR PASSED C 0:00.802 - R n/a
22:53:57 concurrency/waituntil/timeout PASSED C 0:08.387 - R 0:03.687
22:53:57 identParamDeclarator PASSED C 0:01.746 - R 0:00.068
22:53:57 identFuncDeclarator PASSED C 0:01.946 - R 0:00.035
22:53:57 enum_tests/enumInlineValue PASSED C 0:07.795 - R 0:00.040
22:53:57 init1 PASSED C 0:01.622 - R 0:00.041
22:53:57 enum_tests/anonymous PASSED C 0:07.961 - R 0:00.074
22:53:57 enum_tests/input PASSED C 0:07.575 - R 0:00.176
22:53:57 enum_tests/stringEnum PASSED C 0:06.856 - R 0:00.020
22:53:57 coroutine/prodcons PASSED C 0:10.895 - R 0:00.125
22:53:57 include/vector-sequence PASSED C 0:02.137 - R 0:00.039
22:53:57 ...rrency/pthread/pthread_demo_lock PASSED C 0:12.053 - R 0:10.217
22:53:57 enum_tests/typedIntEnum PASSED C 0:06.857 - R 0:00.041
22:53:57 div PASSED C 0:08.993 - R 0:00.036
22:53:57 enum_tests/voidEnum PASSED C 0:07.237 - R 0:00.038
22:53:57 include/vector-collections PASSED C 0:03.112 - R 0:00.038
22:53:57 exceptions/conditional PASSED C 0:06.928 - R 0:00.076
22:53:57 concurrency/waitfor/recurse PASSED C 0:12.696 - R 0:04.501
22:53:57 ctrl-flow/loopctrl PASSED C 0:09.956 - R 0:00.039
22:53:57 exceptions/data-except PASSED C 0:07.037 - R 0:00.074
22:53:57 limits PASSED C 0:01.556 - R 0:00.127
22:53:57 exceptions/defaults PASSED C 0:07.296 - R 0:00.021
22:53:57 linking/nostdlib PASSED C 0:01.547 - R 0:00.045
22:53:57 exceptions/finally PASSED C 0:07.286 - R 0:00.129
22:53:57 exceptions/polymorphic PASSED C 0:07.238 - R 0:00.071
22:53:57 exceptions/interact PASSED C 0:07.344 - R 0:00.038
22:53:57 concurrency/waitfor/dtor PASSED C 0:12.051 - R 0:07.211
22:53:57 nested-types-ERR1 PASSED C 0:00.221 - R n/a
22:53:57 exceptions/terminate PASSED C 0:07.330 - R 0:00.120
22:53:57 enum_tests/planet PASSED C 0:09.546 - R 0:00.128
22:53:57 exceptions/cancel/coroutine PASSED C 0:08.213 - R 0:00.037
22:53:57 enum_tests/position PASSED C 0:09.212 - R 0:00.042
22:53:57 nested-types-ERR2 PASSED C 0:00.371 - R n/a
22:53:57 exceptions/resume PASSED C 0:07.670 - R 0:00.073
22:53:57 exceptions/trash PASSED C 0:07.186 - R 0:00.125
22:53:57 linkonce PASSED C 0:01.735 - R 0:00.038
22:53:57 concurrency/channels/daisy_chain PASSED C 0:16.431 - R 0:10.121
22:53:57 exceptions/conditional-threads PASSED C 0:08.472 - R 0:00.068
22:53:57 concurrency/channels/ping_pong PASSED C 0:16.430 - R 0:10.166
22:53:57 opt-params PASSED C 0:00.231 - R n/a
22:53:57 concurrency/channels/hot_potato PASSED C 0:16.593 - R 0:10.072
22:53:57 concurrency/channels/zero_size PASSED C 0:16.434 - R 0:10.222
22:53:57 concurrency/preempt PASSED C 0:13.723 - R 0:12.120
22:53:57 concurrency/channels/contend PASSED C 0:16.597 - R 0:10.324
22:53:57 exceptions/virtual-poly PASSED C 0:06.985 - R 0:00.039
22:53:57 generator/fmtLines PASSED C 0:06.539 - R 0:00.072
22:53:57 fstream_test PASSED C 0:06.815 - R 0:00.077
22:53:57 maybe PASSED C 0:01.869 - R 0:00.037
22:53:57 generator/fibonacci PASSED C 0:06.798 - R 0:00.123
22:53:57 concurrency/channels/pub_sub PASSED C 0:17.193 - R 0:10.103
22:53:57 polybits PASSED C 0:00.478 - R n/a
22:53:57 nested-types PASSED C 0:01.602 - R 0:00.039
22:53:57 exceptions/defaults-threads PASSED C 0:09.361 - R 0:00.037
22:53:57 genericUnion PASSED C 0:06.881 - R 0:00.035
22:53:57 nowarn/exception PASSED C 0:01.628 - R 0:00.040
22:53:57 generator/suspend_then PASSED C 0:06.995 - R 0:00.021
22:53:57 nowarn/no-autogen PASSED C 0:01.563 - R 0:00.130
22:53:57 numericConstants PASSED C 0:01.542 - R 0:00.024
22:53:57 nowarn/unused PASSED C 0:01.632 - R 0:00.024
22:53:57 operators PASSED C 0:01.603 - R 0:00.036
22:53:57 poly-bare-assn PASSED C 0:01.413 - R 0:00.045
22:53:57 nowarn/array PASSED C 0:01.889 - R 0:00.045
22:53:57 hello PASSED C 0:06.920 - R 0:00.075
22:53:57 exceptions/resume-threads PASSED C 0:09.319 - R 0:00.123
22:53:57 exceptions/terminate-threads PASSED C 0:09.164 - R 0:00.122
22:53:57 nowarn/zero-thunk PASSED C 0:01.786 - R 0:00.082
22:53:57 nowarn/printf-sizeof PASSED C 0:01.873 - R 0:00.075
22:53:57 poly-many-arsz PASSED C 0:01.582 - R 0:00.043
22:53:57 raii/ctor-autogen-ERR1 PASSED C 0:00.944 - R n/a
22:53:57 poly-d-cycle PASSED C 0:01.551 - R 0:00.123
22:53:57 forall PASSED C 0:08.055 - R 0:00.084
22:53:57 identity PASSED C 0:06.842 - R 0:00.070
22:53:57 concurrency/futures/future_except PASSED C 0:28.194 - R 0:00.072
22:53:57 concurrency/waituntil/basic_else PASSED C 0:18.910 - R 0:00.126
22:53:57 poly-member PASSED C 0:01.688 - R 0:00.122
22:53:57 poly-o-cycle PASSED C 0:01.740 - R 0:00.039
22:53:57 poly-self-cycle PASSED C 0:01.695 - R 0:00.130
22:53:57 poly-selection PASSED C 0:01.737 - R 0:00.125
22:53:57 exceptions/finally-threads PASSED C 0:10.049 - R 0:00.121
22:53:57 raii/partial-ERR1 PASSED C 0:00.881 - R n/a
22:53:57 quasiKeyword PASSED C 0:01.701 - R 0:00.087
22:53:57 exceptions/fibonacci_nonlocal PASSED C 0:10.550 - R 0:00.103
22:53:57 include/vector-fstream PASSED C 0:07.134 - R 0:00.124
22:53:57 device/cpu PASSED C 0:13.430 - R 0:00.336
22:53:57 typedefRedef-ERR1 PASSED C 0:00.232 - R n/a
22:53:57 include/stdincludes PASSED C 0:07.652 - R 0:00.041
22:53:57 concurrency/channels/big_elems PASSED C 0:16.896 - R 0:12.368
22:53:57 var-assert PASSED C 0:00.233 - R n/a
22:53:57 raii/typeof-member PASSED C 0:01.643 - R 0:00.037
22:53:57 raii/ctor-autogen PASSED C 0:02.287 - R 0:00.037
22:53:57 exceptions/virtual-cast PASSED C 0:09.771 - R 0:00.037
22:53:57 raii/init_once PASSED C 0:01.904 - R 0:00.073
22:53:57 function-operator PASSED C 0:09.358 - R 0:00.036
22:53:57 raii/partial PASSED C 0:01.804 - R 0:00.077
22:53:57 linking/exception-nothreads PASSED C 0:06.079 - R 0:00.071
22:53:57 switch PASSED C 0:01.602 - R 0:00.039
22:53:57 simpleGenericTriple PASSED C 0:01.942 - R 0:00.045
22:53:57 io/eofType PASSED C 0:07.523 - R 0:00.125
22:53:57 tuple/tupleCast PASSED C 0:01.543 - R 0:00.073
22:53:57 tuple/tupleMember PASSED C 0:01.571 - R 0:00.039
22:53:57 exceptions/cor_resumer PASSED C 0:12.141 - R 0:00.041
22:53:57 result PASSED C 0:02.271 - R 0:00.043
22:53:57 linking/exception-withthreads PASSED C 0:06.510 - R 0:00.038
22:53:57 typedefRedef PASSED C 0:01.564 - R 0:00.069
22:53:57 concurrency/channels/churn PASSED C 0:20.277 - R 0:10.079
22:53:57 smart-pointers PASSED C 0:02.175 - R 0:00.025
22:53:57 tuple/tupleFunction PASSED C 0:01.942 - R 0:00.133
22:53:57 tuple/tuplePolymorphism PASSED C 0:01.969 - R 0:00.025
22:53:57 typeof PASSED C 0:01.506 - R 0:00.123
22:53:57 meta/fork+exec PASSED C 0:04.939 - R 0:00.119
22:53:57 collections/atomic_mpsc PASSED C 0:12.733 - R 0:18.105
22:53:57 variableDeclarator PASSED C 0:01.714 - R 0:00.022
22:53:57 withconflict PASSED C 0:00.894 - R n/a
22:53:57 exceptions/pingpong_nonlocal PASSED C 0:12.788 - R 0:00.041
22:53:57 exceptions/cancel/thread PASSED C 0:13.315 - R 0:00.072
22:53:57 warnings/self-assignment PASSED C 0:01.501 - R 0:00.003
22:53:57 voidPtr PASSED C 0:01.574 - R 0:00.025
22:53:57 KRfunctions PASSED C 0:01.424 - R 0:00.004
22:53:57 ...collections/dimexpr-match-c-ERRS PASSED C 0:01.239 - R n/a
22:53:57 linking/mangling/anon PASSED C 0:07.597 - R 0:00.120
22:53:57 errors/completeType PASSED C 0:00.886 - R n/a
22:53:57 raii/memberCtors-ERR1 PASSED C 0:04.325 - R n/a
22:53:57 list/dlist-insert-remove PASSED C 0:07.254 - R 0:00.038
22:53:57 attributes PASSED C 0:01.604 - R 0:00.002
22:53:57 declarationSpecifier PASSED C 0:01.394 - R 0:00.002
22:53:57 raii/dtor-early-exit-ERR1 PASSED C 0:05.059 - R n/a
22:53:57 literals PASSED C 0:07.429 - R 0:00.124
22:53:57 raii/dtor-early-exit-ERR2 PASSED C 0:05.191 - R n/a
22:53:57 io/manipulatorsOutput4 PASSED C 0:09.383 - R 0:00.227
22:53:57 linking/nothreads PASSED C 0:08.696 - R 0:00.025
22:53:57 ...llections/dimexpr-match-cfa-ERRS PASSED C 0:02.393 - R n/a
22:53:57 extension PASSED C 0:01.414 - R 0:00.003
22:53:57 functions PASSED C 0:01.457 - R 0:00.006
22:53:57 linking/weakso_nothd PASSED C 0:08.999 - R 0:00.072
22:53:57 io/manipulatorsInput-uchunk PASSED C 0:10.034 - R 0:00.174
22:53:57 gccExtensions PASSED C 0:01.661 - R 0:00.002
22:53:57 meta/arch PASSED C 0:00.910 - R n/a
22:53:57 arithmeticConversions PASSED C 0:03.239 - R 0:00.025
22:53:57 tuple/tupleVariadic PASSED C 0:05.077 - R 0:00.027
22:53:57 list/dlist2-insert-remove PASSED C 0:08.700 - R 0:00.041
22:53:57 zero_one-ERR1 PASSED C 0:03.908 - R n/a
22:53:57 linking/io-acquire PASSED C 0:10.269 - R 0:00.038
22:53:57 io/io PASSED C 0:11.827 - R 0:00.037
22:53:57 raii/boxed-types PASSED C 0:07.081 - R 0:00.038
22:53:57 shortCircuit PASSED C 0:06.677 - R 0:00.039
22:53:57 raii/memberCtors PASSED C 0:07.042 - R 0:00.038
22:53:57 meta/dumpable PASSED C 0:09.451 - R 0:00.042
22:53:57 polymorphism PASSED C 0:07.920 - R 0:00.041
22:53:57 concurrency/waituntil/one_chan PASSED C 0:12.542 - R 0:12.165
22:53:57 io/io-acquire-out PASSED C 0:12.138 - R 0:00.168
22:53:57 sizeof PASSED C 0:06.954 - R 0:00.041
22:53:57 references PASSED C 0:07.180 - R 0:00.037
22:53:57 raii/globals PASSED C 0:07.507 - R 0:00.042
22:53:57 malloc PASSED C 0:10.107 - R 0:00.037
22:53:57 quotedKeyword PASSED C 0:08.148 - R 0:00.019
22:53:57 tuplearray PASSED C 0:06.847 - R 0:00.024
22:53:57 strstream PASSED C 0:07.230 - R 0:00.037
22:53:57 io/io-acquire PASSED C 0:12.618 - R 0:00.322
22:53:57 io/io-acquire-in PASSED C 0:12.851 - R 0:00.120
22:53:57 concurrency/preempt2 PASSED C 0:12.878 - R 0:21.607
22:53:57 userLiterals PASSED C 0:07.428 - R 0:00.037
22:53:57 concurrency/waituntil/channel_close PASSED C 0:17.117 - R 0:10.159
22:53:57 zero_one PASSED C 0:06.828 - R 0:00.039
22:53:57 io/io-acquire2 PASSED C 0:13.760 - R 0:00.422
22:53:57 time PASSED C 0:08.705 - R 0:00.038
22:53:57 raii/dtor-early-exit PASSED C 0:09.687 - R 0:00.037
22:53:57 tuple/tupleAssign PASSED C 0:08.752 - R 0:00.036
22:53:57 minmax PASSED C 0:11.474 - R 0:00.037
22:53:57 searchsort PASSED C 0:09.244 - R 0:00.037
22:53:57 io/away_fair PASSED C 0:15.065 - R 0:00.268
22:53:57 vector PASSED C 0:08.456 - R 0:00.035
22:53:57 sum PASSED C 0:09.355 - R 0:00.037
22:53:57 linking/withthreads PASSED C 0:13.668 - R 0:00.068
22:53:57 ...collections/array-md-sbscr-cases PASSED C 0:08.051 - R 0:00.068
22:53:57 vector_math/vec2_double PASSED C 0:09.620 - R 0:00.037
22:53:57 vector_math/vec2_uint PASSED C 0:09.528 - R 0:00.036
22:53:57 concurrency/waituntil/futures PASSED C 0:29.307 - R 0:00.068
22:53:57 swap PASSED C 0:10.916 - R 0:00.020
22:53:57 abs PASSED C 0:08.933 - R 0:00.038
22:53:57 io/many_read PASSED C 0:15.824 - R 0:00.069
22:53:57 io/comp_fair PASSED C 0:16.542 - R 0:00.972
22:53:57 io/manipulatorsInput PASSED C 0:08.180 - R 0:00.036
22:53:57 concurrency/unified_locking/mcs PASSED C 0:14.112 - R 0:20.789
22:53:57 ato PASSED C 0:09.679 - R 0:00.037
22:53:57 ...rrency/examples/boundedBufferEXT PASSED C 0:12.699 - R 0:27.665
22:53:57 random PASSED C 0:08.371 - R 0:00.036
22:53:57 io/comp_basic PASSED C 0:18.631 - R 0:00.518
22:53:57 bitmanip2 PASSED C 0:10.643 - R 0:00.068
22:53:57 gmp PASSED C 0:09.690 - R 0:00.038
22:53:57 bitmanip1 PASSED C 0:10.842 - R 0:00.070
22:53:57 exceptions/hotpotato_checked PASSED C 0:10.467 - R 0:00.117
22:53:57 exceptions/cardgame PASSED C 0:10.525 - R 0:00.119
22:53:57 exceptions/hotpotato PASSED C 0:10.549 - R 0:00.069
22:53:57 ...rrency/examples/boundedBufferINT PASSED C 0:12.728 - R 0:29.848
22:53:57 vector_math/vec3_int PASSED C 0:12.889 - R 0:00.035
22:53:57 vector_math/vec2_ldouble PASSED C 0:09.815 - R 0:00.035
22:53:57 include/includes PASSED C 0:21.587 - R 0:00.035
22:53:57 bitmanip3 PASSED C 0:12.151 - R 0:00.068
22:53:57 vector_math/vec4_int PASSED C 0:13.471 - R 0:00.035
22:53:57 vector_math/vec2_int PASSED C 0:13.763 - R 0:00.035
22:53:57 io/manipulatorsOutput2 PASSED C 0:11.252 - R 0:00.036
22:53:57 vector_math/vec4_float PASSED C 0:14.422 - R 0:00.035
22:53:57 vector_math/vec3_float PASSED C 0:14.567 - R 0:00.035
22:53:57 vector_math/vec2_float PASSED C 0:15.291 - R 0:00.038
22:53:57 math PASSED C 0:12.442 - R 0:00.034
22:53:57 io/manipulatorsOutput1 PASSED C 0:13.740 - R 0:00.035
22:53:57 mathX PASSED C 0:13.644 - R 0:00.036
22:53:57 io/manipulatorsOutput3 PASSED C 0:14.044 - R 0:00.117
22:53:57 io/io-acquire-no-io PASSED C 0:12.632 - R 0:12.759
22:53:57 PRNG PASSED C 0:17.750 - R 0:02.121
22:53:57 heap PASSED C 0:10.378 - R 0:19.439
22:53:57 concurrency/actors/dynamic PASSED C 0:17.676 - R 0:35.902
22:53:57 rational PASSED C 0:26.849 - R 0:00.035
22:53:57 concurrency/waituntil/repeat_close PASSED C 0:16.996 - R 0:30.099
22:53:57 concurrency/waituntil/channels PASSED C 0:13.010 - R 0:35.432
22:53:57 ...ency/unified_locking/futex_mutex PASSED C 0:14.347 - R 0:40.955
22:53:57 ...ency/waituntil/channel_zero_size PASSED C 0:13.484 - R 0:39.737
22:53:57 concurrency/waituntil/all_types PASSED C 0:34.639 - R 0:21.599
22:53:57 concurrency/monitor PASSED C 0:12.092 - R 0:58.324
22:53:57 ...urrency/unified_locking/mcs_spin PASSED C 0:14.495 - R 0:52.847
22:53:57 .../unified_locking/spin_queue_lock PASSED C 0:14.593 - R 0:52.873
22:53:57 concurrency/multi-monitor PASSED C 0:12.060 - R 1:03.505
22:53:57 concurrency/waituntil/locks PASSED C 0:16.449 - R 1:06.920
22:53:57 concurrency/unified_locking/locks PASSED C 0:18.140 - R 1:34.560
22:53:57 concurrency/mutexstmt/locks PASSED C 0:12.270 - R 2:15.349
22:53:57375 passes, 0 failures, 0 timeouts, 0 cancelled, 0 other
22:53:57Tests took 2:28.552
22:53:57[Pipeline] }
22:53:57[Pipeline] // dir
22:53:57[Pipeline] }
22:53:57[Pipeline] // stage
22:53:57[Pipeline] echo
22:53:57 -------- Test: Release --------
22:53:57[Pipeline] stage
22:53:57[Pipeline] { (Test: Release)
22:53:57[Pipeline] dir
22:53:57Running in /var/lib/jenkins/workspace/Cforall_master@tmp
22:53:57[Pipeline] {
22:53:57[Pipeline] sh
22:53:57+ nproc
22:53:57+ make -j 96 --no-print-directory -C tests timeout=600 global-timeout=14400 tests debug=no archive-errors=/var/lib/jenkins/workspace/Cforall_master@tmp/tests/crashes/full-nodebug
22:53:57Running 375 tests on 96 cores (arm64 - no debug)
22:53:57 array-ERR2 PASSED C 0:00.118 - R n/a
22:53:57 array-ERR3 PASSED C 0:00.128 - R n/a
22:53:57 ...ollections/language-dim-mismatch PASSED C 0:00.410 - R n/a
22:53:57 concurrency/mainError PASSED C 0:00.456 - R n/a
22:53:57 concurrency/keywordErrors PASSED C 0:00.625 - R n/a
22:53:57 castError PASSED C 0:01.021 - R n/a
22:53:57 array-collections/symtab-collision PASSED C 0:01.056 - R n/a
22:53:57 array-collections/safety-summary PASSED C 0:01.077 - R n/a
22:53:57 concurrency/ctor-check PASSED C 0:01.298 - R n/a
22:53:57 attr-priority PASSED C 0:01.447 - R 0:00.003
22:53:57 array-ERR1 PASSED C 0:01.631 - R n/a
22:53:57 cast PASSED C 0:01.614 - R 0:00.132
22:53:57 array PASSED C 0:01.726 - R 0:00.075
22:53:57 castReturn PASSED C 0:01.737 - R 0:00.074
22:53:57 array-collections/c-dependent PASSED C 0:01.810 - R 0:00.131
22:53:57 builtins/sync PASSED C 0:02.061 - R 0:00.130
22:53:57 array-collections/array-raii-c PASSED C 0:02.244 - R 0:00.022
22:53:57 array-collections/dimexpr-match-c PASSED C 0:02.522 - R 0:00.074
22:53:57 array-collections/array-sbscr-types PASSED C 0:03.105 - R 0:00.023
22:53:57 ...ns/vector-err-retn-perm-it-byval PASSED C 0:03.279 - R n/a
22:53:57 ...ns/vector-err-pass-perm-it-byval PASSED C 0:03.656 - R n/a
22:53:57 concurrency/clib_tls PASSED C 0:03.617 - R 0:00.044
22:53:57 array-collections/array-basic PASSED C 0:03.678 - R 0:00.037
22:53:57 array-collections/boxed PASSED C 0:03.714 - R 0:00.037
22:53:57 concurrency/clib PASSED C 0:03.615 - R 0:00.128
22:53:57 array-collections/dimexpr-match-cfa PASSED C 0:05.325 - R 0:00.069
22:53:57 collections/string-operator-ERR16 PASSED C 0:05.496 - R n/a
22:53:57 collections/string-operator-ERR15 PASSED C 0:05.593 - R n/a
22:53:57 collections/string-operator-ERR13 PASSED C 0:05.687 - R n/a
22:53:57 collections/string-operator-ERR09 PASSED C 0:05.803 - R n/a
22:53:57 collections/string-operator-ERR11 PASSED C 0:05.870 - R n/a
22:53:57 ...urrency/pthread/pthread_key_test PASSED C 0:04.457 - R 0:00.038
22:53:57 avl_test PASSED C 0:06.436 - R 0:00.038
22:53:57 alloc-ERROR PASSED C 0:06.550 - R n/a
22:53:57 algorithms/range_test PASSED C 0:06.992 - R 0:00.019
22:53:57 complex PASSED C 0:07.012 - R 0:00.022
22:53:57 collections/vector-demo PASSED C 0:07.234 - R 0:00.021
22:53:57 array-collections/accordion PASSED C 0:07.448 - R 0:00.039
22:53:57 collections/string-gc PASSED C 0:07.729 - R 0:00.021
22:53:57 array-collections/array-raii-cfa PASSED C 0:07.990 - R 0:00.025
22:53:57 concurrency/cluster PASSED C 0:08.592 - R 0:00.037
22:53:57 collections/string-istream PASSED C 0:08.670 - R 0:00.022
22:53:57 concurrency/futures/basic PASSED C 0:08.906 - R 0:00.039
22:53:57 concurrency/futures/abandon PASSED C 0:08.889 - R 0:00.177
22:53:57 collections/stack PASSED C 0:09.448 - R 0:00.021
22:53:57 concurrency/park/start_parked PASSED C 0:08.547 - R 0:00.025
22:53:57 concurrency/park/contention PASSED C 0:09.060 - R 0:00.070
22:53:57 collections/multi_list PASSED C 0:09.851 - R 0:00.021
22:53:57 concurrency/mutexstmt/monitors PASSED C 0:10.206 - R 0:00.577
22:53:57 collections/string-ctx-manage PASSED C 0:10.936 - R 0:00.024
22:53:57 collections/queue PASSED C 0:11.134 - R 0:00.021
22:53:57 concurrency/cofor PASSED C 0:11.922 - R 0:00.040
22:53:57 concurrency/examples/gortn PASSED C 0:12.152 - R 0:00.051
22:53:57 concurrency/migrate PASSED C 0:12.227 - R 0:00.039
22:53:57 concurrency/examples/matrixSum PASSED C 0:12.330 - R 0:00.040
22:53:57 collections/string-ostream PASSED C 0:12.394 - R 0:00.040
22:53:57 concurrency/coroutineYield PASSED C 0:12.732 - R 0:00.036
22:53:57 collections/string-istream-manip PASSED C 0:12.770 - R 0:00.044
22:53:57 collections/sequence PASSED C 0:12.828 - R 0:00.037
22:53:57 collections/string-overwrite PASSED C 0:12.859 - R 0:00.083
22:53:57 ...ections/string-overwrite-noshare PASSED C 0:12.850 - R 0:00.133
22:53:57 concurrency/join PASSED C 0:12.898 - R 0:00.131
22:53:57 ...rrency/pthread/pthread_attr_test PASSED C 0:11.829 - R 0:00.022
22:53:57 concurrency/park/force_preempt PASSED C 0:12.234 - R 0:00.321
22:53:57 ...rrency/pthread/pthread_cond_test PASSED C 0:11.894 - R 0:00.039
22:53:57 concurrency/examples/datingService PASSED C 0:13.396 - R 0:00.120
22:53:57 concurrency/monitor PASSED C 0:12.128 - R 0:01.429
22:53:57 ...rrency/pthread/pthread_once_test PASSED C 0:11.870 - R 0:00.037
22:53:57 collections/atomic_mpsc PASSED C 0:12.551 - R 0:01.391
22:53:57 ...pthread/pthread_demo_create_join PASSED C 0:12.231 - R 0:00.128
22:53:57 collections/string-compare PASSED C 0:14.142 - R 0:00.025
22:53:57 concurrency/multi-monitor PASSED C 0:12.174 - R 0:02.029
22:53:57 const-init PASSED C 0:01.758 - R 0:00.041
22:53:57 const-ref PASSED C 0:01.620 - R 0:00.127
22:53:57 concurrency/barrier/last PASSED C 0:14.897 - R 0:00.038
22:53:57 concurrency/barrier/order PASSED C 0:15.140 - R 0:00.125
22:53:57 ...rrency/examples/boundedBufferINT PASSED C 0:13.561 - R 0:01.787
22:53:57 concurrency/barrier/generation PASSED C 0:15.232 - R 0:00.181
22:53:57 concurrency/signal/block PASSED C 0:13.185 - R 0:00.170
22:53:57 concurrency/mutexstmt/tuple PASSED C 0:15.488 - R 0:00.039
22:53:57 concurrency/readyQ/leader_spin PASSED C 0:12.437 - R 0:01.029
22:53:57 concurrency/waitfor/parse PASSED C 0:07.915 - R 0:00.019
22:53:57 concurrency/futures/wait_any PASSED C 0:15.712 - R 0:00.037
22:53:57 ctrl-flow/loop-inc PASSED C 0:01.551 - R 0:00.068
22:53:57 concurrency/examples/quickSort PASSED C 0:15.981 - R 0:00.036
22:53:57 collections/string-operator PASSED C 0:16.320 - R 0:00.023
22:53:57 concurrency/signal/disjoint FAILED with code -6 C 0:13.308 - R 0:00.036
22:53:57ERROR Eager signal 2
22:53:57Cforall Runtime error (UNIX pid:1179858):
22:53:57Stack back trace for: /var/lib/jenkins/workspace/Cforall_master@tmp/libcfa/arm64-nodebug/src/.libs/libcfa.so.1
22:53:57(0) /var/lib/jenkins/workspace/Cforall_master@tmp/libcfa/arm64-nodebug/src/.libs/libcfa.so.1 : + 0x83ab0 [0xfffff7ed3ab0]
22:53:57(1) /var/lib/jenkins/workspace/Cforall_master@tmp/libcfa/arm64-nodebug/src/.libs/libcfa.so.1 : + 0x3b53c [0xfffff7e8b53c]
22:53:57(2) /var/lib/jenkins/workspace/Cforall_master@tmp/libcfa/arm64-nodebug/src/.libs/libcfa.so.1 : + 0x3cef4 [0xfffff7e8cef4]
22:53:57(3) /var/lib/jenkins/workspace/Cforall_master@tmp/tests/concurrency/signal/disjoint : _X5logicFv_XS8global_t__1 + 0x15c [0xaaaaaaaa3f5c]
22:53:5722:53:57warning: Can't open file anon_inode:[io_uring] which was expanded to anon_inode:[io_uring] during file-backed mapping note processing
22:53:57[New LWP 1179858]
22:53:57[New LWP 1179869]
22:53:57[New LWP 1179868]
22:53:57[Thread debugging using libthread_db enabled]
22:53:57Using host libthread_db library "/lib/aarch64-linux-gnu/libthread_db.so.1".
22:53:57Core was generated by `/var/lib/jenkins/workspace/Cforall_master@tmp/tests/concurrency/signal/disjoint'.
22:53:57Program terminated with signal SIGABRT, Aborted.
22:53:57#0 __pthread_kill_implementation (threadid=281474842402240, signo=signo@entry=6, no_tid=no_tid@entry=0) at ./nptl/pthread_kill.c:44
22:53:5722:53:57warning: 44 ./nptl/pthread_kill.c: No such file or directory
22:53:57[Current thread is 1 (Thread 0xfffff7fe9dc0 (LWP 1179858))]
22:53:57-----
22:53:57#0 __pthread_kill_implementation (threadid=281474842402240, signo=signo@entry=6, no_tid=no_tid@entry=0) at ./nptl/pthread_kill.c:44
22:53:57#1 0x0000fffff7c27540 in __pthread_kill_internal (signo=6, threadid=<optimized out>) at ./nptl/pthread_kill.c:78
22:53:57#2 0x0000fffff7bdcb3c in __GI_raise (sig=sig@entry=6) at ../sysdeps/posix/raise.c:26
22:53:57#3 0x0000fffff7bc7e00 in __GI_abort () at ./stdlib/abort.c:79
22:53:57#4 0x0000fffff7ed35ec in _X7__abortFv_bPKcY17__builtin_va_list__1 (_X11signalAbortb_1=_X11signalAbortb_1@entry=true, _X3fmtPKc_1=_X3fmtPKc_1@entry=0xfffff7ee5918 "Application interrupted by signal: %s.\n", _X4argsY17__builtin_va_list_1=...) at /var/lib/jenkins/workspace/Cforall_master/libcfa/src/interpose.cfa:263
22:53:57#5 0x0000fffff7ed3ab0 in _X5abortFv_bPKc__1 (_X11signalAbortb_1=_X11signalAbortb_1@entry=true, _X3fmtPKc_1=_X3fmtPKc_1@entry=0xfffff7ee5918 "Application interrupted by signal: %s.\n") at /var/lib/jenkins/workspace/Cforall_master/libcfa/src/interpose.cfa:301
22:53:57#6 0x0000fffff7ed3ad0 in _X15sigHandler_termFv_iPS21__anonymous_siginfo_tPS10ucontext_t__1 (_X3sigi_1=<optimized out>, _X3sfpPS21__anonymous_siginfo_t_1=<optimized out>, _X3cxtPS10ucontext_t_1=<optimized out>) at /var/lib/jenkins/workspace/Cforall_master/libcfa/src/interpose.cfa:337
22:53:57#7 <signal handler called>
22:53:57#8 __pthread_kill_implementation (threadid=281474842402240, signo=signo@entry=6, no_tid=no_tid@entry=0) at ./nptl/pthread_kill.c:44
22:53:57#9 0x0000fffff7c27540 in __pthread_kill_internal (signo=6, threadid=<optimized out>) at ./nptl/pthread_kill.c:78
22:53:57#10 0x0000fffff7bdcb3c in __GI_raise (sig=sig@entry=6) at ../sysdeps/posix/raise.c:26
22:53:57#11 0x0000fffff7bc7e00 in __GI_abort () at ./stdlib/abort.c:79
22:53:57#12 0x0000fffff7ed36a4 in _X7__abortFv_bPKcY17__builtin_va_list__1 (_X11signalAbortb_1=_X11signalAbortb_1@entry=false, _X3fmtPKc_1=_X3fmtPKc_1@entry=0xfffff7ee49f0 "%s", _X4argsY17__builtin_va_list_1=...) at /var/lib/jenkins/workspace/Cforall_master/libcfa/src/interpose.cfa:286
22:53:57#13 0x0000fffff7ed3ab0 in _X5abortFv_bPKc__1 (_X11signalAbortb_1=_X11signalAbortb_1@entry=false, _X3fmtPKc_1=_X3fmtPKc_1@entry=0xfffff7ee49f0 "%s") at /var/lib/jenkins/workspace/Cforall_master/libcfa/src/interpose.cfa:301
22:53:57#14 0x0000fffff7e8b53c in abort () at /var/lib/jenkins/workspace/Cforall_master/libcfa/src/interpose.cfa:176
22:53:57#15 0x0000fffff7e8cef4 in _X4endsFv_S8ofstream__1 (_X2osS8ofstream_1=0xfffff7f211c8 <_X9abortFileS8ofstream_1>) at /var/lib/jenkins/workspace/Cforall_master/libcfa/src/fstream.cfa:106
22:53:57#16 0x0000aaaaaaaa3f5c in _X5logicFv_XS8global_t__1 (_X1aXS8global_t_1=_X1aXS8global_t_1@entry=0xaaaaaaac02b0 <_X7globalsS13__anonymous66_1>) at concurrency/signal/disjoint.cfa:115
22:53:57#17 0x0000aaaaaaaa3fc0 in _X4mainFv_S9Signaller__1 (__anonymous_object2552=__anonymous_object2552@entry=0xffffffffd070) at concurrency/signal/disjoint.cfa:126
22:53:57#18 0x0000fffff7f6ad34 in __cfactx_invoke_thread (main=0xaaaaaaaa3f90 <_X4mainFv_S9Signaller__1>, this=0xffffffffd070) at /var/lib/jenkins/workspace/Cforall_master/libcfa/src/concurrency/invoke.c:87
22:53:57#19 0x0000fffff7f6ad10 in __cfactx_coroutine_unwind (storage=<optimized out>, cor=<optimized out>) at /var/lib/jenkins/workspace/Cforall_master/libcfa/src/concurrency/invoke.c:76
22:53:57#20 0x0000aaaaaabffff0 in ?? ()
22:53:57Backtrace stopped: previous frame inner to this frame (corrupt stack?)
22:53:57-----
22:53:57 Id Target Id Frame
22:53:57* 1 Thread 0xfffff7fe9dc0 (LWP 1179858) __pthread_kill_implementation (threadid=281474842402240, signo=signo@entry=6, no_tid=no_tid@entry=0) at ./nptl/pthread_kill.c:44
22:53:57 2 Thread 0xaaaaaab92dc0 (LWP 1179869) 0x0000fffff7f6b7b0 in _X11calc_cutoffQ1_0_0_1__X2tsFy_BD0__Fd_yjmPBD0PU13__timestamp_tjb__1 (_sizeof_Y6Data_t=<optimized out>, _alignof_Y6Data_t=<optimized out>, _X2tsFy_Y6Data_t__1=<optimized out>, _X12shard_factorKj_1=<optimized out>, _X6strictb_1=<optimized out>, _X5countm_1=<optimized out>, _X4tscsPU13__timestamp_t_1=<optimized out>, _X4dataPY6Data_t_1=<optimized out>, _X6procidj_1=<optimized out>, _X4ctscKy_1=<optimized out>) at /var/lib/jenkins/workspace/Cforall_master/libcfa/src/concurrency/kernel/cluster.hfa:111
22:53:57 3 Thread 0xaaaaaab12c00 (LWP 1179868) 0x0000fffff7bdda18 in __GI___sigtimedwait (set=set@entry=0xaaaaaab121e8, info=info@entry=0xaaaaaab12268, timeout=timeout@entry=0x0) at ../sysdeps/unix/sysv/linux/sigtimedwait.c:31
22:53:5722:53:57Archiving concurrency/signal/disjoint (executable and core) to crashes/full-nodebug/concurrency/signal/disjoint
22:53:57 ctrl-flow/labelledExit PASSED C 0:02.123 - R 0:00.038
22:53:57 concurrency/lockfree_stack PASSED C 0:12.165 - R 0:04.186
22:53:57 ...rrency/examples/boundedBufferEXT PASSED C 0:15.024 - R 0:01.627
22:53:57 concurrency/suspend_then PASSED C 0:13.054 - R 0:00.037
22:53:57 concurrency/readyQ/barrier_sleeper PASSED C 0:14.684 - R 0:00.323
22:53:57 enum_tests/lvalue PASSED C 0:00.910 - R n/a
22:53:57 errors/declaration PASSED C 0:00.133 - R n/a
22:53:57 enum PASSED C 0:01.556 - R 0:00.024
22:53:57 concurrency/signal/wait PASSED C 0:14.112 - R 0:00.070
22:53:57 concurrency/waitfor/else PASSED C 0:10.124 - R 0:00.019
22:53:57 errors/scope-type PASSED C 0:00.238 - R n/a
22:53:57 errors/signature PASSED C 0:00.157 - R n/a
22:53:57 enum_tests/inc-dec PASSED C 0:01.754 - R 0:00.023
22:53:57 concurrency/sleep PASSED C 0:13.245 - R 0:01.174
22:53:57 collections/string-api-coverage PASSED C 0:17.824 - R 0:00.022
22:53:57 errors/scope PASSED C 0:00.840 - R n/a
22:53:57 ...cy/unified_locking/pthread_locks PASSED C 0:11.901 - R 0:00.071
22:53:57 concurrency/once PASSED C 0:17.325 - R 0:00.074
22:53:57 ...ions/string-api-coverage-noshare PASSED C 0:17.980 - R 0:00.023
22:53:57 ...ency/unified_locking/exp_backoff PASSED C 0:14.391 - R 0:00.037
22:53:57 concurrency/thread PASSED C 0:14.619 - R 0:00.037
22:53:57 enum_tests/funcEnum PASSED C 0:02.790 - R 0:00.022
22:53:57 concurrency/actors/executor PASSED C 0:18.548 - R 0:00.037
22:53:57 .../unified_locking/block_spin_lock PASSED C 0:14.861 - R 0:00.038
22:53:57 alloc PASSED C 0:18.665 - R 0:00.023
22:53:57 designations PASSED C 0:03.381 - R 0:00.039
22:53:57 .../unified_locking/fast_block_lock PASSED C 0:14.932 - R 0:00.039
22:53:57 eval PASSED C 0:01.484 - R 0:00.022
22:53:57 concurrency/actors/poison PASSED C 0:18.764 - R 0:00.172
22:53:57 concurrency/mutexstmt/locks PASSED C 0:13.404 - R 0:05.509
22:53:57 ...ncy/unified_locking/timeout_lock PASSED C 0:11.270 - R 0:01.182
22:53:57 concurrency/actors/dynamic PASSED C 0:18.927 - R 0:00.221
22:53:57 concurrency/futures/typed PASSED C 0:19.006 - R 0:00.123
22:53:57 concurrency/waitfor/dtor PASSED C 0:12.226 - R 0:00.169
22:53:57 concurrency/actors/pingpong PASSED C 0:19.417 - R 0:00.076
22:53:57 exceptions/try-ctrl-flow PASSED C 0:00.518 - R n/a
22:53:57 concurrency/actors/matrixMultiply PASSED C 0:19.263 - R 0:00.273
22:53:57 concurrency/waitfor/barge PASSED C 0:12.455 - R 0:00.070
22:53:57 enum_tests/structEnum PASSED C 0:03.156 - R 0:00.022
22:53:57 concurrency/actors/types PASSED C 0:19.510 - R 0:00.121
22:53:57 concurrency/actors/static PASSED C 0:19.622 - R 0:00.072
22:53:57 exceptions/type-check PASSED C 0:00.683 - R n/a
22:53:57 concurrency/actors/inline PASSED C 0:19.852 - R 0:00.037
22:53:57 concurrency/actors/inherit PASSED C 0:19.936 - R 0:00.273
22:53:57 ...urrency/waitfor/lexical_priority PASSED C 0:12.699 - R 0:00.038
22:53:57 concurrency/waitfor/recurse PASSED C 0:12.153 - R 0:00.170
22:53:57 ctrl-flow/break-misc PASSED C 0:06.709 - R 0:00.021
22:53:57 copyfile PASSED C 0:07.530 - R 0:00.028
22:53:57 ...fied_locking/mcs_block_spin_lock PASSED C 0:14.796 - R 0:00.035
22:53:57 ctrl-flow/fallthrough PASSED C 0:06.779 - R 0:00.022
22:53:57 exceptions/try-leave-catch PASSED C 0:01.794 - R 0:00.040
22:53:57 counter PASSED C 0:07.254 - R 0:00.074
22:53:57 ctrl-flow/ifwhileCtl PASSED C 0:06.967 - R 0:00.047
22:53:57 expression PASSED C 0:01.552 - R 0:00.043
22:53:57 concurrency/preempt PASSED C 0:14.225 - R 0:05.955
22:53:57 ctrl-flow/goto PASSED C 0:07.316 - R 0:00.042
22:53:57 ctrl-flow/loop_else PASSED C 0:07.066 - R 0:00.022
22:53:57 ...nified_locking/simple_owner_lock PASSED C 0:14.938 - R 0:00.127
22:53:57 coroutine/devicedriver PASSED C 0:08.637 - R 0:00.024
22:53:57 global-monomorph PASSED C 0:01.619 - R 0:00.023
22:53:57 concurrency/unified_locking/mcs PASSED C 0:14.773 - R 0:01.182
22:53:57 coroutine/fibonacci PASSED C 0:08.561 - R 0:00.073
22:53:57 coroutine/raii PASSED C 0:08.349 - R 0:00.037
22:53:57 concurrency/waitfor/statment PASSED C 0:13.098 - R 0:00.039
22:53:57 coroutine/fmtLines PASSED C 0:08.653 - R 0:00.131
22:53:57 exceptions/message PASSED C 0:03.285 - R 0:00.021
22:53:57 ...rrency/pthread/pthread_demo_lock PASSED C 0:12.462 - R 0:07.721
22:53:57 identParamDeclarator PASSED C 0:01.621 - R 0:00.041
22:53:57 coroutine/runningTotal PASSED C 0:08.554 - R 0:00.048
22:53:57 init1-ERROR PASSED C 0:00.816 - R n/a
22:53:57 identFuncDeclarator PASSED C 0:01.773 - R 0:00.043
22:53:57 coroutine/pingpong PASSED C 0:09.534 - R 0:00.037
22:53:57 init1 PASSED C 0:01.510 - R 0:00.038
22:53:57 enum_tests/anonymous PASSED C 0:06.999 - R 0:00.044
22:53:57 ctrl-flow/loop_else-WRN1 PASSED C 0:08.256 - R 0:00.002
22:53:57 concurrency/waituntil/timeout PASSED C 0:08.035 - R 0:03.078
22:53:57 configs/parsebools PASSED C 0:10.453 - R 0:00.421
22:53:57 enum_tests/stringEnum PASSED C 0:06.882 - R 0:00.039
22:53:57 include/vector-sequence PASSED C 0:02.193 - R 0:00.073
22:53:57 enum_tests/enumInlineValue PASSED C 0:07.736 - R 0:00.076
22:53:57 enum_tests/typedIntEnum PASSED C 0:06.919 - R 0:00.023
22:53:57 enum_tests/voidEnum PASSED C 0:06.855 - R 0:00.019
22:53:57 enum_tests/input PASSED C 0:07.766 - R 0:00.042
22:53:57 limits PASSED C 0:01.688 - R 0:00.069
22:53:57 configs/usage PASSED C 0:11.383 - R 0:00.038
22:53:57 configs/parseconfig PASSED C 0:11.395 - R 0:00.120
22:53:57 concurrency/waitfor/when PASSED C 0:15.365 - R 0:00.071
22:53:57 include/vector-collections PASSED C 0:03.287 - R 0:00.022
22:53:57 ...ency/waituntil/channel_zero_size PASSED C 0:13.805 - R 0:00.830
22:53:57 linking/nostdlib PASSED C 0:01.546 - R 0:00.038
22:53:57 nested-types-ERR1 PASSED C 0:00.175 - R n/a
22:53:57 nested-types-ERR2 PASSED C 0:00.353 - R n/a
22:53:57 coroutine/prodcons PASSED C 0:11.632 - R 0:00.022
22:53:57 exceptions/data-except PASSED C 0:07.041 - R 0:00.026
22:53:57 exceptions/conditional PASSED C 0:07.585 - R 0:00.021
22:53:57 div PASSED C 0:09.576 - R 0:00.036
22:53:57 ctrl-flow/loopctrl PASSED C 0:10.154 - R 0:00.037
22:53:57 linkonce PASSED C 0:01.866 - R 0:00.019
22:53:57 opt-params PASSED C 0:00.117 - R n/a
22:53:57 exceptions/finally PASSED C 0:07.309 - R 0:00.039
22:53:57 enum_tests/position PASSED C 0:09.231 - R 0:00.022
22:53:57 exceptions/defaults PASSED C 0:07.639 - R 0:00.129
22:53:57 concurrency/waituntil/one_chan PASSED C 0:14.234 - R 0:00.524
22:53:57 nested-types PASSED C 0:01.566 - R 0:00.020
22:53:57 maybe PASSED C 0:02.020 - R 0:00.037
22:53:57 enum_tests/planet PASSED C 0:09.415 - R 0:00.035
22:53:57 exceptions/interact PASSED C 0:07.476 - R 0:00.026
22:53:57 exceptions/conditional-threads PASSED C 0:08.291 - R 0:00.020
22:53:57 exceptions/cancel/coroutine PASSED C 0:08.580 - R 0:00.021
22:53:57 exceptions/trash PASSED C 0:07.022 - R 0:00.073
22:53:57 exceptions/polymorphic PASSED C 0:07.444 - R 0:00.024
22:53:57 exceptions/resume PASSED C 0:07.416 - R 0:00.069
22:53:57 nowarn/array PASSED C 0:01.751 - R 0:00.045
22:53:57 polybits PASSED C 0:00.404 - R n/a
22:53:57 nowarn/no-autogen PASSED C 0:01.560 - R 0:00.040
22:53:57 exceptions/terminate PASSED C 0:07.524 - R 0:00.040
22:53:57 nowarn/exception PASSED C 0:01.915 - R 0:00.020
22:53:57 generator/fibonacci PASSED C 0:06.796 - R 0:00.028
22:53:57 exceptions/virtual-poly PASSED C 0:07.150 - R 0:00.043
22:53:57 generator/fmtLines PASSED C 0:06.970 - R 0:00.040
22:53:57 numericConstants PASSED C 0:01.597 - R 0:00.024
22:53:57 nowarn/printf-sizeof PASSED C 0:01.750 - R 0:00.070
22:53:57 exceptions/finally-threads PASSED C 0:08.524 - R 0:00.039
22:53:57 concurrency/channels/daisy_chain PASSED C 0:16.710 - R 0:10.131
22:53:57 operators PASSED C 0:01.614 - R 0:00.041
22:53:57 fstream_test PASSED C 0:07.263 - R 0:00.037
22:53:57 nowarn/zero-thunk PASSED C 0:01.701 - R 0:00.070
22:53:57 exceptions/defaults-threads PASSED C 0:08.992 - R 0:00.036
22:53:57 generator/suspend_then PASSED C 0:07.178 - R 0:00.041
22:53:57 poly-bare-assn PASSED C 0:01.522 - R 0:00.041
22:53:57 concurrency/waituntil/channels PASSED C 0:15.183 - R 0:02.083
22:53:57 concurrency/channels/churn PASSED C 0:16.975 - R 0:10.073
22:53:57 device/cpu PASSED C 0:11.379 - R 0:00.273
22:53:57 genericUnion PASSED C 0:07.187 - R 0:00.035
22:53:57 concurrency/channels/hot_potato PASSED C 0:17.036 - R 0:10.065
22:53:57 poly-d-cycle PASSED C 0:01.688 - R 0:00.027
22:53:57 raii/ctor-autogen-ERR1 PASSED C 0:00.923 - R n/a
22:53:57 hello PASSED C 0:06.887 - R 0:00.037
22:53:57 poly-many-arsz PASSED C 0:01.539 - R 0:00.038
22:53:57 nowarn/unused PASSED C 0:02.245 - R 0:00.043
22:53:57 poly-member PASSED C 0:01.565 - R 0:00.020
22:53:57 linking/exception-nothreads PASSED C 0:05.164 - R 0:00.022
22:53:57 poly-o-cycle PASSED C 0:01.612 - R 0:00.021
22:53:57 poly-selection PASSED C 0:01.576 - R 0:00.039
22:53:57 identity PASSED C 0:07.079 - R 0:00.020
22:53:57 quasiKeyword PASSED C 0:01.623 - R 0:00.019
22:53:57 raii/partial-ERR1 PASSED C 0:00.880 - R n/a
22:53:57 typedefRedef-ERR1 PASSED C 0:00.223 - R n/a
22:53:57 poly-self-cycle PASSED C 0:01.825 - R 0:00.019
22:53:57 concurrency/channels/ping_pong PASSED C 0:17.617 - R 0:10.080
22:53:57 concurrency/channels/contend PASSED C 0:17.596 - R 0:10.128
22:53:57 exceptions/resume-threads PASSED C 0:08.989 - R 0:00.022
22:53:57 concurrency/channels/pub_sub PASSED C 0:17.761 - R 0:10.060
22:53:57 forall PASSED C 0:08.345 - R 0:00.021
22:53:57 var-assert PASSED C 0:00.227 - R n/a
22:53:57 exceptions/terminate-threads PASSED C 0:09.049 - R 0:00.024
22:53:57 include/vector-fstream PASSED C 0:07.017 - R 0:00.020
22:53:57 concurrency/channels/big_elems PASSED C 0:17.595 - R 0:10.514
22:53:57 raii/ctor-autogen PASSED C 0:02.120 - R 0:00.021
22:53:57 raii/partial PASSED C 0:01.651 - R 0:00.039
22:53:57 raii/init_once PASSED C 0:01.925 - R 0:00.070
22:53:57 exceptions/virtual-cast PASSED C 0:09.177 - R 0:00.045
22:53:57 raii/typeof-member PASSED C 0:01.637 - R 0:00.071
22:53:57 io/eofType PASSED C 0:06.986 - R 0:00.073
22:53:57 switch PASSED C 0:01.592 - R 0:00.019
22:53:57 tuple/tupleCast PASSED C 0:01.658 - R 0:00.020
22:53:57 tuple/tupleMember PASSED C 0:01.693 - R 0:00.021
22:53:57 linking/exception-withthreads PASSED C 0:06.792 - R 0:00.040
22:53:57 concurrency/futures/future_except PASSED C 0:28.955 - R 0:00.075
22:53:57 typedefRedef PASSED C 0:01.608 - R 0:00.038
22:53:57 concurrency/waituntil/basic_else PASSED C 0:19.939 - R 0:00.038
22:53:57 tuple/tupleFunction PASSED C 0:01.939 - R 0:00.036
22:53:57 simpleGenericTriple PASSED C 0:02.247 - R 0:00.077
22:53:57 smart-pointers PASSED C 0:02.214 - R 0:00.081
22:53:57 variableDeclarator PASSED C 0:01.568 - R 0:00.021
22:53:57 withconflict PASSED C 0:00.897 - R n/a
22:53:57 typeof PASSED C 0:01.697 - R 0:00.070
22:53:57 result PASSED C 0:02.413 - R 0:00.021
22:53:57 exceptions/cancel/thread PASSED C 0:11.982 - R 0:00.038
22:53:57 exceptions/fibonacci_nonlocal PASSED C 0:11.565 - R 0:00.025
22:53:57 tuple/tuplePolymorphism PASSED C 0:02.156 - R 0:00.024
22:53:57 meta/fork+exec PASSED C 0:05.529 - R 0:00.275
22:53:57 warnings/self-assignment PASSED C 0:01.379 - R 0:00.003
22:53:57 voidPtr PASSED C 0:01.503 - R 0:00.074
22:53:57 exceptions/cor_resumer PASSED C 0:11.975 - R 0:00.025
22:53:57 linking/mangling/anon PASSED C 0:07.039 - R 0:00.041
22:53:57 concurrency/channels/zero_size PASSED C 0:19.777 - R 0:10.060
22:53:57 KRfunctions PASSED C 0:01.412 - R 0:00.005
22:53:57 errors/completeType PASSED C 0:00.845 - R n/a
22:53:57 ...collections/dimexpr-match-c-ERRS PASSED C 0:01.110 - R n/a
22:53:57 function-operator PASSED C 0:10.676 - R 0:00.025
22:53:57 include/stdincludes PASSED C 0:09.884 - R 0:00.077
22:53:57 attributes PASSED C 0:01.590 - R 0:00.003
22:53:57 declarationSpecifier PASSED C 0:01.464 - R 0:00.002
22:53:57 ...llections/dimexpr-match-cfa-ERRS PASSED C 0:01.708 - R n/a
22:53:57 list/dlist-insert-remove PASSED C 0:07.392 - R 0:00.041
22:53:57 functions PASSED C 0:01.374 - R 0:00.002
22:53:57 extension PASSED C 0:01.397 - R 0:00.001
22:53:57 raii/memberCtors-ERR1 PASSED C 0:04.283 - R n/a
22:53:57 gccExtensions PASSED C 0:01.280 - R 0:00.004
22:53:57 literals PASSED C 0:07.335 - R 0:00.021
22:53:57 meta/arch PASSED C 0:00.833 - R n/a
22:53:57 list/dlist2-insert-remove PASSED C 0:07.732 - R 0:00.022
22:53:57 raii/dtor-early-exit-ERR2 PASSED C 0:05.042 - R n/a
22:53:57 exceptions/pingpong_nonlocal PASSED C 0:12.792 - R 0:00.021
22:53:57 raii/dtor-early-exit-ERR1 PASSED C 0:05.292 - R n/a
22:53:57 linking/io-acquire PASSED C 0:09.184 - R 0:00.021
22:53:57 linking/nothreads PASSED C 0:09.141 - R 0:00.021
22:53:57 concurrency/waituntil/locks PASSED C 0:18.283 - R 0:02.827
22:53:57 arithmeticConversions PASSED C 0:03.194 - R 0:00.019
22:53:57 zero_one-ERR1 PASSED C 0:03.747 - R n/a
22:53:57 linking/weakso_nothd PASSED C 0:09.288 - R 0:00.019
22:53:57 alloc2 PASSED C 0:32.662 - R 0:00.019
22:53:57 tuple/tupleVariadic PASSED C 0:05.424 - R 0:00.036
22:53:57 io/manipulatorsInput-uchunk PASSED C 0:10.907 - R 0:00.067
22:53:57 io/io PASSED C 0:11.437 - R 0:00.036
22:53:57 raii/boxed-types PASSED C 0:07.016 - R 0:00.019
22:53:57 polymorphism PASSED C 0:07.258 - R 0:00.022
22:53:57 quotedKeyword PASSED C 0:07.200 - R 0:00.019
22:53:57 raii/globals PASSED C 0:06.900 - R 0:00.037
22:53:57 meta/dumpable PASSED C 0:09.703 - R 0:00.036
22:53:57 sizeof PASSED C 0:06.770 - R 0:00.020
22:53:57 shortCircuit PASSED C 0:07.149 - R 0:00.019
22:53:57 concurrency/unified_locking/locks PASSED C 0:16.144 - R 0:12.573
22:53:57 io/io-acquire-in PASSED C 0:12.589 - R 0:00.037
22:53:57 strstream PASSED C 0:07.320 - R 0:00.019
22:53:57 references PASSED C 0:07.506 - R 0:00.020
22:53:57 raii/memberCtors PASSED C 0:08.075 - R 0:00.021
22:53:57 io/io-acquire-out PASSED C 0:12.739 - R 0:00.035
22:53:57 tuplearray PASSED C 0:07.310 - R 0:00.021
22:53:57 io/io-acquire PASSED C 0:13.148 - R 0:00.035
22:53:57 malloc PASSED C 0:11.061 - R 0:00.019
22:53:57 tuple/tupleAssign PASSED C 0:07.671 - R 0:00.018
22:53:57 concurrency/preempt2 PASSED C 0:13.310 - R 0:20.474
22:53:57 io/io-acquire2 PASSED C 0:13.093 - R 0:00.036
22:53:57 heap PASSED C 0:10.418 - R 0:04.437
22:53:57 linking/withthreads PASSED C 0:11.975 - R 0:00.019
22:53:57 zero_one PASSED C 0:07.056 - R 0:00.018
22:53:57 raii/dtor-early-exit PASSED C 0:09.303 - R 0:00.020
22:53:57 userLiterals PASSED C 0:07.997 - R 0:00.018
22:53:57 io/manipulatorsOutput4 PASSED C 0:13.853 - R 0:00.036
22:53:57 vector PASSED C 0:08.486 - R 0:00.018
22:53:57 time PASSED C 0:09.191 - R 0:00.020
22:53:57 sum PASSED C 0:09.604 - R 0:00.036
22:53:57 io/away_fair PASSED C 0:15.348 - R 0:00.034
22:53:57 minmax PASSED C 0:13.315 - R 0:00.021
22:53:57 swap PASSED C 0:10.176 - R 0:00.021
22:53:57 io/many_read PASSED C 0:15.472 - R 0:00.036
22:53:57 vector_math/vec2_double PASSED C 0:09.887 - R 0:00.019
22:53:57 vector_math/vec2_uint PASSED C 0:09.986 - R 0:00.019
22:53:57 abs PASSED C 0:09.158 - R 0:00.019
22:53:57 searchsort PASSED C 0:11.054 - R 0:00.036
22:53:57 concurrency/waituntil/channel_close PASSED C 0:19.453 - R 0:10.050
22:53:57 ato PASSED C 0:09.934 - R 0:00.019
22:53:57 random PASSED C 0:09.069 - R 0:00.021
22:53:57 io/comp_fair PASSED C 0:18.022 - R 0:00.036
22:53:57 concurrency/waituntil/futures PASSED C 0:30.031 - R 0:00.019
22:53:57 io/comp_basic PASSED C 0:18.533 - R 0:00.035
22:53:57 vector_math/vec2_ldouble PASSED C 0:09.662 - R 0:00.018
22:53:57 exceptions/hotpotato_checked PASSED C 0:10.984 - R 0:00.019
22:53:57 gmp PASSED C 0:11.082 - R 0:00.035
22:53:57 io/manipulatorsInput PASSED C 0:11.067 - R 0:00.036
22:53:57 ...collections/array-md-sbscr-cases PASSED C 0:11.955 - R 0:00.018
22:53:57 exceptions/hotpotato PASSED C 0:11.497 - R 0:00.019
22:53:57 exceptions/cardgame PASSED C 0:12.313 - R 0:00.018
22:53:57 bitmanip3 PASSED C 0:13.191 - R 0:00.035
22:53:57 bitmanip1 PASSED C 0:13.417 - R 0:00.036
22:53:57 math PASSED C 0:12.827 - R 0:00.019
22:53:57 io/manipulatorsOutput2 PASSED C 0:13.330 - R 0:00.019
22:53:57 include/includes PASSED C 0:23.341 - R 0:00.018
22:53:57 mathX PASSED C 0:14.171 - R 0:00.035
22:53:57 bitmanip2 PASSED C 0:14.874 - R 0:00.035
22:53:57 concurrency/waituntil/all_types PASSED C 0:35.822 - R 0:00.217
22:53:57 PRNG PASSED C 0:16.612 - R 0:00.370
22:53:57 vector_math/vec3_int PASSED C 0:17.695 - R 0:00.018
22:53:57 vector_math/vec4_int PASSED C 0:18.554 - R 0:00.024
22:53:57 vector_math/vec2_float PASSED C 0:18.891 - R 0:00.020
22:53:57 vector_math/vec4_float PASSED C 0:19.401 - R 0:00.036
22:53:57 vector_math/vec3_float PASSED C 0:20.089 - R 0:00.018
22:53:57 vector_math/vec2_int PASSED C 0:20.446 - R 0:00.018
22:53:57 io/manipulatorsOutput1 PASSED C 0:21.449 - R 0:00.022
22:53:57 io/io-acquire-no-io PASSED C 0:12.421 - R 0:17.646
22:53:57 rational PASSED C 0:29.571 - R 0:00.018
22:53:57 concurrency/waituntil/repeat_close PASSED C 0:15.421 - R 0:30.029
22:53:57 ...ency/unified_locking/futex_mutex PASSED C 0:16.706 - R 0:35.991
22:53:57 io/manipulatorsOutput3 PASSED C 0:30.380 - R 0:00.022
22:53:57 .../unified_locking/spin_queue_lock PASSED C 0:14.938 - R 0:49.139
22:53:57 ...urrency/unified_locking/mcs_spin PASSED C 0:14.393 - R 0:57.768
22:53:57374 passes, 1 failures, 0 timeouts, 0 cancelled, 0 other
22:53:57Tests took 1:18.855
22:53:57make: *** [Makefile:986: all-local] Error 1
22:53:57[Pipeline] }
22:53:57[Pipeline] // dir
22:53:57[Pipeline] }
22:53:57[Pipeline] // stage
22:53:57[Pipeline] echo
22:53:57Archiving core dumps
22:53:57[Pipeline] dir
22:53:57Running in /var/lib/jenkins/workspace/Cforall_master@tmp
22:53:57[Pipeline] {
22:53:57[Pipeline] fileExists
22:53:57[Pipeline] sh
22:53:57+ /var/lib/jenkins/workspace/Cforall_master/tools/jenkins/archive-gen.sh
22:53:57[Pipeline] archiveArtifacts
22:53:57Archiving artifacts
22:53:57Recording fingerprints
22:53:57[Pipeline] }
22:53:57[Pipeline] // dir
22:53:57[Pipeline] }
22:53:57[Pipeline] // wrap
22:53:57[Pipeline] }
22:53:57[Pipeline] // node
22:53:57[Pipeline] echo
22:53:57hudson.AbortException: script returned exit code 2
22:53:57[Pipeline] node
22:53:57Running on Brokk 4 in /var/lib/jenkins/workspace/Cforall_master
22:53:57[Pipeline] {
22:53:57[Pipeline] echo
22:53:57Notifying users of result
22:53:57[Pipeline] echo
22:53:57Reusing previously constructed message
22:53:57[Pipeline] echo
22:53:57Would send email to: cforall@lists.uwaterloo.ca
22:53:57[Pipeline] echo
22:53:57With title: [cforall git][BUILD# 3929 - FAILURE] - branch master
22:53:57[Pipeline] echo
22:53:57Content:
22:53:57<p>This is an automated email from the Jenkins build machine. It was
22:53:57generated because of a git hooks/post-receive script following
22:53:57a ref change which was pushed to the C∀ repository.</p>
22:53:5722:53:57<p>- Status --------------------------------------------------------------</p>
22:53:5722:53:57<p>BUILD# 3929 - FAILURE</p>
22:53:57<p>Check console output at https://cforall.uwaterloo.ca/jenkins/job/Cforall/job/master/3929/ to view the results.</p>
22:53:5722:53:57<p>- Changes -------------------------------------------------------------</p>
22:53:5722:53:57<pre>
22:53:57The branch master has been updated.
22:53:57 from 880968bf0c0545a6330ce6fb2a90567fd5f026cb (commit)
22:53:57</pre>
22:53:5722:53:57<p>- Log -----------------------------------------------------------------</p>
22:53:5722:53:57<pre>
22:53:5722:53:57</pre>
22:53:5722:53:57<p>-----------------------------------------------------------------------</p>
22:53:57<pre>
22:53:57Summary of changes:
22:53:5722:53:57</pre>
22:53:5722:53:57[Pipeline] }
22:53:57[Pipeline] // node
22:53:57[Pipeline] echo
22:53:57Build Completed
22:53:57[Pipeline] End of Pipeline
22:53:57ERROR: script returned exit code 2
22:53:57Finished: FAILURE
[Pipeline] error
[Pipeline] }
22:53:57Failed in branch gcc_11_arm64_new
22:59:45Build Cforall » master #3930 completed: SUCCESS
[Pipeline] echo
22:59:45SUCCESS
[Pipeline] }
23:00:17Build Cforall » master #3927 completed: SUCCESS
[Pipeline] echo
23:00:17SUCCESS
[Pipeline] }
23:00:49Build Cforall » master #3925 completed: SUCCESS
[Pipeline] echo
23:00:49SUCCESS
[Pipeline] }
23:02:16Build Cforall » master #3932 completed: SUCCESS
[Pipeline] echo
23:02:16SUCCESS
[Pipeline] }
23:02:18Build Cforall » master #3928 completed: SUCCESS
[Pipeline] echo
23:02:18SUCCESS
[Pipeline] }
23:03:53Build Cforall » master #3934 completed: SUCCESS
[Pipeline] echo
23:03:53SUCCESS
[Pipeline] }
23:04:26Build Cforall » master #3935 completed: SUCCESS
[Pipeline] echo
23:04:26SUCCESS
[Pipeline] }
23:11:06Build Cforall » master #3933 completed: SUCCESS
[Pipeline] echo
23:11:06SUCCESS
[Pipeline] }
23:14:33Build Cforall » master #3926 completed: SUCCESS
[Pipeline] echo
23:14:33SUCCESS
[Pipeline] }
23:28:36Build Cforall » master #3931 completed: SUCCESS
[Pipeline] echo
23:28:36SUCCESS
[Pipeline] }
[Pipeline] // parallel
[Pipeline] }
[Pipeline] // stage
[Pipeline] }
[Pipeline] // wrap
[Pipeline] echo
error caught
[Pipeline] node
Running on Brokk 4 in /var/lib/jenkins/workspace/Cforall_Full_Build
[Pipeline] {
[Pipeline] echo
notifying users
[Pipeline] emailext
Sending email to: cforall@lists.uwaterloo.ca
[Pipeline] }
[Pipeline] // node
[Pipeline] }
[Pipeline] // node
[Pipeline] End of Pipeline
ERROR: FAILURE
Finished: FAILURE