Started by timer Running as Jenkins Build User Obtained Jenkins/FullBuild from git cforall@plg.uwaterloo.ca:software/cfa/cfa-cc [Pipeline] Start of Pipeline [Pipeline] node Running on Brokk 3 in /var/lib/jenkins/workspace/Cforall_Full_Build [Pipeline] { [Pipeline] checkout The recommended git tool is: NONE using credential git_key_aug2025 Fetching changes from the remote Git repository Checking out Revision 880968bf0c0545a6330ce6fb2a90567fd5f026cb (refs/remotes/origin/master) Commit message: "remove uw-ethesis.pdf from repository" > git rev-parse --resolve-git-dir /var/lib/jenkins/workspace/Cforall_Full_Build/.git # timeout=10 > git config remote.origin.url cforall@plg.uwaterloo.ca:software/cfa/cfa-cc # timeout=10 Fetching upstream changes from cforall@plg.uwaterloo.ca:software/cfa/cfa-cc > git --version # timeout=10 > git --version # 'git version 2.43.0' using GIT_SSH to set credentials Git key use to connect to the cforall git repo (August 2025) Verifying host key using known hosts file > git fetch --tags --force --progress -- cforall@plg.uwaterloo.ca:software/cfa/cfa-cc +refs/heads/*:refs/remotes/origin/* # timeout=10 > git rev-parse refs/remotes/origin/master^{commit} # timeout=10 > git config core.sparsecheckout # timeout=10 > git checkout -f 880968bf0c0545a6330ce6fb2a90567fd5f026cb # timeout=10 > git rev-list --no-walk e2563b2a147d3a25fbf6bfab7e5e5efc06c56824 # timeout=10 [Pipeline] wrap [Pipeline] { [Pipeline] stage [Pipeline] { (Build) [Pipeline] parallel [Pipeline] { (Branch: gcc_10_x86_new) [Pipeline] { (Branch: gcc_11_x86_new) [Pipeline] { (Branch: gcc_12_x86_new) [Pipeline] { (Branch: gcc_9_x64_new) [Pipeline] { (Branch: gcc_10_x64_new) [Pipeline] { (Branch: gcc_11_x64_new) [Pipeline] { (Branch: gcc_12_x64_new) [Pipeline] { (Branch: gcc_10_arm64_new) [Pipeline] { (Branch: gcc_11_arm64_new) [Pipeline] { (Branch: gcc_12_arm64_new) [Pipeline] { (Branch: clang_x64_new) [Pipeline] sleep No need to sleep any longer [Pipeline] sleep No need to sleep any longer [Pipeline] sleep Sleeping for 2 min 0 sec [Pipeline] sleep Sleeping for 4 min 0 sec [Pipeline] sleep Sleeping for 2 min 0 sec [Pipeline] sleep No need to sleep any longer [Pipeline] sleep Sleeping for 4 min 0 sec [Pipeline] sleep No need to sleep any longer [Pipeline] sleep No need to sleep any longer [Pipeline] sleep Sleeping for 3 min 0 sec [Pipeline] sleep No need to sleep any longer [Pipeline] build Scheduling project: Cforall » master [Pipeline] build Scheduling project: Cforall » master [Pipeline] build Scheduling project: Cforall » master [Pipeline] build Scheduling project: Cforall » master [Pipeline] build Scheduling project: Cforall » master [Pipeline] build Scheduling project: Cforall » master Starting building: Cforall » master #3929 Starting building: Cforall » master #3926 Starting building: Cforall » master #3930 Starting building: Cforall » master #3928 Starting building: Cforall » master #3925 Starting building: Cforall » master #3927 [Pipeline] build Scheduling project: Cforall » master [Pipeline] build Scheduling project: Cforall » master Starting building: Cforall » master #3932 Starting building: Cforall » master #3931 [Pipeline] build Scheduling project: Cforall » master Starting building: Cforall » master #3933 [Pipeline] build Scheduling project: Cforall » master [Pipeline] build Scheduling project: Cforall » master Starting building: Cforall » master #3935 Starting building: Cforall » master #3934 Build Cforall » master #3929 completed: FAILURE [Pipeline] echo FAILURE [Pipeline] sh + wget -q -O - https://cforall.uwaterloo.ca/jenkins/job/Cforall/job/master/3929/consoleText Started by upstream project "Cforall_Full_Build" build number 436 originally caused by: Started by timer Running as Jenkins Build User > git rev-parse --resolve-git-dir /var/lib/jenkins/caches/git-914b6fdde163b7e17ee75d99ca23f18a/.git # timeout=10 Setting origin to cforall@plg.uwaterloo.ca:software/cfa/cfa-cc > git config remote.origin.url cforall@plg.uwaterloo.ca:software/cfa/cfa-cc # timeout=10 Fetching origin... Fetching upstream changes from origin > git --version # timeout=10 > git --version # 'git version 2.43.0' > git config --get remote.origin.url # timeout=10 using GIT_SSH to set credentials Git key use to connect to the cforall git repo (August 2025) Verifying host key using known hosts file > git fetch --no-tags --force --progress -- origin +refs/heads/*:refs/remotes/origin/* # timeout=10 Seen branch in repository origin/ADT Seen branch in repository origin/aaron-thesis Seen branch in repository origin/arm-eh Seen branch in repository origin/ast-experimental Seen branch in repository origin/cleanup-dtors Seen branch in repository origin/ctor Seen branch in repository origin/deferred_resn Seen branch in repository origin/demangler Seen branch in repository origin/enum Seen branch in repository origin/forall-pointer-decay Seen branch in repository origin/gc_noraii Seen branch in repository origin/jacob/cs343-translation Seen branch in repository origin/jenkins-sandbox Seen branch in repository origin/master Seen branch in repository origin/memory Seen branch in repository origin/new-ast Seen branch in repository origin/new-ast-unique-expr Seen branch in repository origin/new-env Seen branch in repository origin/no_list Seen branch in repository origin/persistent-indexer Seen branch in repository origin/pthread-emulation Seen branch in repository origin/qualifiedEnum Seen branch in repository origin/resolv-new Seen branch in repository origin/string Seen branch in repository origin/stuck-waitfor-destruct Seen branch in repository origin/with_gc Seen 26 remote branches Obtained Jenkinsfile from 880968bf0c0545a6330ce6fb2a90567fd5f026cb [Pipeline] Start of Pipeline [Pipeline] node Running on Algol in /var/lib/jenkins/workspace/Cforall_master [Pipeline] { [Pipeline] wrap [Pipeline] { [Pipeline] properties WARNING: Unknown parameter(s) found for class type 'hudson.model.ChoiceParameterDefinition': defaultValue WARNING: Unknown parameter(s) found for class type 'hudson.model.ChoiceParameterDefinition': defaultValue [Pipeline] checkout The recommended git tool is: NONE using credential git_key_aug2025 Fetching changes from the remote Git repository Cleaning workspace Fetching without tags Checking out Revision 880968bf0c0545a6330ce6fb2a90567fd5f026cb (master) Commit message: "remove uw-ethesis.pdf from repository" [Pipeline] load [Pipeline] { (Jenkins/tools.groovy) [Pipeline] } [Pipeline] // load [Pipeline] echo Compiler : gcc-11 (g++-11/gcc-11) Architecture : arm64 Arc Flags : --host=aarch64 Run All Tests : true Run Benchmark : true Build Documentation : false Publish : true Silent : true [Pipeline] } [Pipeline] // wrap [Pipeline] } [Pipeline] // node [Pipeline] node Running on Algol in /var/lib/jenkins/workspace/Cforall_master [Pipeline] { [Pipeline] wrap [Pipeline] { [Pipeline] pwd [Pipeline] pwd > git rev-parse --resolve-git-dir /var/lib/jenkins/workspace/Cforall_master/.git # timeout=10 > git config remote.origin.url cforall@plg.uwaterloo.ca:software/cfa/cfa-cc # timeout=10 > git rev-parse --verify HEAD # timeout=10 Resetting working tree > git reset --hard # timeout=10 > git clean -fdx # timeout=10 Fetching upstream changes from cforall@plg.uwaterloo.ca:software/cfa/cfa-cc > git --version # timeout=10 > git --version # 'git version 2.43.0' using GIT_SSH to set credentials Git key use to connect to the cforall git repo (August 2025) Verifying host key using known hosts file > git fetch --no-tags --force --progress -- cforall@plg.uwaterloo.ca:software/cfa/cfa-cc +refs/heads/*:refs/remotes/origin/* # timeout=10 > git config core.sparsecheckout # timeout=10 > git checkout -f 880968bf0c0545a6330ce6fb2a90567fd5f026cb # timeout=10 > git rev-list --no-walk 880968bf0c0545a6330ce6fb2a90567fd5f026cb # timeout=10 [Pipeline] echo -------- Cleanup -------- [Pipeline] stage [Pipeline] { (Cleanup) [Pipeline] dir Running in /var/lib/jenkins/workspace/Cforall_master@tmp [Pipeline] { [Pipeline] deleteDir [Pipeline] } [Pipeline] // dir [Pipeline] } [Pipeline] // stage [Pipeline] echo -------- Checkout -------- [Pipeline] stage [Pipeline] { (Checkout) [Pipeline] checkout The recommended git tool is: NONE using credential git_key_aug2025 Fetching changes from the remote Git repository Cleaning workspace Fetching without tags > git rev-parse --resolve-git-dir /var/lib/jenkins/workspace/Cforall_master/.git # timeout=10 > git config remote.origin.url cforall@plg.uwaterloo.ca:software/cfa/cfa-cc # timeout=10 > git rev-parse --verify HEAD # timeout=10 Resetting working tree > git reset --hard # timeout=10 > git clean -fdx # timeout=10 Fetching upstream changes from cforall@plg.uwaterloo.ca:software/cfa/cfa-cc > git --version # timeout=10 > git --version # 'git version 2.43.0' using GIT_SSH to set credentials Git key use to connect to the cforall git repo (August 2025) Verifying host key using known hosts file > git fetch --no-tags --force --progress -- cforall@plg.uwaterloo.ca:software/cfa/cfa-cc +refs/heads/*:refs/remotes/origin/* # timeout=10 Checking out Revision 880968bf0c0545a6330ce6fb2a90567fd5f026cb (master) Commit message: "remove uw-ethesis.pdf from repository" [Pipeline] echo Constructing new git message [Pipeline] sh > git config core.sparsecheckout # timeout=10 > git checkout -f 880968bf0c0545a6330ce6fb2a90567fd5f026cb # timeout=10 + git rev-list 880968bf0c0545a6330ce6fb2a90567fd5f026cb..880968bf0c0545a6330ce6fb2a90567fd5f026cb [Pipeline] sh + git cat-file -t 880968bf0c0545a6330ce6fb2a90567fd5f026cb [Pipeline] sh + git rev-list --format=short 880968bf0c0545a6330ce6fb2a90567fd5f026cb...880968bf0c0545a6330ce6fb2a90567fd5f026cb [Pipeline] sh + git diff --stat --color 880968bf0c0545a6330ce6fb2a90567fd5f026cb 880968bf0c0545a6330ce6fb2a90567fd5f026cb [Pipeline] echo

- Changes -------------------------------------------------------------

The branch master has been updated.
      from  880968bf0c0545a6330ce6fb2a90567fd5f026cb (commit)

- Log -----------------------------------------------------------------


-----------------------------------------------------------------------

Summary of changes:

[Pipeline] } [Pipeline] // stage [Pipeline] echo -------- Build : configure -------- [Pipeline] stage [Pipeline] { (Build : configure) [Pipeline] dir Running in /var/lib/jenkins/workspace/Cforall_master [Pipeline] { [Pipeline] sh + ./autogen.sh Running aclocal in root Running libtoolize in root libtoolize: putting auxiliary files in AC_CONFIG_AUX_DIR, 'automake'. libtoolize: linking file 'automake/ltmain.sh' libtoolize: putting macros in AC_CONFIG_MACRO_DIRS, 'automake'. libtoolize: linking file 'automake/libtool.m4' libtoolize: linking file 'automake/ltoptions.m4' libtoolize: linking file 'automake/ltsugar.m4' libtoolize: linking file 'automake/ltversion.m4' libtoolize: linking file 'automake/lt~obsolete.m4' Running autoconf in root Running automake in root configure.ac:223: installing 'automake/compile' configure.ac:138: installing 'automake/config.guess' configure.ac:138: installing 'automake/config.sub' configure.ac:17: installing 'automake/install-sh' benchmark/Makefile.am: installing 'automake/depcomp' parallel-tests: installing 'automake/test-driver' configure.ac: installing 'automake/ylwrap' Running aclocal in libcfa Running libtoolize in libcfa libtoolize: putting auxiliary files in AC_CONFIG_AUX_DIR, 'automake'. libtoolize: linking file 'automake/ltmain.sh' libtoolize: putting macros in AC_CONFIG_MACRO_DIRS, 'automake'. libtoolize: linking file 'automake/libtool.m4' libtoolize: linking file 'automake/ltoptions.m4' libtoolize: linking file 'automake/ltsugar.m4' libtoolize: linking file 'automake/ltversion.m4' libtoolize: linking file 'automake/lt~obsolete.m4' Running autoconf in libcfa Running automake in libcfa configure.ac:119: installing 'automake/compile' configure.ac:119: installing 'automake/config.guess' configure.ac:119: installing 'automake/config.sub' configure.ac:12: installing 'automake/install-sh' src/Makefile.am: installing 'automake/depcomp' [Pipeline] } [Pipeline] // dir [Pipeline] dir Running in /var/lib/jenkins/workspace/Cforall_master@tmp [Pipeline] { [Pipeline] sh + /var/lib/jenkins/workspace/Cforall_master/configure CXX=g++-11 CC=gcc-11 --host=aarch64 AR=gcc-ar RANLIB=gcc-ranlib --with-target-hosts=host:debug,host:nodebug --quiet --prefix=/var/lib/jenkins/workspace/Cforall_master@tmp [Pipeline] sh + nproc + make -j 96 --no-print-directory configure-libcfa libcfa/arm64-debug/config.data Configuring libcfa (/var/lib/jenkins/workspace/Cforall_master/libcfa/configure) with ''CXX=g++-11' 'CC=gcc-11' 'AR=gcc-ar' 'RANLIB=gcc-ranlib' '--prefix=/var/lib/jenkins/workspace/Cforall_master@tmp' DRIVER_DIR=/var/lib/jenkins/workspace/Cforall_master@tmp/driver/ ARCHITECTURE=arm64 CONFIGURATION=debug CFA_VERSION=1:0:0' from /var/lib/jenkins/workspace/Cforall_master@tmp / libcfa/arm64-debug/ libcfa/arm64-nodebug/config.data Configuring libcfa (/var/lib/jenkins/workspace/Cforall_master/libcfa/configure) with ''CXX=g++-11' 'CC=gcc-11' 'AR=gcc-ar' 'RANLIB=gcc-ranlib' '--prefix=/var/lib/jenkins/workspace/Cforall_master@tmp' DRIVER_DIR=/var/lib/jenkins/workspace/Cforall_master@tmp/driver/ ARCHITECTURE=arm64 CONFIGURATION=nodebug CFA_VERSION=1:0:0' from /var/lib/jenkins/workspace/Cforall_master@tmp / libcfa/arm64-nodebug/ checking whether make supports nested variables... checking whether make supports nested variables... yes checking for a BSD-compatible install... yes checking for a BSD-compatible install... /usr/bin/install -c checking whether build environment is sane... /usr/bin/install -c checking whether build environment is sane... yes yes checking for a race-free mkdir -p... checking for a race-free mkdir -p... /usr/bin/mkdir -p checking for gawk... /usr/bin/mkdir -p gawk checking whether make sets $(MAKE)... checking for gawk... gawk checking whether make sets $(MAKE)... yes yes checking for distributated build... no checking for distributated build... no checking build system type... checking build system type... aarch64-unknown-linux-gnu checking host system type... aarch64-unknown-linux-gnu checking how to print strings... aarch64-unknown-linux-gnu checking host system type... aarch64-unknown-linux-gnu checking how to print strings... printf checking whether make supports the include directive... printf checking whether make supports the include directive... yes (GNU style) checking for gcc... gcc-11 yes (GNU style) checking for gcc... gcc-11 checking whether the C compiler works... checking whether the C compiler works... yes checking for C compiler default output file name... a.out checking for suffix of executables... yes checking for C compiler default output file name... a.out checking for suffix of executables... checking whether we are cross compiling... checking whether we are cross compiling... no checking for suffix of object files... no checking for suffix of object files... o checking whether the compiler supports GNU C... o checking whether the compiler supports GNU C... yes checking whether gcc-11 accepts -g... yes checking whether gcc-11 accepts -g... yes checking for gcc-11 option to enable C11 features... yes checking for gcc-11 option to enable C11 features... none needed checking whether gcc-11 understands -c and -o together... none needed checking whether gcc-11 understands -c and -o together... yes checking dependency style of gcc-11... yes checking dependency style of gcc-11... gcc3 checking for a sed that does not truncate output... /usr/bin/sed checking for grep that handles long lines and -e... /usr/bin/grep checking for egrep... /usr/bin/grep -E checking for fgrep... gcc3 checking for a sed that does not truncate output... /usr/bin/grep -F checking for ld used by gcc-11... /usr/bin/sed checking for grep that handles long lines and -e... /usr/bin/ld checking if the linker (/usr/bin/ld) is GNU ld... /usr/bin/grep checking for egrep... yes checking for BSD- or MS-compatible name lister (nm)... /usr/bin/grep -E checking for fgrep... /usr/bin/grep -F checking for ld used by gcc-11... /usr/bin/nm -B checking the name lister (/usr/bin/nm -B) interface... /usr/bin/ld checking if the linker (/usr/bin/ld) is GNU ld... yes checking for BSD- or MS-compatible name lister (nm)... /usr/bin/nm -B checking the name lister (/usr/bin/nm -B) interface... BSD nm checking whether ln -s works... yes checking the maximum length of command line arguments... 1572864 checking how to convert aarch64-unknown-linux-gnu file names to aarch64-unknown-linux-gnu format... func_convert_file_noop checking how to convert aarch64-unknown-linux-gnu file names to toolchain format... func_convert_file_noop checking for /usr/bin/ld option to reload object files... -r checking for file... file checking for objdump... objdump checking how to recognize dependent libraries... pass_all checking for dlltool... no checking how to associate runtime and link libraries... printf %s\n checking for archiver @FILE support... BSD nm checking whether ln -s works... yes checking the maximum length of command line arguments... 1572864 checking how to convert aarch64-unknown-linux-gnu file names to aarch64-unknown-linux-gnu format... func_convert_file_noop checking how to convert aarch64-unknown-linux-gnu file names to toolchain format... func_convert_file_noop checking for /usr/bin/ld option to reload object files... -r checking for file... file checking for objdump... objdump checking how to recognize dependent libraries... pass_all checking for dlltool... no checking how to associate runtime and link libraries... printf %s\n checking for archiver @FILE support... @ checking for strip... strip checking for ranlib... gcc-ranlib checking command to parse /usr/bin/nm -B output from gcc-11 object... @ checking for strip... strip checking for ranlib... gcc-ranlib checking command to parse /usr/bin/nm -B output from gcc-11 object... ok checking for sysroot... no checking for a working dd... /usr/bin/dd checking how to truncate binary pipes... /usr/bin/dd bs=4096 count=1 checking for mt... mt checking if mt is a manifest tool... no checking for stdio.h... yes checking for stdlib.h... ok checking for sysroot... no checking for a working dd... /usr/bin/dd checking how to truncate binary pipes... /usr/bin/dd bs=4096 count=1 checking for mt... mt checking if mt is a manifest tool... yes checking for string.h... no checking for stdio.h... yes checking for inttypes.h... yes checking for stdlib.h... yes checking for stdint.h... yes checking for string.h... yes checking for strings.h... yes checking for inttypes.h... yes checking for sys/stat.h... yes checking for stdint.h... yes checking for sys/types.h... yes checking for strings.h... yes checking for unistd.h... yes checking for sys/stat.h... yes checking for dlfcn.h... yes checking for sys/types.h... yes checking for objdir... .libs yes checking for unistd.h... yes checking for dlfcn.h... checking if gcc-11 supports -fno-rtti -fno-exceptions... yes checking for objdir... .libs no checking for gcc-11 option to produce PIC... -fPIC -DPIC checking if gcc-11 PIC flag -fPIC -DPIC works... yes checking if gcc-11 static flag -static works... checking if gcc-11 supports -fno-rtti -fno-exceptions... no checking for gcc-11 option to produce PIC... -fPIC -DPIC checking if gcc-11 PIC flag -fPIC -DPIC works... yes checking if gcc-11 supports -c -o file.o... yes checking if gcc-11 static flag -static works... yes checking if gcc-11 supports -c -o file.o... (cached) yes checking whether the gcc-11 linker (/usr/bin/ld) supports shared libraries... yes checking whether -lc should be explicitly linked in... no checking dynamic linker characteristics... yes checking if gcc-11 supports -c -o file.o... yes checking if gcc-11 supports -c -o file.o... (cached) yes checking whether the gcc-11 linker (/usr/bin/ld) supports shared libraries... yes checking whether -lc should be explicitly linked in... GNU/Linux ld.so checking how to hardcode library paths into programs... immediate checking whether stripping libraries is possible... yes checking if libtool supports shared libraries... yes checking whether to build shared libraries... yes checking whether to build static libraries... no no checking dynamic linker characteristics... checking whether the compiler supports GNU C++... yes checking whether g++-11 accepts -g... yes checking for g++-11 option to enable C++11 features... GNU/Linux ld.so checking how to hardcode library paths into programs... immediate checking whether stripping libraries is possible... yes checking if libtool supports shared libraries... yes checking whether to build shared libraries... yes checking whether to build static libraries... no checking whether the compiler supports GNU C++... yes checking whether g++-11 accepts -g... none needed checking dependency style of g++-11... yes checking for g++-11 option to enable C++11 features... gcc3 checking how to run the C++ preprocessor... g++-11 -E none needed checking dependency style of g++-11... gcc3 checking how to run the C++ preprocessor... g++-11 -E checking for ld used by g++-11... /usr/bin/ld checking if the linker (/usr/bin/ld) is GNU ld... yes checking whether the g++-11 linker (/usr/bin/ld) supports shared libraries... yes checking for g++-11 option to produce PIC... -fPIC -DPIC checking if g++-11 PIC flag -fPIC -DPIC works... checking for ld used by g++-11... /usr/bin/ld checking if the linker (/usr/bin/ld) is GNU ld... yes checking whether the g++-11 linker (/usr/bin/ld) supports shared libraries... yes yes checking if g++-11 static flag -static works... yes checking if g++-11 supports -c -o file.o... checking for g++-11 option to produce PIC... -fPIC -DPIC checking if g++-11 PIC flag -fPIC -DPIC works... yes checking if g++-11 supports -c -o file.o... (cached) yes checking whether the g++-11 linker (/usr/bin/ld) supports shared libraries... yes checking dynamic linker characteristics... (cached) GNU/Linux ld.so checking how to hardcode library paths into programs... immediate checking for gcc... (cached) gcc-11 yes checking if g++-11 static flag -static works... checking whether the compiler supports GNU C... (cached) yes checking whether gcc-11 accepts -g... (cached) yes checking for gcc-11 option to enable C11 features... (cached) none needed checking whether gcc-11 understands -c and -o together... (cached) yes checking dependency style of gcc-11... (cached) gcc3 checking dependency style of gcc-11... gcc3 checking whether make sets $(MAKE)... (cached) yes checking for linux/rseq.h... yes checking if g++-11 supports -c -o file.o... yes checking for rseq_available in -lrseq... yes checking if g++-11 supports -c -o file.o... (cached) yes checking whether the g++-11 linker (/usr/bin/ld) supports shared libraries... yes checking dynamic linker characteristics... (cached) GNU/Linux ld.so checking how to hardcode library paths into programs... immediate checking for gcc... (cached) gcc-11 no checking for gcc-11 options needed to detect all undeclared functions... checking whether the compiler supports GNU C... (cached) yes checking whether gcc-11 accepts -g... (cached) yes checking for gcc-11 option to enable C11 features... (cached) none needed checking whether gcc-11 understands -c and -o together... (cached) yes checking dependency style of gcc-11... (cached) gcc3 checking dependency style of gcc-11... none needed checking for linux/io_uring.h... gcc3 checking whether make sets $(MAKE)... (cached) yes checking for linux/rseq.h... yes checking for liburing.h... yes checking for rseq_available in -lrseq... no checking whether IORING_OP_NOP is declared... no checking for gcc-11 options needed to detect all undeclared functions... yes checking whether IORING_OP_READV is declared... yes checking whether IORING_OP_WRITEV is declared... none needed checking for linux/io_uring.h... yes checking whether IORING_OP_FSYNC is declared... yes checking for liburing.h... yes checking whether IORING_OP_READ_FIXED is declared... no checking whether IORING_OP_NOP is declared... yes checking whether IORING_OP_WRITE_FIXED is declared... yes checking whether IORING_OP_READV is declared... yes checking whether IORING_OP_POLL_ADD is declared... yes checking whether IORING_OP_WRITEV is declared... yes checking whether IORING_OP_POLL_REMOVE is declared... yes yes checking whether IORING_OP_FSYNC is declared... checking whether IORING_OP_SYNC_FILE_RANGE is declared... yes yes checking whether IORING_OP_READ_FIXED is declared... checking whether IORING_OP_SENDMSG is declared... yes yes checking whether IORING_OP_RECVMSG is declared... checking whether IORING_OP_WRITE_FIXED is declared... yes yes checking whether IORING_OP_TIMEOUT is declared... checking whether IORING_OP_POLL_ADD is declared... yes yes checking whether IORING_OP_TIMEOUT_REMOVE is declared... checking whether IORING_OP_POLL_REMOVE is declared... yes checking whether IORING_OP_ACCEPT is declared... yes checking whether IORING_OP_SYNC_FILE_RANGE is declared... yes checking whether IORING_OP_ASYNC_CANCEL is declared... yes checking whether IORING_OP_SENDMSG is declared... yes checking whether IORING_OP_LINK_TIMEOUT is declared... yes checking whether IORING_OP_RECVMSG is declared... yes checking whether IORING_OP_CONNECT is declared... yes checking whether IORING_OP_TIMEOUT is declared... yes checking whether IORING_OP_FALLOCATE is declared... yes checking whether IORING_OP_TIMEOUT_REMOVE is declared... yes yes checking whether IORING_OP_OPENAT is declared... checking whether IORING_OP_ACCEPT is declared... yes checking whether IORING_OP_CLOSE is declared... yes checking whether IORING_OP_ASYNC_CANCEL is declared... yes checking whether IORING_OP_FILES_UPDATE is declared... yes checking whether IORING_OP_LINK_TIMEOUT is declared... yes checking whether IORING_OP_STATX is declared... yes checking whether IORING_OP_CONNECT is declared... yes checking whether IORING_OP_READ is declared... yes checking whether IORING_OP_FALLOCATE is declared... yes checking whether IORING_OP_WRITE is declared... yes checking whether IORING_OP_OPENAT is declared... yes checking whether IORING_OP_FADVISE is declared... yes checking whether IORING_OP_CLOSE is declared... yes checking whether IORING_OP_MADVISE is declared... yes checking whether IORING_OP_FILES_UPDATE is declared... yes checking whether IORING_OP_SEND is declared... yes checking whether IORING_OP_STATX is declared... yes checking whether IORING_OP_RECV is declared... yes checking whether IORING_OP_READ is declared... yes checking whether IORING_OP_OPENAT2 is declared... yes checking whether IORING_OP_WRITE is declared... yes checking whether IORING_OP_EPOLL_CTL is declared... yes checking whether IORING_OP_FADVISE is declared... yes checking whether IORING_OP_SPLICE is declared... yes checking whether IORING_OP_MADVISE is declared... yes checking whether IORING_OP_PROVIDE_BUFFERS is declared... yes checking whether IORING_OP_SEND is declared... yes checking whether IORING_OP_REMOVE_BUFFER is declared... yes checking whether IORING_OP_RECV is declared... no checking whether IORING_OP_TEE is declared... yes checking whether IORING_OP_OPENAT2 is declared... yes checking whether IOSQE_FIXED_FILE is declared... yes checking whether IORING_OP_EPOLL_CTL is declared... yes checking whether IOSQE_IO_DRAIN is declared... yes checking whether IORING_OP_SPLICE is declared... yes checking whether IOSQE_IO_LINK is declared... yes checking whether IORING_OP_PROVIDE_BUFFERS is declared... yes checking whether IOSQE_IO_HARDLINK is declared... yes checking whether IORING_OP_REMOVE_BUFFER is declared... yes checking whether IOSQE_ASYNC is declared... no checking whether IORING_OP_TEE is declared... yes checking whether IOSQE_BUFFER_SELECT is declared... yes checking whether IOSQE_FIXED_FILE is declared... yes checking whether SPLICE_F_FD_IN_FIXED is declared... yes checking whether IOSQE_IO_DRAIN is declared... yes checking whether IORING_SETUP_ATTACH_WQ is declared... yes checking whether IOSQE_IO_LINK is declared... yes checking whether IORING_REGISTER_IOWQ_MAX_WORKERS is declared... yes checking whether IOSQE_IO_HARDLINK is declared... yes checking for preadv2... yes checking whether IOSQE_ASYNC is declared... yes checking whether IOSQE_BUFFER_SELECT is declared... yes checking for pwritev2... yes checking whether SPLICE_F_FD_IN_FIXED is declared... yes yes checking whether IORING_SETUP_ATTACH_WQ is declared... checking that generated files are newer than configure... done configure: creating ./config.status yes checking whether IORING_REGISTER_IOWQ_MAX_WORKERS is declared... yes checking for preadv2... yes checking for pwritev2... yes checking that generated files are newer than configure... done configure: creating ./config.status config.status: creating Makefile config.status: creating src/Makefile config.status: creating prelude/Makefile config.status: creating src/concurrency/io/call.cfa /var/lib/jenkins/workspace/Cforall_master/libcfa/src/concurrency/io/call.cfa.in:144: SyntaxWarning: invalid escape sequence '\(' sig = re.search("(.*) (.*)\((.*)\)", signature) config.status: creating prelude/defines.hfa config.status: creating Makefile config.status: executing depfiles commands config.status: creating src/Makefile config.status: creating prelude/Makefile config.status: creating src/concurrency/io/call.cfa config.status: executing libtool commands Cforall library configuraton completed. Type "make -j 8 install". /var/lib/jenkins/workspace/Cforall_master/libcfa/src/concurrency/io/call.cfa.in:144: SyntaxWarning: invalid escape sequence '\(' sig = re.search("(.*) (.*)\((.*)\)", signature) config.status: creating prelude/defines.hfa config.status: executing depfiles commands config.status: executing libtool commands Cforall library configuraton completed. Type "make -j 8 install". [Pipeline] } [Pipeline] // dir [Pipeline] } [Pipeline] // stage [Pipeline] echo -------- Build : cfa-cpp -------- [Pipeline] stage [Pipeline] { (Build : cfa-cpp) [Pipeline] dir Running in /var/lib/jenkins/workspace/Cforall_master@tmp [Pipeline] { [Pipeline] sh + nproc + make -j 96 --no-print-directory -C driver CXX as.o CXX cc1.o CXX cfa.o CXXLD as CXXLD cc1 CXXLD cfa [Pipeline] sh + nproc + make -j 96 --no-print-directory -C src YACC Parser/parser.cc updating Parser/parser.output updating Parser/parser.hh make all-am CXX main.o CXX CompilationState.o CXX MakeLibCfa.o LEX Parser/lex.cc CXX AST/Attribute.o CXX AST/Copy.o CXX AST/Create.o CXX AST/Decl.o CXX AST/DeclReplacer.o CXX AST/Expr.o CXX AST/GenericSubstitution.o CXX AST/Init.o CXX AST/Inspect.o CXX AST/LinkageSpec.o CXX AST/Node.o CXX AST/Pass.o CXX AST/Print.o CXX AST/Stmt.o CXX AST/SymbolTable.o CXX AST/Type.o CXX AST/TypeEnvironment.o CXX AST/TypeSubstitution.o CXX AST/Util.o CXX CodeGen/CodeGenerator.o CXX CodeGen/GenType.o CXX CodeGen/OperatorTable.o CXX CodeGen/FixMain.o CXX CodeGen/FixNames.o CXX CodeGen/Generate.o CXX CodeGen/LinkOnce.o CXX Concurrency/Actors.o CXX Concurrency/Corun.o CXX Concurrency/Keywords.o CXX Concurrency/Waitfor.o CXX Concurrency/Waituntil.o CXX Common/Assert.o CXX Common/CodeLocationTools.o CXX Common/DeclStats.o CXX Common/Eval.o CXX Common/Examine.o CXX Common/Indenter.o CXX Common/ResolvProtoDump.o CXX Common/SemanticError.o CXX Common/Stats/Counter.o CXX Common/Stats/Heap.o CXX Common/Stats/ResolveTime.o CXX Common/Stats/Stats.o CXX Common/Stats/Time.o CXX Common/Symbol.o CXX Common/UniqueName.o CXX Common/DebugMalloc.o CXX ControlStruct/ExceptDecl.o CXX ControlStruct/ExceptTranslate.o CXX ControlStruct/FixLabels.o CXX ControlStruct/HoistControlDecls.o CXX ControlStruct/LabelGenerator.o CXX ControlStruct/MultiLevelExit.o CXX ControlStruct/TranslateEnumRange.o CXX GenPoly/GenPoly.o CXX GenPoly/Lvalue2.o CXX GenPoly/Box.o CXX GenPoly/FindFunction.o CXX GenPoly/InstantiateGeneric.o CXX GenPoly/Lvalue.o CXX GenPoly/ScrubTypeVars.o CXX GenPoly/Specialize.o CXX InitTweak/GenInit.o CXX InitTweak/InitTweak.o CXX InitTweak/FixGlobalInit.o CXX InitTweak/FixInit.o CXX Parser/DeclarationNode.o CXX Parser/ExpressionNode.o CXX Parser/InitializerNode.o CXX Parser/ParseNode.o CXX Parser/parser.o CXX Parser/RunParser.o CXX Parser/StatementNode.o CXX Parser/TypeData.o CXX Parser/TypedefTable.o CXX ResolvExpr/AdjustExprType.o CXX ResolvExpr/Candidate.o CXX ResolvExpr/CandidateFinder.o CXX ResolvExpr/CastCost.o CXX ResolvExpr/CommonType.o CXX ResolvExpr/ConversionCost.o CXX ResolvExpr/CurrentObject.o CXX ResolvExpr/ExplodedArg.o CXX ResolvExpr/FindOpenVars.o CXX ResolvExpr/PolyCost.o CXX ResolvExpr/PtrsAssignable.o CXX ResolvExpr/PtrsCastable.o CXX ResolvExpr/RenameVars.o CXX ResolvExpr/Resolver.o CXX ResolvExpr/ResolveTypeof.o CXX ResolvExpr/SatisfyAssertions.o CXX ResolvExpr/SpecCost.o CXX ResolvExpr/Unify.o CXX ResolvExpr/CandidatePrinter.o In file included from /usr/include/aarch64-linux-gnu/c++/11/bits/os_defines.h:39, from /usr/include/aarch64-linux-gnu/c++/11/bits/c++config.h:586, from /usr/include/c++/11/cstdio:41, from /var/lib/jenkins/workspace/Cforall_master/src/Parser/parser.yy:41: /usr/include/features.h:415:4: warning: #warning _FORTIFY_SOURCE requires GCC 4.1 or later [-Wcpp] 415 | # warning _FORTIFY_SOURCE requires GCC 4.1 or later | ^~~~~~~ CXX ResolvExpr/EraseWith.o CXX SymTab/FixFunction.o CXX SymTab/GenImplicitCall.o CXX SymTab/Mangler.o CXX SymTab/ManglerCommon.o CXX Tuples/Explode.o CXX Tuples/TupleAssignment.o CXX Tuples/TupleExpansion.o CXX Tuples/Tuples.o CXX Validate/Autogen.o CXX Validate/CheckAssertions.o CXX Validate/CompoundLiteral.o CXX Validate/EliminateTypedef.o CXX Validate/EnumAndPointerDecay.o CXX Validate/FindSpecialDecls.o CXX Validate/FixQualifiedTypes.o CXX Validate/FixReturnTypes.o CXX Validate/ForallPointerDecay.o CXX Validate/GenericParameter.o CXX Validate/HoistStruct.o CXX Validate/HoistTypeDecls.o CXX Validate/ImplementEnumFunc.o CXX Validate/InitializerLength.o CXX Validate/LabelAddressFixer.o CXX Validate/LinkInstanceTypes.o CXX Validate/ReplaceTypedef.o CXX Validate/ReturnCheck.o CXX Validate/VerifyCtorDtorAssign.o CXX Virtual/ExpandCasts.o CXX Virtual/Tables.o CXX Virtual/VirtualDtor.o CXX Parser/lex.o CXXLD ../driver/cfa-cpp [Pipeline] } [Pipeline] // dir [Pipeline] } [Pipeline] // stage [Pipeline] echo -------- Build : libcfa(debug) -------- [Pipeline] stage [Pipeline] { (Build : libcfa(debug)) [Pipeline] dir Running in /var/lib/jenkins/workspace/Cforall_master@tmp [Pipeline] { [Pipeline] sh + nproc + make -j 96 --no-print-directory -C libcfa/arm64-debug Making all in prelude mkdir .deps touch .deps/builtins.Po (CDPATH="${ZSH_VERSION+.}:" && cd /var/lib/jenkins/workspace/Cforall_master/libcfa && /bin/bash '/var/lib/jenkins/workspace/Cforall_master/libcfa/automake/missing' autoheader) rm -f stamp-h1 touch /var/lib/jenkins/workspace/Cforall_master/libcfa/prelude/defines.hfa.in cd .. && /bin/bash ./config.status prelude/defines.hfa config.status: creating prelude/defines.hfa config.status: prelude/defines.hfa is unchanged make all-am GEN gcc-builtins.c GEN builtins.cfa GEN prelude.cfa GEN extras.cfa GEN extras.cfa GEN gcc-builtins.cfa GEN bootloader.c Making all in src CFA common.lo CFA fstream.lo CFA heap.lo CFA iostream.lo CFA iterator.lo CFA limits.lo CFA math.lo CFA memory.lo CFA parseargs.lo CFA parseconfig.lo CFA rational.lo CFA stdlib.lo CFA strstream.lo CFA time.lo CFA assert.lo CFA bits/debug.lo CC exception.lo CFA interpose.lo CFA prelude-inline.lo CFA startup.lo CC virtual.lo GEN prelude.lo CFA interpose_thread.lo CPPAS concurrency/CtxSwitch-arm64.lo CC concurrency/invoke.lo CFA concurrency/io.lo CFA concurrency/kernel/startup.lo CFA concurrency/preemption.lo CFA concurrency/ready_queue.lo CFA concurrency/stats.lo CFA concurrency/pthread.lo CFA bits/weakso_locks.lo CFA algorithms/range_iterator.lo CFA collections/maybe.lo CFA collections/pair.lo CFA collections/result.lo CFA collections/string.lo CFA collections/string_res.lo CFA collections/vector.lo CFA device/cpu.lo CFA concurrency/alarm.lo CFA concurrency/coroutine.lo CFA concurrency/exception.lo CFA concurrency/kernel.lo CFA concurrency/kernel/cluster.lo CFA concurrency/locks.lo CFA concurrency/monitor.lo CFA concurrency/mutex.lo CFA concurrency/select.lo CFA concurrency/thread.lo CFA concurrency/cofor.lo CFA concurrency/clib/cfathread.lo CFA concurrency/io/setup.lo CFA concurrency/io/call.lo /usr/include/linux/io_uring.h:83:43: warning: 'packed' attribute ignored for field of type 'union __io_uring_sqe____anonymous65' [-Wattributes] 83 | } __attribute__((packed)); | ^ /usr/include/linux/io_uring.h:83:43: warning: 'packed' attribute ignored for field of type 'union __io_uring_sqe____anonymous53' [-Wattributes] 83 | } __attribute__((packed)); | ^ /usr/include/linux/io_uring.h:83:43: warning: 'packed' attribute ignored for field of type 'union __io_uring_sqe____anonymous129' [-Wattributes] 83 | } __attribute__((packed)); | ^ CCLD libcfa.la /usr/bin/ld: warning: .libs/common.o: requires executable stack (because the .note.GNU-stack section is executable) /usr/include/linux/io_uring.h:83:43: warning: 'packed' attribute ignored for field of type 'union __io_uring_sqe____anonymous119' [-Wattributes] 83 | } __attribute__((packed)); | ^ /usr/include/linux/io_uring.h:83:43: warning: 'packed' attribute ignored for field of type 'union __io_uring_sqe____anonymous119' [-Wattributes] 83 | } __attribute__((packed)); | ^ /usr/include/linux/io_uring.h:83:43: warning: 'packed' attribute ignored for field of type 'union __io_uring_sqe____anonymous32' [-Wattributes] 83 | } __attribute__((packed)); | ^ /usr/include/linux/io_uring.h:83:43: warning: 'packed' attribute ignored for field of type 'union __io_uring_sqe____anonymous97' [-Wattributes] 83 | } __attribute__((packed)); | ^ CCLD libcfathread.la /usr/bin/ld: warning: concurrency/.libs/alarm.o: requires executable stack (because the .note.GNU-stack section is executable) make[1]: Nothing to be done for 'all-am'. [Pipeline] } [Pipeline] // dir [Pipeline] } [Pipeline] // stage [Pipeline] echo -------- Build : libcfa(nodebug) -------- [Pipeline] stage [Pipeline] { (Build : libcfa(nodebug)) [Pipeline] dir Running in /var/lib/jenkins/workspace/Cforall_master@tmp [Pipeline] { [Pipeline] sh + nproc + make -j 96 --no-print-directory -C libcfa/arm64-nodebug Making all in prelude mkdir .deps touch .deps/builtins.Po cd .. && /bin/bash ./config.status prelude/defines.hfa config.status: creating prelude/defines.hfa config.status: prelude/defines.hfa is unchanged make all-am GEN gcc-builtins.c GEN builtins.cfa GEN prelude.cfa GEN extras.cfa GEN extras.cfa GEN gcc-builtins.cfa GEN bootloader.c Making all in src CFA common.lo CFA fstream.lo CFA heap.lo CFA iostream.lo CFA iterator.lo CFA limits.lo CFA math.lo CFA memory.lo CFA parseargs.lo CFA parseconfig.lo CFA rational.lo CFA stdlib.lo CFA strstream.lo CFA time.lo CFA assert.lo CFA bits/debug.lo CC exception.lo CFA interpose.lo CFA prelude-inline.lo CFA startup.lo CC virtual.lo GEN prelude.lo CFA interpose_thread.lo CFA concurrency/preemption.lo CFA concurrency/ready_queue.lo CFA concurrency/stats.lo CFA concurrency/pthread.lo CFA bits/weakso_locks.lo CFA algorithms/range_iterator.lo CFA collections/maybe.lo CFA collections/pair.lo CFA collections/result.lo CFA collections/string.lo CFA collections/string_res.lo CFA collections/vector.lo CFA device/cpu.lo CFA concurrency/alarm.lo CFA concurrency/coroutine.lo CFA concurrency/exception.lo CFA concurrency/kernel.lo CFA concurrency/kernel/cluster.lo CFA concurrency/locks.lo CFA concurrency/monitor.lo CFA concurrency/mutex.lo CFA concurrency/select.lo CFA concurrency/thread.lo CFA concurrency/cofor.lo CFA concurrency/clib/cfathread.lo CPPAS concurrency/CtxSwitch-arm64.lo CC concurrency/invoke.lo CFA concurrency/io.lo CFA concurrency/io/setup.lo CFA concurrency/io/call.lo CFA concurrency/kernel/startup.lo /var/lib/jenkins/workspace/Cforall_master/libcfa/src/exception.c: In function '__cfaehm_allocate_exception': /var/lib/jenkins/workspace/Cforall_master/libcfa/src/exception.c:142:17: warning: ignoring return value of 'write' declared with attribute 'warn_unused_result' [-Wunused-result] 142 | write( 2, "abort2\n", 7 ); | ^~~~~~~~~~~~~~~~~~~~~~~~~ /var/lib/jenkins/workspace/Cforall_master/libcfa/src/exception.c: In function '__cfaehm_exception_cleanup': /var/lib/jenkins/workspace/Cforall_master/libcfa/src/exception.c:127:17: warning: ignoring return value of 'write' declared with attribute 'warn_unused_result' [-Wunused-result] 127 | write( 2, "abort1\n", 7 ); | ^~~~~~~~~~~~~~~~~~~~~~~~~ /var/lib/jenkins/workspace/Cforall_master/libcfa/src/exception.c: In function '__cfaehm_cancel_stack': /var/lib/jenkins/workspace/Cforall_master/libcfa/src/exception.c:230:9: warning: ignoring return value of 'write' declared with attribute 'warn_unused_result' [-Wunused-result] 230 | write( 2, "abort3\n", 7 ); | ^~~~~~~~~~~~~~~~~~~~~~~~~ /var/lib/jenkins/workspace/Cforall_master/libcfa/src/exception.c: In function '__cfaehm_begin_unwind': /var/lib/jenkins/workspace/Cforall_master/libcfa/src/exception.c:252:17: warning: ignoring return value of 'write' declared with attribute 'warn_unused_result' [-Wunused-result] 252 | write( 2, "abort4\n", 7 ); | ^~~~~~~~~~~~~~~~~~~~~~~~~ /var/lib/jenkins/workspace/Cforall_master/libcfa/src/exception.c:278:17: warning: ignoring return value of 'write' declared with attribute 'warn_unused_result' [-Wunused-result] 278 | write( 2, "abort5\n", 7 ); | ^~~~~~~~~~~~~~~~~~~~~~~~~ /var/lib/jenkins/workspace/Cforall_master/libcfa/src/exception.c: In function '__cfaehm_rethrow_terminate': /var/lib/jenkins/workspace/Cforall_master/libcfa/src/exception.c:308:9: warning: ignoring return value of 'write' declared with attribute 'warn_unused_result' [-Wunused-result] 308 | write( 2, "abort7\n", 7 ); | ^~~~~~~~~~~~~~~~~~~~~~~~~ /var/lib/jenkins/workspace/Cforall_master/libcfa/src/exception.c: In function '__cfaehm_rethrow_adapter': /var/lib/jenkins/workspace/Cforall_master/libcfa/src/exception.c:300:9: warning: ignoring return value of 'write' declared with attribute 'warn_unused_result' [-Wunused-result] 300 | write( 2, "abort6\n", 7 ); | ^~~~~~~~~~~~~~~~~~~~~~~~~ /usr/include/linux/io_uring.h:83:43: warning: 'packed' attribute ignored for field of type 'union __io_uring_sqe____anonymous65' [-Wattributes] 83 | } __attribute__((packed)); | ^ /usr/include/aarch64-linux-gnu/bits/socket2.h:70:94: warning: '_X12_constructorFv_U26__anonymous___SOCKADDR_ARGU26__anonymous___SOCKADDR_ARG_autogen___1' is static but used in inline function 'recvfrom' which is not static 70 | return __recvfrom_chk (__fd, __buf, __n, sz, __flags, __addr, __addr_len); | ^ /usr/include/aarch64-linux-gnu/bits/socket2.h:70:124: warning: '_X11_destructorFv_U26__anonymous___SOCKADDR_ARG_autogen___1' is static but used in inline function 'recvfrom' which is not static 70 | return __recvfrom_chk (__fd, __buf, __n, sz, __flags, __addr, __addr_len); | ^ /usr/include/aarch64-linux-gnu/bits/socket2.h:68:103: warning: '_X12_constructorFv_U26__anonymous___SOCKADDR_ARGU26__anonymous___SOCKADDR_ARG_autogen___1' is static but used in inline function 'recvfrom' which is not static 68 | return __recvfrom_chk_warn (__fd, __buf, __n, sz, __flags, __addr, | ^ /usr/include/aarch64-linux-gnu/bits/socket2.h:68:128: warning: '_X11_destructorFv_U26__anonymous___SOCKADDR_ARG_autogen___1' is static but used in inline function 'recvfrom' which is not static 68 | return __recvfrom_chk_warn (__fd, __buf, __n, sz, __flags, __addr, | ^ /usr/include/aarch64-linux-gnu/bits/socket2.h:66:96: warning: '_X12_constructorFv_U26__anonymous___SOCKADDR_ARGU26__anonymous___SOCKADDR_ARG_autogen___1' is static but used in inline function 'recvfrom' which is not static 66 | return __recvfrom_alias (__fd, __buf, __n, __flags, __addr, __addr_len); | ^ /usr/include/aarch64-linux-gnu/bits/socket2.h:66:128: warning: '_X11_destructorFv_U26__anonymous___SOCKADDR_ARG_autogen___1' is static but used in inline function 'recvfrom' which is not static 66 | return __recvfrom_alias (__fd, __buf, __n, __flags, __addr, __addr_len); | ^ /usr/include/linux/io_uring.h:83:43: warning: 'packed' attribute ignored for field of type 'union __io_uring_sqe____anonymous129' [-Wattributes] 83 | } __attribute__((packed)); | ^ /usr/include/aarch64-linux-gnu/bits/socket2.h:70:95: warning: '_X12_constructorFv_U26__anonymous___SOCKADDR_ARGU26__anonymous___SOCKADDR_ARG_autogen___1' is static but used in inline function 'recvfrom' which is not static 70 | return __recvfrom_chk (__fd, __buf, __n, sz, __flags, __addr, __addr_len); | ^ /usr/include/aarch64-linux-gnu/bits/socket2.h:70:125: warning: '_X11_destructorFv_U26__anonymous___SOCKADDR_ARG_autogen___1' is static but used in inline function 'recvfrom' which is not static 70 | return __recvfrom_chk (__fd, __buf, __n, sz, __flags, __addr, __addr_len); | ^ /usr/include/aarch64-linux-gnu/bits/socket2.h:68:104: warning: '_X12_constructorFv_U26__anonymous___SOCKADDR_ARGU26__anonymous___SOCKADDR_ARG_autogen___1' is static but used in inline function 'recvfrom' which is not static 68 | return __recvfrom_chk_warn (__fd, __buf, __n, sz, __flags, __addr, | ^ /usr/include/aarch64-linux-gnu/bits/socket2.h:68:129: warning: '_X11_destructorFv_U26__anonymous___SOCKADDR_ARG_autogen___1' is static but used in inline function 'recvfrom' which is not static 68 | return __recvfrom_chk_warn (__fd, __buf, __n, sz, __flags, __addr, | ^ /usr/include/aarch64-linux-gnu/bits/socket2.h:66:97: warning: '_X12_constructorFv_U26__anonymous___SOCKADDR_ARGU26__anonymous___SOCKADDR_ARG_autogen___1' is static but used in inline function 'recvfrom' which is not static 66 | return __recvfrom_alias (__fd, __buf, __n, __flags, __addr, __addr_len); | ^ /usr/include/aarch64-linux-gnu/bits/socket2.h:66:129: warning: '_X11_destructorFv_U26__anonymous___SOCKADDR_ARG_autogen___1' is static but used in inline function 'recvfrom' which is not static 66 | return __recvfrom_alias (__fd, __buf, __n, __flags, __addr, __addr_len); | ^ /usr/include/linux/io_uring.h:83:43: warning: 'packed' attribute ignored for field of type 'union __io_uring_sqe____anonymous53' [-Wattributes] 83 | } __attribute__((packed)); | ^ /usr/include/aarch64-linux-gnu/bits/socket2.h:70:95: warning: '_X12_constructorFv_U26__anonymous___SOCKADDR_ARGU26__anonymous___SOCKADDR_ARG_autogen___1' is static but used in inline function 'recvfrom' which is not static 70 | return __recvfrom_chk (__fd, __buf, __n, sz, __flags, __addr, __addr_len); | ^ /usr/include/aarch64-linux-gnu/bits/socket2.h:70:125: warning: '_X11_destructorFv_U26__anonymous___SOCKADDR_ARG_autogen___1' is static but used in inline function 'recvfrom' which is not static 70 | return __recvfrom_chk (__fd, __buf, __n, sz, __flags, __addr, __addr_len); | ^ /usr/include/aarch64-linux-gnu/bits/socket2.h:68:104: warning: '_X12_constructorFv_U26__anonymous___SOCKADDR_ARGU26__anonymous___SOCKADDR_ARG_autogen___1' is static but used in inline function 'recvfrom' which is not static 68 | return __recvfrom_chk_warn (__fd, __buf, __n, sz, __flags, __addr, | ^ /usr/include/aarch64-linux-gnu/bits/socket2.h:68:129: warning: '_X11_destructorFv_U26__anonymous___SOCKADDR_ARG_autogen___1' is static but used in inline function 'recvfrom' which is not static 68 | return __recvfrom_chk_warn (__fd, __buf, __n, sz, __flags, __addr, | ^ /usr/include/aarch64-linux-gnu/bits/socket2.h:66:97: warning: '_X12_constructorFv_U26__anonymous___SOCKADDR_ARGU26__anonymous___SOCKADDR_ARG_autogen___1' is static but used in inline function 'recvfrom' which is not static 66 | return __recvfrom_alias (__fd, __buf, __n, __flags, __addr, __addr_len); | ^ /usr/include/aarch64-linux-gnu/bits/socket2.h:66:129: warning: '_X11_destructorFv_U26__anonymous___SOCKADDR_ARG_autogen___1' is static but used in inline function 'recvfrom' which is not static 66 | return __recvfrom_alias (__fd, __buf, __n, __flags, __addr, __addr_len); | ^ /usr/include/linux/io_uring.h:83:43: warning: 'packed' attribute ignored for field of type 'union __io_uring_sqe____anonymous119' [-Wattributes] 83 | } __attribute__((packed)); | ^ /usr/include/aarch64-linux-gnu/bits/socket2.h:70:95: warning: '_X12_constructorFv_U26__anonymous___SOCKADDR_ARGU26__anonymous___SOCKADDR_ARG_autogen___1' is static but used in inline function 'recvfrom' which is not static 70 | return __recvfrom_chk (__fd, __buf, __n, sz, __flags, __addr, __addr_len); | ^ /usr/include/aarch64-linux-gnu/bits/socket2.h:70:125: warning: '_X11_destructorFv_U26__anonymous___SOCKADDR_ARG_autogen___1' is static but used in inline function 'recvfrom' which is not static 70 | return __recvfrom_chk (__fd, __buf, __n, sz, __flags, __addr, __addr_len); | ^ /usr/include/aarch64-linux-gnu/bits/socket2.h:68:104: warning: '_X12_constructorFv_U26__anonymous___SOCKADDR_ARGU26__anonymous___SOCKADDR_ARG_autogen___1' is static but used in inline function 'recvfrom' which is not static 68 | return __recvfrom_chk_warn (__fd, __buf, __n, sz, __flags, __addr, | ^ /usr/include/aarch64-linux-gnu/bits/socket2.h:68:129: warning: '_X11_destructorFv_U26__anonymous___SOCKADDR_ARG_autogen___1' is static but used in inline function 'recvfrom' which is not static 68 | return __recvfrom_chk_warn (__fd, __buf, __n, sz, __flags, __addr, | ^ /usr/include/aarch64-linux-gnu/bits/socket2.h:66:97: warning: '_X12_constructorFv_U26__anonymous___SOCKADDR_ARGU26__anonymous___SOCKADDR_ARG_autogen___1' is static but used in inline function 'recvfrom' which is not static 66 | return __recvfrom_alias (__fd, __buf, __n, __flags, __addr, __addr_len); | ^ /usr/include/aarch64-linux-gnu/bits/socket2.h:66:129: warning: '_X11_destructorFv_U26__anonymous___SOCKADDR_ARG_autogen___1' is static but used in inline function 'recvfrom' which is not static 66 | return __recvfrom_alias (__fd, __buf, __n, __flags, __addr, __addr_len); | ^ /usr/include/linux/io_uring.h:83:43: warning: 'packed' attribute ignored for field of type 'union __io_uring_sqe____anonymous119' [-Wattributes] 83 | } __attribute__((packed)); | ^ /usr/include/aarch64-linux-gnu/bits/socket2.h:70:95: warning: '_X12_constructorFv_U26__anonymous___SOCKADDR_ARGU26__anonymous___SOCKADDR_ARG_autogen___1' is static but used in inline function 'recvfrom' which is not static 70 | return __recvfrom_chk (__fd, __buf, __n, sz, __flags, __addr, __addr_len); | ^ /usr/include/aarch64-linux-gnu/bits/socket2.h:70:125: warning: '_X11_destructorFv_U26__anonymous___SOCKADDR_ARG_autogen___1' is static but used in inline function 'recvfrom' which is not static 70 | return __recvfrom_chk (__fd, __buf, __n, sz, __flags, __addr, __addr_len); | ^ /usr/include/aarch64-linux-gnu/bits/socket2.h:68:104: warning: '_X12_constructorFv_U26__anonymous___SOCKADDR_ARGU26__anonymous___SOCKADDR_ARG_autogen___1' is static but used in inline function 'recvfrom' which is not static 68 | return __recvfrom_chk_warn (__fd, __buf, __n, sz, __flags, __addr, | ^ /usr/include/aarch64-linux-gnu/bits/socket2.h:68:129: warning: '_X11_destructorFv_U26__anonymous___SOCKADDR_ARG_autogen___1' is static but used in inline function 'recvfrom' which is not static 68 | return __recvfrom_chk_warn (__fd, __buf, __n, sz, __flags, __addr, | ^ /usr/include/aarch64-linux-gnu/bits/socket2.h:66:97: warning: '_X12_constructorFv_U26__anonymous___SOCKADDR_ARGU26__anonymous___SOCKADDR_ARG_autogen___1' is static but used in inline function 'recvfrom' which is not static 66 | return __recvfrom_alias (__fd, __buf, __n, __flags, __addr, __addr_len); | ^ /usr/include/aarch64-linux-gnu/bits/socket2.h:66:129: warning: '_X11_destructorFv_U26__anonymous___SOCKADDR_ARG_autogen___1' is static but used in inline function 'recvfrom' which is not static 66 | return __recvfrom_alias (__fd, __buf, __n, __flags, __addr, __addr_len); | ^ CCLD libcfa.la /usr/bin/ld: warning: .libs/common.o: requires executable stack (because the .note.GNU-stack section is executable) /usr/include/linux/io_uring.h:83:43: warning: 'packed' attribute ignored for field of type 'union __io_uring_sqe____anonymous32' [-Wattributes] 83 | } __attribute__((packed)); | ^ /usr/include/aarch64-linux-gnu/bits/socket2.h:70:94: warning: '_X12_constructorFv_U26__anonymous___SOCKADDR_ARGU26__anonymous___SOCKADDR_ARG_autogen___1' is static but used in inline function 'recvfrom' which is not static 70 | return __recvfrom_chk (__fd, __buf, __n, sz, __flags, __addr, __addr_len); | ^ /usr/include/aarch64-linux-gnu/bits/socket2.h:70:124: warning: '_X11_destructorFv_U26__anonymous___SOCKADDR_ARG_autogen___1' is static but used in inline function 'recvfrom' which is not static 70 | return __recvfrom_chk (__fd, __buf, __n, sz, __flags, __addr, __addr_len); | ^ /usr/include/aarch64-linux-gnu/bits/socket2.h:68:103: warning: '_X12_constructorFv_U26__anonymous___SOCKADDR_ARGU26__anonymous___SOCKADDR_ARG_autogen___1' is static but used in inline function 'recvfrom' which is not static 68 | return __recvfrom_chk_warn (__fd, __buf, __n, sz, __flags, __addr, | ^ /usr/include/aarch64-linux-gnu/bits/socket2.h:68:128: warning: '_X11_destructorFv_U26__anonymous___SOCKADDR_ARG_autogen___1' is static but used in inline function 'recvfrom' which is not static 68 | return __recvfrom_chk_warn (__fd, __buf, __n, sz, __flags, __addr, | ^ /usr/include/aarch64-linux-gnu/bits/socket2.h:66:96: warning: '_X12_constructorFv_U26__anonymous___SOCKADDR_ARGU26__anonymous___SOCKADDR_ARG_autogen___1' is static but used in inline function 'recvfrom' which is not static 66 | return __recvfrom_alias (__fd, __buf, __n, __flags, __addr, __addr_len); | ^ /usr/include/aarch64-linux-gnu/bits/socket2.h:66:128: warning: '_X11_destructorFv_U26__anonymous___SOCKADDR_ARG_autogen___1' is static but used in inline function 'recvfrom' which is not static 66 | return __recvfrom_alias (__fd, __buf, __n, __flags, __addr, __addr_len); | ^ /usr/include/linux/io_uring.h:83:43: warning: 'packed' attribute ignored for field of type 'union __io_uring_sqe____anonymous97' [-Wattributes] 83 | } __attribute__((packed)); | ^ /usr/include/aarch64-linux-gnu/bits/socket2.h:70:95: warning: '_X12_constructorFv_U26__anonymous___SOCKADDR_ARGU26__anonymous___SOCKADDR_ARG_autogen___1' is static but used in inline function 'recvfrom' which is not static 70 | return __recvfrom_chk (__fd, __buf, __n, sz, __flags, __addr, __addr_len); | ^ /usr/include/aarch64-linux-gnu/bits/socket2.h:70:125: warning: '_X11_destructorFv_U26__anonymous___SOCKADDR_ARG_autogen___1' is static but used in inline function 'recvfrom' which is not static 70 | return __recvfrom_chk (__fd, __buf, __n, sz, __flags, __addr, __addr_len); | ^ /usr/include/aarch64-linux-gnu/bits/socket2.h:68:104: warning: '_X12_constructorFv_U26__anonymous___SOCKADDR_ARGU26__anonymous___SOCKADDR_ARG_autogen___1' is static but used in inline function 'recvfrom' which is not static 68 | return __recvfrom_chk_warn (__fd, __buf, __n, sz, __flags, __addr, | ^ /usr/include/aarch64-linux-gnu/bits/socket2.h:68:129: warning: '_X11_destructorFv_U26__anonymous___SOCKADDR_ARG_autogen___1' is static but used in inline function 'recvfrom' which is not static 68 | return __recvfrom_chk_warn (__fd, __buf, __n, sz, __flags, __addr, | ^ /usr/include/aarch64-linux-gnu/bits/socket2.h:66:97: warning: '_X12_constructorFv_U26__anonymous___SOCKADDR_ARGU26__anonymous___SOCKADDR_ARG_autogen___1' is static but used in inline function 'recvfrom' which is not static 66 | return __recvfrom_alias (__fd, __buf, __n, __flags, __addr, __addr_len); | ^ /usr/include/aarch64-linux-gnu/bits/socket2.h:66:129: warning: '_X11_destructorFv_U26__anonymous___SOCKADDR_ARG_autogen___1' is static but used in inline function 'recvfrom' which is not static 66 | return __recvfrom_alias (__fd, __buf, __n, __flags, __addr, __addr_len); | ^ CCLD libcfathread.la /usr/bin/ld: warning: concurrency/.libs/coroutine.o: requires executable stack (because the .note.GNU-stack section is executable) make[1]: Nothing to be done for 'all-am'. [Pipeline] } [Pipeline] // dir [Pipeline] } [Pipeline] // stage [Pipeline] echo -------- Build : install -------- [Pipeline] stage [Pipeline] { (Build : install) [Pipeline] dir Running in /var/lib/jenkins/workspace/Cforall_master@tmp [Pipeline] { [Pipeline] sh + nproc + make -j 96 --no-print-directory install Making install in driver make install-exec-hook /usr/bin/install -c cfa '/var/lib/jenkins/workspace/Cforall_master@tmp/bin//cfa' /usr/bin/mkdir -p '/var/lib/jenkins/workspace/Cforall_master@tmp/lib/cfa/' /bin/bash ../libtool --mode=install /usr/bin/install -c as cc1 '/var/lib/jenkins/workspace/Cforall_master@tmp/lib/cfa/' libtool: install: /usr/bin/install -c as /var/lib/jenkins/workspace/Cforall_master@tmp/lib/cfa/as libtool: install: /usr/bin/install -c cc1 /var/lib/jenkins/workspace/Cforall_master@tmp/lib/cfa/cc1 Making install in src make install-am make[3]: Nothing to be done for 'install-exec-am'. /usr/bin/mkdir -p '/var/lib/jenkins/workspace/Cforall_master@tmp/lib/cfa/' /bin/bash ../libtool --mode=install /usr/bin/install -c ../driver/cfa-cpp '/var/lib/jenkins/workspace/Cforall_master@tmp/lib/cfa/' libtool: install: /usr/bin/install -c ../driver/cfa-cpp /var/lib/jenkins/workspace/Cforall_master@tmp/lib/cfa/cfa-cpp Making install in . (CDPATH="${ZSH_VERSION+.}:" && cd /var/lib/jenkins/workspace/Cforall_master && /bin/bash '/var/lib/jenkins/workspace/Cforall_master/automake/missing' autoheader) rm -f stamp-h1 touch /var/lib/jenkins/workspace/Cforall_master/src/config.h.in cd . && /bin/bash ./config.status config.h config.status: creating config.h config.status: config.h is unchanged make[2]: Nothing to be done for 'install-exec-am'. /usr/bin/mkdir -p '/var/lib/jenkins/workspace/Cforall_master@tmp/share/man/man1' /usr/bin/install -c -m 644 /var/lib/jenkins/workspace/Cforall_master/doc/man/cfa.1 '/var/lib/jenkins/workspace/Cforall_master@tmp/share/man/man1' Making install in libcfa/arm64-debug Making install in prelude make[3]: Nothing to be done for 'install-exec-am'. /usr/bin/mkdir -p '/var/lib/jenkins/workspace/Cforall_master@tmp/lib/cfa/arm64-debug/' /usr/bin/install -c -m 644 gcc-builtins.cfa builtins.cfa extras.cfa prelude.cfa bootloader.c defines.hfa '/var/lib/jenkins/workspace/Cforall_master@tmp/lib/cfa/arm64-debug/' Making install in src /usr/bin/mkdir -p '/var/lib/jenkins/workspace/Cforall_master@tmp/lib/cfa/arm64-debug/' /bin/bash ../libtool --mode=install /usr/bin/install -c libcfa.la libcfathread.la '/var/lib/jenkins/workspace/Cforall_master@tmp/lib/cfa/arm64-debug/' /usr/bin/mkdir -p '/var/lib/jenkins/workspace/Cforall_master@tmp/include/cfa/' /usr/bin/mkdir -p '/var/lib/jenkins/workspace/Cforall_master@tmp/include/cfa//stdhdr/sys' /usr/bin/install -c -m 644 /var/lib/jenkins/workspace/Cforall_master/libcfa/src/stdhdr/sys/mman.h /var/lib/jenkins/workspace/Cforall_master/libcfa/src/stdhdr/sys/time.h /var/lib/jenkins/workspace/Cforall_master/libcfa/src/stdhdr/sys/socket.h '/var/lib/jenkins/workspace/Cforall_master@tmp/include/cfa//stdhdr/sys' /usr/bin/mkdir -p '/var/lib/jenkins/workspace/Cforall_master@tmp/include/cfa//algorithms' /usr/bin/install -c -m 644 /var/lib/jenkins/workspace/Cforall_master/libcfa/src/algorithms/range_iterator.hfa '/var/lib/jenkins/workspace/Cforall_master@tmp/include/cfa//algorithms' /usr/bin/mkdir -p '/var/lib/jenkins/workspace/Cforall_master@tmp/include/cfa//concurrency/kernel' /usr/bin/install -c -m 644 /var/lib/jenkins/workspace/Cforall_master/libcfa/src/concurrency/kernel/cluster.hfa /var/lib/jenkins/workspace/Cforall_master/libcfa/src/concurrency/kernel/fwd.hfa '/var/lib/jenkins/workspace/Cforall_master@tmp/include/cfa//concurrency/kernel' /usr/bin/install -c -m 644 /var/lib/jenkins/workspace/Cforall_master/libcfa/src/common.hfa /var/lib/jenkins/workspace/Cforall_master/libcfa/src/fstream.hfa /var/lib/jenkins/workspace/Cforall_master/libcfa/src/heap.hfa /var/lib/jenkins/workspace/Cforall_master/libcfa/src/iostream.hfa /var/lib/jenkins/workspace/Cforall_master/libcfa/src/iterator.hfa /var/lib/jenkins/workspace/Cforall_master/libcfa/src/limits.hfa /var/lib/jenkins/workspace/Cforall_master/libcfa/src/math.hfa /var/lib/jenkins/workspace/Cforall_master/libcfa/src/memory.hfa /var/lib/jenkins/workspace/Cforall_master/libcfa/src/parseargs.hfa /var/lib/jenkins/workspace/Cforall_master/libcfa/src/parseconfig.hfa /var/lib/jenkins/workspace/Cforall_master/libcfa/src/rational.hfa /var/lib/jenkins/workspace/Cforall_master/libcfa/src/stdlib.hfa /var/lib/jenkins/workspace/Cforall_master/libcfa/src/strstream.hfa /var/lib/jenkins/workspace/Cforall_master/libcfa/src/time.hfa /var/lib/jenkins/workspace/Cforall_master/libcfa/src/Exception.hfa /var/lib/jenkins/workspace/Cforall_master/libcfa/src/bitmanip.hfa /var/lib/jenkins/workspace/Cforall_master/libcfa/src/clock.hfa /var/lib/jenkins/workspace/Cforall_master/libcfa/src/exception.hfa /var/lib/jenkins/workspace/Cforall_master/libcfa/src/exception.h /var/lib/jenkins/workspace/Cforall_master/libcfa/src/gmp.hfa /var/lib/jenkins/workspace/Cforall_master/libcfa/src/math.trait.hfa /var/lib/jenkins/workspace/Cforall_master/libcfa/src/raii.hfa /var/lib/jenkins/workspace/Cforall_master/libcfa/src/time_t.hfa /var/lib/jenkins/workspace/Cforall_master/libcfa/src/virtual_dtor.hfa '/var/lib/jenkins/workspace/Cforall_master@tmp/include/cfa//.' /usr/bin/mkdir -p '/var/lib/jenkins/workspace/Cforall_master@tmp/include/cfa//concurrency' /usr/bin/install -c -m 644 /var/lib/jenkins/workspace/Cforall_master/libcfa/src/concurrency/iofwd.hfa /var/lib/jenkins/workspace/Cforall_master/libcfa/src/concurrency/barrier.hfa /var/lib/jenkins/workspace/Cforall_master/libcfa/src/concurrency/alarm.hfa /var/lib/jenkins/workspace/Cforall_master/libcfa/src/concurrency/coroutine.hfa /var/lib/jenkins/workspace/Cforall_master/libcfa/src/concurrency/exception.hfa /var/lib/jenkins/workspace/Cforall_master/libcfa/src/concurrency/kernel.hfa /var/lib/jenkins/workspace/Cforall_master/libcfa/src/concurrency/locks.hfa /var/lib/jenkins/workspace/Cforall_master/libcfa/src/concurrency/monitor.hfa /var/lib/jenkins/workspace/Cforall_master/libcfa/src/concurrency/mutex.hfa /var/lib/jenkins/workspace/Cforall_master/libcfa/src/concurrency/select.hfa /var/lib/jenkins/workspace/Cforall_master/libcfa/src/concurrency/thread.hfa /var/lib/jenkins/workspace/Cforall_master/libcfa/src/concurrency/cofor.hfa /var/lib/jenkins/workspace/Cforall_master/libcfa/src/concurrency/invoke.h /var/lib/jenkins/workspace/Cforall_master/libcfa/src/concurrency/future.hfa /var/lib/jenkins/workspace/Cforall_master/libcfa/src/concurrency/once.hfa /var/lib/jenkins/workspace/Cforall_master/libcfa/src/concurrency/mutex_stmt.hfa /var/lib/jenkins/workspace/Cforall_master/libcfa/src/concurrency/channel.hfa /var/lib/jenkins/workspace/Cforall_master/libcfa/src/concurrency/actor.hfa '/var/lib/jenkins/workspace/Cforall_master@tmp/include/cfa//concurrency' /usr/bin/mkdir -p '/var/lib/jenkins/workspace/Cforall_master@tmp/include/cfa//concurrency/clib' /usr/bin/install -c -m 644 /var/lib/jenkins/workspace/Cforall_master/libcfa/src/concurrency/clib/cfathread.h '/var/lib/jenkins/workspace/Cforall_master@tmp/include/cfa//concurrency/clib' /usr/bin/mkdir -p '/var/lib/jenkins/workspace/Cforall_master@tmp/include/cfa//device' /usr/bin/install -c -m 644 /var/lib/jenkins/workspace/Cforall_master/libcfa/src/device/cpu.hfa '/var/lib/jenkins/workspace/Cforall_master@tmp/include/cfa//device' /usr/bin/mkdir -p '/var/lib/jenkins/workspace/Cforall_master@tmp/include/cfa//stdhdr/libltdl' /usr/bin/install -c -m 644 /var/lib/jenkins/workspace/Cforall_master/libcfa/src/stdhdr/libltdl/lt_dlloader.h '/var/lib/jenkins/workspace/Cforall_master@tmp/include/cfa//stdhdr/libltdl' /usr/bin/mkdir -p '/var/lib/jenkins/workspace/Cforall_master@tmp/include/cfa//vec' /usr/bin/install -c -m 644 /var/lib/jenkins/workspace/Cforall_master/libcfa/src/vec/vec.hfa /var/lib/jenkins/workspace/Cforall_master/libcfa/src/vec/vec2.hfa /var/lib/jenkins/workspace/Cforall_master/libcfa/src/vec/vec3.hfa /var/lib/jenkins/workspace/Cforall_master/libcfa/src/vec/vec4.hfa '/var/lib/jenkins/workspace/Cforall_master@tmp/include/cfa//vec' libtool: install: /usr/bin/install -c .libs/libcfa.so.1.0.0 /var/lib/jenkins/workspace/Cforall_master@tmp/lib/cfa/arm64-debug/libcfa.so.1.0.0 /usr/bin/mkdir -p '/var/lib/jenkins/workspace/Cforall_master@tmp/include/cfa//bits' /usr/bin/install -c -m 644 /var/lib/jenkins/workspace/Cforall_master/libcfa/src/bits/weakso_locks.hfa /var/lib/jenkins/workspace/Cforall_master/libcfa/src/bits/algorithm.hfa /var/lib/jenkins/workspace/Cforall_master/libcfa/src/bits/align.hfa /var/lib/jenkins/workspace/Cforall_master/libcfa/src/bits/collections.hfa /var/lib/jenkins/workspace/Cforall_master/libcfa/src/bits/debug.hfa /var/lib/jenkins/workspace/Cforall_master/libcfa/src/bits/defs.hfa /var/lib/jenkins/workspace/Cforall_master/libcfa/src/bits/locks.hfa /var/lib/jenkins/workspace/Cforall_master/libcfa/src/bits/collection.hfa /var/lib/jenkins/workspace/Cforall_master/libcfa/src/bits/stack.hfa /var/lib/jenkins/workspace/Cforall_master/libcfa/src/bits/queue.hfa /var/lib/jenkins/workspace/Cforall_master/libcfa/src/bits/sequence.hfa /var/lib/jenkins/workspace/Cforall_master/libcfa/src/bits/atomic.hfa /var/lib/jenkins/workspace/Cforall_master/libcfa/src/bits/random.hfa '/var/lib/jenkins/workspace/Cforall_master@tmp/include/cfa//bits' libtool: install: (cd /var/lib/jenkins/workspace/Cforall_master@tmp/lib/cfa/arm64-debug && { ln -s -f libcfa.so.1.0.0 libcfa.so.1 || { rm -f libcfa.so.1 && ln -s libcfa.so.1.0.0 libcfa.so.1; }; }) /usr/bin/mkdir -p '/var/lib/jenkins/workspace/Cforall_master@tmp/include/cfa//stdhdr' /usr/bin/install -c -m 644 /var/lib/jenkins/workspace/Cforall_master/libcfa/src/stdhdr/stdalign.h /var/lib/jenkins/workspace/Cforall_master/libcfa/src/stdhdr/stdio.h /var/lib/jenkins/workspace/Cforall_master/libcfa/src/stdhdr/malloc.h /var/lib/jenkins/workspace/Cforall_master/libcfa/src/stdhdr/time.h /var/lib/jenkins/workspace/Cforall_master/libcfa/src/stdhdr/signal.h /var/lib/jenkins/workspace/Cforall_master/libcfa/src/stdhdr/stdbool.h /var/lib/jenkins/workspace/Cforall_master/libcfa/src/stdhdr/unistd.h /var/lib/jenkins/workspace/Cforall_master/libcfa/src/stdhdr/stdatomic.h /var/lib/jenkins/workspace/Cforall_master/libcfa/src/stdhdr/stdint.h /var/lib/jenkins/workspace/Cforall_master/libcfa/src/stdhdr/gmp.h /var/lib/jenkins/workspace/Cforall_master/libcfa/src/stdhdr/locale.h /var/lib/jenkins/workspace/Cforall_master/libcfa/src/stdhdr/string.h /var/lib/jenkins/workspace/Cforall_master/libcfa/src/stdhdr/fenv.h /var/lib/jenkins/workspace/Cforall_master/libcfa/src/stdhdr/wchar.h /var/lib/jenkins/workspace/Cforall_master/libcfa/src/stdhdr/tgmath.h /var/lib/jenkins/workspace/Cforall_master/libcfa/src/stdhdr/math.h /var/lib/jenkins/workspace/Cforall_master/libcfa/src/stdhdr/pthread.h /var/lib/jenkins/workspace/Cforall_master/libcfa/src/stdhdr/complex.h /var/lib/jenkins/workspace/Cforall_master/libcfa/src/stdhdr/wctype.h /var/lib/jenkins/workspace/Cforall_master/libcfa/src/stdhdr/unwind.h /var/lib/jenkins/workspace/Cforall_master/libcfa/src/stdhdr/float.h /var/lib/jenkins/workspace/Cforall_master/libcfa/src/stdhdr/stdarg.h /var/lib/jenkins/workspace/Cforall_master/libcfa/src/stdhdr/stdlib.h /var/lib/jenkins/workspace/Cforall_master/libcfa/src/stdhdr/iso646.h /var/lib/jenkins/workspace/Cforall_master/libcfa/src/stdhdr/stddef.h /var/lib/jenkins/workspace/Cforall_master/libcfa/src/stdhdr/stdnoreturn.h /var/lib/jenkins/workspace/Cforall_master/libcfa/src/stdhdr/assert.h /var/lib/jenkins/workspace/Cforall_master/libcfa/src/stdhdr/ctype.h /var/lib/jenkins/workspace/Cforall_master/libcfa/src/stdhdr/errno.h /var/lib/jenkins/workspace/Cforall_master/libcfa/src/stdhdr/threads.h /var/lib/jenkins/workspace/Cforall_master/libcfa/src/stdhdr/uchar.h /var/lib/jenkins/workspace/Cforall_master/libcfa/src/stdhdr/inttypes.h /var/lib/jenkins/workspace/Cforall_master/libcfa/src/stdhdr/limits.h /var/lib/jenkins/workspace/Cforall_master/libcfa/src/stdhdr/setjmp.h '/var/lib/jenkins/workspace/Cforall_master@tmp/include/cfa//stdhdr' /usr/bin/mkdir -p '/var/lib/jenkins/workspace/Cforall_master@tmp/include/cfa//collections' libtool: install: (cd /var/lib/jenkins/workspace/Cforall_master@tmp/lib/cfa/arm64-debug && { ln -s -f libcfa.so.1.0.0 libcfa.so || { rm -f libcfa.so && ln -s libcfa.so.1.0.0 libcfa.so; }; }) /usr/bin/install -c -m 644 /var/lib/jenkins/workspace/Cforall_master/libcfa/src/collections/maybe.hfa /var/lib/jenkins/workspace/Cforall_master/libcfa/src/collections/pair.hfa /var/lib/jenkins/workspace/Cforall_master/libcfa/src/collections/result.hfa /var/lib/jenkins/workspace/Cforall_master/libcfa/src/collections/string.hfa /var/lib/jenkins/workspace/Cforall_master/libcfa/src/collections/string_res.hfa /var/lib/jenkins/workspace/Cforall_master/libcfa/src/collections/vector.hfa /var/lib/jenkins/workspace/Cforall_master/libcfa/src/collections/array.hfa /var/lib/jenkins/workspace/Cforall_master/libcfa/src/collections/list.hfa /var/lib/jenkins/workspace/Cforall_master/libcfa/src/collections/list2.hfa /var/lib/jenkins/workspace/Cforall_master/libcfa/src/collections/lockfree.hfa /var/lib/jenkins/workspace/Cforall_master/libcfa/src/collections/string_sharectx.hfa /var/lib/jenkins/workspace/Cforall_master/libcfa/src/collections/vector2.hfa '/var/lib/jenkins/workspace/Cforall_master@tmp/include/cfa//collections' libtool: install: /usr/bin/install -c .libs/libcfa.lai /var/lib/jenkins/workspace/Cforall_master@tmp/lib/cfa/arm64-debug/libcfa.la libtool: install: /usr/bin/install -c .libs/libcfathread.so.1.0.0 /var/lib/jenkins/workspace/Cforall_master@tmp/lib/cfa/arm64-debug/libcfathread.so.1.0.0 libtool: install: (cd /var/lib/jenkins/workspace/Cforall_master@tmp/lib/cfa/arm64-debug && { ln -s -f libcfathread.so.1.0.0 libcfathread.so.1 || { rm -f libcfathread.so.1 && ln -s libcfathread.so.1.0.0 libcfathread.so.1; }; }) libtool: install: (cd /var/lib/jenkins/workspace/Cforall_master@tmp/lib/cfa/arm64-debug && { ln -s -f libcfathread.so.1.0.0 libcfathread.so || { rm -f libcfathread.so && ln -s libcfathread.so.1.0.0 libcfathread.so; }; }) libtool: install: /usr/bin/install -c .libs/libcfathread.lai /var/lib/jenkins/workspace/Cforall_master@tmp/lib/cfa/arm64-debug/libcfathread.la libtool: warning: remember to run 'libtool --finish /var/lib/jenkins/workspace/Cforall_master@tmp/lib/cfa/arm64-debug/' make[3]: Nothing to be done for 'install-exec-am'. make[3]: Nothing to be done for 'install-data-am'. Making install in libcfa/arm64-nodebug Making install in prelude make[3]: Nothing to be done for 'install-exec-am'. /usr/bin/mkdir -p '/var/lib/jenkins/workspace/Cforall_master@tmp/lib/cfa/arm64-nodebug/' /usr/bin/install -c -m 644 gcc-builtins.cfa builtins.cfa extras.cfa prelude.cfa bootloader.c defines.hfa '/var/lib/jenkins/workspace/Cforall_master@tmp/lib/cfa/arm64-nodebug/' Making install in src /usr/bin/mkdir -p '/var/lib/jenkins/workspace/Cforall_master@tmp/lib/cfa/arm64-nodebug/' /bin/bash ../libtool --mode=install /usr/bin/install -c libcfa.la libcfathread.la '/var/lib/jenkins/workspace/Cforall_master@tmp/lib/cfa/arm64-nodebug/' /usr/bin/mkdir -p '/var/lib/jenkins/workspace/Cforall_master@tmp/include/cfa/' /usr/bin/mkdir -p '/var/lib/jenkins/workspace/Cforall_master@tmp/include/cfa//stdhdr/sys' /usr/bin/install -c -m 644 /var/lib/jenkins/workspace/Cforall_master/libcfa/src/stdhdr/sys/mman.h /var/lib/jenkins/workspace/Cforall_master/libcfa/src/stdhdr/sys/time.h /var/lib/jenkins/workspace/Cforall_master/libcfa/src/stdhdr/sys/socket.h '/var/lib/jenkins/workspace/Cforall_master@tmp/include/cfa//stdhdr/sys' /usr/bin/mkdir -p '/var/lib/jenkins/workspace/Cforall_master@tmp/include/cfa//algorithms' /usr/bin/install -c -m 644 /var/lib/jenkins/workspace/Cforall_master/libcfa/src/algorithms/range_iterator.hfa '/var/lib/jenkins/workspace/Cforall_master@tmp/include/cfa//algorithms' /usr/bin/mkdir -p '/var/lib/jenkins/workspace/Cforall_master@tmp/include/cfa//concurrency/kernel' /usr/bin/install -c -m 644 /var/lib/jenkins/workspace/Cforall_master/libcfa/src/concurrency/kernel/cluster.hfa /var/lib/jenkins/workspace/Cforall_master/libcfa/src/concurrency/kernel/fwd.hfa '/var/lib/jenkins/workspace/Cforall_master@tmp/include/cfa//concurrency/kernel' /usr/bin/install -c -m 644 /var/lib/jenkins/workspace/Cforall_master/libcfa/src/common.hfa /var/lib/jenkins/workspace/Cforall_master/libcfa/src/fstream.hfa /var/lib/jenkins/workspace/Cforall_master/libcfa/src/heap.hfa /var/lib/jenkins/workspace/Cforall_master/libcfa/src/iostream.hfa /var/lib/jenkins/workspace/Cforall_master/libcfa/src/iterator.hfa /var/lib/jenkins/workspace/Cforall_master/libcfa/src/limits.hfa /var/lib/jenkins/workspace/Cforall_master/libcfa/src/math.hfa /var/lib/jenkins/workspace/Cforall_master/libcfa/src/memory.hfa /var/lib/jenkins/workspace/Cforall_master/libcfa/src/parseargs.hfa /var/lib/jenkins/workspace/Cforall_master/libcfa/src/parseconfig.hfa /var/lib/jenkins/workspace/Cforall_master/libcfa/src/rational.hfa /var/lib/jenkins/workspace/Cforall_master/libcfa/src/stdlib.hfa /var/lib/jenkins/workspace/Cforall_master/libcfa/src/strstream.hfa /var/lib/jenkins/workspace/Cforall_master/libcfa/src/time.hfa /var/lib/jenkins/workspace/Cforall_master/libcfa/src/Exception.hfa /var/lib/jenkins/workspace/Cforall_master/libcfa/src/bitmanip.hfa /var/lib/jenkins/workspace/Cforall_master/libcfa/src/clock.hfa /var/lib/jenkins/workspace/Cforall_master/libcfa/src/exception.hfa /var/lib/jenkins/workspace/Cforall_master/libcfa/src/exception.h /var/lib/jenkins/workspace/Cforall_master/libcfa/src/gmp.hfa /var/lib/jenkins/workspace/Cforall_master/libcfa/src/math.trait.hfa /var/lib/jenkins/workspace/Cforall_master/libcfa/src/raii.hfa /var/lib/jenkins/workspace/Cforall_master/libcfa/src/time_t.hfa /var/lib/jenkins/workspace/Cforall_master/libcfa/src/virtual_dtor.hfa '/var/lib/jenkins/workspace/Cforall_master@tmp/include/cfa//.' /usr/bin/mkdir -p '/var/lib/jenkins/workspace/Cforall_master@tmp/include/cfa//concurrency' /usr/bin/install -c -m 644 /var/lib/jenkins/workspace/Cforall_master/libcfa/src/concurrency/iofwd.hfa /var/lib/jenkins/workspace/Cforall_master/libcfa/src/concurrency/barrier.hfa /var/lib/jenkins/workspace/Cforall_master/libcfa/src/concurrency/alarm.hfa /var/lib/jenkins/workspace/Cforall_master/libcfa/src/concurrency/coroutine.hfa /var/lib/jenkins/workspace/Cforall_master/libcfa/src/concurrency/exception.hfa /var/lib/jenkins/workspace/Cforall_master/libcfa/src/concurrency/kernel.hfa /var/lib/jenkins/workspace/Cforall_master/libcfa/src/concurrency/locks.hfa /var/lib/jenkins/workspace/Cforall_master/libcfa/src/concurrency/monitor.hfa /var/lib/jenkins/workspace/Cforall_master/libcfa/src/concurrency/mutex.hfa /var/lib/jenkins/workspace/Cforall_master/libcfa/src/concurrency/select.hfa /var/lib/jenkins/workspace/Cforall_master/libcfa/src/concurrency/thread.hfa /var/lib/jenkins/workspace/Cforall_master/libcfa/src/concurrency/cofor.hfa /var/lib/jenkins/workspace/Cforall_master/libcfa/src/concurrency/invoke.h /var/lib/jenkins/workspace/Cforall_master/libcfa/src/concurrency/future.hfa /var/lib/jenkins/workspace/Cforall_master/libcfa/src/concurrency/once.hfa /var/lib/jenkins/workspace/Cforall_master/libcfa/src/concurrency/mutex_stmt.hfa /var/lib/jenkins/workspace/Cforall_master/libcfa/src/concurrency/channel.hfa /var/lib/jenkins/workspace/Cforall_master/libcfa/src/concurrency/actor.hfa '/var/lib/jenkins/workspace/Cforall_master@tmp/include/cfa//concurrency' /usr/bin/mkdir -p '/var/lib/jenkins/workspace/Cforall_master@tmp/include/cfa//concurrency/clib' /usr/bin/install -c -m 644 /var/lib/jenkins/workspace/Cforall_master/libcfa/src/concurrency/clib/cfathread.h '/var/lib/jenkins/workspace/Cforall_master@tmp/include/cfa//concurrency/clib' /usr/bin/mkdir -p '/var/lib/jenkins/workspace/Cforall_master@tmp/include/cfa//device' /usr/bin/install -c -m 644 /var/lib/jenkins/workspace/Cforall_master/libcfa/src/device/cpu.hfa '/var/lib/jenkins/workspace/Cforall_master@tmp/include/cfa//device' /usr/bin/mkdir -p '/var/lib/jenkins/workspace/Cforall_master@tmp/include/cfa//stdhdr/libltdl' /usr/bin/install -c -m 644 /var/lib/jenkins/workspace/Cforall_master/libcfa/src/stdhdr/libltdl/lt_dlloader.h '/var/lib/jenkins/workspace/Cforall_master@tmp/include/cfa//stdhdr/libltdl' libtool: install: /usr/bin/install -c .libs/libcfa.so.1.0.0 /var/lib/jenkins/workspace/Cforall_master@tmp/lib/cfa/arm64-nodebug/libcfa.so.1.0.0 /usr/bin/mkdir -p '/var/lib/jenkins/workspace/Cforall_master@tmp/include/cfa//vec' /usr/bin/install -c -m 644 /var/lib/jenkins/workspace/Cforall_master/libcfa/src/vec/vec.hfa /var/lib/jenkins/workspace/Cforall_master/libcfa/src/vec/vec2.hfa /var/lib/jenkins/workspace/Cforall_master/libcfa/src/vec/vec3.hfa /var/lib/jenkins/workspace/Cforall_master/libcfa/src/vec/vec4.hfa '/var/lib/jenkins/workspace/Cforall_master@tmp/include/cfa//vec' /usr/bin/mkdir -p '/var/lib/jenkins/workspace/Cforall_master@tmp/include/cfa//bits' /usr/bin/install -c -m 644 /var/lib/jenkins/workspace/Cforall_master/libcfa/src/bits/weakso_locks.hfa /var/lib/jenkins/workspace/Cforall_master/libcfa/src/bits/algorithm.hfa /var/lib/jenkins/workspace/Cforall_master/libcfa/src/bits/align.hfa /var/lib/jenkins/workspace/Cforall_master/libcfa/src/bits/collections.hfa /var/lib/jenkins/workspace/Cforall_master/libcfa/src/bits/debug.hfa /var/lib/jenkins/workspace/Cforall_master/libcfa/src/bits/defs.hfa /var/lib/jenkins/workspace/Cforall_master/libcfa/src/bits/locks.hfa /var/lib/jenkins/workspace/Cforall_master/libcfa/src/bits/collection.hfa /var/lib/jenkins/workspace/Cforall_master/libcfa/src/bits/stack.hfa /var/lib/jenkins/workspace/Cforall_master/libcfa/src/bits/queue.hfa /var/lib/jenkins/workspace/Cforall_master/libcfa/src/bits/sequence.hfa /var/lib/jenkins/workspace/Cforall_master/libcfa/src/bits/atomic.hfa /var/lib/jenkins/workspace/Cforall_master/libcfa/src/bits/random.hfa '/var/lib/jenkins/workspace/Cforall_master@tmp/include/cfa//bits' libtool: install: (cd /var/lib/jenkins/workspace/Cforall_master@tmp/lib/cfa/arm64-nodebug && { ln -s -f libcfa.so.1.0.0 libcfa.so.1 || { rm -f libcfa.so.1 && ln -s libcfa.so.1.0.0 libcfa.so.1; }; }) /usr/bin/mkdir -p '/var/lib/jenkins/workspace/Cforall_master@tmp/include/cfa//stdhdr' /usr/bin/install -c -m 644 /var/lib/jenkins/workspace/Cforall_master/libcfa/src/stdhdr/stdalign.h /var/lib/jenkins/workspace/Cforall_master/libcfa/src/stdhdr/stdio.h /var/lib/jenkins/workspace/Cforall_master/libcfa/src/stdhdr/malloc.h /var/lib/jenkins/workspace/Cforall_master/libcfa/src/stdhdr/time.h /var/lib/jenkins/workspace/Cforall_master/libcfa/src/stdhdr/signal.h /var/lib/jenkins/workspace/Cforall_master/libcfa/src/stdhdr/stdbool.h /var/lib/jenkins/workspace/Cforall_master/libcfa/src/stdhdr/unistd.h /var/lib/jenkins/workspace/Cforall_master/libcfa/src/stdhdr/stdatomic.h /var/lib/jenkins/workspace/Cforall_master/libcfa/src/stdhdr/stdint.h /var/lib/jenkins/workspace/Cforall_master/libcfa/src/stdhdr/gmp.h /var/lib/jenkins/workspace/Cforall_master/libcfa/src/stdhdr/locale.h /var/lib/jenkins/workspace/Cforall_master/libcfa/src/stdhdr/string.h /var/lib/jenkins/workspace/Cforall_master/libcfa/src/stdhdr/fenv.h /var/lib/jenkins/workspace/Cforall_master/libcfa/src/stdhdr/wchar.h /var/lib/jenkins/workspace/Cforall_master/libcfa/src/stdhdr/tgmath.h /var/lib/jenkins/workspace/Cforall_master/libcfa/src/stdhdr/math.h /var/lib/jenkins/workspace/Cforall_master/libcfa/src/stdhdr/pthread.h /var/lib/jenkins/workspace/Cforall_master/libcfa/src/stdhdr/complex.h /var/lib/jenkins/workspace/Cforall_master/libcfa/src/stdhdr/wctype.h /var/lib/jenkins/workspace/Cforall_master/libcfa/src/stdhdr/unwind.h /var/lib/jenkins/workspace/Cforall_master/libcfa/src/stdhdr/float.h /var/lib/jenkins/workspace/Cforall_master/libcfa/src/stdhdr/stdarg.h /var/lib/jenkins/workspace/Cforall_master/libcfa/src/stdhdr/stdlib.h /var/lib/jenkins/workspace/Cforall_master/libcfa/src/stdhdr/iso646.h /var/lib/jenkins/workspace/Cforall_master/libcfa/src/stdhdr/stddef.h /var/lib/jenkins/workspace/Cforall_master/libcfa/src/stdhdr/stdnoreturn.h /var/lib/jenkins/workspace/Cforall_master/libcfa/src/stdhdr/assert.h /var/lib/jenkins/workspace/Cforall_master/libcfa/src/stdhdr/ctype.h /var/lib/jenkins/workspace/Cforall_master/libcfa/src/stdhdr/errno.h /var/lib/jenkins/workspace/Cforall_master/libcfa/src/stdhdr/threads.h /var/lib/jenkins/workspace/Cforall_master/libcfa/src/stdhdr/uchar.h /var/lib/jenkins/workspace/Cforall_master/libcfa/src/stdhdr/inttypes.h /var/lib/jenkins/workspace/Cforall_master/libcfa/src/stdhdr/limits.h /var/lib/jenkins/workspace/Cforall_master/libcfa/src/stdhdr/setjmp.h '/var/lib/jenkins/workspace/Cforall_master@tmp/include/cfa//stdhdr' libtool: install: (cd /var/lib/jenkins/workspace/Cforall_master@tmp/lib/cfa/arm64-nodebug && { ln -s -f libcfa.so.1.0.0 libcfa.so || { rm -f libcfa.so && ln -s libcfa.so.1.0.0 libcfa.so; }; }) /usr/bin/mkdir -p '/var/lib/jenkins/workspace/Cforall_master@tmp/include/cfa//collections' /usr/bin/install -c -m 644 /var/lib/jenkins/workspace/Cforall_master/libcfa/src/collections/maybe.hfa /var/lib/jenkins/workspace/Cforall_master/libcfa/src/collections/pair.hfa /var/lib/jenkins/workspace/Cforall_master/libcfa/src/collections/result.hfa /var/lib/jenkins/workspace/Cforall_master/libcfa/src/collections/string.hfa /var/lib/jenkins/workspace/Cforall_master/libcfa/src/collections/string_res.hfa /var/lib/jenkins/workspace/Cforall_master/libcfa/src/collections/vector.hfa /var/lib/jenkins/workspace/Cforall_master/libcfa/src/collections/array.hfa /var/lib/jenkins/workspace/Cforall_master/libcfa/src/collections/list.hfa /var/lib/jenkins/workspace/Cforall_master/libcfa/src/collections/list2.hfa /var/lib/jenkins/workspace/Cforall_master/libcfa/src/collections/lockfree.hfa /var/lib/jenkins/workspace/Cforall_master/libcfa/src/collections/string_sharectx.hfa /var/lib/jenkins/workspace/Cforall_master/libcfa/src/collections/vector2.hfa '/var/lib/jenkins/workspace/Cforall_master@tmp/include/cfa//collections' libtool: install: /usr/bin/install -c .libs/libcfa.lai /var/lib/jenkins/workspace/Cforall_master@tmp/lib/cfa/arm64-nodebug/libcfa.la libtool: install: /usr/bin/install -c .libs/libcfathread.so.1.0.0 /var/lib/jenkins/workspace/Cforall_master@tmp/lib/cfa/arm64-nodebug/libcfathread.so.1.0.0 libtool: install: (cd /var/lib/jenkins/workspace/Cforall_master@tmp/lib/cfa/arm64-nodebug && { ln -s -f libcfathread.so.1.0.0 libcfathread.so.1 || { rm -f libcfathread.so.1 && ln -s libcfathread.so.1.0.0 libcfathread.so.1; }; }) libtool: install: (cd /var/lib/jenkins/workspace/Cforall_master@tmp/lib/cfa/arm64-nodebug && { ln -s -f libcfathread.so.1.0.0 libcfathread.so || { rm -f libcfathread.so && ln -s libcfathread.so.1.0.0 libcfathread.so; }; }) libtool: install: /usr/bin/install -c .libs/libcfathread.lai /var/lib/jenkins/workspace/Cforall_master@tmp/lib/cfa/arm64-nodebug/libcfathread.la libtool: warning: remember to run 'libtool --finish /var/lib/jenkins/workspace/Cforall_master@tmp/lib/cfa/arm64-nodebug/' make[3]: Nothing to be done for 'install-exec-am'. make[3]: Nothing to be done for 'install-data-am'. [Pipeline] } [Pipeline] // dir [Pipeline] } [Pipeline] // stage [Pipeline] sh + free -h total used free shared buff/cache available Mem: 502Gi 7.4Gi 489Gi 3.5Mi 8.5Gi 495Gi Swap: 127Gi 0B 127Gi [Pipeline] sh + ulimit -a time(seconds) unlimited file(blocks) unlimited data(kbytes) unlimited stack(kbytes) 8192 coredump(blocks) 0 memory(kbytes) unlimited locked memory(kbytes) 65876424 process 2058180 nofiles 1048576 vmemory(kbytes) unlimited locks unlimited rtprio 0 [Pipeline] echo -------- Test: Debug -------- [Pipeline] stage [Pipeline] { (Test: Debug) [Pipeline] dir Running in /var/lib/jenkins/workspace/Cforall_master@tmp [Pipeline] { [Pipeline] sh + nproc + make -j 96 --no-print-directory -C tests timeout=600 global-timeout=14400 tests debug=yes archive-errors=/var/lib/jenkins/workspace/Cforall_master@tmp/tests/crashes/full-debug Running 375 tests on 96 cores (arm64 - debug) array-ERR2 PASSED C 0:00.114 - R n/a array-ERR3 PASSED C 0:00.174 - R n/a ...ollections/language-dim-mismatch PASSED C 0:00.383 - R n/a concurrency/mainError PASSED C 0:00.452 - R n/a concurrency/keywordErrors PASSED C 0:00.633 - R n/a castError PASSED C 0:00.938 - R n/a array-collections/symtab-collision PASSED C 0:00.980 - R n/a array-collections/safety-summary PASSED C 0:01.189 - R n/a concurrency/ctor-check PASSED C 0:01.199 - R n/a attr-priority PASSED C 0:01.489 - R 0:00.002 array-ERR1 PASSED C 0:01.529 - R n/a castReturn PASSED C 0:01.726 - R 0:00.045 array PASSED C 0:01.787 - R 0:00.021 array-collections/c-dependent PASSED C 0:01.749 - R 0:00.127 array-collections/array-raii-c PASSED C 0:01.943 - R 0:00.040 cast PASSED C 0:01.881 - R 0:00.126 array-collections/dimexpr-match-c PASSED C 0:02.144 - R 0:00.039 builtins/sync PASSED C 0:02.078 - R 0:00.130 concurrency/clib_tls PASSED C 0:02.728 - R 0:00.038 array-collections/array-sbscr-types PASSED C 0:02.846 - R 0:00.040 ...ns/vector-err-retn-perm-it-byval PASSED C 0:02.972 - R n/a array-collections/dimexpr-match-cfa PASSED C 0:03.062 - R 0:00.021 array-collections/boxed PASSED C 0:03.135 - R 0:00.041 concurrency/clib PASSED C 0:02.887 - R 0:00.273 array-collections/array-basic PASSED C 0:03.183 - R 0:00.024 ...ns/vector-err-pass-perm-it-byval PASSED C 0:03.339 - R n/a collections/string-operator-ERR15 PASSED C 0:05.380 - R n/a collections/string-operator-ERR09 PASSED C 0:05.400 - R n/a collections/string-operator-ERR13 PASSED C 0:05.433 - R n/a collections/string-operator-ERR16 PASSED C 0:05.468 - R n/a avl_test PASSED C 0:05.535 - R 0:00.023 collections/string-operator-ERR11 PASSED C 0:05.685 - R n/a ...urrency/pthread/pthread_key_test PASSED C 0:04.148 - R 0:00.037 alloc-ERROR PASSED C 0:06.054 - R n/a collections/vector-demo PASSED C 0:06.267 - R 0:00.020 algorithms/range_test PASSED C 0:06.672 - R 0:00.021 complex PASSED C 0:07.123 - R 0:00.024 array-collections/array-raii-cfa PASSED C 0:07.369 - R 0:00.039 collections/string-gc PASSED C 0:07.653 - R 0:00.039 array-collections/accordion PASSED C 0:07.743 - R 0:00.039 collections/string-istream PASSED C 0:08.202 - R 0:00.038 concurrency/futures/basic PASSED C 0:08.945 - R 0:00.122 concurrency/cluster PASSED C 0:09.019 - R 0:00.072 concurrency/futures/abandon PASSED C 0:09.145 - R 0:00.172 concurrency/park/start_parked PASSED C 0:08.492 - R 0:00.123 collections/string-compare PASSED C 0:09.706 - R 0:00.021 concurrency/park/contention PASSED C 0:08.904 - R 0:00.272 collections/multi_list PASSED C 0:09.789 - R 0:00.024 collections/stack PASSED C 0:10.152 - R 0:00.039 collections/string-ostream PASSED C 0:10.342 - R 0:00.022 collections/sequence PASSED C 0:10.574 - R 0:00.021 collections/string-operator PASSED C 0:10.689 - R 0:00.028 concurrency/cofor PASSED C 0:10.776 - R 0:00.043 collections/string-ctx-manage PASSED C 0:10.840 - R 0:00.028 collections/queue PASSED C 0:10.903 - R 0:00.024 collections/string-istream-manip PASSED C 0:11.144 - R 0:00.224 ...ections/string-overwrite-noshare PASSED C 0:11.938 - R 0:00.073 concurrency/examples/gortn PASSED C 0:12.008 - R 0:00.125 collections/string-overwrite PASSED C 0:12.029 - R 0:00.222 concurrency/examples/matrixSum PASSED C 0:12.101 - R 0:00.127 concurrency/join PASSED C 0:12.169 - R 0:00.073 concurrency/coroutineYield PASSED C 0:12.523 - R 0:00.179 concurrency/migrate PASSED C 0:12.634 - R 0:00.235 concurrency/examples/datingService PASSED C 0:12.954 - R 0:00.072 const-init PASSED C 0:01.601 - R 0:00.074 alloc PASSED C 0:13.092 - R 0:00.124 ...rrency/pthread/pthread_cond_test PASSED C 0:11.895 - R 0:00.128 ...rrency/pthread/pthread_attr_test PASSED C 0:12.209 - R 0:00.123 ...pthread/pthread_demo_create_join PASSED C 0:12.146 - R 0:00.038 const-ref PASSED C 0:01.653 - R 0:00.079 ...rrency/pthread/pthread_once_test PASSED C 0:12.150 - R 0:00.072 collections/string-api-coverage PASSED C 0:14.357 - R 0:00.038 concurrency/park/force_preempt PASSED C 0:13.623 - R 0:00.435 ...ions/string-api-coverage-noshare PASSED C 0:14.726 - R 0:00.132 concurrency/futures/wait_any PASSED C 0:14.778 - R 0:00.228 concurrency/barrier/last PASSED C 0:14.780 - R 0:00.331 concurrency/once PASSED C 0:14.567 - R 0:00.328 concurrency/examples/quickSort PASSED C 0:15.338 - R 0:00.036 concurrency/waitfor/parse PASSED C 0:07.674 - R 0:00.038 concurrency/mutexstmt/tuple PASSED C 0:15.406 - R 0:00.039 concurrency/readyQ/leader_spin PASSED C 0:12.088 - R 0:01.530 ctrl-flow/labelledExit PASSED C 0:01.543 - R 0:00.040 concurrency/barrier/order PASSED C 0:15.619 - R 0:00.179 concurrency/suspend_then PASSED C 0:12.860 - R 0:00.076 ctrl-flow/loop-inc PASSED C 0:01.516 - R 0:00.069 concurrency/signal/wait PASSED C 0:13.038 - R 0:00.592 concurrency/lockfree_stack PASSED C 0:12.106 - R 0:04.752 enum_tests/lvalue PASSED C 0:00.915 - R n/a alloc2 PASSED C 0:17.102 - R 0:00.072 enum PASSED C 0:01.722 - R 0:00.040 ...cy/unified_locking/pthread_locks PASSED C 0:10.938 - R 0:00.828 concurrency/thread PASSED C 0:14.125 - R 0:00.119 .../unified_locking/block_spin_lock PASSED C 0:14.070 - R 0:00.124 errors/declaration PASSED C 0:00.144 - R n/a concurrency/sleep PASSED C 0:13.443 - R 0:01.231 errors/scope-type PASSED C 0:00.216 - R n/a concurrency/waitfor/else PASSED C 0:10.593 - R 0:00.121 concurrency/actors/poison PASSED C 0:17.786 - R 0:00.122 errors/signature PASSED C 0:00.305 - R n/a concurrency/mutexstmt/monitors PASSED C 0:09.771 - R 0:08.107 concurrency/actors/inline PASSED C 0:17.731 - R 0:00.286 concurrency/actors/static PASSED C 0:17.889 - R 0:00.270 ...ncy/unified_locking/timeout_lock PASSED C 0:10.867 - R 0:01.227 designations PASSED C 0:02.889 - R 0:00.126 ...ency/unified_locking/exp_backoff PASSED C 0:14.830 - R 0:00.172 enum_tests/inc-dec PASSED C 0:02.388 - R 0:00.076 concurrency/barrier/generation PASSED C 0:15.277 - R 0:03.083 concurrency/readyQ/barrier_sleeper PASSED C 0:14.191 - R 0:02.180 .../unified_locking/fast_block_lock PASSED C 0:14.829 - R 0:00.329 errors/scope PASSED C 0:01.014 - R n/a concurrency/actors/inherit PASSED C 0:18.344 - R 0:00.120 concurrency/actors/pingpong PASSED C 0:18.289 - R 0:00.178 concurrency/actors/types PASSED C 0:18.370 - R 0:00.126 enum_tests/funcEnum PASSED C 0:02.673 - R 0:00.128 concurrency/actors/executor PASSED C 0:18.537 - R 0:00.178 concurrency/futures/typed PASSED C 0:18.648 - R 0:00.326 eval PASSED C 0:01.520 - R 0:00.038 concurrency/waitfor/barge PASSED C 0:12.120 - R 0:01.075 copyfile PASSED C 0:07.242 - R 0:00.122 ...urrency/waitfor/lexical_priority PASSED C 0:12.250 - R 0:00.074 enum_tests/structEnum PASSED C 0:02.649 - R 0:00.070 exceptions/try-ctrl-flow PASSED C 0:00.551 - R n/a ...fied_locking/mcs_block_spin_lock PASSED C 0:14.521 - R 0:00.128 ...nified_locking/simple_owner_lock PASSED C 0:14.284 - R 0:00.223 exceptions/type-check PASSED C 0:00.649 - R n/a concurrency/actors/matrixMultiply PASSED C 0:18.633 - R 0:01.687 counter PASSED C 0:07.156 - R 0:00.123 ctrl-flow/break-misc PASSED C 0:07.091 - R 0:00.042 ctrl-flow/fallthrough PASSED C 0:07.038 - R 0:00.042 ctrl-flow/ifwhileCtl PASSED C 0:06.856 - R 0:00.038 coroutine/fibonacci PASSED C 0:08.508 - R 0:00.074 configs/parsebools PASSED C 0:09.777 - R 0:00.278 concurrency/signal/block PASSED C 0:12.818 - R 0:06.148 exceptions/try-leave-catch PASSED C 0:01.608 - R 0:00.069 coroutine/fmtLines PASSED C 0:08.926 - R 0:00.122 concurrency/signal/disjoint PASSED C 0:13.174 - R 0:05.939 exceptions/message PASSED C 0:02.914 - R 0:00.073 coroutine/runningTotal PASSED C 0:08.573 - R 0:00.036 configs/parseconfig PASSED C 0:10.709 - R 0:00.125 ctrl-flow/loop_else PASSED C 0:06.943 - R 0:00.039 coroutine/pingpong PASSED C 0:09.069 - R 0:00.124 expression PASSED C 0:01.947 - R 0:00.069 configs/usage PASSED C 0:11.059 - R 0:00.072 ctrl-flow/goto PASSED C 0:08.273 - R 0:00.071 coroutine/raii PASSED C 0:09.001 - R 0:00.071 concurrency/waitfor/statment PASSED C 0:13.986 - R 0:00.126 global-monomorph PASSED C 0:01.504 - R 0:00.125 coroutine/devicedriver PASSED C 0:10.304 - R 0:00.072 concurrency/waitfor/when PASSED C 0:13.012 - R 0:00.524 ctrl-flow/loop_else-WRN1 PASSED C 0:07.890 - R 0:00.004 init1-ERROR PASSED C 0:00.802 - R n/a concurrency/waituntil/timeout PASSED C 0:08.387 - R 0:03.687 identParamDeclarator PASSED C 0:01.746 - R 0:00.068 identFuncDeclarator PASSED C 0:01.946 - R 0:00.035 enum_tests/enumInlineValue PASSED C 0:07.795 - R 0:00.040 init1 PASSED C 0:01.622 - R 0:00.041 enum_tests/anonymous PASSED C 0:07.961 - R 0:00.074 enum_tests/input PASSED C 0:07.575 - R 0:00.176 enum_tests/stringEnum PASSED C 0:06.856 - R 0:00.020 coroutine/prodcons PASSED C 0:10.895 - R 0:00.125 include/vector-sequence PASSED C 0:02.137 - R 0:00.039 ...rrency/pthread/pthread_demo_lock PASSED C 0:12.053 - R 0:10.217 enum_tests/typedIntEnum PASSED C 0:06.857 - R 0:00.041 div PASSED C 0:08.993 - R 0:00.036 enum_tests/voidEnum PASSED C 0:07.237 - R 0:00.038 include/vector-collections PASSED C 0:03.112 - R 0:00.038 exceptions/conditional PASSED C 0:06.928 - R 0:00.076 concurrency/waitfor/recurse PASSED C 0:12.696 - R 0:04.501 ctrl-flow/loopctrl PASSED C 0:09.956 - R 0:00.039 exceptions/data-except PASSED C 0:07.037 - R 0:00.074 limits PASSED C 0:01.556 - R 0:00.127 exceptions/defaults PASSED C 0:07.296 - R 0:00.021 linking/nostdlib PASSED C 0:01.547 - R 0:00.045 exceptions/finally PASSED C 0:07.286 - R 0:00.129 exceptions/polymorphic PASSED C 0:07.238 - R 0:00.071 exceptions/interact PASSED C 0:07.344 - R 0:00.038 concurrency/waitfor/dtor PASSED C 0:12.051 - R 0:07.211 nested-types-ERR1 PASSED C 0:00.221 - R n/a exceptions/terminate PASSED C 0:07.330 - R 0:00.120 enum_tests/planet PASSED C 0:09.546 - R 0:00.128 exceptions/cancel/coroutine PASSED C 0:08.213 - R 0:00.037 enum_tests/position PASSED C 0:09.212 - R 0:00.042 nested-types-ERR2 PASSED C 0:00.371 - R n/a exceptions/resume PASSED C 0:07.670 - R 0:00.073 exceptions/trash PASSED C 0:07.186 - R 0:00.125 linkonce PASSED C 0:01.735 - R 0:00.038 concurrency/channels/daisy_chain PASSED C 0:16.431 - R 0:10.121 exceptions/conditional-threads PASSED C 0:08.472 - R 0:00.068 concurrency/channels/ping_pong PASSED C 0:16.430 - R 0:10.166 opt-params PASSED C 0:00.231 - R n/a concurrency/channels/hot_potato PASSED C 0:16.593 - R 0:10.072 concurrency/channels/zero_size PASSED C 0:16.434 - R 0:10.222 concurrency/preempt PASSED C 0:13.723 - R 0:12.120 concurrency/channels/contend PASSED C 0:16.597 - R 0:10.324 exceptions/virtual-poly PASSED C 0:06.985 - R 0:00.039 generator/fmtLines PASSED C 0:06.539 - R 0:00.072 fstream_test PASSED C 0:06.815 - R 0:00.077 maybe PASSED C 0:01.869 - R 0:00.037 generator/fibonacci PASSED C 0:06.798 - R 0:00.123 concurrency/channels/pub_sub PASSED C 0:17.193 - R 0:10.103 polybits PASSED C 0:00.478 - R n/a nested-types PASSED C 0:01.602 - R 0:00.039 exceptions/defaults-threads PASSED C 0:09.361 - R 0:00.037 genericUnion PASSED C 0:06.881 - R 0:00.035 nowarn/exception PASSED C 0:01.628 - R 0:00.040 generator/suspend_then PASSED C 0:06.995 - R 0:00.021 nowarn/no-autogen PASSED C 0:01.563 - R 0:00.130 numericConstants PASSED C 0:01.542 - R 0:00.024 nowarn/unused PASSED C 0:01.632 - R 0:00.024 operators PASSED C 0:01.603 - R 0:00.036 poly-bare-assn PASSED C 0:01.413 - R 0:00.045 nowarn/array PASSED C 0:01.889 - R 0:00.045 hello PASSED C 0:06.920 - R 0:00.075 exceptions/resume-threads PASSED C 0:09.319 - R 0:00.123 exceptions/terminate-threads PASSED C 0:09.164 - R 0:00.122 nowarn/zero-thunk PASSED C 0:01.786 - R 0:00.082 nowarn/printf-sizeof PASSED C 0:01.873 - R 0:00.075 poly-many-arsz PASSED C 0:01.582 - R 0:00.043 raii/ctor-autogen-ERR1 PASSED C 0:00.944 - R n/a poly-d-cycle PASSED C 0:01.551 - R 0:00.123 forall PASSED C 0:08.055 - R 0:00.084 identity PASSED C 0:06.842 - R 0:00.070 concurrency/futures/future_except PASSED C 0:28.194 - R 0:00.072 concurrency/waituntil/basic_else PASSED C 0:18.910 - R 0:00.126 poly-member PASSED C 0:01.688 - R 0:00.122 poly-o-cycle PASSED C 0:01.740 - R 0:00.039 poly-self-cycle PASSED C 0:01.695 - R 0:00.130 poly-selection PASSED C 0:01.737 - R 0:00.125 exceptions/finally-threads PASSED C 0:10.049 - R 0:00.121 raii/partial-ERR1 PASSED C 0:00.881 - R n/a quasiKeyword PASSED C 0:01.701 - R 0:00.087 exceptions/fibonacci_nonlocal PASSED C 0:10.550 - R 0:00.103 include/vector-fstream PASSED C 0:07.134 - R 0:00.124 device/cpu PASSED C 0:13.430 - R 0:00.336 typedefRedef-ERR1 PASSED C 0:00.232 - R n/a include/stdincludes PASSED C 0:07.652 - R 0:00.041 concurrency/channels/big_elems PASSED C 0:16.896 - R 0:12.368 var-assert PASSED C 0:00.233 - R n/a raii/typeof-member PASSED C 0:01.643 - R 0:00.037 raii/ctor-autogen PASSED C 0:02.287 - R 0:00.037 exceptions/virtual-cast PASSED C 0:09.771 - R 0:00.037 raii/init_once PASSED C 0:01.904 - R 0:00.073 function-operator PASSED C 0:09.358 - R 0:00.036 raii/partial PASSED C 0:01.804 - R 0:00.077 linking/exception-nothreads PASSED C 0:06.079 - R 0:00.071 switch PASSED C 0:01.602 - R 0:00.039 simpleGenericTriple PASSED C 0:01.942 - R 0:00.045 io/eofType PASSED C 0:07.523 - R 0:00.125 tuple/tupleCast PASSED C 0:01.543 - R 0:00.073 tuple/tupleMember PASSED C 0:01.571 - R 0:00.039 exceptions/cor_resumer PASSED C 0:12.141 - R 0:00.041 result PASSED C 0:02.271 - R 0:00.043 linking/exception-withthreads PASSED C 0:06.510 - R 0:00.038 typedefRedef PASSED C 0:01.564 - R 0:00.069 concurrency/channels/churn PASSED C 0:20.277 - R 0:10.079 smart-pointers PASSED C 0:02.175 - R 0:00.025 tuple/tupleFunction PASSED C 0:01.942 - R 0:00.133 tuple/tuplePolymorphism PASSED C 0:01.969 - R 0:00.025 typeof PASSED C 0:01.506 - R 0:00.123 meta/fork+exec PASSED C 0:04.939 - R 0:00.119 collections/atomic_mpsc PASSED C 0:12.733 - R 0:18.105 variableDeclarator PASSED C 0:01.714 - R 0:00.022 withconflict PASSED C 0:00.894 - R n/a exceptions/pingpong_nonlocal PASSED C 0:12.788 - R 0:00.041 exceptions/cancel/thread PASSED C 0:13.315 - R 0:00.072 warnings/self-assignment PASSED C 0:01.501 - R 0:00.003 voidPtr PASSED C 0:01.574 - R 0:00.025 KRfunctions PASSED C 0:01.424 - R 0:00.004 ...collections/dimexpr-match-c-ERRS PASSED C 0:01.239 - R n/a linking/mangling/anon PASSED C 0:07.597 - R 0:00.120 errors/completeType PASSED C 0:00.886 - R n/a raii/memberCtors-ERR1 PASSED C 0:04.325 - R n/a list/dlist-insert-remove PASSED C 0:07.254 - R 0:00.038 attributes PASSED C 0:01.604 - R 0:00.002 declarationSpecifier PASSED C 0:01.394 - R 0:00.002 raii/dtor-early-exit-ERR1 PASSED C 0:05.059 - R n/a literals PASSED C 0:07.429 - R 0:00.124 raii/dtor-early-exit-ERR2 PASSED C 0:05.191 - R n/a io/manipulatorsOutput4 PASSED C 0:09.383 - R 0:00.227 linking/nothreads PASSED C 0:08.696 - R 0:00.025 ...llections/dimexpr-match-cfa-ERRS PASSED C 0:02.393 - R n/a extension PASSED C 0:01.414 - R 0:00.003 functions PASSED C 0:01.457 - R 0:00.006 linking/weakso_nothd PASSED C 0:08.999 - R 0:00.072 io/manipulatorsInput-uchunk PASSED C 0:10.034 - R 0:00.174 gccExtensions PASSED C 0:01.661 - R 0:00.002 meta/arch PASSED C 0:00.910 - R n/a arithmeticConversions PASSED C 0:03.239 - R 0:00.025 tuple/tupleVariadic PASSED C 0:05.077 - R 0:00.027 list/dlist2-insert-remove PASSED C 0:08.700 - R 0:00.041 zero_one-ERR1 PASSED C 0:03.908 - R n/a linking/io-acquire PASSED C 0:10.269 - R 0:00.038 io/io PASSED C 0:11.827 - R 0:00.037 raii/boxed-types PASSED C 0:07.081 - R 0:00.038 shortCircuit PASSED C 0:06.677 - R 0:00.039 raii/memberCtors PASSED C 0:07.042 - R 0:00.038 meta/dumpable PASSED C 0:09.451 - R 0:00.042 polymorphism PASSED C 0:07.920 - R 0:00.041 concurrency/waituntil/one_chan PASSED C 0:12.542 - R 0:12.165 io/io-acquire-out PASSED C 0:12.138 - R 0:00.168 sizeof PASSED C 0:06.954 - R 0:00.041 references PASSED C 0:07.180 - R 0:00.037 raii/globals PASSED C 0:07.507 - R 0:00.042 malloc PASSED C 0:10.107 - R 0:00.037 quotedKeyword PASSED C 0:08.148 - R 0:00.019 tuplearray PASSED C 0:06.847 - R 0:00.024 strstream PASSED C 0:07.230 - R 0:00.037 io/io-acquire PASSED C 0:12.618 - R 0:00.322 io/io-acquire-in PASSED C 0:12.851 - R 0:00.120 concurrency/preempt2 PASSED C 0:12.878 - R 0:21.607 userLiterals PASSED C 0:07.428 - R 0:00.037 concurrency/waituntil/channel_close PASSED C 0:17.117 - R 0:10.159 zero_one PASSED C 0:06.828 - R 0:00.039 io/io-acquire2 PASSED C 0:13.760 - R 0:00.422 time PASSED C 0:08.705 - R 0:00.038 raii/dtor-early-exit PASSED C 0:09.687 - R 0:00.037 tuple/tupleAssign PASSED C 0:08.752 - R 0:00.036 minmax PASSED C 0:11.474 - R 0:00.037 searchsort PASSED C 0:09.244 - R 0:00.037 io/away_fair PASSED C 0:15.065 - R 0:00.268 vector PASSED C 0:08.456 - R 0:00.035 sum PASSED C 0:09.355 - R 0:00.037 linking/withthreads PASSED C 0:13.668 - R 0:00.068 ...collections/array-md-sbscr-cases PASSED C 0:08.051 - R 0:00.068 vector_math/vec2_double PASSED C 0:09.620 - R 0:00.037 vector_math/vec2_uint PASSED C 0:09.528 - R 0:00.036 concurrency/waituntil/futures PASSED C 0:29.307 - R 0:00.068 swap PASSED C 0:10.916 - R 0:00.020 abs PASSED C 0:08.933 - R 0:00.038 io/many_read PASSED C 0:15.824 - R 0:00.069 io/comp_fair PASSED C 0:16.542 - R 0:00.972 io/manipulatorsInput PASSED C 0:08.180 - R 0:00.036 concurrency/unified_locking/mcs PASSED C 0:14.112 - R 0:20.789 ato PASSED C 0:09.679 - R 0:00.037 ...rrency/examples/boundedBufferEXT PASSED C 0:12.699 - R 0:27.665 random PASSED C 0:08.371 - R 0:00.036 io/comp_basic PASSED C 0:18.631 - R 0:00.518 bitmanip2 PASSED C 0:10.643 - R 0:00.068 gmp PASSED C 0:09.690 - R 0:00.038 bitmanip1 PASSED C 0:10.842 - R 0:00.070 exceptions/hotpotato_checked PASSED C 0:10.467 - R 0:00.117 exceptions/cardgame PASSED C 0:10.525 - R 0:00.119 exceptions/hotpotato PASSED C 0:10.549 - R 0:00.069 ...rrency/examples/boundedBufferINT PASSED C 0:12.728 - R 0:29.848 vector_math/vec3_int PASSED C 0:12.889 - R 0:00.035 vector_math/vec2_ldouble PASSED C 0:09.815 - R 0:00.035 include/includes PASSED C 0:21.587 - R 0:00.035 bitmanip3 PASSED C 0:12.151 - R 0:00.068 vector_math/vec4_int PASSED C 0:13.471 - R 0:00.035 vector_math/vec2_int PASSED C 0:13.763 - R 0:00.035 io/manipulatorsOutput2 PASSED C 0:11.252 - R 0:00.036 vector_math/vec4_float PASSED C 0:14.422 - R 0:00.035 vector_math/vec3_float PASSED C 0:14.567 - R 0:00.035 vector_math/vec2_float PASSED C 0:15.291 - R 0:00.038 math PASSED C 0:12.442 - R 0:00.034 io/manipulatorsOutput1 PASSED C 0:13.740 - R 0:00.035 mathX PASSED C 0:13.644 - R 0:00.036 io/manipulatorsOutput3 PASSED C 0:14.044 - R 0:00.117 io/io-acquire-no-io PASSED C 0:12.632 - R 0:12.759 PRNG PASSED C 0:17.750 - R 0:02.121 heap PASSED C 0:10.378 - R 0:19.439 concurrency/actors/dynamic PASSED C 0:17.676 - R 0:35.902 rational PASSED C 0:26.849 - R 0:00.035 concurrency/waituntil/repeat_close PASSED C 0:16.996 - R 0:30.099 concurrency/waituntil/channels PASSED C 0:13.010 - R 0:35.432 ...ency/unified_locking/futex_mutex PASSED C 0:14.347 - R 0:40.955 ...ency/waituntil/channel_zero_size PASSED C 0:13.484 - R 0:39.737 concurrency/waituntil/all_types PASSED C 0:34.639 - R 0:21.599 concurrency/monitor PASSED C 0:12.092 - R 0:58.324 ...urrency/unified_locking/mcs_spin PASSED C 0:14.495 - R 0:52.847 .../unified_locking/spin_queue_lock PASSED C 0:14.593 - R 0:52.873 concurrency/multi-monitor PASSED C 0:12.060 - R 1:03.505 concurrency/waituntil/locks PASSED C 0:16.449 - R 1:06.920 concurrency/unified_locking/locks PASSED C 0:18.140 - R 1:34.560 concurrency/mutexstmt/locks PASSED C 0:12.270 - R 2:15.349 375 passes, 0 failures, 0 timeouts, 0 cancelled, 0 other Tests took 2:28.552 [Pipeline] } [Pipeline] // dir [Pipeline] } [Pipeline] // stage [Pipeline] echo -------- Test: Release -------- [Pipeline] stage [Pipeline] { (Test: Release) [Pipeline] dir Running in /var/lib/jenkins/workspace/Cforall_master@tmp [Pipeline] { [Pipeline] sh + nproc + make -j 96 --no-print-directory -C tests timeout=600 global-timeout=14400 tests debug=no archive-errors=/var/lib/jenkins/workspace/Cforall_master@tmp/tests/crashes/full-nodebug Running 375 tests on 96 cores (arm64 - no debug) array-ERR2 PASSED C 0:00.118 - R n/a array-ERR3 PASSED C 0:00.128 - R n/a ...ollections/language-dim-mismatch PASSED C 0:00.410 - R n/a concurrency/mainError PASSED C 0:00.456 - R n/a concurrency/keywordErrors PASSED C 0:00.625 - R n/a castError PASSED C 0:01.021 - R n/a array-collections/symtab-collision PASSED C 0:01.056 - R n/a array-collections/safety-summary PASSED C 0:01.077 - R n/a concurrency/ctor-check PASSED C 0:01.298 - R n/a attr-priority PASSED C 0:01.447 - R 0:00.003 array-ERR1 PASSED C 0:01.631 - R n/a cast PASSED C 0:01.614 - R 0:00.132 array PASSED C 0:01.726 - R 0:00.075 castReturn PASSED C 0:01.737 - R 0:00.074 array-collections/c-dependent PASSED C 0:01.810 - R 0:00.131 builtins/sync PASSED C 0:02.061 - R 0:00.130 array-collections/array-raii-c PASSED C 0:02.244 - R 0:00.022 array-collections/dimexpr-match-c PASSED C 0:02.522 - R 0:00.074 array-collections/array-sbscr-types PASSED C 0:03.105 - R 0:00.023 ...ns/vector-err-retn-perm-it-byval PASSED C 0:03.279 - R n/a ...ns/vector-err-pass-perm-it-byval PASSED C 0:03.656 - R n/a concurrency/clib_tls PASSED C 0:03.617 - R 0:00.044 array-collections/array-basic PASSED C 0:03.678 - R 0:00.037 array-collections/boxed PASSED C 0:03.714 - R 0:00.037 concurrency/clib PASSED C 0:03.615 - R 0:00.128 array-collections/dimexpr-match-cfa PASSED C 0:05.325 - R 0:00.069 collections/string-operator-ERR16 PASSED C 0:05.496 - R n/a collections/string-operator-ERR15 PASSED C 0:05.593 - R n/a collections/string-operator-ERR13 PASSED C 0:05.687 - R n/a collections/string-operator-ERR09 PASSED C 0:05.803 - R n/a collections/string-operator-ERR11 PASSED C 0:05.870 - R n/a ...urrency/pthread/pthread_key_test PASSED C 0:04.457 - R 0:00.038 avl_test PASSED C 0:06.436 - R 0:00.038 alloc-ERROR PASSED C 0:06.550 - R n/a algorithms/range_test PASSED C 0:06.992 - R 0:00.019 complex PASSED C 0:07.012 - R 0:00.022 collections/vector-demo PASSED C 0:07.234 - R 0:00.021 array-collections/accordion PASSED C 0:07.448 - R 0:00.039 collections/string-gc PASSED C 0:07.729 - R 0:00.021 array-collections/array-raii-cfa PASSED C 0:07.990 - R 0:00.025 concurrency/cluster PASSED C 0:08.592 - R 0:00.037 collections/string-istream PASSED C 0:08.670 - R 0:00.022 concurrency/futures/basic PASSED C 0:08.906 - R 0:00.039 concurrency/futures/abandon PASSED C 0:08.889 - R 0:00.177 collections/stack PASSED C 0:09.448 - R 0:00.021 concurrency/park/start_parked PASSED C 0:08.547 - R 0:00.025 concurrency/park/contention PASSED C 0:09.060 - R 0:00.070 collections/multi_list PASSED C 0:09.851 - R 0:00.021 concurrency/mutexstmt/monitors PASSED C 0:10.206 - R 0:00.577 collections/string-ctx-manage PASSED C 0:10.936 - R 0:00.024 collections/queue PASSED C 0:11.134 - R 0:00.021 concurrency/cofor PASSED C 0:11.922 - R 0:00.040 concurrency/examples/gortn PASSED C 0:12.152 - R 0:00.051 concurrency/migrate PASSED C 0:12.227 - R 0:00.039 concurrency/examples/matrixSum PASSED C 0:12.330 - R 0:00.040 collections/string-ostream PASSED C 0:12.394 - R 0:00.040 concurrency/coroutineYield PASSED C 0:12.732 - R 0:00.036 collections/string-istream-manip PASSED C 0:12.770 - R 0:00.044 collections/sequence PASSED C 0:12.828 - R 0:00.037 collections/string-overwrite PASSED C 0:12.859 - R 0:00.083 ...ections/string-overwrite-noshare PASSED C 0:12.850 - R 0:00.133 concurrency/join PASSED C 0:12.898 - R 0:00.131 ...rrency/pthread/pthread_attr_test PASSED C 0:11.829 - R 0:00.022 concurrency/park/force_preempt PASSED C 0:12.234 - R 0:00.321 ...rrency/pthread/pthread_cond_test PASSED C 0:11.894 - R 0:00.039 concurrency/examples/datingService PASSED C 0:13.396 - R 0:00.120 concurrency/monitor PASSED C 0:12.128 - R 0:01.429 ...rrency/pthread/pthread_once_test PASSED C 0:11.870 - R 0:00.037 collections/atomic_mpsc PASSED C 0:12.551 - R 0:01.391 ...pthread/pthread_demo_create_join PASSED C 0:12.231 - R 0:00.128 collections/string-compare PASSED C 0:14.142 - R 0:00.025 concurrency/multi-monitor PASSED C 0:12.174 - R 0:02.029 const-init PASSED C 0:01.758 - R 0:00.041 const-ref PASSED C 0:01.620 - R 0:00.127 concurrency/barrier/last PASSED C 0:14.897 - R 0:00.038 concurrency/barrier/order PASSED C 0:15.140 - R 0:00.125 ...rrency/examples/boundedBufferINT PASSED C 0:13.561 - R 0:01.787 concurrency/barrier/generation PASSED C 0:15.232 - R 0:00.181 concurrency/signal/block PASSED C 0:13.185 - R 0:00.170 concurrency/mutexstmt/tuple PASSED C 0:15.488 - R 0:00.039 concurrency/readyQ/leader_spin PASSED C 0:12.437 - R 0:01.029 concurrency/waitfor/parse PASSED C 0:07.915 - R 0:00.019 concurrency/futures/wait_any PASSED C 0:15.712 - R 0:00.037 ctrl-flow/loop-inc PASSED C 0:01.551 - R 0:00.068 concurrency/examples/quickSort PASSED C 0:15.981 - R 0:00.036 collections/string-operator PASSED C 0:16.320 - R 0:00.023 concurrency/signal/disjoint FAILED with code -6 C 0:13.308 - R 0:00.036 ERROR Eager signal 2 Cforall Runtime error (UNIX pid:1179858): Stack back trace for: /var/lib/jenkins/workspace/Cforall_master@tmp/libcfa/arm64-nodebug/src/.libs/libcfa.so.1 (0) /var/lib/jenkins/workspace/Cforall_master@tmp/libcfa/arm64-nodebug/src/.libs/libcfa.so.1 : + 0x83ab0 [0xfffff7ed3ab0] (1) /var/lib/jenkins/workspace/Cforall_master@tmp/libcfa/arm64-nodebug/src/.libs/libcfa.so.1 : + 0x3b53c [0xfffff7e8b53c] (2) /var/lib/jenkins/workspace/Cforall_master@tmp/libcfa/arm64-nodebug/src/.libs/libcfa.so.1 : + 0x3cef4 [0xfffff7e8cef4] (3) /var/lib/jenkins/workspace/Cforall_master@tmp/tests/concurrency/signal/disjoint : _X5logicFv_XS8global_t__1 + 0x15c [0xaaaaaaaa3f5c] warning: Can't open file anon_inode:[io_uring] which was expanded to anon_inode:[io_uring] during file-backed mapping note processing [New LWP 1179858] [New LWP 1179869] [New LWP 1179868] [Thread debugging using libthread_db enabled] Using host libthread_db library "/lib/aarch64-linux-gnu/libthread_db.so.1". Core was generated by `/var/lib/jenkins/workspace/Cforall_master@tmp/tests/concurrency/signal/disjoint'. Program terminated with signal SIGABRT, Aborted. #0 __pthread_kill_implementation (threadid=281474842402240, signo=signo@entry=6, no_tid=no_tid@entry=0) at ./nptl/pthread_kill.c:44 warning: 44 ./nptl/pthread_kill.c: No such file or directory [Current thread is 1 (Thread 0xfffff7fe9dc0 (LWP 1179858))] ----- #0 __pthread_kill_implementation (threadid=281474842402240, signo=signo@entry=6, no_tid=no_tid@entry=0) at ./nptl/pthread_kill.c:44 #1 0x0000fffff7c27540 in __pthread_kill_internal (signo=6, threadid=) at ./nptl/pthread_kill.c:78 #2 0x0000fffff7bdcb3c in __GI_raise (sig=sig@entry=6) at ../sysdeps/posix/raise.c:26 #3 0x0000fffff7bc7e00 in __GI_abort () at ./stdlib/abort.c:79 #4 0x0000fffff7ed35ec in _X7__abortFv_bPKcY17__builtin_va_list__1 (_X11signalAbortb_1=_X11signalAbortb_1@entry=true, _X3fmtPKc_1=_X3fmtPKc_1@entry=0xfffff7ee5918 "Application interrupted by signal: %s.\n", _X4argsY17__builtin_va_list_1=...) at /var/lib/jenkins/workspace/Cforall_master/libcfa/src/interpose.cfa:263 #5 0x0000fffff7ed3ab0 in _X5abortFv_bPKc__1 (_X11signalAbortb_1=_X11signalAbortb_1@entry=true, _X3fmtPKc_1=_X3fmtPKc_1@entry=0xfffff7ee5918 "Application interrupted by signal: %s.\n") at /var/lib/jenkins/workspace/Cforall_master/libcfa/src/interpose.cfa:301 #6 0x0000fffff7ed3ad0 in _X15sigHandler_termFv_iPS21__anonymous_siginfo_tPS10ucontext_t__1 (_X3sigi_1=, _X3sfpPS21__anonymous_siginfo_t_1=, _X3cxtPS10ucontext_t_1=) at /var/lib/jenkins/workspace/Cforall_master/libcfa/src/interpose.cfa:337 #7 #8 __pthread_kill_implementation (threadid=281474842402240, signo=signo@entry=6, no_tid=no_tid@entry=0) at ./nptl/pthread_kill.c:44 #9 0x0000fffff7c27540 in __pthread_kill_internal (signo=6, threadid=) at ./nptl/pthread_kill.c:78 #10 0x0000fffff7bdcb3c in __GI_raise (sig=sig@entry=6) at ../sysdeps/posix/raise.c:26 #11 0x0000fffff7bc7e00 in __GI_abort () at ./stdlib/abort.c:79 #12 0x0000fffff7ed36a4 in _X7__abortFv_bPKcY17__builtin_va_list__1 (_X11signalAbortb_1=_X11signalAbortb_1@entry=false, _X3fmtPKc_1=_X3fmtPKc_1@entry=0xfffff7ee49f0 "%s", _X4argsY17__builtin_va_list_1=...) at /var/lib/jenkins/workspace/Cforall_master/libcfa/src/interpose.cfa:286 #13 0x0000fffff7ed3ab0 in _X5abortFv_bPKc__1 (_X11signalAbortb_1=_X11signalAbortb_1@entry=false, _X3fmtPKc_1=_X3fmtPKc_1@entry=0xfffff7ee49f0 "%s") at /var/lib/jenkins/workspace/Cforall_master/libcfa/src/interpose.cfa:301 #14 0x0000fffff7e8b53c in abort () at /var/lib/jenkins/workspace/Cforall_master/libcfa/src/interpose.cfa:176 #15 0x0000fffff7e8cef4 in _X4endsFv_S8ofstream__1 (_X2osS8ofstream_1=0xfffff7f211c8 <_X9abortFileS8ofstream_1>) at /var/lib/jenkins/workspace/Cforall_master/libcfa/src/fstream.cfa:106 #16 0x0000aaaaaaaa3f5c in _X5logicFv_XS8global_t__1 (_X1aXS8global_t_1=_X1aXS8global_t_1@entry=0xaaaaaaac02b0 <_X7globalsS13__anonymous66_1>) at concurrency/signal/disjoint.cfa:115 #17 0x0000aaaaaaaa3fc0 in _X4mainFv_S9Signaller__1 (__anonymous_object2552=__anonymous_object2552@entry=0xffffffffd070) at concurrency/signal/disjoint.cfa:126 #18 0x0000fffff7f6ad34 in __cfactx_invoke_thread (main=0xaaaaaaaa3f90 <_X4mainFv_S9Signaller__1>, this=0xffffffffd070) at /var/lib/jenkins/workspace/Cforall_master/libcfa/src/concurrency/invoke.c:87 #19 0x0000fffff7f6ad10 in __cfactx_coroutine_unwind (storage=, cor=) at /var/lib/jenkins/workspace/Cforall_master/libcfa/src/concurrency/invoke.c:76 #20 0x0000aaaaaabffff0 in ?? () Backtrace stopped: previous frame inner to this frame (corrupt stack?) ----- Id Target Id Frame * 1 Thread 0xfffff7fe9dc0 (LWP 1179858) __pthread_kill_implementation (threadid=281474842402240, signo=signo@entry=6, no_tid=no_tid@entry=0) at ./nptl/pthread_kill.c:44 2 Thread 0xaaaaaab92dc0 (LWP 1179869) 0x0000fffff7f6b7b0 in _X11calc_cutoffQ1_0_0_1__X2tsFy_BD0__Fd_yjmPBD0PU13__timestamp_tjb__1 (_sizeof_Y6Data_t=, _alignof_Y6Data_t=, _X2tsFy_Y6Data_t__1=, _X12shard_factorKj_1=, _X6strictb_1=, _X5countm_1=, _X4tscsPU13__timestamp_t_1=, _X4dataPY6Data_t_1=, _X6procidj_1=, _X4ctscKy_1=) at /var/lib/jenkins/workspace/Cforall_master/libcfa/src/concurrency/kernel/cluster.hfa:111 3 Thread 0xaaaaaab12c00 (LWP 1179868) 0x0000fffff7bdda18 in __GI___sigtimedwait (set=set@entry=0xaaaaaab121e8, info=info@entry=0xaaaaaab12268, timeout=timeout@entry=0x0) at ../sysdeps/unix/sysv/linux/sigtimedwait.c:31 Archiving concurrency/signal/disjoint (executable and core) to crashes/full-nodebug/concurrency/signal/disjoint ctrl-flow/labelledExit PASSED C 0:02.123 - R 0:00.038 concurrency/lockfree_stack PASSED C 0:12.165 - R 0:04.186 ...rrency/examples/boundedBufferEXT PASSED C 0:15.024 - R 0:01.627 concurrency/suspend_then PASSED C 0:13.054 - R 0:00.037 concurrency/readyQ/barrier_sleeper PASSED C 0:14.684 - R 0:00.323 enum_tests/lvalue PASSED C 0:00.910 - R n/a errors/declaration PASSED C 0:00.133 - R n/a enum PASSED C 0:01.556 - R 0:00.024 concurrency/signal/wait PASSED C 0:14.112 - R 0:00.070 concurrency/waitfor/else PASSED C 0:10.124 - R 0:00.019 errors/scope-type PASSED C 0:00.238 - R n/a errors/signature PASSED C 0:00.157 - R n/a enum_tests/inc-dec PASSED C 0:01.754 - R 0:00.023 concurrency/sleep PASSED C 0:13.245 - R 0:01.174 collections/string-api-coverage PASSED C 0:17.824 - R 0:00.022 errors/scope PASSED C 0:00.840 - R n/a ...cy/unified_locking/pthread_locks PASSED C 0:11.901 - R 0:00.071 concurrency/once PASSED C 0:17.325 - R 0:00.074 ...ions/string-api-coverage-noshare PASSED C 0:17.980 - R 0:00.023 ...ency/unified_locking/exp_backoff PASSED C 0:14.391 - R 0:00.037 concurrency/thread PASSED C 0:14.619 - R 0:00.037 enum_tests/funcEnum PASSED C 0:02.790 - R 0:00.022 concurrency/actors/executor PASSED C 0:18.548 - R 0:00.037 .../unified_locking/block_spin_lock PASSED C 0:14.861 - R 0:00.038 alloc PASSED C 0:18.665 - R 0:00.023 designations PASSED C 0:03.381 - R 0:00.039 .../unified_locking/fast_block_lock PASSED C 0:14.932 - R 0:00.039 eval PASSED C 0:01.484 - R 0:00.022 concurrency/actors/poison PASSED C 0:18.764 - R 0:00.172 concurrency/mutexstmt/locks PASSED C 0:13.404 - R 0:05.509 ...ncy/unified_locking/timeout_lock PASSED C 0:11.270 - R 0:01.182 concurrency/actors/dynamic PASSED C 0:18.927 - R 0:00.221 concurrency/futures/typed PASSED C 0:19.006 - R 0:00.123 concurrency/waitfor/dtor PASSED C 0:12.226 - R 0:00.169 concurrency/actors/pingpong PASSED C 0:19.417 - R 0:00.076 exceptions/try-ctrl-flow PASSED C 0:00.518 - R n/a concurrency/actors/matrixMultiply PASSED C 0:19.263 - R 0:00.273 concurrency/waitfor/barge PASSED C 0:12.455 - R 0:00.070 enum_tests/structEnum PASSED C 0:03.156 - R 0:00.022 concurrency/actors/types PASSED C 0:19.510 - R 0:00.121 concurrency/actors/static PASSED C 0:19.622 - R 0:00.072 exceptions/type-check PASSED C 0:00.683 - R n/a concurrency/actors/inline PASSED C 0:19.852 - R 0:00.037 concurrency/actors/inherit PASSED C 0:19.936 - R 0:00.273 ...urrency/waitfor/lexical_priority PASSED C 0:12.699 - R 0:00.038 concurrency/waitfor/recurse PASSED C 0:12.153 - R 0:00.170 ctrl-flow/break-misc PASSED C 0:06.709 - R 0:00.021 copyfile PASSED C 0:07.530 - R 0:00.028 ...fied_locking/mcs_block_spin_lock PASSED C 0:14.796 - R 0:00.035 ctrl-flow/fallthrough PASSED C 0:06.779 - R 0:00.022 exceptions/try-leave-catch PASSED C 0:01.794 - R 0:00.040 counter PASSED C 0:07.254 - R 0:00.074 ctrl-flow/ifwhileCtl PASSED C 0:06.967 - R 0:00.047 expression PASSED C 0:01.552 - R 0:00.043 concurrency/preempt PASSED C 0:14.225 - R 0:05.955 ctrl-flow/goto PASSED C 0:07.316 - R 0:00.042 ctrl-flow/loop_else PASSED C 0:07.066 - R 0:00.022 ...nified_locking/simple_owner_lock PASSED C 0:14.938 - R 0:00.127 coroutine/devicedriver PASSED C 0:08.637 - R 0:00.024 global-monomorph PASSED C 0:01.619 - R 0:00.023 concurrency/unified_locking/mcs PASSED C 0:14.773 - R 0:01.182 coroutine/fibonacci PASSED C 0:08.561 - R 0:00.073 coroutine/raii PASSED C 0:08.349 - R 0:00.037 concurrency/waitfor/statment PASSED C 0:13.098 - R 0:00.039 coroutine/fmtLines PASSED C 0:08.653 - R 0:00.131 exceptions/message PASSED C 0:03.285 - R 0:00.021 ...rrency/pthread/pthread_demo_lock PASSED C 0:12.462 - R 0:07.721 identParamDeclarator PASSED C 0:01.621 - R 0:00.041 coroutine/runningTotal PASSED C 0:08.554 - R 0:00.048 init1-ERROR PASSED C 0:00.816 - R n/a identFuncDeclarator PASSED C 0:01.773 - R 0:00.043 coroutine/pingpong PASSED C 0:09.534 - R 0:00.037 init1 PASSED C 0:01.510 - R 0:00.038 enum_tests/anonymous PASSED C 0:06.999 - R 0:00.044 ctrl-flow/loop_else-WRN1 PASSED C 0:08.256 - R 0:00.002 concurrency/waituntil/timeout PASSED C 0:08.035 - R 0:03.078 configs/parsebools PASSED C 0:10.453 - R 0:00.421 enum_tests/stringEnum PASSED C 0:06.882 - R 0:00.039 include/vector-sequence PASSED C 0:02.193 - R 0:00.073 enum_tests/enumInlineValue PASSED C 0:07.736 - R 0:00.076 enum_tests/typedIntEnum PASSED C 0:06.919 - R 0:00.023 enum_tests/voidEnum PASSED C 0:06.855 - R 0:00.019 enum_tests/input PASSED C 0:07.766 - R 0:00.042 limits PASSED C 0:01.688 - R 0:00.069 configs/usage PASSED C 0:11.383 - R 0:00.038 configs/parseconfig PASSED C 0:11.395 - R 0:00.120 concurrency/waitfor/when PASSED C 0:15.365 - R 0:00.071 include/vector-collections PASSED C 0:03.287 - R 0:00.022 ...ency/waituntil/channel_zero_size PASSED C 0:13.805 - R 0:00.830 linking/nostdlib PASSED C 0:01.546 - R 0:00.038 nested-types-ERR1 PASSED C 0:00.175 - R n/a nested-types-ERR2 PASSED C 0:00.353 - R n/a coroutine/prodcons PASSED C 0:11.632 - R 0:00.022 exceptions/data-except PASSED C 0:07.041 - R 0:00.026 exceptions/conditional PASSED C 0:07.585 - R 0:00.021 div PASSED C 0:09.576 - R 0:00.036 ctrl-flow/loopctrl PASSED C 0:10.154 - R 0:00.037 linkonce PASSED C 0:01.866 - R 0:00.019 opt-params PASSED C 0:00.117 - R n/a exceptions/finally PASSED C 0:07.309 - R 0:00.039 enum_tests/position PASSED C 0:09.231 - R 0:00.022 exceptions/defaults PASSED C 0:07.639 - R 0:00.129 concurrency/waituntil/one_chan PASSED C 0:14.234 - R 0:00.524 nested-types PASSED C 0:01.566 - R 0:00.020 maybe PASSED C 0:02.020 - R 0:00.037 enum_tests/planet PASSED C 0:09.415 - R 0:00.035 exceptions/interact PASSED C 0:07.476 - R 0:00.026 exceptions/conditional-threads PASSED C 0:08.291 - R 0:00.020 exceptions/cancel/coroutine PASSED C 0:08.580 - R 0:00.021 exceptions/trash PASSED C 0:07.022 - R 0:00.073 exceptions/polymorphic PASSED C 0:07.444 - R 0:00.024 exceptions/resume PASSED C 0:07.416 - R 0:00.069 nowarn/array PASSED C 0:01.751 - R 0:00.045 polybits PASSED C 0:00.404 - R n/a nowarn/no-autogen PASSED C 0:01.560 - R 0:00.040 exceptions/terminate PASSED C 0:07.524 - R 0:00.040 nowarn/exception PASSED C 0:01.915 - R 0:00.020 generator/fibonacci PASSED C 0:06.796 - R 0:00.028 exceptions/virtual-poly PASSED C 0:07.150 - R 0:00.043 generator/fmtLines PASSED C 0:06.970 - R 0:00.040 numericConstants PASSED C 0:01.597 - R 0:00.024 nowarn/printf-sizeof PASSED C 0:01.750 - R 0:00.070 exceptions/finally-threads PASSED C 0:08.524 - R 0:00.039 concurrency/channels/daisy_chain PASSED C 0:16.710 - R 0:10.131 operators PASSED C 0:01.614 - R 0:00.041 fstream_test PASSED C 0:07.263 - R 0:00.037 nowarn/zero-thunk PASSED C 0:01.701 - R 0:00.070 exceptions/defaults-threads PASSED C 0:08.992 - R 0:00.036 generator/suspend_then PASSED C 0:07.178 - R 0:00.041 poly-bare-assn PASSED C 0:01.522 - R 0:00.041 concurrency/waituntil/channels PASSED C 0:15.183 - R 0:02.083 concurrency/channels/churn PASSED C 0:16.975 - R 0:10.073 device/cpu PASSED C 0:11.379 - R 0:00.273 genericUnion PASSED C 0:07.187 - R 0:00.035 concurrency/channels/hot_potato PASSED C 0:17.036 - R 0:10.065 poly-d-cycle PASSED C 0:01.688 - R 0:00.027 raii/ctor-autogen-ERR1 PASSED C 0:00.923 - R n/a hello PASSED C 0:06.887 - R 0:00.037 poly-many-arsz PASSED C 0:01.539 - R 0:00.038 nowarn/unused PASSED C 0:02.245 - R 0:00.043 poly-member PASSED C 0:01.565 - R 0:00.020 linking/exception-nothreads PASSED C 0:05.164 - R 0:00.022 poly-o-cycle PASSED C 0:01.612 - R 0:00.021 poly-selection PASSED C 0:01.576 - R 0:00.039 identity PASSED C 0:07.079 - R 0:00.020 quasiKeyword PASSED C 0:01.623 - R 0:00.019 raii/partial-ERR1 PASSED C 0:00.880 - R n/a typedefRedef-ERR1 PASSED C 0:00.223 - R n/a poly-self-cycle PASSED C 0:01.825 - R 0:00.019 concurrency/channels/ping_pong PASSED C 0:17.617 - R 0:10.080 concurrency/channels/contend PASSED C 0:17.596 - R 0:10.128 exceptions/resume-threads PASSED C 0:08.989 - R 0:00.022 concurrency/channels/pub_sub PASSED C 0:17.761 - R 0:10.060 forall PASSED C 0:08.345 - R 0:00.021 var-assert PASSED C 0:00.227 - R n/a exceptions/terminate-threads PASSED C 0:09.049 - R 0:00.024 include/vector-fstream PASSED C 0:07.017 - R 0:00.020 concurrency/channels/big_elems PASSED C 0:17.595 - R 0:10.514 raii/ctor-autogen PASSED C 0:02.120 - R 0:00.021 raii/partial PASSED C 0:01.651 - R 0:00.039 raii/init_once PASSED C 0:01.925 - R 0:00.070 exceptions/virtual-cast PASSED C 0:09.177 - R 0:00.045 raii/typeof-member PASSED C 0:01.637 - R 0:00.071 io/eofType PASSED C 0:06.986 - R 0:00.073 switch PASSED C 0:01.592 - R 0:00.019 tuple/tupleCast PASSED C 0:01.658 - R 0:00.020 tuple/tupleMember PASSED C 0:01.693 - R 0:00.021 linking/exception-withthreads PASSED C 0:06.792 - R 0:00.040 concurrency/futures/future_except PASSED C 0:28.955 - R 0:00.075 typedefRedef PASSED C 0:01.608 - R 0:00.038 concurrency/waituntil/basic_else PASSED C 0:19.939 - R 0:00.038 tuple/tupleFunction PASSED C 0:01.939 - R 0:00.036 simpleGenericTriple PASSED C 0:02.247 - R 0:00.077 smart-pointers PASSED C 0:02.214 - R 0:00.081 variableDeclarator PASSED C 0:01.568 - R 0:00.021 withconflict PASSED C 0:00.897 - R n/a typeof PASSED C 0:01.697 - R 0:00.070 result PASSED C 0:02.413 - R 0:00.021 exceptions/cancel/thread PASSED C 0:11.982 - R 0:00.038 exceptions/fibonacci_nonlocal PASSED C 0:11.565 - R 0:00.025 tuple/tuplePolymorphism PASSED C 0:02.156 - R 0:00.024 meta/fork+exec PASSED C 0:05.529 - R 0:00.275 warnings/self-assignment PASSED C 0:01.379 - R 0:00.003 voidPtr PASSED C 0:01.503 - R 0:00.074 exceptions/cor_resumer PASSED C 0:11.975 - R 0:00.025 linking/mangling/anon PASSED C 0:07.039 - R 0:00.041 concurrency/channels/zero_size PASSED C 0:19.777 - R 0:10.060 KRfunctions PASSED C 0:01.412 - R 0:00.005 errors/completeType PASSED C 0:00.845 - R n/a ...collections/dimexpr-match-c-ERRS PASSED C 0:01.110 - R n/a function-operator PASSED C 0:10.676 - R 0:00.025 include/stdincludes PASSED C 0:09.884 - R 0:00.077 attributes PASSED C 0:01.590 - R 0:00.003 declarationSpecifier PASSED C 0:01.464 - R 0:00.002 ...llections/dimexpr-match-cfa-ERRS PASSED C 0:01.708 - R n/a list/dlist-insert-remove PASSED C 0:07.392 - R 0:00.041 functions PASSED C 0:01.374 - R 0:00.002 extension PASSED C 0:01.397 - R 0:00.001 raii/memberCtors-ERR1 PASSED C 0:04.283 - R n/a gccExtensions PASSED C 0:01.280 - R 0:00.004 literals PASSED C 0:07.335 - R 0:00.021 meta/arch PASSED C 0:00.833 - R n/a list/dlist2-insert-remove PASSED C 0:07.732 - R 0:00.022 raii/dtor-early-exit-ERR2 PASSED C 0:05.042 - R n/a exceptions/pingpong_nonlocal PASSED C 0:12.792 - R 0:00.021 raii/dtor-early-exit-ERR1 PASSED C 0:05.292 - R n/a linking/io-acquire PASSED C 0:09.184 - R 0:00.021 linking/nothreads PASSED C 0:09.141 - R 0:00.021 concurrency/waituntil/locks PASSED C 0:18.283 - R 0:02.827 arithmeticConversions PASSED C 0:03.194 - R 0:00.019 zero_one-ERR1 PASSED C 0:03.747 - R n/a linking/weakso_nothd PASSED C 0:09.288 - R 0:00.019 alloc2 PASSED C 0:32.662 - R 0:00.019 tuple/tupleVariadic PASSED C 0:05.424 - R 0:00.036 io/manipulatorsInput-uchunk PASSED C 0:10.907 - R 0:00.067 io/io PASSED C 0:11.437 - R 0:00.036 raii/boxed-types PASSED C 0:07.016 - R 0:00.019 polymorphism PASSED C 0:07.258 - R 0:00.022 quotedKeyword PASSED C 0:07.200 - R 0:00.019 raii/globals PASSED C 0:06.900 - R 0:00.037 meta/dumpable PASSED C 0:09.703 - R 0:00.036 sizeof PASSED C 0:06.770 - R 0:00.020 shortCircuit PASSED C 0:07.149 - R 0:00.019 concurrency/unified_locking/locks PASSED C 0:16.144 - R 0:12.573 io/io-acquire-in PASSED C 0:12.589 - R 0:00.037 strstream PASSED C 0:07.320 - R 0:00.019 references PASSED C 0:07.506 - R 0:00.020 raii/memberCtors PASSED C 0:08.075 - R 0:00.021 io/io-acquire-out PASSED C 0:12.739 - R 0:00.035 tuplearray PASSED C 0:07.310 - R 0:00.021 io/io-acquire PASSED C 0:13.148 - R 0:00.035 malloc PASSED C 0:11.061 - R 0:00.019 tuple/tupleAssign PASSED C 0:07.671 - R 0:00.018 concurrency/preempt2 PASSED C 0:13.310 - R 0:20.474 io/io-acquire2 PASSED C 0:13.093 - R 0:00.036 heap PASSED C 0:10.418 - R 0:04.437 linking/withthreads PASSED C 0:11.975 - R 0:00.019 zero_one PASSED C 0:07.056 - R 0:00.018 raii/dtor-early-exit PASSED C 0:09.303 - R 0:00.020 userLiterals PASSED C 0:07.997 - R 0:00.018 io/manipulatorsOutput4 PASSED C 0:13.853 - R 0:00.036 vector PASSED C 0:08.486 - R 0:00.018 time PASSED C 0:09.191 - R 0:00.020 sum PASSED C 0:09.604 - R 0:00.036 io/away_fair PASSED C 0:15.348 - R 0:00.034 minmax PASSED C 0:13.315 - R 0:00.021 swap PASSED C 0:10.176 - R 0:00.021 io/many_read PASSED C 0:15.472 - R 0:00.036 vector_math/vec2_double PASSED C 0:09.887 - R 0:00.019 vector_math/vec2_uint PASSED C 0:09.986 - R 0:00.019 abs PASSED C 0:09.158 - R 0:00.019 searchsort PASSED C 0:11.054 - R 0:00.036 concurrency/waituntil/channel_close PASSED C 0:19.453 - R 0:10.050 ato PASSED C 0:09.934 - R 0:00.019 random PASSED C 0:09.069 - R 0:00.021 io/comp_fair PASSED C 0:18.022 - R 0:00.036 concurrency/waituntil/futures PASSED C 0:30.031 - R 0:00.019 io/comp_basic PASSED C 0:18.533 - R 0:00.035 vector_math/vec2_ldouble PASSED C 0:09.662 - R 0:00.018 exceptions/hotpotato_checked PASSED C 0:10.984 - R 0:00.019 gmp PASSED C 0:11.082 - R 0:00.035 io/manipulatorsInput PASSED C 0:11.067 - R 0:00.036 ...collections/array-md-sbscr-cases PASSED C 0:11.955 - R 0:00.018 exceptions/hotpotato PASSED C 0:11.497 - R 0:00.019 exceptions/cardgame PASSED C 0:12.313 - R 0:00.018 bitmanip3 PASSED C 0:13.191 - R 0:00.035 bitmanip1 PASSED C 0:13.417 - R 0:00.036 math PASSED C 0:12.827 - R 0:00.019 io/manipulatorsOutput2 PASSED C 0:13.330 - R 0:00.019 include/includes PASSED C 0:23.341 - R 0:00.018 mathX PASSED C 0:14.171 - R 0:00.035 bitmanip2 PASSED C 0:14.874 - R 0:00.035 concurrency/waituntil/all_types PASSED C 0:35.822 - R 0:00.217 PRNG PASSED C 0:16.612 - R 0:00.370 vector_math/vec3_int PASSED C 0:17.695 - R 0:00.018 vector_math/vec4_int PASSED C 0:18.554 - R 0:00.024 vector_math/vec2_float PASSED C 0:18.891 - R 0:00.020 vector_math/vec4_float PASSED C 0:19.401 - R 0:00.036 vector_math/vec3_float PASSED C 0:20.089 - R 0:00.018 vector_math/vec2_int PASSED C 0:20.446 - R 0:00.018 io/manipulatorsOutput1 PASSED C 0:21.449 - R 0:00.022 io/io-acquire-no-io PASSED C 0:12.421 - R 0:17.646 rational PASSED C 0:29.571 - R 0:00.018 concurrency/waituntil/repeat_close PASSED C 0:15.421 - R 0:30.029 ...ency/unified_locking/futex_mutex PASSED C 0:16.706 - R 0:35.991 io/manipulatorsOutput3 PASSED C 0:30.380 - R 0:00.022 .../unified_locking/spin_queue_lock PASSED C 0:14.938 - R 0:49.139 ...urrency/unified_locking/mcs_spin PASSED C 0:14.393 - R 0:57.768 374 passes, 1 failures, 0 timeouts, 0 cancelled, 0 other Tests took 1:18.855 make: *** [Makefile:986: all-local] Error 1 [Pipeline] } [Pipeline] // dir [Pipeline] } [Pipeline] // stage [Pipeline] echo Archiving core dumps [Pipeline] dir Running in /var/lib/jenkins/workspace/Cforall_master@tmp [Pipeline] { [Pipeline] fileExists [Pipeline] sh + /var/lib/jenkins/workspace/Cforall_master/tools/jenkins/archive-gen.sh [Pipeline] archiveArtifacts Archiving artifacts Recording fingerprints [Pipeline] } [Pipeline] // dir [Pipeline] } [Pipeline] // wrap [Pipeline] } [Pipeline] // node [Pipeline] echo hudson.AbortException: script returned exit code 2 [Pipeline] node Running on Brokk 4 in /var/lib/jenkins/workspace/Cforall_master [Pipeline] { [Pipeline] echo Notifying users of result [Pipeline] echo Reusing previously constructed message [Pipeline] echo Would send email to: cforall@lists.uwaterloo.ca [Pipeline] echo With title: [cforall git][BUILD# 3929 - FAILURE] - branch master [Pipeline] echo Content:

This is an automated email from the Jenkins build machine. It was generated because of a git hooks/post-receive script following a ref change which was pushed to the C∀ repository.

- Status --------------------------------------------------------------

BUILD# 3929 - FAILURE

Check console output at https://cforall.uwaterloo.ca/jenkins/job/Cforall/job/master/3929/ to view the results.

- Changes -------------------------------------------------------------

The branch master has been updated.
      from  880968bf0c0545a6330ce6fb2a90567fd5f026cb (commit)

- Log -----------------------------------------------------------------


-----------------------------------------------------------------------

Summary of changes:

[Pipeline] } [Pipeline] // node [Pipeline] echo Build Completed [Pipeline] End of Pipeline ERROR: script returned exit code 2 Finished: FAILURE [Pipeline] error [Pipeline] } Failed in branch gcc_11_arm64_new Build Cforall » master #3930 completed: SUCCESS [Pipeline] echo SUCCESS [Pipeline] } Build Cforall » master #3927 completed: SUCCESS [Pipeline] echo SUCCESS [Pipeline] } Build Cforall » master #3925 completed: SUCCESS [Pipeline] echo SUCCESS [Pipeline] } Build Cforall » master #3932 completed: SUCCESS [Pipeline] echo SUCCESS [Pipeline] } Build Cforall » master #3928 completed: SUCCESS [Pipeline] echo SUCCESS [Pipeline] } Build Cforall » master #3934 completed: SUCCESS [Pipeline] echo SUCCESS [Pipeline] } Build Cforall » master #3935 completed: SUCCESS [Pipeline] echo SUCCESS [Pipeline] } Build Cforall » master #3933 completed: SUCCESS [Pipeline] echo SUCCESS [Pipeline] } Build Cforall » master #3926 completed: SUCCESS [Pipeline] echo SUCCESS [Pipeline] } Build Cforall » master #3931 completed: SUCCESS [Pipeline] echo SUCCESS [Pipeline] } [Pipeline] // parallel [Pipeline] } [Pipeline] // stage [Pipeline] } [Pipeline] // wrap [Pipeline] echo error caught [Pipeline] node Running on Brokk 4 in /var/lib/jenkins/workspace/Cforall_Full_Build [Pipeline] { [Pipeline] echo notifying users [Pipeline] emailext Sending email to: cforall@lists.uwaterloo.ca [Pipeline] } [Pipeline] // node [Pipeline] } [Pipeline] // node [Pipeline] End of Pipeline ERROR: FAILURE Finished: FAILURE