23:12:14 include/vector-collections PASSED C 0:03.103 - R 0:00.070
23:12:14 linking/nostdlib PASSED C 0:01.506 - R 0:00.027
23:12:14 exceptions/conditional PASSED C 0:07.096 - R 0:00.123
23:12:14 exceptions/data-except PASSED C 0:07.010 - R 0:00.073
23:12:14 exceptions/finally PASSED C 0:06.951 - R 0:00.036
23:12:14 exceptions/defaults PASSED C 0:07.268 - R 0:00.021
23:12:14 exceptions/interact PASSED C 0:07.064 - R 0:00.040
23:12:14 enum_tests/planet PASSED C 0:09.133 - R 0:00.040
23:12:14 nested-types-ERR1 PASSED C 0:00.170 - R n/a
23:12:14 device/cpu PASSED C 0:10.523 - R 0:00.119
23:12:14 exceptions/polymorphic PASSED C 0:07.022 - R 0:00.127
23:12:14 concurrency/waitfor/dtor PASSED C 0:12.143 - R 0:06.553
23:12:14 linkonce PASSED C 0:01.699 - R 0:00.024
23:12:14 nested-types-ERR2 PASSED C 0:00.368 - R n/a
23:12:14 exceptions/trash PASSED C 0:06.861 - R 0:00.073
23:12:14 enum_tests/position PASSED C 0:09.257 - R 0:00.077
23:12:14 exceptions/resume PASSED C 0:07.413 - R 0:00.036
23:12:14 exceptions/cancel/coroutine PASSED C 0:08.506 - R 0:00.071
23:12:14 concurrency/channels/daisy_chain PASSED C 0:16.131 - R 0:10.120
23:12:14 opt-params PASSED C 0:00.119 - R n/a
23:12:14 exceptions/conditional-threads PASSED C 0:08.432 - R 0:00.125
23:12:14 exceptions/terminate PASSED C 0:07.313 - R 0:00.076
23:12:14 exceptions/finally-threads PASSED C 0:08.483 - R 0:00.035
23:12:14 nested-types PASSED C 0:01.465 - R 0:00.025
23:12:14 concurrency/channels/zero_size PASSED C 0:16.547 - R 0:10.232
23:12:14 concurrency/channels/hot_potato PASSED C 0:16.643 - R 0:10.125
23:12:14 exceptions/virtual-poly PASSED C 0:06.971 - R 0:00.022
23:12:14 concurrency/channels/pub_sub PASSED C 0:16.731 - R 0:10.164
23:12:14 maybe PASSED C 0:01.918 - R 0:00.074
23:12:14 fstream_test PASSED C 0:06.781 - R 0:00.039
23:12:14 polybits PASSED C 0:00.323 - R n/a
23:12:14 nowarn/no-autogen PASSED C 0:01.577 - R 0:00.077
23:12:14 nowarn/exception PASSED C 0:01.669 - R 0:00.039
23:12:14 concurrency/channels/churn PASSED C 0:17.118 - R 0:10.159
23:12:14 exceptions/defaults-threads PASSED C 0:09.251 - R 0:00.120
23:12:14 nowarn/zero-thunk PASSED C 0:01.434 - R 0:00.125
23:12:14 generator/fibonacci PASSED C 0:06.844 - R 0:00.037
23:12:14 nowarn/array PASSED C 0:01.788 - R 0:00.040
23:12:14 nowarn/printf-sizeof PASSED C 0:01.738 - R 0:00.042
23:12:14 nowarn/unused PASSED C 0:01.640 - R 0:00.046
23:12:14 operators PASSED C 0:01.501 - R 0:00.070
23:12:14 poly-member PASSED C 0:01.375 - R 0:00.040
23:12:14 genericUnion PASSED C 0:06.792 - R 0:00.021
23:12:14 poly-bare-assn PASSED C 0:01.567 - R 0:00.040
23:12:14 concurrency/waitfor/recurse PASSED C 0:12.744 - R 0:07.662
23:12:14 poly-d-cycle PASSED C 0:01.516 - R 0:00.072
23:12:14 numericConstants PASSED C 0:01.732 - R 0:00.040
23:12:14 generator/suspend_then PASSED C 0:06.882 - R 0:00.038
23:12:14 linking/exception-nothreads PASSED C 0:04.999 - R 0:00.039
23:12:14 exceptions/resume-threads PASSED C 0:09.094 - R 0:00.069
23:12:14 forall PASSED C 0:07.834 - R 0:00.041
23:12:14 poly-many-arsz PASSED C 0:01.756 - R 0:00.037
23:12:14 raii/ctor-autogen-ERR1 PASSED C 0:00.936 - R n/a
23:12:14 exceptions/terminate-threads PASSED C 0:08.929 - R 0:00.123
23:12:14 poly-selection PASSED C 0:01.434 - R 0:00.073
23:12:14 hello PASSED C 0:06.946 - R 0:00.074
23:12:14 include/stdincludes PASSED C 0:06.755 - R 0:00.021
23:12:14 concurrency/channels/ping_pong PASSED C 0:18.130 - R 0:10.072
23:12:14 identity PASSED C 0:06.858 - R 0:00.040
23:12:14 poly-o-cycle PASSED C 0:01.687 - R 0:00.121
23:12:14 concurrency/channels/contend PASSED C 0:18.157 - R 0:10.219
23:12:14 raii/partial-ERR1 PASSED C 0:00.980 - R n/a
23:12:14 poly-self-cycle PASSED C 0:01.710 - R 0:00.036
23:12:14 generator/fmtLines PASSED C 0:07.587 - R 0:00.125
23:12:14 exceptions/virtual-cast PASSED C 0:08.821 - R 0:00.077
23:12:14 typedefRedef-ERR1 PASSED C 0:00.196 - R n/a
23:12:14 concurrency/waituntil/basic_else PASSED C 0:19.484 - R 0:00.037
23:12:14 raii/partial PASSED C 0:01.420 - R 0:00.039
23:12:14 include/vector-fstream PASSED C 0:07.234 - R 0:00.039
23:12:14 var-assert PASSED C 0:00.260 - R n/a
23:12:14 raii/typeof-member PASSED C 0:01.520 - R 0:00.037
23:12:14 quasiKeyword PASSED C 0:02.317 - R 0:00.125
23:12:14 exceptions/fibonacci_nonlocal PASSED C 0:11.207 - R 0:00.127
23:12:14 concurrency/futures/future_except PASSED C 0:29.256 - R 0:00.074
23:12:14 raii/init_once PASSED C 0:02.054 - R 0:00.078
23:12:14 switch PASSED C 0:01.410 - R 0:00.130
23:12:14 io/eofType PASSED C 0:07.714 - R 0:00.127
23:12:14 tuple/tupleCast PASSED C 0:01.481 - R 0:00.059
23:12:14 concurrency/channels/big_elems PASSED C 0:17.078 - R 0:12.738
23:12:14 meta/fork+exec PASSED C 0:04.637 - R 0:00.177
23:12:14 tuple/tupleFunction PASSED C 0:01.750 - R 0:00.026
23:12:14 smart-pointers PASSED C 0:01.995 - R 0:00.076
23:12:14 simpleGenericTriple PASSED C 0:02.078 - R 0:00.069
23:12:14 raii/ctor-autogen PASSED C 0:02.882 - R 0:00.054
23:12:14 result PASSED C 0:02.177 - R 0:00.137
23:12:14 typedefRedef PASSED C 0:01.703 - R 0:00.063
23:12:14 tuple/tuplePolymorphism PASSED C 0:01.962 - R 0:00.059
23:12:14 exceptions/cancel/thread PASSED C 0:12.582 - R 0:00.074
23:12:14 tuple/tupleMember PASSED C 0:02.017 - R 0:00.039
23:12:14 typeof PASSED C 0:01.820 - R 0:00.023
23:12:14 linking/exception-withthreads PASSED C 0:07.168 - R 0:00.081
23:12:14 exceptions/cor_resumer PASSED C 0:12.731 - R 0:00.060
23:12:14 withconflict PASSED C 0:00.840 - R n/a
23:12:14 variableDeclarator PASSED C 0:01.866 - R 0:00.049
23:12:14 linking/mangling/anon PASSED C 0:07.430 - R 0:00.036
23:12:14 function-operator PASSED C 0:10.363 - R 0:00.077
23:12:14 warnings/self-assignment PASSED C 0:01.464 - R 0:00.004
23:12:14 ...collections/dimexpr-match-c-ERRS PASSED C 0:01.048 - R n/a
23:12:14 exceptions/pingpong_nonlocal PASSED C 0:12.883 - R 0:00.125
23:12:14 KRfunctions PASSED C 0:01.502 - R 0:00.005
23:12:14 voidPtr PASSED C 0:01.745 - R 0:00.124
23:12:14 errors/completeType PASSED C 0:00.932 - R n/a
23:12:14 list/dlist-insert-remove PASSED C 0:07.661 - R 0:00.071
23:12:14 raii/memberCtors-ERR1 PASSED C 0:04.692 - R n/a
23:12:14 declarationSpecifier PASSED C 0:01.408 - R 0:00.008
23:12:14 list/dlist2-insert-remove PASSED C 0:07.776 - R 0:00.077
23:12:14 ...llections/dimexpr-match-cfa-ERRS PASSED C 0:02.006 - R n/a
23:12:14 literals PASSED C 0:07.818 - R 0:00.048
23:12:14 linking/io-acquire PASSED C 0:09.150 - R 0:00.023
23:12:14 raii/dtor-early-exit-ERR2 PASSED C 0:05.307 - R n/a
23:12:14 collections/atomic_mpsc PASSED C 0:12.406 - R 0:20.371
23:12:14 raii/dtor-early-exit-ERR1 PASSED C 0:05.481 - R n/a
23:12:14 io/io PASSED C 0:10.792 - R 0:00.071
23:12:14 extension PASSED C 0:01.430 - R 0:00.002
23:12:14 linking/nothreads PASSED C 0:09.247 - R 0:00.071
23:12:14 attributes PASSED C 0:02.432 - R 0:00.002
23:12:14 tuple/tupleVariadic PASSED C 0:04.776 - R 0:00.037
23:12:14 io/manipulatorsOutput4 PASSED C 0:10.296 - R 0:00.071
23:12:14 linking/weakso_nothd PASSED C 0:09.269 - R 0:00.022
23:12:14 gccExtensions PASSED C 0:01.541 - R 0:00.005
23:12:14 io/manipulatorsInput-uchunk PASSED C 0:10.535 - R 0:00.122
23:12:14 meta/arch PASSED C 0:00.839 - R n/a
23:12:14 functions PASSED C 0:01.911 - R 0:00.002
23:12:14 arithmeticConversions PASSED C 0:03.487 - R 0:00.037
23:12:14 zero_one-ERR1 PASSED C 0:03.764 - R n/a
23:12:14 polymorphism PASSED C 0:07.100 - R 0:00.039
23:12:14 raii/globals PASSED C 0:06.838 - R 0:00.039
23:12:14 meta/dumpable PASSED C 0:09.245 - R 0:00.039
23:12:14 raii/boxed-types PASSED C 0:07.153 - R 0:00.124
23:12:14 raii/memberCtors PASSED C 0:06.969 - R 0:00.036
23:12:14 quotedKeyword PASSED C 0:07.449 - R 0:00.037
23:12:14 io/io-acquire-in PASSED C 0:12.198 - R 0:00.169
23:12:14 concurrency/waituntil/one_chan PASSED C 0:13.885 - R 0:10.423
23:12:14 tuplearray PASSED C 0:06.816 - R 0:00.037
23:12:14 malloc PASSED C 0:10.465 - R 0:00.038
23:12:14 concurrency/preempt2 PASSED C 0:12.655 - R 0:21.391
23:12:14 sizeof PASSED C 0:07.358 - R 0:00.035
23:12:14 references PASSED C 0:07.462 - R 0:00.038
23:12:14 io/io-acquire-out PASSED C 0:12.694 - R 0:00.171
23:12:14 strstream PASSED C 0:07.341 - R 0:00.038
23:12:14 shortCircuit PASSED C 0:07.612 - R 0:00.036
23:12:14 linking/withthreads PASSED C 0:11.657 - R 0:00.035
23:12:14 tuple/tupleAssign PASSED C 0:07.731 - R 0:00.037
23:12:14 io/io-acquire2 PASSED C 0:13.540 - R 0:00.375
23:12:14 concurrency/waituntil/channel_close PASSED C 0:17.226 - R 0:10.060
23:12:14 time PASSED C 0:08.475 - R 0:00.040
23:12:14 zero_one PASSED C 0:06.857 - R 0:00.035
23:12:14 vector PASSED C 0:08.277 - R 0:00.038
23:12:14 io/away_fair FAILED with code -6 C 0:14.846 - R 0:00.269
23:12:14starting
23:12:14100
23:12:14200
23:12:14300
23:12:14400
23:12:14500
23:12:14600
23:12:14700
23:12:14800
23:12:14900
23:12:141000
23:12:14done
23:12:14Processor (0xfffff7fb12c0) tearing down ring with 4294967295 entries allocated but not submitted, out of 256
23:12:14Cforall Runtime error (UNIX pid:138368):
23:12:14Stack back trace for: /var/lib/jenkins/workspace/Cforall_master@tmp/libcfa/arm64-debug/src/.libs/libcfa.so.1
23:12:14(0) /var/lib/jenkins/workspace/Cforall_master@tmp/libcfa/arm64-debug/src/.libs/libcfa.so.1 : + 0xef2f8 [0xfffff7e5f2f8]
23:12:14(1) /var/lib/jenkins/workspace/Cforall_master@tmp/libcfa/arm64-debug/src/.libs/libcfa.so.1 : __cabi_abort + 0 [0xfffff7e5eb10]
23:12:14(2) /var/lib/jenkins/workspace/Cforall_master@tmp/libcfa/arm64-debug/src/.libs/libcfa.so.1 : _X4endsFv_S8ofstream__1 + 0x88 [0xfffff7dae888]
23:12:14(3) /var/lib/jenkins/workspace/Cforall_master@tmp/libcfa/arm64-debug/src/.libs/libcfa.so.1 : _X15_operator_bitorQ1_0_0_1__X19basic_ostream_tableKS18basic_ostream_data_BD0__Fv_BD0j__1 + 0x38 [0xfffff7db8e70]
23:12:14(4) /var/lib/jenkins/workspace/Cforall_master@tmp/libcfa/arm64-debug/src/.libs/libcfathread.so.1 : + 0x4b7dc [0xfffff7f3b7dc]
23:12:14(5) /var/lib/jenkins/workspace/Cforall_master@tmp/libcfa/arm64-debug/src/.libs/libcfathread.so.1 : + 0x4a63c [0xfffff7f3a63c]
23:12:14(6) /var/lib/jenkins/workspace/Cforall_master@tmp/libcfa/arm64-debug/src/.libs/libcfathread.so.1 : + 0x4bbd8 [0xfffff7f3bbd8]
23:12:14(7) /var/lib/jenkins/workspace/Cforall_master@tmp/libcfa/arm64-debug/src/.libs/libcfathread.so.1 : + 0x56ebc [0xfffff7f46ebc]
23:12:14(8) /lib/ld-linux-aarch64.so.1 : + 0xf00 [0xfffff7fbef00]
23:12:14(9) /lib/ld-linux-aarch64.so.1 : + 0x4910 [0xfffff7fc2910]
23:12:14(10) /lib/aarch64-linux-gnu/libc.so.6 : + 0x3f228 [0xfffff7aff228]
23:12:1423:12:14warning: Can't open file anon_inode:[io_uring] which was expanded to anon_inode:[io_uring] during file-backed mapping note processing
23:12:14[New LWP 138368]
23:12:14[Thread debugging using libthread_db enabled]
23:12:14Using host libthread_db library "/lib/aarch64-linux-gnu/libthread_db.so.1".
23:12:14Core was generated by `/var/lib/jenkins/workspace/Cforall_master@tmp/tests/io/away_fair'.
23:12:14Program terminated with signal SIGABRT, Aborted.
23:12:14#0 __pthread_kill_implementation (threadid=281474842402240, signo=signo@entry=6, no_tid=no_tid@entry=0) at ./nptl/pthread_kill.c:44
23:12:1423:12:14warning: 44 ./nptl/pthread_kill.c: No such file or directory
23:12:14-----
23:12:14#0 __pthread_kill_implementation (threadid=281474842402240, signo=signo@entry=6, no_tid=no_tid@entry=0) at ./nptl/pthread_kill.c:44
23:12:14#1 0x0000fffff7b47540 in __pthread_kill_internal (signo=6, threadid=<optimized out>) at ./nptl/pthread_kill.c:78
23:12:14#2 0x0000fffff7afcb3c in __GI_raise (sig=sig@entry=6) at ../sysdeps/posix/raise.c:26
23:12:14#3 0x0000fffff7ae7e00 in __GI_abort () at ./stdlib/abort.c:79
23:12:14#4 0x0000fffff7e5f058 in _X7__abortFv_bPKcY17__builtin_va_list__1 (_X11signalAbortb_1=true, _X3fmtPKc_1=0xfffff7e7e760 "Application interrupted by signal: %s.\n", _X4argsY17__builtin_va_list_1=...) at /var/lib/jenkins/workspace/Cforall_master/libcfa/src/interpose.cfa:263
23:12:14#5 0x0000fffff7e5f2f8 in _X5abortFv_bPKc__1 (_X11signalAbortb_1=true, _X3fmtPKc_1=0xfffff7e7e760 "Application interrupted by signal: %s.\n") at /var/lib/jenkins/workspace/Cforall_master/libcfa/src/interpose.cfa:301
23:12:14#6 0x0000fffff7e5f4bc in _X15sigHandler_termFv_iPS21__anonymous_siginfo_tPS10ucontext_t__1 (_X3sigi_1=6, _X3sfpPS21__anonymous_siginfo_t_1=0xfffff7ee1f30 <stack+60832>, _X3cxtPS10ucontext_t_1=0xfffff7ee1fb0 <stack+60960>) at /var/lib/jenkins/workspace/Cforall_master/libcfa/src/interpose.cfa:337
23:12:14#7 <signal handler called>
23:12:14#8 __pthread_kill_implementation (threadid=281474842402240, signo=signo@entry=6, no_tid=no_tid@entry=0) at ./nptl/pthread_kill.c:44
23:12:14#9 0x0000fffff7b47540 in __pthread_kill_internal (signo=6, threadid=<optimized out>) at ./nptl/pthread_kill.c:78
23:12:14#10 0x0000fffff7afcb3c in __GI_raise (sig=sig@entry=6) at ../sysdeps/posix/raise.c:26
23:12:14#11 0x0000fffff7ae7e00 in __GI_abort () at ./stdlib/abort.c:79
23:12:14#12 0x0000fffff7e5f190 in _X7__abortFv_bPKcY17__builtin_va_list__1 (_X11signalAbortb_1=false, _X3fmtPKc_1=0xfffff7e7e4c0 "%s", _X4argsY17__builtin_va_list_1=...) at /var/lib/jenkins/workspace/Cforall_master/libcfa/src/interpose.cfa:286
23:12:14#13 0x0000fffff7e5f2f8 in _X5abortFv_bPKc__1 (_X11signalAbortb_1=false, _X3fmtPKc_1=0xfffff7e7e4c0 "%s") at /var/lib/jenkins/workspace/Cforall_master/libcfa/src/interpose.cfa:301
23:12:14#14 0x0000fffff7e5eb10 in abort () at /var/lib/jenkins/workspace/Cforall_master/libcfa/src/interpose.cfa:176
23:12:14#15 0x0000fffff7dae888 in _X4endsFv_S8ofstream__1 (_X2osS8ofstream_1=0xfffff7ec1368 <_X9abortFileS8ofstream_1>) at /var/lib/jenkins/workspace/Cforall_master/libcfa/src/fstream.cfa:106
23:12:14#16 0x0000fffff7db8e70 in _X15_operator_bitorQ1_0_0_1__X19basic_ostream_tableKS18basic_ostream_data_BD0__Fv_BD0j__1 (_X19basic_ostream_tableKS18basic_ostream_data_Y6ostype__1=0xfffff7ec13d8 <_X19ofstream_basic_dataS18basic_ostream_data_S8ofstream__1>, _X2osY6ostype_1=0xfffff7ec1368 <_X9abortFileS8ofstream_1>, _X1tj_1=256) at /var/lib/jenkins/workspace/Cforall_master/libcfa/src/iostream.cfa:98
23:12:14#17 0x0000fffff7f3b7dc in _X19__io_uring_teardownFv_S11io_context$__1 (_X4thisS11io_context$_1=0xaaaaaaad4b00) at /var/lib/jenkins/workspace/Cforall_master/libcfa/src/concurrency/io/setup.cfa:288
23:12:14#18 0x0000fffff7f3a63c in _X11_destructorFv_S11io_context$__1 (_X4thisS11io_context$_1=0xaaaaaaad4b00) at /var/lib/jenkins/workspace/Cforall_master/libcfa/src/concurrency/io/setup.cfa:125
23:12:14#19 0x0000fffff7f3bbd8 in _X13__cfa_io_stopFv_PS9processor__1 (_X4procPS9processor_1=0xfffff7fb12c0 <_X21storage_mainProcessorA0c_1>) at /var/lib/jenkins/workspace/Cforall_master/libcfa/src/concurrency/io/setup.cfa:313
23:12:14#20 0x0000fffff7f46ebc in _X17__kernel_shutdownFv___1 () at /var/lib/jenkins/workspace/Cforall_master/libcfa/src/concurrency/kernel/startup.cfa:312
23:12:14#21 0x0000fffff7fbef00 in _dl_call_fini (closure_map=closure_map@entry=0xfffff7ff72d0) at ./elf/dl-call_fini.c:43
23:12:14#22 0x0000fffff7fc2910 in _dl_fini () at ./elf/dl-fini.c:114
23:12:14#23 0x0000fffff7aff228 in __run_exit_handlers (status=0, listp=0xfffff7c70670 <__exit_funcs>, run_list_atexit=run_list_atexit@entry=true, run_dtors=run_dtors@entry=true) at ./stdlib/exit.c:108
23:12:14#24 0x0000fffff7aff30c in __GI_exit (status=<optimized out>) at ./stdlib/exit.c:138
23:12:14#25 0x0000fffff7ae84c8 in __libc_start_call_main (main=main@entry=0xaaaaaaaa4e08 <main>, argc=argc@entry=1, argv=argv@entry=0xfffffffff248) at ../sysdeps/nptl/libc_start_call_main.h:74
23:12:14#26 0x0000fffff7ae8598 in __libc_start_main_impl (main=0xaaaaaaaa4e08 <main>, argc=1, argv=0xfffffffff248, init=<optimized out>, fini=<optimized out>, rtld_fini=<optimized out>, stack_end=<optimized out>) at ../csu/libc-start.c:360
23:12:14#27 0x0000aaaaaaaa31f0 in _start ()
23:12:14-----
23:12:14 Id Target Id Frame
23:12:14* 1 Thread 0xfffff7fe9dc0 (LWP 138368) __pthread_kill_implementation (threadid=281474842402240, signo=signo@entry=6, no_tid=no_tid@entry=0) at ./nptl/pthread_kill.c:44
23:12:1423:12:14Archiving io/away_fair (executable and core) to crashes/full-debug/io/away_fair
23:12:14 userLiterals PASSED C 0:08.745 - R 0:00.039
23:12:14 swap PASSED C 0:09.405 - R 0:00.036
23:12:14 io/io-acquire PASSED C 0:14.993 - R 0:00.471
23:12:14 minmax PASSED C 0:12.697 - R 0:00.036
23:12:14 raii/dtor-early-exit PASSED C 0:10.790 - R 0:00.036
23:12:14 sum PASSED C 0:10.288 - R 0:00.035
23:12:14 ...collections/array-md-sbscr-cases PASSED C 0:08.185 - R 0:00.036
23:12:14 io/many_read PASSED C 0:15.988 - R 0:00.069
23:12:14 io/comp_fair PASSED C 0:16.226 - R 0:00.774
23:12:14 searchsort PASSED C 0:11.123 - R 0:00.036
23:12:14 io/comp_basic PASSED C 0:16.590 - R 0:00.620
23:12:14 vector_math/vec2_uint PASSED C 0:09.916 - R 0:00.037
23:12:14 vector_math/vec2_double PASSED C 0:10.403 - R 0:00.036
23:12:14 concurrency/waituntil/futures PASSED C 0:29.748 - R 0:00.068
23:12:14 io/manipulatorsInput PASSED C 0:08.158 - R 0:00.037
23:12:14 ato PASSED C 0:09.860 - R 0:00.036
23:12:14 gmp PASSED C 0:08.485 - R 0:00.067
23:12:14 abs PASSED C 0:10.226 - R 0:00.037
23:12:14 bitmanip1 PASSED C 0:10.430 - R 0:00.117
23:12:14 bitmanip2 PASSED C 0:10.525 - R 0:00.117
23:12:14 random PASSED C 0:08.795 - R 0:00.035
23:12:14 exceptions/cardgame PASSED C 0:10.440 - R 0:00.118
23:12:14 exceptions/hotpotato_checked PASSED C 0:10.624 - R 0:00.068
23:12:14 exceptions/hotpotato PASSED C 0:10.490 - R 0:00.068
23:12:14 bitmanip3 PASSED C 0:11.580 - R 0:00.067
23:12:14 io/manipulatorsOutput2 PASSED C 0:10.091 - R 0:00.035
23:12:14 vector_math/vec3_int PASSED C 0:13.003 - R 0:00.037
23:12:14 include/includes PASSED C 0:21.412 - R 0:00.021
23:12:14 vector_math/vec4_int PASSED C 0:13.144 - R 0:00.037
23:12:14 vector_math/vec2_float PASSED C 0:13.908 - R 0:00.067
23:12:14 vector_math/vec2_int PASSED C 0:13.941 - R 0:00.071
23:12:14 vector_math/vec2_ldouble PASSED C 0:10.708 - R 0:00.036
23:12:14 vector_math/vec3_float PASSED C 0:15.328 - R 0:00.067
23:12:14 mathX PASSED C 0:12.566 - R 0:00.035
23:12:14 math PASSED C 0:12.959 - R 0:00.035
23:12:14 vector_math/vec4_float PASSED C 0:16.209 - R 0:00.069
23:12:14 io/manipulatorsOutput1 PASSED C 0:13.942 - R 0:00.069
23:12:14 io/io-acquire-no-io PASSED C 0:12.178 - R 0:12.010
23:12:14 io/manipulatorsOutput3 PASSED C 0:14.550 - R 0:00.119
23:12:14 ...rrency/examples/boundedBufferEXT PASSED C 0:12.455 - R 0:35.620
23:12:14 PRNG PASSED C 0:15.902 - R 0:02.121
23:12:14 ...rrency/examples/boundedBufferINT PASSED C 0:12.546 - R 0:35.736
23:12:14 heap PASSED C 0:10.335 - R 0:18.437
23:12:14 concurrency/waituntil/repeat_close PASSED C 0:13.670 - R 0:30.154
23:12:14 rational PASSED C 0:27.673 - R 0:00.070
23:12:14 concurrency/waituntil/channels PASSED C 0:14.499 - R 0:32.927
23:12:14 concurrency/unified_locking/mcs PASSED C 0:14.008 - R 0:38.256
23:12:14 ...ency/unified_locking/futex_mutex PASSED C 0:13.852 - R 0:42.661
23:12:14 concurrency/monitor PASSED C 0:12.395 - R 0:49.964
23:12:14 concurrency/actors/dynamic PASSED C 0:18.549 - R 0:44.721
23:12:14 ...ency/waituntil/channel_zero_size PASSED C 0:13.489 - R 0:43.635
23:12:14 concurrency/waituntil/all_types PASSED C 0:34.105 - R 0:27.706
23:12:14 .../unified_locking/spin_queue_lock PASSED C 0:14.224 - R 0:50.739
23:12:14 ...urrency/unified_locking/mcs_spin PASSED C 0:14.364 - R 0:54.462
23:12:14 concurrency/multi-monitor PASSED C 0:12.285 - R 1:08.352
23:12:14 concurrency/waituntil/locks PASSED C 0:15.877 - R 1:07.976
23:12:14 concurrency/unified_locking/locks PASSED C 0:16.156 - R 1:37.563
23:12:14 concurrency/mutexstmt/locks PASSED C 0:12.012 - R 2:21.563
23:12:14374 passes, 1 failures, 0 timeouts, 0 cancelled, 0 other
23:12:14Tests took 2:34.484
23:12:14make: *** [Makefile:986: all-local] Error 1
23:12:14[Pipeline] }
23:12:14[Pipeline] // dir
23:12:14[Pipeline] }
23:12:14[Pipeline] // stage
23:12:14[Pipeline] echo
23:12:14Archiving core dumps
23:12:14[Pipeline] dir
23:12:14Running in /var/lib/jenkins/workspace/Cforall_master@tmp
23:12:14[Pipeline] {
23:12:14[Pipeline] fileExists
23:12:14[Pipeline] sh
23:12:14+ /var/lib/jenkins/workspace/Cforall_master/tools/jenkins/archive-gen.sh
23:12:14[Pipeline] archiveArtifacts
23:12:14Archiving artifacts
23:12:14Recording fingerprints
23:12:14[Pipeline] }
23:12:14[Pipeline] // dir
23:12:14[Pipeline] }
23:12:14[Pipeline] // wrap
23:12:14[Pipeline] }
23:12:14[Pipeline] // node
23:12:14[Pipeline] echo
23:12:14hudson.AbortException: script returned exit code 2
23:12:14[Pipeline] node
23:12:14Running on Algol in /var/lib/jenkins/workspace/Cforall_master
23:12:14[Pipeline] {
23:12:14[Pipeline] echo
23:12:14Notifying users of result
23:12:14[Pipeline] echo
23:12:14Reusing previously constructed message
23:12:14[Pipeline] echo
23:12:14Would send email to: cforall@lists.uwaterloo.ca
23:12:14[Pipeline] echo
23:12:14With title: [cforall git][BUILD# 3850 - FAILURE] - branch master
23:12:14[Pipeline] echo
23:12:14Content:
23:12:14<p>This is an automated email from the Jenkins build machine. It was
23:12:14generated because of a git hooks/post-receive script following
23:12:14a ref change which was pushed to the C∀ repository.</p>
23:12:1423:12:14<p>- Status --------------------------------------------------------------</p>
23:12:1423:12:14<p>BUILD# 3850 - FAILURE</p>
23:12:14<p>Check console output at https://cforall.uwaterloo.ca/jenkins/job/Cforall/job/master/3850/ to view the results.</p>
23:12:1423:12:14<p>- Changes -------------------------------------------------------------</p>
23:12:1423:12:14<pre>
23:12:14The branch master has been updated.
23:12:14 from 262e12b24a19d992dad599c1cc6143374ac571f4 (commit)
23:12:14</pre>
23:12:1423:12:14<p>- Log -----------------------------------------------------------------</p>
23:12:1423:12:14<pre>
23:12:1423:12:14</pre>
23:12:1423:12:14<p>-----------------------------------------------------------------------</p>
23:12:14<pre>
23:12:14Summary of changes:
23:12:1423:12:14</pre>
23:12:1423:12:14[Pipeline] }
23:12:14[Pipeline] // node
23:12:14[Pipeline] echo
23:12:14Build Completed
23:12:14[Pipeline] End of Pipeline
23:12:14ERROR: script returned exit code 2
23:12:14Finished: FAILURE
[Pipeline] error
[Pipeline] }
23:12:14Failed in branch gcc_10_arm64_new
23:15:26Build Cforall » master #3844 completed: SUCCESS
[Pipeline] echo
23:15:26SUCCESS
[Pipeline] }
23:29:10Build Cforall » master #3849 completed: SUCCESS
[Pipeline] echo
23:29:10SUCCESS
[Pipeline] }
[Pipeline] // parallel
[Pipeline] }
[Pipeline] // stage
[Pipeline] }
[Pipeline] // wrap
[Pipeline] echo
error caught
[Pipeline] node
Running on Brokk 4 in /var/lib/jenkins/workspace/Cforall_Full_Build
[Pipeline] {
[Pipeline] echo
notifying users
[Pipeline] emailext
Sending email to: cforall@lists.uwaterloo.ca
[Pipeline] }
[Pipeline] // node
[Pipeline] }
[Pipeline] // node
[Pipeline] End of Pipeline
ERROR: FAILURE
Finished: FAILURE