Started by timer
Running as Jenkins Build User
Obtained Jenkins/FullBuild from git cforall@plg.uwaterloo.ca:software/cfa/cfa-cc
[Pipeline] Start of Pipeline
[Pipeline] node
Running on Brokk 3 in /var/lib/jenkins/workspace/Cforall_Full_Build
[Pipeline] {
[Pipeline] checkout
The recommended git tool is: NONE
using credential git_key_aug2025
Fetching changes from the remote Git repository
> git rev-parse --resolve-git-dir /var/lib/jenkins/workspace/Cforall_Full_Build/.git # timeout=10
> git config remote.origin.url cforall@plg.uwaterloo.ca:software/cfa/cfa-cc # timeout=10
Fetching upstream changes from cforall@plg.uwaterloo.ca:software/cfa/cfa-cc
> git --version # timeout=10
> git --version # 'git version 2.43.0'
using GIT_SSH to set credentials Git key use to connect to the cforall git repo (August 2025)
Verifying host key using known hosts file
> git fetch --tags --force --progress -- cforall@plg.uwaterloo.ca:software/cfa/cfa-cc +refs/heads/*:refs/remotes/origin/* # timeout=10
Checking out Revision 262e12b24a19d992dad599c1cc6143374ac571f4 (refs/remotes/origin/master)
Commit message: "allow making print version without editing source"
> git rev-parse refs/remotes/origin/master^{commit} # timeout=10
> git config core.sparsecheckout # timeout=10
> git checkout -f 262e12b24a19d992dad599c1cc6143374ac571f4 # timeout=10
> git rev-list --no-walk 262e12b24a19d992dad599c1cc6143374ac571f4 # timeout=10
[Pipeline] wrap
[Pipeline] {
[Pipeline] stage
[Pipeline] { (Build)
[Pipeline] parallel
[Pipeline] { (Branch: gcc_10_x86_new)
[Pipeline] { (Branch: gcc_11_x86_new)
[Pipeline] { (Branch: gcc_12_x86_new)
[Pipeline] { (Branch: gcc_9_x64_new)
[Pipeline] { (Branch: gcc_10_x64_new)
[Pipeline] { (Branch: gcc_11_x64_new)
[Pipeline] { (Branch: gcc_12_x64_new)
[Pipeline] { (Branch: gcc_10_arm64_new)
[Pipeline] { (Branch: gcc_11_arm64_new)
[Pipeline] { (Branch: gcc_12_arm64_new)
[Pipeline] { (Branch: clang_x64_new)
[Pipeline] sleep
Sleeping for 4 min 0 sec
[Pipeline] sleep
Sleeping for 2 min 0 sec
[Pipeline] sleep
No need to sleep any longer
[Pipeline] sleep
No need to sleep any longer
[Pipeline] sleep
Sleeping for 1 min 0 sec
[Pipeline] sleep
Sleeping for 2 min 0 sec
[Pipeline] sleep
No need to sleep any longer
[Pipeline] sleep
Sleeping for 4 min 0 sec
[Pipeline] sleep
Sleeping for 2 min 0 sec
[Pipeline] sleep
Sleeping for 2 min 0 sec
[Pipeline] sleep
Sleeping for 3 min 0 sec
[Pipeline] build
Scheduling project: Cforall » master
[Pipeline] build
Scheduling project: Cforall » master
[Pipeline] build
Scheduling project: Cforall » master
Starting building: Cforall » master #3842
Starting building: Cforall » master #3841
Starting building: Cforall » master #3840
[Pipeline] build
Scheduling project: Cforall » master
Starting building: Cforall » master #3843
[Pipeline] build
Scheduling project: Cforall » master
[Pipeline] build
Scheduling project: Cforall » master
[Pipeline] build
Scheduling project: Cforall » master
[Pipeline] build
Scheduling project: Cforall » master
Starting building: Cforall » master #3847
Starting building: Cforall » master #3846
Starting building: Cforall » master #3844
Starting building: Cforall » master #3845
[Pipeline] build
Scheduling project: Cforall » master
Starting building: Cforall » master #3848
[Pipeline] build
Scheduling project: Cforall » master
[Pipeline] build
Scheduling project: Cforall » master
Starting building: Cforall » master #3849
Starting building: Cforall » master #3850
Build Cforall » master #3847 completed: SUCCESS
[Pipeline] echo
SUCCESS
[Pipeline] }
Build Cforall » master #3842 completed: SUCCESS
[Pipeline] echo
SUCCESS
[Pipeline] }
Build Cforall » master #3841 completed: SUCCESS
[Pipeline] echo
SUCCESS
[Pipeline] }
Build Cforall » master #3843 completed: SUCCESS
[Pipeline] echo
SUCCESS
[Pipeline] }
Build Cforall » master #3840 completed: SUCCESS
[Pipeline] echo
SUCCESS
[Pipeline] }
Build Cforall » master #3845 completed: SUCCESS
[Pipeline] echo
SUCCESS
[Pipeline] }
Build Cforall » master #3848 completed: SUCCESS
[Pipeline] echo
SUCCESS
[Pipeline] }
Build Cforall » master #3846 completed: SUCCESS
[Pipeline] echo
SUCCESS
[Pipeline] }
Build Cforall » master #3850 completed: FAILURE
[Pipeline] echo
FAILURE
[Pipeline] sh
+ wget -q -O - https://cforall.uwaterloo.ca/jenkins/job/Cforall/job/master/3850/consoleText
Started by upstream project "Cforall_Full_Build" build number 429
originally caused by:
Started by timer
Running as Jenkins Build User
> git rev-parse --resolve-git-dir /var/lib/jenkins/caches/git-914b6fdde163b7e17ee75d99ca23f18a/.git # timeout=10
Setting origin to cforall@plg.uwaterloo.ca:software/cfa/cfa-cc
> git config remote.origin.url cforall@plg.uwaterloo.ca:software/cfa/cfa-cc # timeout=10
Fetching origin...
Fetching upstream changes from origin
> git --version # timeout=10
> git --version # 'git version 2.43.0'
> git config --get remote.origin.url # timeout=10
using GIT_SSH to set credentials Git key use to connect to the cforall git repo (August 2025)
Verifying host key using known hosts file
> git fetch --no-tags --force --progress -- origin +refs/heads/*:refs/remotes/origin/* # timeout=10
Seen branch in repository origin/ADT
Seen branch in repository origin/aaron-thesis
Seen branch in repository origin/arm-eh
Seen branch in repository origin/ast-experimental
Seen branch in repository origin/cleanup-dtors
Seen branch in repository origin/ctor
Seen branch in repository origin/deferred_resn
Seen branch in repository origin/demangler
Seen branch in repository origin/enum
Seen branch in repository origin/forall-pointer-decay
Seen branch in repository origin/gc_noraii
Seen branch in repository origin/jacob/cs343-translation
Seen branch in repository origin/jenkins-sandbox
Seen branch in repository origin/master
Seen branch in repository origin/memory
Seen branch in repository origin/new-ast
Seen branch in repository origin/new-ast-unique-expr
Seen branch in repository origin/new-env
Seen branch in repository origin/no_list
Seen branch in repository origin/persistent-indexer
Seen branch in repository origin/pthread-emulation
Seen branch in repository origin/qualifiedEnum
Seen branch in repository origin/resolv-new
Seen branch in repository origin/string
Seen branch in repository origin/stuck-waitfor-destruct
Seen branch in repository origin/with_gc
Seen 26 remote branches
Obtained Jenkinsfile from 262e12b24a19d992dad599c1cc6143374ac571f4
[Pipeline] Start of Pipeline
[Pipeline] node
Running on Brokk 4 in /var/lib/jenkins/workspace/Cforall_master
[Pipeline] {
[Pipeline] wrap
[Pipeline] {
[Pipeline] properties
WARNING: Unknown parameter(s) found for class type 'hudson.model.ChoiceParameterDefinition': defaultValue
WARNING: Unknown parameter(s) found for class type 'hudson.model.ChoiceParameterDefinition': defaultValue
[Pipeline] checkout
The recommended git tool is: NONE
using credential git_key_aug2025
Fetching changes from the remote Git repository
Cleaning workspace
Fetching without tags
> git rev-parse --resolve-git-dir /var/lib/jenkins/workspace/Cforall_master/.git # timeout=10
> git config remote.origin.url cforall@plg.uwaterloo.ca:software/cfa/cfa-cc # timeout=10
> git rev-parse --verify HEAD # timeout=10
Resetting working tree
> git reset --hard # timeout=10
> git clean -fdx # timeout=10
Fetching upstream changes from cforall@plg.uwaterloo.ca:software/cfa/cfa-cc
> git --version # timeout=10
> git --version # 'git version 2.43.0'
using GIT_SSH to set credentials Git key use to connect to the cforall git repo (August 2025)
Verifying host key using known hosts file
> git fetch --no-tags --force --progress -- cforall@plg.uwaterloo.ca:software/cfa/cfa-cc +refs/heads/*:refs/remotes/origin/* # timeout=10
Checking out Revision 262e12b24a19d992dad599c1cc6143374ac571f4 (master)
Commit message: "allow making print version without editing source"
[Pipeline] load
[Pipeline] { (Jenkins/tools.groovy)
[Pipeline] }
[Pipeline] // load
[Pipeline] echo
Compiler : gcc-10 (g++-10/gcc-10)
Architecture : arm64
Arc Flags : --host=aarch64
Run All Tests : true
Run Benchmark : true
Build Documentation : false
Publish : true
Silent : true
[Pipeline] }
[Pipeline] // wrap
[Pipeline] }
[Pipeline] // node
[Pipeline] node
> git config core.sparsecheckout # timeout=10
> git checkout -f 262e12b24a19d992dad599c1cc6143374ac571f4 # timeout=10
> git rev-list --no-walk 262e12b24a19d992dad599c1cc6143374ac571f4 # timeout=10
Still waiting to schedule task
Waiting for next available executor on ‘Algol’
Running on Algol in /var/lib/jenkins/workspace/Cforall_master
[Pipeline] {
[Pipeline] wrap
[Pipeline] {
[Pipeline] pwd
[Pipeline] pwd
[Pipeline] echo
-------- Cleanup --------
[Pipeline] stage
[Pipeline] { (Cleanup)
[Pipeline] dir
Running in /var/lib/jenkins/workspace/Cforall_master@tmp
[Pipeline] {
[Pipeline] deleteDir
[Pipeline] }
[Pipeline] // dir
[Pipeline] }
[Pipeline] // stage
[Pipeline] echo
-------- Checkout --------
[Pipeline] stage
[Pipeline] { (Checkout)
[Pipeline] checkout
The recommended git tool is: NONE
using credential git_key_aug2025
Fetching changes from the remote Git repository
Cleaning workspace
Fetching without tags
> git rev-parse --resolve-git-dir /var/lib/jenkins/workspace/Cforall_master/.git # timeout=10
> git config remote.origin.url cforall@plg.uwaterloo.ca:software/cfa/cfa-cc # timeout=10
> git rev-parse --verify HEAD # timeout=10
Resetting working tree
> git reset --hard # timeout=10
> git clean -fdx # timeout=10
Fetching upstream changes from cforall@plg.uwaterloo.ca:software/cfa/cfa-cc
> git --version # timeout=10
> git --version # 'git version 2.43.0'
using GIT_SSH to set credentials Git key use to connect to the cforall git repo (August 2025)
Verifying host key using known hosts file
> git fetch --no-tags --force --progress -- cforall@plg.uwaterloo.ca:software/cfa/cfa-cc +refs/heads/*:refs/remotes/origin/* # timeout=10
Checking out Revision 262e12b24a19d992dad599c1cc6143374ac571f4 (master)
Commit message: "allow making print version without editing source"
[Pipeline] echo
Constructing new git message
[Pipeline] sh
+ git rev-list 262e12b24a19d992dad599c1cc6143374ac571f4..262e12b24a19d992dad599c1cc6143374ac571f4
[Pipeline] sh
> git config core.sparsecheckout # timeout=10
> git checkout -f 262e12b24a19d992dad599c1cc6143374ac571f4 # timeout=10
+ git cat-file -t 262e12b24a19d992dad599c1cc6143374ac571f4
[Pipeline] sh
+ git rev-list --format=short 262e12b24a19d992dad599c1cc6143374ac571f4...262e12b24a19d992dad599c1cc6143374ac571f4
[Pipeline] sh
+ git diff --stat --color 262e12b24a19d992dad599c1cc6143374ac571f4 262e12b24a19d992dad599c1cc6143374ac571f4
[Pipeline] echo
- Changes -------------------------------------------------------------
The branch master has been updated.
from 262e12b24a19d992dad599c1cc6143374ac571f4 (commit)
- Log -----------------------------------------------------------------
-----------------------------------------------------------------------
Summary of changes:
[Pipeline] }
[Pipeline] // stage
[Pipeline] echo
-------- Build : configure --------
[Pipeline] stage
[Pipeline] { (Build : configure)
[Pipeline] dir
Running in /var/lib/jenkins/workspace/Cforall_master
[Pipeline] {
[Pipeline] sh
+ ./autogen.sh
Running aclocal in root
Running libtoolize in root
libtoolize: putting auxiliary files in AC_CONFIG_AUX_DIR, 'automake'.
libtoolize: linking file 'automake/ltmain.sh'
libtoolize: putting macros in AC_CONFIG_MACRO_DIRS, 'automake'.
libtoolize: linking file 'automake/libtool.m4'
libtoolize: linking file 'automake/ltoptions.m4'
libtoolize: linking file 'automake/ltsugar.m4'
libtoolize: linking file 'automake/ltversion.m4'
libtoolize: linking file 'automake/lt~obsolete.m4'
Running autoconf in root
Running automake in root
configure.ac:223: installing 'automake/compile'
configure.ac:138: installing 'automake/config.guess'
configure.ac:138: installing 'automake/config.sub'
configure.ac:17: installing 'automake/install-sh'
benchmark/Makefile.am: installing 'automake/depcomp'
parallel-tests: installing 'automake/test-driver'
configure.ac: installing 'automake/ylwrap'
Running aclocal in libcfa
Running libtoolize in libcfa
libtoolize: putting auxiliary files in AC_CONFIG_AUX_DIR, 'automake'.
libtoolize: linking file 'automake/ltmain.sh'
libtoolize: putting macros in AC_CONFIG_MACRO_DIRS, 'automake'.
libtoolize: linking file 'automake/libtool.m4'
libtoolize: linking file 'automake/ltoptions.m4'
libtoolize: linking file 'automake/ltsugar.m4'
libtoolize: linking file 'automake/ltversion.m4'
libtoolize: linking file 'automake/lt~obsolete.m4'
Running autoconf in libcfa
Running automake in libcfa
configure.ac:119: installing 'automake/compile'
configure.ac:119: installing 'automake/config.guess'
configure.ac:119: installing 'automake/config.sub'
configure.ac:12: installing 'automake/install-sh'
src/Makefile.am: installing 'automake/depcomp'
[Pipeline] }
[Pipeline] // dir
[Pipeline] dir
Running in /var/lib/jenkins/workspace/Cforall_master@tmp
[Pipeline] {
[Pipeline] sh
+ /var/lib/jenkins/workspace/Cforall_master/configure CXX=g++-10 CC=gcc-10 --host=aarch64 AR=gcc-ar RANLIB=gcc-ranlib --with-target-hosts=host:debug,host:nodebug --quiet --prefix=/var/lib/jenkins/workspace/Cforall_master@tmp
[Pipeline] sh
+ nproc
+ make -j 96 --no-print-directory configure-libcfa
libcfa/arm64-debug/config.data
Configuring libcfa (/var/lib/jenkins/workspace/Cforall_master/libcfa/configure) with ''CXX=g++-10' 'CC=gcc-10' 'AR=gcc-ar' 'RANLIB=gcc-ranlib' '--prefix=/var/lib/jenkins/workspace/Cforall_master@tmp' DRIVER_DIR=/var/lib/jenkins/workspace/Cforall_master@tmp/driver/ ARCHITECTURE=arm64 CONFIGURATION=debug CFA_VERSION=1:0:0' from /var/lib/jenkins/workspace/Cforall_master@tmp / libcfa/arm64-debug/
libcfa/arm64-nodebug/config.data
Configuring libcfa (/var/lib/jenkins/workspace/Cforall_master/libcfa/configure) with ''CXX=g++-10' 'CC=gcc-10' 'AR=gcc-ar' 'RANLIB=gcc-ranlib' '--prefix=/var/lib/jenkins/workspace/Cforall_master@tmp' DRIVER_DIR=/var/lib/jenkins/workspace/Cforall_master@tmp/driver/ ARCHITECTURE=arm64 CONFIGURATION=nodebug CFA_VERSION=1:0:0' from /var/lib/jenkins/workspace/Cforall_master@tmp / libcfa/arm64-nodebug/
checking whether make supports nested variables... checking whether make supports nested variables... yes
checking for a BSD-compatible install... yes
checking for a BSD-compatible install... /usr/bin/install -c
checking whether build environment is sane... /usr/bin/install -c
checking whether build environment is sane... yes
yes
checking for a race-free mkdir -p... checking for a race-free mkdir -p... /usr/bin/mkdir -p
checking for gawk... /usr/bin/mkdir -p
gawk
checking whether make sets $(MAKE)... checking for gawk... gawk
checking whether make sets $(MAKE)... yes
yes
checking for distributated build... no
checking for distributated build... no
checking build system type... checking build system type... aarch64-unknown-linux-gnu
checking host system type... aarch64-unknown-linux-gnu
checking how to print strings... aarch64-unknown-linux-gnu
checking host system type... aarch64-unknown-linux-gnu
checking how to print strings... printf
checking whether make supports the include directive... printf
checking whether make supports the include directive... yes (GNU style)
checking for gcc... gcc-10
yes (GNU style)
checking for gcc... gcc-10
checking whether the C compiler works... checking whether the C compiler works... yes
checking for C compiler default output file name... a.out
checking for suffix of executables... yes
checking for C compiler default output file name... a.out
checking for suffix of executables...
checking whether we are cross compiling... checking whether we are cross compiling... no
no
checking for suffix of object files... checking for suffix of object files... o
checking whether the compiler supports GNU C... o
checking whether the compiler supports GNU C... yes
checking whether gcc-10 accepts -g... yes
checking whether gcc-10 accepts -g... yes
checking for gcc-10 option to enable C11 features... yes
checking for gcc-10 option to enable C11 features... none needed
checking whether gcc-10 understands -c and -o together... none needed
checking whether gcc-10 understands -c and -o together... yes
checking dependency style of gcc-10... yes
checking dependency style of gcc-10... gcc3
checking for a sed that does not truncate output... /usr/bin/sed
checking for grep that handles long lines and -e... /usr/bin/grep
checking for egrep... gcc3
checking for a sed that does not truncate output... /usr/bin/grep -E
checking for fgrep... /usr/bin/grep -F
checking for ld used by gcc-10... /usr/bin/sed
checking for grep that handles long lines and -e... /usr/bin/grep
checking for egrep... /usr/bin/ld
checking if the linker (/usr/bin/ld) is GNU ld... /usr/bin/grep -E
checking for fgrep... yes
checking for BSD- or MS-compatible name lister (nm)... /usr/bin/grep -F
checking for ld used by gcc-10... /usr/bin/nm -B
checking the name lister (/usr/bin/nm -B) interface... /usr/bin/ld
checking if the linker (/usr/bin/ld) is GNU ld... yes
checking for BSD- or MS-compatible name lister (nm)... /usr/bin/nm -B
checking the name lister (/usr/bin/nm -B) interface... BSD nm
checking whether ln -s works... yes
checking the maximum length of command line arguments... 1572864
checking how to convert aarch64-unknown-linux-gnu file names to aarch64-unknown-linux-gnu format... func_convert_file_noop
checking how to convert aarch64-unknown-linux-gnu file names to toolchain format... func_convert_file_noop
checking for /usr/bin/ld option to reload object files... -r
checking for file... file
checking for objdump... BSD nm
checking whether ln -s works... yes
checking the maximum length of command line arguments... objdump
checking how to recognize dependent libraries... pass_all
checking for dlltool... no
checking how to associate runtime and link libraries... printf %s\n
checking for archiver @FILE support... 1572864
checking how to convert aarch64-unknown-linux-gnu file names to aarch64-unknown-linux-gnu format... func_convert_file_noop
checking how to convert aarch64-unknown-linux-gnu file names to toolchain format... func_convert_file_noop
checking for /usr/bin/ld option to reload object files... -r
checking for file... file
checking for objdump... objdump
checking how to recognize dependent libraries... pass_all
checking for dlltool... no
checking how to associate runtime and link libraries... printf %s\n
checking for archiver @FILE support... @
checking for strip... strip
checking for ranlib... gcc-ranlib
checking command to parse /usr/bin/nm -B output from gcc-10 object... @
checking for strip... strip
checking for ranlib... gcc-ranlib
checking command to parse /usr/bin/nm -B output from gcc-10 object... ok
checking for sysroot... no
checking for a working dd... /usr/bin/dd
checking how to truncate binary pipes... /usr/bin/dd bs=4096 count=1
ok
checking for mt... mt
checking if mt is a manifest tool... checking for sysroot... no
checking for a working dd... no
/usr/bin/dd
checking how to truncate binary pipes... checking for stdio.h... /usr/bin/dd bs=4096 count=1
checking for mt... mt
checking if mt is a manifest tool... no
checking for stdio.h... yes
checking for stdlib.h... yes
checking for stdlib.h... yes
checking for string.h... yes
checking for string.h... yes
checking for inttypes.h... yes
checking for inttypes.h... yes
checking for stdint.h... yes
checking for stdint.h... yes
checking for strings.h... yes
checking for strings.h... yes
checking for sys/stat.h... yes
checking for sys/stat.h... yes
checking for sys/types.h... yes
checking for sys/types.h... yes
checking for unistd.h... yes
checking for unistd.h... yes
checking for dlfcn.h... yes
checking for dlfcn.h... yes
checking for objdir... .libs
yes
checking for objdir... .libs
checking if gcc-10 supports -fno-rtti -fno-exceptions... checking if gcc-10 supports -fno-rtti -fno-exceptions... no
checking for gcc-10 option to produce PIC... -fPIC -DPIC
checking if gcc-10 PIC flag -fPIC -DPIC works... no
checking for gcc-10 option to produce PIC... -fPIC -DPIC
checking if gcc-10 PIC flag -fPIC -DPIC works... yes
checking if gcc-10 static flag -static works... yes
checking if gcc-10 static flag -static works... yes
checking if gcc-10 supports -c -o file.o... yes
checking if gcc-10 supports -c -o file.o... yes
checking if gcc-10 supports -c -o file.o... (cached) yes
checking whether the gcc-10 linker (/usr/bin/ld) supports shared libraries... yes
checking if gcc-10 supports -c -o file.o... (cached) yes
checking whether the gcc-10 linker (/usr/bin/ld) supports shared libraries... yes
checking whether -lc should be explicitly linked in... yes
checking whether -lc should be explicitly linked in... no
checking dynamic linker characteristics... no
checking dynamic linker characteristics... GNU/Linux ld.so
checking how to hardcode library paths into programs... immediate
checking whether stripping libraries is possible... yes
checking if libtool supports shared libraries... yes
checking whether to build shared libraries... yes
checking whether to build static libraries... no
GNU/Linux ld.so
checking how to hardcode library paths into programs... immediate
checking whether stripping libraries is possible... yes
checking if libtool supports shared libraries... yes
checking whether to build shared libraries... yes
checking whether to build static libraries... no
checking whether the compiler supports GNU C++... checking whether the compiler supports GNU C++... yes
checking whether g++-10 accepts -g... yes
checking whether g++-10 accepts -g... yes
checking for g++-10 option to enable C++11 features... yes
checking for g++-10 option to enable C++11 features... none needed
checking dependency style of g++-10... none needed
checking dependency style of g++-10... gcc3
checking how to run the C++ preprocessor... gcc3
checking how to run the C++ preprocessor... g++-10 -E
g++-10 -E
checking for ld used by g++-10... checking for ld used by g++-10... /usr/bin/ld
checking if the linker (/usr/bin/ld) is GNU ld... /usr/bin/ld
checking if the linker (/usr/bin/ld) is GNU ld... yes
yes
checking whether the g++-10 linker (/usr/bin/ld) supports shared libraries... checking whether the g++-10 linker (/usr/bin/ld) supports shared libraries... yes
yes
checking for g++-10 option to produce PIC... -fPIC -DPIC
checking if g++-10 PIC flag -fPIC -DPIC works... checking for g++-10 option to produce PIC... -fPIC -DPIC
checking if g++-10 PIC flag -fPIC -DPIC works... yes
checking if g++-10 static flag -static works... yes
checking if g++-10 static flag -static works... yes
checking if g++-10 supports -c -o file.o... yes
checking if g++-10 supports -c -o file.o... yes
checking if g++-10 supports -c -o file.o... (cached) yes
checking whether the g++-10 linker (/usr/bin/ld) supports shared libraries... yes
checking dynamic linker characteristics... (cached) GNU/Linux ld.so
checking how to hardcode library paths into programs... immediate
checking for gcc... (cached) gcc-10
yes
checking if g++-10 supports -c -o file.o... (cached) yes
checking whether the g++-10 linker (/usr/bin/ld) supports shared libraries... yes
checking dynamic linker characteristics... (cached) GNU/Linux ld.so
checking how to hardcode library paths into programs... immediate
checking for gcc... (cached) gcc-10
checking whether the compiler supports GNU C... (cached) yes
checking whether gcc-10 accepts -g... (cached) yes
checking for gcc-10 option to enable C11 features... (cached) none needed
checking whether gcc-10 understands -c and -o together... (cached) yes
checking dependency style of gcc-10... (cached) gcc3
checking dependency style of gcc-10... checking whether the compiler supports GNU C... (cached) yes
checking whether gcc-10 accepts -g... (cached) yes
checking for gcc-10 option to enable C11 features... (cached) none needed
checking whether gcc-10 understands -c and -o together... (cached) yes
checking dependency style of gcc-10... (cached) gcc3
checking dependency style of gcc-10... gcc3
checking whether make sets $(MAKE)... (cached) yes
checking for linux/rseq.h... gcc3
checking whether make sets $(MAKE)... (cached) yes
checking for linux/rseq.h... yes
checking for rseq_available in -lrseq... yes
checking for rseq_available in -lrseq... no
checking for gcc-10 options needed to detect all undeclared functions... no
checking for gcc-10 options needed to detect all undeclared functions... none needed
checking for linux/io_uring.h... none needed
checking for linux/io_uring.h... yes
checking for liburing.h... yes
checking for liburing.h... no
checking whether IORING_OP_NOP is declared... no
checking whether IORING_OP_NOP is declared... yes
checking whether IORING_OP_READV is declared... yes
checking whether IORING_OP_READV is declared... yes
checking whether IORING_OP_WRITEV is declared... yes
checking whether IORING_OP_WRITEV is declared... yes
checking whether IORING_OP_FSYNC is declared... yes
checking whether IORING_OP_FSYNC is declared... yes
checking whether IORING_OP_READ_FIXED is declared... yes
checking whether IORING_OP_READ_FIXED is declared... yes
checking whether IORING_OP_WRITE_FIXED is declared... yes
checking whether IORING_OP_WRITE_FIXED is declared... yes
checking whether IORING_OP_POLL_ADD is declared... yes
checking whether IORING_OP_POLL_ADD is declared... yes
checking whether IORING_OP_POLL_REMOVE is declared... yes
checking whether IORING_OP_POLL_REMOVE is declared... yes
checking whether IORING_OP_SYNC_FILE_RANGE is declared... yes
checking whether IORING_OP_SYNC_FILE_RANGE is declared... yes
checking whether IORING_OP_SENDMSG is declared... yes
checking whether IORING_OP_SENDMSG is declared... yes
checking whether IORING_OP_RECVMSG is declared... yes
checking whether IORING_OP_RECVMSG is declared... yes
checking whether IORING_OP_TIMEOUT is declared... yes
checking whether IORING_OP_TIMEOUT is declared... yes
checking whether IORING_OP_TIMEOUT_REMOVE is declared... yes
checking whether IORING_OP_TIMEOUT_REMOVE is declared... yes
checking whether IORING_OP_ACCEPT is declared... yes
checking whether IORING_OP_ACCEPT is declared... yes
checking whether IORING_OP_ASYNC_CANCEL is declared... yes
checking whether IORING_OP_ASYNC_CANCEL is declared... yes
checking whether IORING_OP_LINK_TIMEOUT is declared... yes
checking whether IORING_OP_LINK_TIMEOUT is declared... yes
checking whether IORING_OP_CONNECT is declared... yes
checking whether IORING_OP_CONNECT is declared... yes
checking whether IORING_OP_FALLOCATE is declared... yes
checking whether IORING_OP_FALLOCATE is declared... yes
checking whether IORING_OP_OPENAT is declared... yes
checking whether IORING_OP_OPENAT is declared... yes
checking whether IORING_OP_CLOSE is declared... yes
checking whether IORING_OP_CLOSE is declared... yes
checking whether IORING_OP_FILES_UPDATE is declared... yes
checking whether IORING_OP_FILES_UPDATE is declared... yes
checking whether IORING_OP_STATX is declared... yes
checking whether IORING_OP_STATX is declared... yes
checking whether IORING_OP_READ is declared... yes
checking whether IORING_OP_READ is declared... yes
checking whether IORING_OP_WRITE is declared... yes
checking whether IORING_OP_WRITE is declared... yes
checking whether IORING_OP_FADVISE is declared... yes
checking whether IORING_OP_FADVISE is declared... yes
checking whether IORING_OP_MADVISE is declared... yes
checking whether IORING_OP_MADVISE is declared... yes
checking whether IORING_OP_SEND is declared... yes
checking whether IORING_OP_SEND is declared... yes
checking whether IORING_OP_RECV is declared... yes
checking whether IORING_OP_RECV is declared... yes
checking whether IORING_OP_OPENAT2 is declared... yes
checking whether IORING_OP_OPENAT2 is declared... yes
checking whether IORING_OP_EPOLL_CTL is declared... yes
checking whether IORING_OP_EPOLL_CTL is declared... yes
checking whether IORING_OP_SPLICE is declared... yes
checking whether IORING_OP_SPLICE is declared... yes
checking whether IORING_OP_PROVIDE_BUFFERS is declared... yes
checking whether IORING_OP_PROVIDE_BUFFERS is declared... yes
checking whether IORING_OP_REMOVE_BUFFER is declared... yes
checking whether IORING_OP_REMOVE_BUFFER is declared... no
checking whether IORING_OP_TEE is declared... no
checking whether IORING_OP_TEE is declared... yes
checking whether IOSQE_FIXED_FILE is declared... yes
checking whether IOSQE_FIXED_FILE is declared... yes
checking whether IOSQE_IO_DRAIN is declared... yes
checking whether IOSQE_IO_DRAIN is declared... yes
checking whether IOSQE_IO_LINK is declared... yes
checking whether IOSQE_IO_LINK is declared... yes
checking whether IOSQE_IO_HARDLINK is declared... yes
checking whether IOSQE_IO_HARDLINK is declared... yes
checking whether IOSQE_ASYNC is declared... yes
checking whether IOSQE_ASYNC is declared... yes
checking whether IOSQE_BUFFER_SELECT is declared... yes
checking whether IOSQE_BUFFER_SELECT is declared... yes
checking whether SPLICE_F_FD_IN_FIXED is declared... yes
checking whether SPLICE_F_FD_IN_FIXED is declared... yes
checking whether IORING_SETUP_ATTACH_WQ is declared... yes
checking whether IORING_SETUP_ATTACH_WQ is declared... yes
checking whether IORING_REGISTER_IOWQ_MAX_WORKERS is declared... yes
checking whether IORING_REGISTER_IOWQ_MAX_WORKERS is declared... yes
checking for preadv2... yes
checking for preadv2... yes
checking for pwritev2... yes
checking for pwritev2... yes
yes
checking that generated files are newer than configure... done
configure: creating ./config.status
checking that generated files are newer than configure... done
configure: creating ./config.status
config.status: creating Makefile
config.status: creating src/Makefile
config.status: creating Makefile
config.status: creating prelude/Makefile
config.status: creating src/Makefile
config.status: creating src/concurrency/io/call.cfa
config.status: creating prelude/Makefile
config.status: creating src/concurrency/io/call.cfa
/var/lib/jenkins/workspace/Cforall_master/libcfa/src/concurrency/io/call.cfa.in:144: SyntaxWarning: invalid escape sequence '\('
sig = re.search("(.*) (.*)\((.*)\)", signature)
config.status: creating prelude/defines.hfa
/var/lib/jenkins/workspace/Cforall_master/libcfa/src/concurrency/io/call.cfa.in:144: SyntaxWarning: invalid escape sequence '\('
sig = re.search("(.*) (.*)\((.*)\)", signature)
config.status: executing depfiles commands
config.status: creating prelude/defines.hfa
config.status: executing depfiles commands
config.status: executing libtool commands
Cforall library configuraton completed. Type "make -j 8 install".
config.status: executing libtool commands
Cforall library configuraton completed. Type "make -j 8 install".
[Pipeline] }
[Pipeline] // dir
[Pipeline] }
[Pipeline] // stage
[Pipeline] echo
-------- Build : cfa-cpp --------
[Pipeline] stage
[Pipeline] { (Build : cfa-cpp)
[Pipeline] dir
Running in /var/lib/jenkins/workspace/Cforall_master@tmp
[Pipeline] {
[Pipeline] sh
+ nproc
+ make -j 96 --no-print-directory -C driver
CXX as.o
CXX cc1.o
CXX cfa.o
CXXLD as
CXXLD cc1
CXXLD cfa
[Pipeline] sh
+ nproc
+ make -j 96 --no-print-directory -C src
YACC Parser/parser.cc
updating Parser/parser.output
updating Parser/parser.hh
make all-am
CXX main.o
CXX CompilationState.o
CXX MakeLibCfa.o
LEX Parser/lex.cc
CXX AST/Attribute.o
CXX AST/Copy.o
CXX AST/Create.o
CXX AST/Decl.o
CXX AST/DeclReplacer.o
CXX AST/Expr.o
CXX AST/GenericSubstitution.o
CXX AST/Init.o
CXX AST/Inspect.o
CXX AST/LinkageSpec.o
CXX AST/Node.o
CXX AST/Pass.o
CXX AST/Print.o
CXX AST/Stmt.o
CXX AST/SymbolTable.o
CXX AST/Type.o
CXX AST/TypeEnvironment.o
CXX AST/TypeSubstitution.o
CXX AST/Util.o
CXX CodeGen/CodeGenerator.o
CXX CodeGen/GenType.o
CXX CodeGen/OperatorTable.o
CXX CodeGen/FixMain.o
CXX CodeGen/FixNames.o
CXX CodeGen/Generate.o
CXX CodeGen/LinkOnce.o
CXX Concurrency/Actors.o
CXX Concurrency/Corun.o
CXX Concurrency/Keywords.o
CXX Concurrency/Waitfor.o
CXX Concurrency/Waituntil.o
CXX Common/Assert.o
CXX Common/CodeLocationTools.o
CXX Common/DeclStats.o
CXX Common/Eval.o
CXX Common/Examine.o
CXX Common/Indenter.o
CXX Common/ResolvProtoDump.o
CXX Common/SemanticError.o
CXX Common/Stats/Counter.o
CXX Common/Stats/Heap.o
CXX Common/Stats/ResolveTime.o
CXX Common/Stats/Stats.o
CXX Common/Stats/Time.o
CXX Common/Symbol.o
CXX Common/UniqueName.o
CXX Common/DebugMalloc.o
CXX ControlStruct/ExceptDecl.o
CXX ControlStruct/ExceptTranslate.o
CXX ControlStruct/FixLabels.o
CXX ControlStruct/HoistControlDecls.o
CXX ControlStruct/LabelGenerator.o
CXX ControlStruct/MultiLevelExit.o
CXX ControlStruct/TranslateEnumRange.o
CXX GenPoly/GenPoly.o
CXX GenPoly/Lvalue2.o
CXX GenPoly/Box.o
CXX GenPoly/FindFunction.o
CXX GenPoly/InstantiateGeneric.o
CXX GenPoly/Lvalue.o
CXX GenPoly/ScrubTypeVars.o
CXX GenPoly/Specialize.o
CXX InitTweak/GenInit.o
CXX InitTweak/InitTweak.o
CXX InitTweak/FixGlobalInit.o
CXX InitTweak/FixInit.o
CXX Parser/DeclarationNode.o
CXX Parser/ExpressionNode.o
CXX Parser/InitializerNode.o
CXX Parser/ParseNode.o
CXX Parser/parser.o
CXX Parser/RunParser.o
CXX Parser/StatementNode.o
CXX Parser/TypeData.o
CXX Parser/TypedefTable.o
CXX ResolvExpr/AdjustExprType.o
CXX ResolvExpr/Candidate.o
CXX ResolvExpr/CandidateFinder.o
CXX ResolvExpr/CastCost.o
CXX ResolvExpr/CommonType.o
CXX ResolvExpr/ConversionCost.o
CXX ResolvExpr/CurrentObject.o
CXX ResolvExpr/ExplodedArg.o
CXX ResolvExpr/FindOpenVars.o
CXX ResolvExpr/PolyCost.o
CXX ResolvExpr/PtrsAssignable.o
CXX ResolvExpr/PtrsCastable.o
CXX ResolvExpr/RenameVars.o
CXX ResolvExpr/Resolver.o
CXX ResolvExpr/ResolveTypeof.o
CXX ResolvExpr/SatisfyAssertions.o
CXX ResolvExpr/SpecCost.o
CXX ResolvExpr/Unify.o
In file included from /usr/include/aarch64-linux-gnu/c++/10/bits/os_defines.h:39,
from /usr/include/aarch64-linux-gnu/c++/10/bits/c++config.h:522,
from /usr/include/c++/10/cstdio:41,
from /var/lib/jenkins/workspace/Cforall_master/src/Parser/parser.yy:41:
/usr/include/features.h:415:4: warning: #warning _FORTIFY_SOURCE requires GCC 4.1 or later [-Wcpp]
415 | # warning _FORTIFY_SOURCE requires GCC 4.1 or later
| ^~~~~~~
CXX ResolvExpr/CandidatePrinter.o
CXX ResolvExpr/EraseWith.o
CXX SymTab/FixFunction.o
CXX SymTab/GenImplicitCall.o
CXX SymTab/Mangler.o
CXX SymTab/ManglerCommon.o
CXX Tuples/Explode.o
CXX Tuples/TupleAssignment.o
CXX Tuples/TupleExpansion.o
CXX Tuples/Tuples.o
CXX Validate/Autogen.o
CXX Validate/CheckAssertions.o
CXX Validate/CompoundLiteral.o
CXX Validate/EliminateTypedef.o
CXX Validate/EnumAndPointerDecay.o
CXX Validate/FindSpecialDecls.o
CXX Validate/FixQualifiedTypes.o
CXX Validate/FixReturnTypes.o
CXX Validate/ForallPointerDecay.o
CXX Validate/GenericParameter.o
CXX Validate/HoistStruct.o
CXX Validate/HoistTypeDecls.o
CXX Validate/ImplementEnumFunc.o
CXX Validate/InitializerLength.o
CXX Validate/LabelAddressFixer.o
CXX Validate/LinkInstanceTypes.o
CXX Validate/ReplaceTypedef.o
CXX Validate/ReturnCheck.o
CXX Validate/VerifyCtorDtorAssign.o
CXX Virtual/ExpandCasts.o
CXX Virtual/Tables.o
CXX Virtual/VirtualDtor.o
CXX Parser/lex.o
/var/lib/jenkins/workspace/Cforall_master/src/ResolvExpr/CommonType.cpp: In function ‘ast::ptr ResolvExpr::{anonymous}::handleReference(ast::ptr&, ast::ptr&, ResolvExpr::WidenMode, ast::TypeEnvironment&, const OpenVarSet&)’:
/var/lib/jenkins/workspace/Cforall_master/src/ResolvExpr/CommonType.cpp:716:23: note: parameter passing for argument of type ‘ResolvExpr::WidenMode’ changed in GCC 9.1
716 | ast::ptr< ast::Type > handleReference(
| ^~~~~~~~~~~~~~~
/var/lib/jenkins/workspace/Cforall_master/src/ResolvExpr/CommonType.cpp: In function ‘ast::ptr ResolvExpr::commonType(ast::ptr&, ast::ptr&, ast::TypeEnvironment&, ast::AssertionSet&, ast::AssertionSet&, const OpenVarSet&, ResolvExpr::WidenMode)’:
/var/lib/jenkins/workspace/Cforall_master/src/ResolvExpr/CommonType.cpp:748:23: note: parameter passing for argument of type ‘ResolvExpr::WidenMode’ changed in GCC 9.1
748 | ast::ptr< ast::Type > commonType(
| ^~~~~~~~~~
/var/lib/jenkins/workspace/Cforall_master/src/ResolvExpr/Unify.cpp: In function ‘bool ResolvExpr::unifyExact(const ast::Type*, const ast::Type*, ast::TypeEnvironment&, ast::AssertionSet&, ast::AssertionSet&, const OpenVarSet&, ResolvExpr::WidenMode)’:
/var/lib/jenkins/workspace/Cforall_master/src/ResolvExpr/Unify.cpp:644:6: note: parameter passing for argument of type ‘ResolvExpr::WidenMode’ changed in GCC 9.1
644 | bool unifyExact(
| ^~~~~~~~~~
/var/lib/jenkins/workspace/Cforall_master/src/ResolvExpr/Unify.cpp: In function ‘bool ResolvExpr::unifyInexact(ast::ptr&, ast::ptr&, ast::TypeEnvironment&, ast::AssertionSet&, ast::AssertionSet&, const OpenVarSet&, ResolvExpr::WidenMode, ast::ptr&)’:
/var/lib/jenkins/workspace/Cforall_master/src/ResolvExpr/Unify.cpp:671:6: note: parameter passing for argument of type ‘ResolvExpr::WidenMode’ changed in GCC 9.1
671 | bool unifyInexact(
| ^~~~~~~~~~~~
/var/lib/jenkins/workspace/Cforall_master/src/AST/TypeEnvironment.cpp: In member function ‘bool ast::TypeEnvironment::bindVar(const ast::TypeInstType*, const ast::Type*, const ast::TypeData&, ast::AssertionSet&, ast::AssertionSet&, const OpenVarSet&, ResolvExpr::WidenMode)’:
/var/lib/jenkins/workspace/Cforall_master/src/AST/TypeEnvironment.cpp:280:6: note: parameter passing for argument of type ‘ResolvExpr::WidenMode’ changed in GCC 9.1
280 | bool TypeEnvironment::bindVar(
| ^~~~~~~~~~~~~~~
/var/lib/jenkins/workspace/Cforall_master/src/AST/TypeEnvironment.cpp: In member function ‘bool ast::TypeEnvironment::bindVarToVar(const ast::TypeInstType*, const ast::TypeInstType*, ast::TypeData&&, ast::AssertionSet&, ast::AssertionSet&, const OpenVarSet&, ResolvExpr::WidenMode)’:
/var/lib/jenkins/workspace/Cforall_master/src/AST/TypeEnvironment.cpp:319:6: note: parameter passing for argument of type ‘ResolvExpr::WidenMode’ changed in GCC 9.1
319 | bool TypeEnvironment::bindVarToVar(
| ^~~~~~~~~~~~~~~
CXXLD ../driver/cfa-cpp
[Pipeline] }
[Pipeline] // dir
[Pipeline] }
[Pipeline] // stage
[Pipeline] echo
-------- Build : libcfa(debug) --------
[Pipeline] stage
[Pipeline] { (Build : libcfa(debug))
[Pipeline] dir
Running in /var/lib/jenkins/workspace/Cforall_master@tmp
[Pipeline] {
[Pipeline] sh
+ nproc
+ make -j 96 --no-print-directory -C libcfa/arm64-debug
Making all in prelude
mkdir .deps
touch .deps/builtins.Po
(CDPATH="${ZSH_VERSION+.}:" && cd /var/lib/jenkins/workspace/Cforall_master/libcfa && /bin/bash '/var/lib/jenkins/workspace/Cforall_master/libcfa/automake/missing' autoheader)
rm -f stamp-h1
touch /var/lib/jenkins/workspace/Cforall_master/libcfa/prelude/defines.hfa.in
cd .. && /bin/bash ./config.status prelude/defines.hfa
config.status: creating prelude/defines.hfa
config.status: prelude/defines.hfa is unchanged
make all-am
GEN gcc-builtins.c
GEN builtins.cfa
GEN prelude.cfa
GEN extras.cfa
GEN extras.cfa
GEN gcc-builtins.cfa
GEN bootloader.c
Making all in src
CFA common.lo
CFA fstream.lo
CFA iostream.lo
CFA heap.lo
CFA iterator.lo
CFA limits.lo
CFA math.lo
CFA memory.lo
CFA parseargs.lo
CFA parseconfig.lo
CFA rational.lo
CFA stdlib.lo
CFA strstream.lo
CFA time.lo
CFA assert.lo
CFA bits/debug.lo
CC exception.lo
CFA interpose.lo
CFA prelude-inline.lo
CFA startup.lo
CC virtual.lo
GEN prelude.lo
CFA interpose_thread.lo
CFA bits/weakso_locks.lo
CFA algorithms/range_iterator.lo
CFA collections/maybe.lo
CFA collections/pair.lo
CFA collections/result.lo
CFA collections/string.lo
CFA collections/string_res.lo
CFA collections/vector.lo
CFA device/cpu.lo
CFA concurrency/alarm.lo
CFA concurrency/coroutine.lo
CFA concurrency/exception.lo
CFA concurrency/kernel.lo
CFA concurrency/kernel/cluster.lo
CFA concurrency/locks.lo
CFA concurrency/monitor.lo
CFA concurrency/mutex.lo
CFA concurrency/select.lo
CFA concurrency/thread.lo
CFA concurrency/cofor.lo
CFA concurrency/clib/cfathread.lo
CPPAS concurrency/CtxSwitch-arm64.lo
CC concurrency/invoke.lo
CFA concurrency/io.lo
CFA concurrency/io/setup.lo
CFA concurrency/io/call.lo
CFA concurrency/kernel/startup.lo
CFA concurrency/preemption.lo
CFA concurrency/ready_queue.lo
CFA concurrency/stats.lo
CFA concurrency/pthread.lo
/usr/include/linux/io_uring.h:83:36: warning: 'packed' attribute ignored for field of type 'union __io_uring_sqe____anonymous65' [-Wattributes]
83 | } __attribute__((packed));
| ^
CCLD libcfa.la
/usr/bin/ld: warning: .libs/common.o: requires executable stack (because the .note.GNU-stack section is executable)
/usr/include/linux/io_uring.h:83:36: warning: 'packed' attribute ignored for field of type 'union __io_uring_sqe____anonymous129' [-Wattributes]
83 | } __attribute__((packed));
| ^
/usr/include/linux/io_uring.h:83:36: warning: 'packed' attribute ignored for field of type 'union __io_uring_sqe____anonymous53' [-Wattributes]
83 | } __attribute__((packed));
| ^
/usr/include/linux/io_uring.h:83:36: warning: 'packed' attribute ignored for field of type 'union __io_uring_sqe____anonymous119' [-Wattributes]
83 | } __attribute__((packed));
| ^
/usr/include/linux/io_uring.h:83:36: warning: 'packed' attribute ignored for field of type 'union __io_uring_sqe____anonymous119' [-Wattributes]
83 | } __attribute__((packed));
| ^
/usr/include/linux/io_uring.h:83:36: warning: 'packed' attribute ignored for field of type 'union __io_uring_sqe____anonymous32' [-Wattributes]
83 | } __attribute__((packed));
| ^
/usr/include/linux/io_uring.h:83:36: warning: 'packed' attribute ignored for field of type 'union __io_uring_sqe____anonymous97' [-Wattributes]
83 | } __attribute__((packed));
| ^
CCLD libcfathread.la
/usr/bin/ld: warning: concurrency/.libs/alarm.o: requires executable stack (because the .note.GNU-stack section is executable)
make[1]: Nothing to be done for 'all-am'.
[Pipeline] }
[Pipeline] // dir
[Pipeline] }
[Pipeline] // stage
[Pipeline] echo
-------- Build : libcfa(nodebug) --------
[Pipeline] stage
[Pipeline] { (Build : libcfa(nodebug))
[Pipeline] dir
Running in /var/lib/jenkins/workspace/Cforall_master@tmp
[Pipeline] {
[Pipeline] sh
+ nproc
+ make -j 96 --no-print-directory -C libcfa/arm64-nodebug
Making all in prelude
mkdir .deps
touch .deps/builtins.Po
cd .. && /bin/bash ./config.status prelude/defines.hfa
config.status: creating prelude/defines.hfa
config.status: prelude/defines.hfa is unchanged
make all-am
GEN gcc-builtins.c
GEN builtins.cfa
GEN prelude.cfa
GEN extras.cfa
GEN extras.cfa
GEN gcc-builtins.cfa
GEN bootloader.c
Making all in src
CFA common.lo
CFA heap.lo
CFA fstream.lo
CFA iostream.lo
CFA iterator.lo
CFA limits.lo
CFA math.lo
CFA memory.lo
CFA parseargs.lo
CFA parseconfig.lo
CFA rational.lo
CFA stdlib.lo
CFA strstream.lo
CFA time.lo
CFA assert.lo
CC exception.lo
CFA interpose.lo
CFA prelude-inline.lo
CFA startup.lo
CC virtual.lo
GEN prelude.lo
CFA interpose_thread.lo
CFA bits/weakso_locks.lo
CFA algorithms/range_iterator.lo
CFA collections/maybe.lo
CFA collections/pair.lo
CFA collections/result.lo
CFA collections/string.lo
CFA collections/string_res.lo
CFA collections/vector.lo
CFA device/cpu.lo
CFA bits/debug.lo
CFA concurrency/alarm.lo
CFA concurrency/coroutine.lo
CFA concurrency/exception.lo
CFA concurrency/kernel.lo
CFA concurrency/kernel/cluster.lo
CFA concurrency/locks.lo
CFA concurrency/monitor.lo
CFA concurrency/mutex.lo
CFA concurrency/select.lo
CFA concurrency/thread.lo
CFA concurrency/cofor.lo
CFA concurrency/clib/cfathread.lo
CPPAS concurrency/CtxSwitch-arm64.lo
CC concurrency/invoke.lo
CFA concurrency/io.lo
CFA concurrency/io/call.lo
CFA concurrency/io/setup.lo
CFA concurrency/kernel/startup.lo
CFA concurrency/preemption.lo
CFA concurrency/ready_queue.lo
CFA concurrency/stats.lo
CFA concurrency/pthread.lo
/var/lib/jenkins/workspace/Cforall_master/libcfa/src/exception.c: In function '__cfaehm_allocate_exception':
/var/lib/jenkins/workspace/Cforall_master/libcfa/src/exception.c:142:3: warning: ignoring return value of 'write' declared with attribute 'warn_unused_result' [-Wunused-result]
142 | write( 2, "abort2\n", 7 );
| ^~~~~~~~~~~~~~~~~~~~~~~~~
/var/lib/jenkins/workspace/Cforall_master/libcfa/src/exception.c: In function '__cfaehm_exception_cleanup':
/var/lib/jenkins/workspace/Cforall_master/libcfa/src/exception.c:127:3: warning: ignoring return value of 'write' declared with attribute 'warn_unused_result' [-Wunused-result]
127 | write( 2, "abort1\n", 7 );
| ^~~~~~~~~~~~~~~~~~~~~~~~~
/var/lib/jenkins/workspace/Cforall_master/libcfa/src/exception.c: In function '__cfaehm_cancel_stack':
/var/lib/jenkins/workspace/Cforall_master/libcfa/src/exception.c:230:2: warning: ignoring return value of 'write' declared with attribute 'warn_unused_result' [-Wunused-result]
230 | write( 2, "abort3\n", 7 );
| ^~~~~~~~~~~~~~~~~~~~~~~~~
/var/lib/jenkins/workspace/Cforall_master/libcfa/src/exception.c: In function '__cfaehm_begin_unwind':
/var/lib/jenkins/workspace/Cforall_master/libcfa/src/exception.c:252:3: warning: ignoring return value of 'write' declared with attribute 'warn_unused_result' [-Wunused-result]
252 | write( 2, "abort4\n", 7 );
| ^~~~~~~~~~~~~~~~~~~~~~~~~
/var/lib/jenkins/workspace/Cforall_master/libcfa/src/exception.c:278:3: warning: ignoring return value of 'write' declared with attribute 'warn_unused_result' [-Wunused-result]
278 | write( 2, "abort5\n", 7 );
| ^~~~~~~~~~~~~~~~~~~~~~~~~
/var/lib/jenkins/workspace/Cforall_master/libcfa/src/exception.c: In function '__cfaehm_rethrow_terminate':
/var/lib/jenkins/workspace/Cforall_master/libcfa/src/exception.c:308:2: warning: ignoring return value of 'write' declared with attribute 'warn_unused_result' [-Wunused-result]
308 | write( 2, "abort7\n", 7 );
| ^~~~~~~~~~~~~~~~~~~~~~~~~
/var/lib/jenkins/workspace/Cforall_master/libcfa/src/exception.c: In function '__cfaehm_rethrow_adapter':
/var/lib/jenkins/workspace/Cforall_master/libcfa/src/exception.c:300:2: warning: ignoring return value of 'write' declared with attribute 'warn_unused_result' [-Wunused-result]
300 | write( 2, "abort6\n", 7 );
| ^~~~~~~~~~~~~~~~~~~~~~~~~
/usr/include/linux/io_uring.h:83:36: warning: 'packed' attribute ignored for field of type 'union __io_uring_sqe____anonymous65' [-Wattributes]
83 | } __attribute__((packed));
| ^
/usr/include/aarch64-linux-gnu/bits/socket2.h:70:94: warning: '_X12_constructorFv_U26__anonymous___SOCKADDR_ARGU26__anonymous___SOCKADDR_ARG_autogen___1' is static but used in inline function 'recvfrom' which is not static
70 | return __recvfrom_chk (__fd, __buf, __n, sz, __flags, __addr, __addr_len);
| ^
/usr/include/aarch64-linux-gnu/bits/socket2.h:70:124: warning: '_X11_destructorFv_U26__anonymous___SOCKADDR_ARG_autogen___1' is static but used in inline function 'recvfrom' which is not static
70 | return __recvfrom_chk (__fd, __buf, __n, sz, __flags, __addr, __addr_len);
| ^
/usr/include/aarch64-linux-gnu/bits/socket2.h:68:103: warning: '_X12_constructorFv_U26__anonymous___SOCKADDR_ARGU26__anonymous___SOCKADDR_ARG_autogen___1' is static but used in inline function 'recvfrom' which is not static
68 | return __recvfrom_chk_warn (__fd, __buf, __n, sz, __flags, __addr,
| ^
/usr/include/aarch64-linux-gnu/bits/socket2.h:68:128: warning: '_X11_destructorFv_U26__anonymous___SOCKADDR_ARG_autogen___1' is static but used in inline function 'recvfrom' which is not static
68 | return __recvfrom_chk_warn (__fd, __buf, __n, sz, __flags, __addr,
| ^
/usr/include/aarch64-linux-gnu/bits/socket2.h:66:96: warning: '_X12_constructorFv_U26__anonymous___SOCKADDR_ARGU26__anonymous___SOCKADDR_ARG_autogen___1' is static but used in inline function 'recvfrom' which is not static
66 | return __recvfrom_alias (__fd, __buf, __n, __flags, __addr, __addr_len);
| ^
/usr/include/aarch64-linux-gnu/bits/socket2.h:66:128: warning: '_X11_destructorFv_U26__anonymous___SOCKADDR_ARG_autogen___1' is static but used in inline function 'recvfrom' which is not static
66 | return __recvfrom_alias (__fd, __buf, __n, __flags, __addr, __addr_len);
| ^
/usr/include/linux/io_uring.h:83:36: warning: 'packed' attribute ignored for field of type 'union __io_uring_sqe____anonymous119' [-Wattributes]
83 | } __attribute__((packed));
| ^
/usr/include/aarch64-linux-gnu/bits/socket2.h:70:95: warning: '_X12_constructorFv_U26__anonymous___SOCKADDR_ARGU26__anonymous___SOCKADDR_ARG_autogen___1' is static but used in inline function 'recvfrom' which is not static
70 | return __recvfrom_chk (__fd, __buf, __n, sz, __flags, __addr, __addr_len);
| ^
/usr/include/aarch64-linux-gnu/bits/socket2.h:70:125: warning: '_X11_destructorFv_U26__anonymous___SOCKADDR_ARG_autogen___1' is static but used in inline function 'recvfrom' which is not static
70 | return __recvfrom_chk (__fd, __buf, __n, sz, __flags, __addr, __addr_len);
| ^
/usr/include/aarch64-linux-gnu/bits/socket2.h:68:104: warning: '_X12_constructorFv_U26__anonymous___SOCKADDR_ARGU26__anonymous___SOCKADDR_ARG_autogen___1' is static but used in inline function 'recvfrom' which is not static
68 | return __recvfrom_chk_warn (__fd, __buf, __n, sz, __flags, __addr,
| ^
/usr/include/aarch64-linux-gnu/bits/socket2.h:68:129: warning: '_X11_destructorFv_U26__anonymous___SOCKADDR_ARG_autogen___1' is static but used in inline function 'recvfrom' which is not static
68 | return __recvfrom_chk_warn (__fd, __buf, __n, sz, __flags, __addr,
| ^
/usr/include/aarch64-linux-gnu/bits/socket2.h:66:97: warning: '_X12_constructorFv_U26__anonymous___SOCKADDR_ARGU26__anonymous___SOCKADDR_ARG_autogen___1' is static but used in inline function 'recvfrom' which is not static
66 | return __recvfrom_alias (__fd, __buf, __n, __flags, __addr, __addr_len);
| ^
/usr/include/aarch64-linux-gnu/bits/socket2.h:66:129: warning: '_X11_destructorFv_U26__anonymous___SOCKADDR_ARG_autogen___1' is static but used in inline function 'recvfrom' which is not static
66 | return __recvfrom_alias (__fd, __buf, __n, __flags, __addr, __addr_len);
| ^
/usr/include/linux/io_uring.h:83:36: warning: 'packed' attribute ignored for field of type 'union __io_uring_sqe____anonymous129' [-Wattributes]
83 | } __attribute__((packed));
| ^
/usr/include/aarch64-linux-gnu/bits/socket2.h:70:95: warning: '_X12_constructorFv_U26__anonymous___SOCKADDR_ARGU26__anonymous___SOCKADDR_ARG_autogen___1' is static but used in inline function 'recvfrom' which is not static
70 | return __recvfrom_chk (__fd, __buf, __n, sz, __flags, __addr, __addr_len);
| ^
/usr/include/aarch64-linux-gnu/bits/socket2.h:70:125: warning: '_X11_destructorFv_U26__anonymous___SOCKADDR_ARG_autogen___1' is static but used in inline function 'recvfrom' which is not static
70 | return __recvfrom_chk (__fd, __buf, __n, sz, __flags, __addr, __addr_len);
| ^
/usr/include/aarch64-linux-gnu/bits/socket2.h:68:104: warning: '_X12_constructorFv_U26__anonymous___SOCKADDR_ARGU26__anonymous___SOCKADDR_ARG_autogen___1' is static but used in inline function 'recvfrom' which is not static
68 | return __recvfrom_chk_warn (__fd, __buf, __n, sz, __flags, __addr,
| ^
/usr/include/aarch64-linux-gnu/bits/socket2.h:68:129: warning: '_X11_destructorFv_U26__anonymous___SOCKADDR_ARG_autogen___1' is static but used in inline function 'recvfrom' which is not static
68 | return __recvfrom_chk_warn (__fd, __buf, __n, sz, __flags, __addr,
| ^
/usr/include/aarch64-linux-gnu/bits/socket2.h:66:97: warning: '_X12_constructorFv_U26__anonymous___SOCKADDR_ARGU26__anonymous___SOCKADDR_ARG_autogen___1' is static but used in inline function 'recvfrom' which is not static
66 | return __recvfrom_alias (__fd, __buf, __n, __flags, __addr, __addr_len);
| ^
/usr/include/aarch64-linux-gnu/bits/socket2.h:66:129: warning: '_X11_destructorFv_U26__anonymous___SOCKADDR_ARG_autogen___1' is static but used in inline function 'recvfrom' which is not static
66 | return __recvfrom_alias (__fd, __buf, __n, __flags, __addr, __addr_len);
| ^
/usr/include/linux/io_uring.h:83:36: warning: 'packed' attribute ignored for field of type 'union __io_uring_sqe____anonymous53' [-Wattributes]
83 | } __attribute__((packed));
| ^
/usr/include/aarch64-linux-gnu/bits/socket2.h:70:95: warning: '_X12_constructorFv_U26__anonymous___SOCKADDR_ARGU26__anonymous___SOCKADDR_ARG_autogen___1' is static but used in inline function 'recvfrom' which is not static
70 | return __recvfrom_chk (__fd, __buf, __n, sz, __flags, __addr, __addr_len);
| ^
/usr/include/aarch64-linux-gnu/bits/socket2.h:70:125: warning: '_X11_destructorFv_U26__anonymous___SOCKADDR_ARG_autogen___1' is static but used in inline function 'recvfrom' which is not static
70 | return __recvfrom_chk (__fd, __buf, __n, sz, __flags, __addr, __addr_len);
| ^
/usr/include/aarch64-linux-gnu/bits/socket2.h:68:104: warning: '_X12_constructorFv_U26__anonymous___SOCKADDR_ARGU26__anonymous___SOCKADDR_ARG_autogen___1' is static but used in inline function 'recvfrom' which is not static
68 | return __recvfrom_chk_warn (__fd, __buf, __n, sz, __flags, __addr,
| ^
/usr/include/aarch64-linux-gnu/bits/socket2.h:68:129: warning: '_X11_destructorFv_U26__anonymous___SOCKADDR_ARG_autogen___1' is static but used in inline function 'recvfrom' which is not static
68 | return __recvfrom_chk_warn (__fd, __buf, __n, sz, __flags, __addr,
| ^
/usr/include/aarch64-linux-gnu/bits/socket2.h:66:97: warning: '_X12_constructorFv_U26__anonymous___SOCKADDR_ARGU26__anonymous___SOCKADDR_ARG_autogen___1' is static but used in inline function 'recvfrom' which is not static
66 | return __recvfrom_alias (__fd, __buf, __n, __flags, __addr, __addr_len);
| ^
/usr/include/aarch64-linux-gnu/bits/socket2.h:66:129: warning: '_X11_destructorFv_U26__anonymous___SOCKADDR_ARG_autogen___1' is static but used in inline function 'recvfrom' which is not static
66 | return __recvfrom_alias (__fd, __buf, __n, __flags, __addr, __addr_len);
| ^
/usr/include/linux/io_uring.h:83:36: warning: 'packed' attribute ignored for field of type 'union __io_uring_sqe____anonymous119' [-Wattributes]
83 | } __attribute__((packed));
| ^
/usr/include/aarch64-linux-gnu/bits/socket2.h:70:95: warning: '_X12_constructorFv_U26__anonymous___SOCKADDR_ARGU26__anonymous___SOCKADDR_ARG_autogen___1' is static but used in inline function 'recvfrom' which is not static
70 | return __recvfrom_chk (__fd, __buf, __n, sz, __flags, __addr, __addr_len);
| ^
/usr/include/aarch64-linux-gnu/bits/socket2.h:70:125: warning: '_X11_destructorFv_U26__anonymous___SOCKADDR_ARG_autogen___1' is static but used in inline function 'recvfrom' which is not static
70 | return __recvfrom_chk (__fd, __buf, __n, sz, __flags, __addr, __addr_len);
| ^
/usr/include/aarch64-linux-gnu/bits/socket2.h:68:104: warning: '_X12_constructorFv_U26__anonymous___SOCKADDR_ARGU26__anonymous___SOCKADDR_ARG_autogen___1' is static but used in inline function 'recvfrom' which is not static
68 | return __recvfrom_chk_warn (__fd, __buf, __n, sz, __flags, __addr,
| ^
/usr/include/aarch64-linux-gnu/bits/socket2.h:68:129: warning: '_X11_destructorFv_U26__anonymous___SOCKADDR_ARG_autogen___1' is static but used in inline function 'recvfrom' which is not static
68 | return __recvfrom_chk_warn (__fd, __buf, __n, sz, __flags, __addr,
| ^
/usr/include/aarch64-linux-gnu/bits/socket2.h:66:97: warning: '_X12_constructorFv_U26__anonymous___SOCKADDR_ARGU26__anonymous___SOCKADDR_ARG_autogen___1' is static but used in inline function 'recvfrom' which is not static
66 | return __recvfrom_alias (__fd, __buf, __n, __flags, __addr, __addr_len);
| ^
/usr/include/aarch64-linux-gnu/bits/socket2.h:66:129: warning: '_X11_destructorFv_U26__anonymous___SOCKADDR_ARG_autogen___1' is static but used in inline function 'recvfrom' which is not static
66 | return __recvfrom_alias (__fd, __buf, __n, __flags, __addr, __addr_len);
| ^
/usr/include/linux/io_uring.h:83:36: warning: 'packed' attribute ignored for field of type 'union __io_uring_sqe____anonymous32' [-Wattributes]
83 | } __attribute__((packed));
| ^
CCLD libcfa.la
/usr/include/aarch64-linux-gnu/bits/socket2.h:70:94: warning: '_X12_constructorFv_U26__anonymous___SOCKADDR_ARGU26__anonymous___SOCKADDR_ARG_autogen___1' is static but used in inline function 'recvfrom' which is not static
70 | return __recvfrom_chk (__fd, __buf, __n, sz, __flags, __addr, __addr_len);
| ^
/usr/include/aarch64-linux-gnu/bits/socket2.h:70:124: warning: '_X11_destructorFv_U26__anonymous___SOCKADDR_ARG_autogen___1' is static but used in inline function 'recvfrom' which is not static
70 | return __recvfrom_chk (__fd, __buf, __n, sz, __flags, __addr, __addr_len);
| ^
/usr/include/aarch64-linux-gnu/bits/socket2.h:68:103: warning: '_X12_constructorFv_U26__anonymous___SOCKADDR_ARGU26__anonymous___SOCKADDR_ARG_autogen___1' is static but used in inline function 'recvfrom' which is not static
68 | return __recvfrom_chk_warn (__fd, __buf, __n, sz, __flags, __addr,
| ^
/usr/include/aarch64-linux-gnu/bits/socket2.h:68:128: warning: '_X11_destructorFv_U26__anonymous___SOCKADDR_ARG_autogen___1' is static but used in inline function 'recvfrom' which is not static
68 | return __recvfrom_chk_warn (__fd, __buf, __n, sz, __flags, __addr,
| ^
/usr/include/aarch64-linux-gnu/bits/socket2.h:66:96: warning: '_X12_constructorFv_U26__anonymous___SOCKADDR_ARGU26__anonymous___SOCKADDR_ARG_autogen___1' is static but used in inline function 'recvfrom' which is not static
66 | return __recvfrom_alias (__fd, __buf, __n, __flags, __addr, __addr_len);
| ^
/usr/include/aarch64-linux-gnu/bits/socket2.h:66:128: warning: '_X11_destructorFv_U26__anonymous___SOCKADDR_ARG_autogen___1' is static but used in inline function 'recvfrom' which is not static
66 | return __recvfrom_alias (__fd, __buf, __n, __flags, __addr, __addr_len);
| ^
/usr/bin/ld: warning: .libs/common.o: requires executable stack (because the .note.GNU-stack section is executable)
/usr/include/linux/io_uring.h:83:36: warning: 'packed' attribute ignored for field of type 'union __io_uring_sqe____anonymous97' [-Wattributes]
83 | } __attribute__((packed));
| ^
/usr/include/aarch64-linux-gnu/bits/socket2.h:70:95: warning: '_X12_constructorFv_U26__anonymous___SOCKADDR_ARGU26__anonymous___SOCKADDR_ARG_autogen___1' is static but used in inline function 'recvfrom' which is not static
70 | return __recvfrom_chk (__fd, __buf, __n, sz, __flags, __addr, __addr_len);
| ^
/usr/include/aarch64-linux-gnu/bits/socket2.h:70:125: warning: '_X11_destructorFv_U26__anonymous___SOCKADDR_ARG_autogen___1' is static but used in inline function 'recvfrom' which is not static
70 | return __recvfrom_chk (__fd, __buf, __n, sz, __flags, __addr, __addr_len);
| ^
/usr/include/aarch64-linux-gnu/bits/socket2.h:68:104: warning: '_X12_constructorFv_U26__anonymous___SOCKADDR_ARGU26__anonymous___SOCKADDR_ARG_autogen___1' is static but used in inline function 'recvfrom' which is not static
68 | return __recvfrom_chk_warn (__fd, __buf, __n, sz, __flags, __addr,
| ^
/usr/include/aarch64-linux-gnu/bits/socket2.h:68:129: warning: '_X11_destructorFv_U26__anonymous___SOCKADDR_ARG_autogen___1' is static but used in inline function 'recvfrom' which is not static
68 | return __recvfrom_chk_warn (__fd, __buf, __n, sz, __flags, __addr,
| ^
/usr/include/aarch64-linux-gnu/bits/socket2.h:66:97: warning: '_X12_constructorFv_U26__anonymous___SOCKADDR_ARGU26__anonymous___SOCKADDR_ARG_autogen___1' is static but used in inline function 'recvfrom' which is not static
66 | return __recvfrom_alias (__fd, __buf, __n, __flags, __addr, __addr_len);
| ^
/usr/include/aarch64-linux-gnu/bits/socket2.h:66:129: warning: '_X11_destructorFv_U26__anonymous___SOCKADDR_ARG_autogen___1' is static but used in inline function 'recvfrom' which is not static
66 | return __recvfrom_alias (__fd, __buf, __n, __flags, __addr, __addr_len);
| ^
CCLD libcfathread.la
/usr/bin/ld: warning: concurrency/.libs/coroutine.o: requires executable stack (because the .note.GNU-stack section is executable)
make[1]: Nothing to be done for 'all-am'.
[Pipeline] }
[Pipeline] // dir
[Pipeline] }
[Pipeline] // stage
[Pipeline] echo
-------- Build : install --------
[Pipeline] stage
[Pipeline] { (Build : install)
[Pipeline] dir
Running in /var/lib/jenkins/workspace/Cforall_master@tmp
[Pipeline] {
[Pipeline] sh
+ nproc
+ make -j 96 --no-print-directory install
Making install in driver
make install-exec-hook
/usr/bin/install -c cfa '/var/lib/jenkins/workspace/Cforall_master@tmp/bin//cfa'
/usr/bin/mkdir -p '/var/lib/jenkins/workspace/Cforall_master@tmp/lib/cfa/'
/bin/bash ../libtool --mode=install /usr/bin/install -c as cc1 '/var/lib/jenkins/workspace/Cforall_master@tmp/lib/cfa/'
libtool: install: /usr/bin/install -c as /var/lib/jenkins/workspace/Cforall_master@tmp/lib/cfa/as
libtool: install: /usr/bin/install -c cc1 /var/lib/jenkins/workspace/Cforall_master@tmp/lib/cfa/cc1
Making install in src
make install-am
make[3]: Nothing to be done for 'install-exec-am'.
/usr/bin/mkdir -p '/var/lib/jenkins/workspace/Cforall_master@tmp/lib/cfa/'
/bin/bash ../libtool --mode=install /usr/bin/install -c ../driver/cfa-cpp '/var/lib/jenkins/workspace/Cforall_master@tmp/lib/cfa/'
libtool: install: /usr/bin/install -c ../driver/cfa-cpp /var/lib/jenkins/workspace/Cforall_master@tmp/lib/cfa/cfa-cpp
Making install in .
(CDPATH="${ZSH_VERSION+.}:" && cd /var/lib/jenkins/workspace/Cforall_master && /bin/bash '/var/lib/jenkins/workspace/Cforall_master/automake/missing' autoheader)
rm -f stamp-h1
touch /var/lib/jenkins/workspace/Cforall_master/src/config.h.in
cd . && /bin/bash ./config.status config.h
config.status: creating config.h
config.status: config.h is unchanged
make[2]: Nothing to be done for 'install-exec-am'.
/usr/bin/mkdir -p '/var/lib/jenkins/workspace/Cforall_master@tmp/share/man/man1'
/usr/bin/install -c -m 644 /var/lib/jenkins/workspace/Cforall_master/doc/man/cfa.1 '/var/lib/jenkins/workspace/Cforall_master@tmp/share/man/man1'
Making install in libcfa/arm64-debug
Making install in prelude
make[3]: Nothing to be done for 'install-exec-am'.
/usr/bin/mkdir -p '/var/lib/jenkins/workspace/Cforall_master@tmp/lib/cfa/arm64-debug/'
/usr/bin/install -c -m 644 gcc-builtins.cfa builtins.cfa extras.cfa prelude.cfa bootloader.c defines.hfa '/var/lib/jenkins/workspace/Cforall_master@tmp/lib/cfa/arm64-debug/'
Making install in src
/usr/bin/mkdir -p '/var/lib/jenkins/workspace/Cforall_master@tmp/lib/cfa/arm64-debug/'
/bin/bash ../libtool --mode=install /usr/bin/install -c libcfa.la libcfathread.la '/var/lib/jenkins/workspace/Cforall_master@tmp/lib/cfa/arm64-debug/'
/usr/bin/mkdir -p '/var/lib/jenkins/workspace/Cforall_master@tmp/include/cfa/'
/usr/bin/mkdir -p '/var/lib/jenkins/workspace/Cforall_master@tmp/include/cfa//stdhdr/sys'
/usr/bin/install -c -m 644 /var/lib/jenkins/workspace/Cforall_master/libcfa/src/stdhdr/sys/mman.h /var/lib/jenkins/workspace/Cforall_master/libcfa/src/stdhdr/sys/time.h /var/lib/jenkins/workspace/Cforall_master/libcfa/src/stdhdr/sys/socket.h '/var/lib/jenkins/workspace/Cforall_master@tmp/include/cfa//stdhdr/sys'
/usr/bin/mkdir -p '/var/lib/jenkins/workspace/Cforall_master@tmp/include/cfa//algorithms'
/usr/bin/install -c -m 644 /var/lib/jenkins/workspace/Cforall_master/libcfa/src/algorithms/range_iterator.hfa '/var/lib/jenkins/workspace/Cforall_master@tmp/include/cfa//algorithms'
/usr/bin/mkdir -p '/var/lib/jenkins/workspace/Cforall_master@tmp/include/cfa//concurrency/kernel'
/usr/bin/install -c -m 644 /var/lib/jenkins/workspace/Cforall_master/libcfa/src/concurrency/kernel/cluster.hfa /var/lib/jenkins/workspace/Cforall_master/libcfa/src/concurrency/kernel/fwd.hfa '/var/lib/jenkins/workspace/Cforall_master@tmp/include/cfa//concurrency/kernel'
/usr/bin/install -c -m 644 /var/lib/jenkins/workspace/Cforall_master/libcfa/src/common.hfa /var/lib/jenkins/workspace/Cforall_master/libcfa/src/fstream.hfa /var/lib/jenkins/workspace/Cforall_master/libcfa/src/heap.hfa /var/lib/jenkins/workspace/Cforall_master/libcfa/src/iostream.hfa /var/lib/jenkins/workspace/Cforall_master/libcfa/src/iterator.hfa /var/lib/jenkins/workspace/Cforall_master/libcfa/src/limits.hfa /var/lib/jenkins/workspace/Cforall_master/libcfa/src/math.hfa /var/lib/jenkins/workspace/Cforall_master/libcfa/src/memory.hfa /var/lib/jenkins/workspace/Cforall_master/libcfa/src/parseargs.hfa /var/lib/jenkins/workspace/Cforall_master/libcfa/src/parseconfig.hfa /var/lib/jenkins/workspace/Cforall_master/libcfa/src/rational.hfa /var/lib/jenkins/workspace/Cforall_master/libcfa/src/stdlib.hfa /var/lib/jenkins/workspace/Cforall_master/libcfa/src/strstream.hfa /var/lib/jenkins/workspace/Cforall_master/libcfa/src/time.hfa /var/lib/jenkins/workspace/Cforall_master/libcfa/src/Exception.hfa /var/lib/jenkins/workspace/Cforall_master/libcfa/src/bitmanip.hfa /var/lib/jenkins/workspace/Cforall_master/libcfa/src/clock.hfa /var/lib/jenkins/workspace/Cforall_master/libcfa/src/exception.hfa /var/lib/jenkins/workspace/Cforall_master/libcfa/src/exception.h /var/lib/jenkins/workspace/Cforall_master/libcfa/src/gmp.hfa /var/lib/jenkins/workspace/Cforall_master/libcfa/src/math.trait.hfa /var/lib/jenkins/workspace/Cforall_master/libcfa/src/raii.hfa /var/lib/jenkins/workspace/Cforall_master/libcfa/src/time_t.hfa /var/lib/jenkins/workspace/Cforall_master/libcfa/src/virtual_dtor.hfa '/var/lib/jenkins/workspace/Cforall_master@tmp/include/cfa//.'
/usr/bin/mkdir -p '/var/lib/jenkins/workspace/Cforall_master@tmp/include/cfa//concurrency'
/usr/bin/install -c -m 644 /var/lib/jenkins/workspace/Cforall_master/libcfa/src/concurrency/iofwd.hfa /var/lib/jenkins/workspace/Cforall_master/libcfa/src/concurrency/barrier.hfa /var/lib/jenkins/workspace/Cforall_master/libcfa/src/concurrency/alarm.hfa /var/lib/jenkins/workspace/Cforall_master/libcfa/src/concurrency/coroutine.hfa /var/lib/jenkins/workspace/Cforall_master/libcfa/src/concurrency/exception.hfa /var/lib/jenkins/workspace/Cforall_master/libcfa/src/concurrency/kernel.hfa /var/lib/jenkins/workspace/Cforall_master/libcfa/src/concurrency/locks.hfa /var/lib/jenkins/workspace/Cforall_master/libcfa/src/concurrency/monitor.hfa /var/lib/jenkins/workspace/Cforall_master/libcfa/src/concurrency/mutex.hfa /var/lib/jenkins/workspace/Cforall_master/libcfa/src/concurrency/select.hfa /var/lib/jenkins/workspace/Cforall_master/libcfa/src/concurrency/thread.hfa /var/lib/jenkins/workspace/Cforall_master/libcfa/src/concurrency/cofor.hfa /var/lib/jenkins/workspace/Cforall_master/libcfa/src/concurrency/invoke.h /var/lib/jenkins/workspace/Cforall_master/libcfa/src/concurrency/future.hfa /var/lib/jenkins/workspace/Cforall_master/libcfa/src/concurrency/once.hfa /var/lib/jenkins/workspace/Cforall_master/libcfa/src/concurrency/mutex_stmt.hfa /var/lib/jenkins/workspace/Cforall_master/libcfa/src/concurrency/channel.hfa /var/lib/jenkins/workspace/Cforall_master/libcfa/src/concurrency/actor.hfa '/var/lib/jenkins/workspace/Cforall_master@tmp/include/cfa//concurrency'
/usr/bin/mkdir -p '/var/lib/jenkins/workspace/Cforall_master@tmp/include/cfa//concurrency/clib'
/usr/bin/install -c -m 644 /var/lib/jenkins/workspace/Cforall_master/libcfa/src/concurrency/clib/cfathread.h '/var/lib/jenkins/workspace/Cforall_master@tmp/include/cfa//concurrency/clib'
/usr/bin/mkdir -p '/var/lib/jenkins/workspace/Cforall_master@tmp/include/cfa//device'
/usr/bin/install -c -m 644 /var/lib/jenkins/workspace/Cforall_master/libcfa/src/device/cpu.hfa '/var/lib/jenkins/workspace/Cforall_master@tmp/include/cfa//device'
/usr/bin/mkdir -p '/var/lib/jenkins/workspace/Cforall_master@tmp/include/cfa//stdhdr/libltdl'
/usr/bin/install -c -m 644 /var/lib/jenkins/workspace/Cforall_master/libcfa/src/stdhdr/libltdl/lt_dlloader.h '/var/lib/jenkins/workspace/Cforall_master@tmp/include/cfa//stdhdr/libltdl'
/usr/bin/mkdir -p '/var/lib/jenkins/workspace/Cforall_master@tmp/include/cfa//vec'
/usr/bin/install -c -m 644 /var/lib/jenkins/workspace/Cforall_master/libcfa/src/vec/vec.hfa /var/lib/jenkins/workspace/Cforall_master/libcfa/src/vec/vec2.hfa /var/lib/jenkins/workspace/Cforall_master/libcfa/src/vec/vec3.hfa /var/lib/jenkins/workspace/Cforall_master/libcfa/src/vec/vec4.hfa '/var/lib/jenkins/workspace/Cforall_master@tmp/include/cfa//vec'
libtool: install: /usr/bin/install -c .libs/libcfa.so.1.0.0 /var/lib/jenkins/workspace/Cforall_master@tmp/lib/cfa/arm64-debug/libcfa.so.1.0.0
/usr/bin/mkdir -p '/var/lib/jenkins/workspace/Cforall_master@tmp/include/cfa//bits'
/usr/bin/install -c -m 644 /var/lib/jenkins/workspace/Cforall_master/libcfa/src/bits/weakso_locks.hfa /var/lib/jenkins/workspace/Cforall_master/libcfa/src/bits/algorithm.hfa /var/lib/jenkins/workspace/Cforall_master/libcfa/src/bits/align.hfa /var/lib/jenkins/workspace/Cforall_master/libcfa/src/bits/collections.hfa /var/lib/jenkins/workspace/Cforall_master/libcfa/src/bits/debug.hfa /var/lib/jenkins/workspace/Cforall_master/libcfa/src/bits/defs.hfa /var/lib/jenkins/workspace/Cforall_master/libcfa/src/bits/locks.hfa /var/lib/jenkins/workspace/Cforall_master/libcfa/src/bits/collection.hfa /var/lib/jenkins/workspace/Cforall_master/libcfa/src/bits/stack.hfa /var/lib/jenkins/workspace/Cforall_master/libcfa/src/bits/queue.hfa /var/lib/jenkins/workspace/Cforall_master/libcfa/src/bits/sequence.hfa /var/lib/jenkins/workspace/Cforall_master/libcfa/src/bits/atomic.hfa /var/lib/jenkins/workspace/Cforall_master/libcfa/src/bits/random.hfa '/var/lib/jenkins/workspace/Cforall_master@tmp/include/cfa//bits'
libtool: install: (cd /var/lib/jenkins/workspace/Cforall_master@tmp/lib/cfa/arm64-debug && { ln -s -f libcfa.so.1.0.0 libcfa.so.1 || { rm -f libcfa.so.1 && ln -s libcfa.so.1.0.0 libcfa.so.1; }; })
/usr/bin/mkdir -p '/var/lib/jenkins/workspace/Cforall_master@tmp/include/cfa//stdhdr'
/usr/bin/install -c -m 644 /var/lib/jenkins/workspace/Cforall_master/libcfa/src/stdhdr/stdalign.h /var/lib/jenkins/workspace/Cforall_master/libcfa/src/stdhdr/stdio.h /var/lib/jenkins/workspace/Cforall_master/libcfa/src/stdhdr/malloc.h /var/lib/jenkins/workspace/Cforall_master/libcfa/src/stdhdr/time.h /var/lib/jenkins/workspace/Cforall_master/libcfa/src/stdhdr/signal.h /var/lib/jenkins/workspace/Cforall_master/libcfa/src/stdhdr/stdbool.h /var/lib/jenkins/workspace/Cforall_master/libcfa/src/stdhdr/unistd.h /var/lib/jenkins/workspace/Cforall_master/libcfa/src/stdhdr/stdatomic.h /var/lib/jenkins/workspace/Cforall_master/libcfa/src/stdhdr/stdint.h /var/lib/jenkins/workspace/Cforall_master/libcfa/src/stdhdr/gmp.h /var/lib/jenkins/workspace/Cforall_master/libcfa/src/stdhdr/locale.h /var/lib/jenkins/workspace/Cforall_master/libcfa/src/stdhdr/string.h /var/lib/jenkins/workspace/Cforall_master/libcfa/src/stdhdr/fenv.h /var/lib/jenkins/workspace/Cforall_master/libcfa/src/stdhdr/wchar.h /var/lib/jenkins/workspace/Cforall_master/libcfa/src/stdhdr/tgmath.h /var/lib/jenkins/workspace/Cforall_master/libcfa/src/stdhdr/math.h /var/lib/jenkins/workspace/Cforall_master/libcfa/src/stdhdr/pthread.h /var/lib/jenkins/workspace/Cforall_master/libcfa/src/stdhdr/complex.h /var/lib/jenkins/workspace/Cforall_master/libcfa/src/stdhdr/wctype.h /var/lib/jenkins/workspace/Cforall_master/libcfa/src/stdhdr/unwind.h /var/lib/jenkins/workspace/Cforall_master/libcfa/src/stdhdr/float.h /var/lib/jenkins/workspace/Cforall_master/libcfa/src/stdhdr/stdarg.h /var/lib/jenkins/workspace/Cforall_master/libcfa/src/stdhdr/stdlib.h /var/lib/jenkins/workspace/Cforall_master/libcfa/src/stdhdr/iso646.h /var/lib/jenkins/workspace/Cforall_master/libcfa/src/stdhdr/stddef.h /var/lib/jenkins/workspace/Cforall_master/libcfa/src/stdhdr/stdnoreturn.h /var/lib/jenkins/workspace/Cforall_master/libcfa/src/stdhdr/assert.h /var/lib/jenkins/workspace/Cforall_master/libcfa/src/stdhdr/ctype.h /var/lib/jenkins/workspace/Cforall_master/libcfa/src/stdhdr/errno.h /var/lib/jenkins/workspace/Cforall_master/libcfa/src/stdhdr/threads.h /var/lib/jenkins/workspace/Cforall_master/libcfa/src/stdhdr/uchar.h /var/lib/jenkins/workspace/Cforall_master/libcfa/src/stdhdr/inttypes.h /var/lib/jenkins/workspace/Cforall_master/libcfa/src/stdhdr/limits.h /var/lib/jenkins/workspace/Cforall_master/libcfa/src/stdhdr/setjmp.h '/var/lib/jenkins/workspace/Cforall_master@tmp/include/cfa//stdhdr'
/usr/bin/mkdir -p '/var/lib/jenkins/workspace/Cforall_master@tmp/include/cfa//collections'
/usr/bin/install -c -m 644 /var/lib/jenkins/workspace/Cforall_master/libcfa/src/collections/maybe.hfa /var/lib/jenkins/workspace/Cforall_master/libcfa/src/collections/pair.hfa /var/lib/jenkins/workspace/Cforall_master/libcfa/src/collections/result.hfa /var/lib/jenkins/workspace/Cforall_master/libcfa/src/collections/string.hfa /var/lib/jenkins/workspace/Cforall_master/libcfa/src/collections/string_res.hfa /var/lib/jenkins/workspace/Cforall_master/libcfa/src/collections/vector.hfa /var/lib/jenkins/workspace/Cforall_master/libcfa/src/collections/array.hfa /var/lib/jenkins/workspace/Cforall_master/libcfa/src/collections/list.hfa /var/lib/jenkins/workspace/Cforall_master/libcfa/src/collections/list2.hfa /var/lib/jenkins/workspace/Cforall_master/libcfa/src/collections/lockfree.hfa /var/lib/jenkins/workspace/Cforall_master/libcfa/src/collections/string_sharectx.hfa /var/lib/jenkins/workspace/Cforall_master/libcfa/src/collections/vector2.hfa '/var/lib/jenkins/workspace/Cforall_master@tmp/include/cfa//collections'
libtool: install: (cd /var/lib/jenkins/workspace/Cforall_master@tmp/lib/cfa/arm64-debug && { ln -s -f libcfa.so.1.0.0 libcfa.so || { rm -f libcfa.so && ln -s libcfa.so.1.0.0 libcfa.so; }; })
libtool: install: /usr/bin/install -c .libs/libcfa.lai /var/lib/jenkins/workspace/Cforall_master@tmp/lib/cfa/arm64-debug/libcfa.la
libtool: install: /usr/bin/install -c .libs/libcfathread.so.1.0.0 /var/lib/jenkins/workspace/Cforall_master@tmp/lib/cfa/arm64-debug/libcfathread.so.1.0.0
libtool: install: (cd /var/lib/jenkins/workspace/Cforall_master@tmp/lib/cfa/arm64-debug && { ln -s -f libcfathread.so.1.0.0 libcfathread.so.1 || { rm -f libcfathread.so.1 && ln -s libcfathread.so.1.0.0 libcfathread.so.1; }; })
libtool: install: (cd /var/lib/jenkins/workspace/Cforall_master@tmp/lib/cfa/arm64-debug && { ln -s -f libcfathread.so.1.0.0 libcfathread.so || { rm -f libcfathread.so && ln -s libcfathread.so.1.0.0 libcfathread.so; }; })
libtool: install: /usr/bin/install -c .libs/libcfathread.lai /var/lib/jenkins/workspace/Cforall_master@tmp/lib/cfa/arm64-debug/libcfathread.la
libtool: warning: remember to run 'libtool --finish /var/lib/jenkins/workspace/Cforall_master@tmp/lib/cfa/arm64-debug/'
make[3]: Nothing to be done for 'install-exec-am'.
make[3]: Nothing to be done for 'install-data-am'.
Making install in libcfa/arm64-nodebug
Making install in prelude
make[3]: Nothing to be done for 'install-exec-am'.
/usr/bin/mkdir -p '/var/lib/jenkins/workspace/Cforall_master@tmp/lib/cfa/arm64-nodebug/'
/usr/bin/install -c -m 644 gcc-builtins.cfa builtins.cfa extras.cfa prelude.cfa bootloader.c defines.hfa '/var/lib/jenkins/workspace/Cforall_master@tmp/lib/cfa/arm64-nodebug/'
Making install in src
/usr/bin/mkdir -p '/var/lib/jenkins/workspace/Cforall_master@tmp/lib/cfa/arm64-nodebug/'
/bin/bash ../libtool --mode=install /usr/bin/install -c libcfa.la libcfathread.la '/var/lib/jenkins/workspace/Cforall_master@tmp/lib/cfa/arm64-nodebug/'
/usr/bin/mkdir -p '/var/lib/jenkins/workspace/Cforall_master@tmp/include/cfa/'
/usr/bin/mkdir -p '/var/lib/jenkins/workspace/Cforall_master@tmp/include/cfa//stdhdr/sys'
/usr/bin/install -c -m 644 /var/lib/jenkins/workspace/Cforall_master/libcfa/src/stdhdr/sys/mman.h /var/lib/jenkins/workspace/Cforall_master/libcfa/src/stdhdr/sys/time.h /var/lib/jenkins/workspace/Cforall_master/libcfa/src/stdhdr/sys/socket.h '/var/lib/jenkins/workspace/Cforall_master@tmp/include/cfa//stdhdr/sys'
/usr/bin/mkdir -p '/var/lib/jenkins/workspace/Cforall_master@tmp/include/cfa//algorithms'
/usr/bin/install -c -m 644 /var/lib/jenkins/workspace/Cforall_master/libcfa/src/algorithms/range_iterator.hfa '/var/lib/jenkins/workspace/Cforall_master@tmp/include/cfa//algorithms'
/usr/bin/mkdir -p '/var/lib/jenkins/workspace/Cforall_master@tmp/include/cfa//concurrency/kernel'
/usr/bin/install -c -m 644 /var/lib/jenkins/workspace/Cforall_master/libcfa/src/concurrency/kernel/cluster.hfa /var/lib/jenkins/workspace/Cforall_master/libcfa/src/concurrency/kernel/fwd.hfa '/var/lib/jenkins/workspace/Cforall_master@tmp/include/cfa//concurrency/kernel'
/usr/bin/install -c -m 644 /var/lib/jenkins/workspace/Cforall_master/libcfa/src/common.hfa /var/lib/jenkins/workspace/Cforall_master/libcfa/src/fstream.hfa /var/lib/jenkins/workspace/Cforall_master/libcfa/src/heap.hfa /var/lib/jenkins/workspace/Cforall_master/libcfa/src/iostream.hfa /var/lib/jenkins/workspace/Cforall_master/libcfa/src/iterator.hfa /var/lib/jenkins/workspace/Cforall_master/libcfa/src/limits.hfa /var/lib/jenkins/workspace/Cforall_master/libcfa/src/math.hfa /var/lib/jenkins/workspace/Cforall_master/libcfa/src/memory.hfa /var/lib/jenkins/workspace/Cforall_master/libcfa/src/parseargs.hfa /var/lib/jenkins/workspace/Cforall_master/libcfa/src/parseconfig.hfa /var/lib/jenkins/workspace/Cforall_master/libcfa/src/rational.hfa /var/lib/jenkins/workspace/Cforall_master/libcfa/src/stdlib.hfa /var/lib/jenkins/workspace/Cforall_master/libcfa/src/strstream.hfa /var/lib/jenkins/workspace/Cforall_master/libcfa/src/time.hfa /var/lib/jenkins/workspace/Cforall_master/libcfa/src/Exception.hfa /var/lib/jenkins/workspace/Cforall_master/libcfa/src/bitmanip.hfa /var/lib/jenkins/workspace/Cforall_master/libcfa/src/clock.hfa /var/lib/jenkins/workspace/Cforall_master/libcfa/src/exception.hfa /var/lib/jenkins/workspace/Cforall_master/libcfa/src/exception.h /var/lib/jenkins/workspace/Cforall_master/libcfa/src/gmp.hfa /var/lib/jenkins/workspace/Cforall_master/libcfa/src/math.trait.hfa /var/lib/jenkins/workspace/Cforall_master/libcfa/src/raii.hfa /var/lib/jenkins/workspace/Cforall_master/libcfa/src/time_t.hfa /var/lib/jenkins/workspace/Cforall_master/libcfa/src/virtual_dtor.hfa '/var/lib/jenkins/workspace/Cforall_master@tmp/include/cfa//.'
/usr/bin/mkdir -p '/var/lib/jenkins/workspace/Cforall_master@tmp/include/cfa//concurrency'
/usr/bin/install -c -m 644 /var/lib/jenkins/workspace/Cforall_master/libcfa/src/concurrency/iofwd.hfa /var/lib/jenkins/workspace/Cforall_master/libcfa/src/concurrency/barrier.hfa /var/lib/jenkins/workspace/Cforall_master/libcfa/src/concurrency/alarm.hfa /var/lib/jenkins/workspace/Cforall_master/libcfa/src/concurrency/coroutine.hfa /var/lib/jenkins/workspace/Cforall_master/libcfa/src/concurrency/exception.hfa /var/lib/jenkins/workspace/Cforall_master/libcfa/src/concurrency/kernel.hfa /var/lib/jenkins/workspace/Cforall_master/libcfa/src/concurrency/locks.hfa /var/lib/jenkins/workspace/Cforall_master/libcfa/src/concurrency/monitor.hfa /var/lib/jenkins/workspace/Cforall_master/libcfa/src/concurrency/mutex.hfa /var/lib/jenkins/workspace/Cforall_master/libcfa/src/concurrency/select.hfa /var/lib/jenkins/workspace/Cforall_master/libcfa/src/concurrency/thread.hfa /var/lib/jenkins/workspace/Cforall_master/libcfa/src/concurrency/cofor.hfa /var/lib/jenkins/workspace/Cforall_master/libcfa/src/concurrency/invoke.h /var/lib/jenkins/workspace/Cforall_master/libcfa/src/concurrency/future.hfa /var/lib/jenkins/workspace/Cforall_master/libcfa/src/concurrency/once.hfa /var/lib/jenkins/workspace/Cforall_master/libcfa/src/concurrency/mutex_stmt.hfa /var/lib/jenkins/workspace/Cforall_master/libcfa/src/concurrency/channel.hfa /var/lib/jenkins/workspace/Cforall_master/libcfa/src/concurrency/actor.hfa '/var/lib/jenkins/workspace/Cforall_master@tmp/include/cfa//concurrency'
/usr/bin/mkdir -p '/var/lib/jenkins/workspace/Cforall_master@tmp/include/cfa//concurrency/clib'
/usr/bin/install -c -m 644 /var/lib/jenkins/workspace/Cforall_master/libcfa/src/concurrency/clib/cfathread.h '/var/lib/jenkins/workspace/Cforall_master@tmp/include/cfa//concurrency/clib'
/usr/bin/mkdir -p '/var/lib/jenkins/workspace/Cforall_master@tmp/include/cfa//device'
/usr/bin/install -c -m 644 /var/lib/jenkins/workspace/Cforall_master/libcfa/src/device/cpu.hfa '/var/lib/jenkins/workspace/Cforall_master@tmp/include/cfa//device'
/usr/bin/mkdir -p '/var/lib/jenkins/workspace/Cforall_master@tmp/include/cfa//stdhdr/libltdl'
/usr/bin/install -c -m 644 /var/lib/jenkins/workspace/Cforall_master/libcfa/src/stdhdr/libltdl/lt_dlloader.h '/var/lib/jenkins/workspace/Cforall_master@tmp/include/cfa//stdhdr/libltdl'
/usr/bin/mkdir -p '/var/lib/jenkins/workspace/Cforall_master@tmp/include/cfa//vec'
/usr/bin/install -c -m 644 /var/lib/jenkins/workspace/Cforall_master/libcfa/src/vec/vec.hfa /var/lib/jenkins/workspace/Cforall_master/libcfa/src/vec/vec2.hfa /var/lib/jenkins/workspace/Cforall_master/libcfa/src/vec/vec3.hfa /var/lib/jenkins/workspace/Cforall_master/libcfa/src/vec/vec4.hfa '/var/lib/jenkins/workspace/Cforall_master@tmp/include/cfa//vec'
/usr/bin/mkdir -p '/var/lib/jenkins/workspace/Cforall_master@tmp/include/cfa//bits'
/usr/bin/install -c -m 644 /var/lib/jenkins/workspace/Cforall_master/libcfa/src/bits/weakso_locks.hfa /var/lib/jenkins/workspace/Cforall_master/libcfa/src/bits/algorithm.hfa /var/lib/jenkins/workspace/Cforall_master/libcfa/src/bits/align.hfa /var/lib/jenkins/workspace/Cforall_master/libcfa/src/bits/collections.hfa /var/lib/jenkins/workspace/Cforall_master/libcfa/src/bits/debug.hfa /var/lib/jenkins/workspace/Cforall_master/libcfa/src/bits/defs.hfa /var/lib/jenkins/workspace/Cforall_master/libcfa/src/bits/locks.hfa /var/lib/jenkins/workspace/Cforall_master/libcfa/src/bits/collection.hfa /var/lib/jenkins/workspace/Cforall_master/libcfa/src/bits/stack.hfa /var/lib/jenkins/workspace/Cforall_master/libcfa/src/bits/queue.hfa /var/lib/jenkins/workspace/Cforall_master/libcfa/src/bits/sequence.hfa /var/lib/jenkins/workspace/Cforall_master/libcfa/src/bits/atomic.hfa /var/lib/jenkins/workspace/Cforall_master/libcfa/src/bits/random.hfa '/var/lib/jenkins/workspace/Cforall_master@tmp/include/cfa//bits'
libtool: install: /usr/bin/install -c .libs/libcfa.so.1.0.0 /var/lib/jenkins/workspace/Cforall_master@tmp/lib/cfa/arm64-nodebug/libcfa.so.1.0.0
/usr/bin/mkdir -p '/var/lib/jenkins/workspace/Cforall_master@tmp/include/cfa//stdhdr'
/usr/bin/install -c -m 644 /var/lib/jenkins/workspace/Cforall_master/libcfa/src/stdhdr/stdalign.h /var/lib/jenkins/workspace/Cforall_master/libcfa/src/stdhdr/stdio.h /var/lib/jenkins/workspace/Cforall_master/libcfa/src/stdhdr/malloc.h /var/lib/jenkins/workspace/Cforall_master/libcfa/src/stdhdr/time.h /var/lib/jenkins/workspace/Cforall_master/libcfa/src/stdhdr/signal.h /var/lib/jenkins/workspace/Cforall_master/libcfa/src/stdhdr/stdbool.h /var/lib/jenkins/workspace/Cforall_master/libcfa/src/stdhdr/unistd.h /var/lib/jenkins/workspace/Cforall_master/libcfa/src/stdhdr/stdatomic.h /var/lib/jenkins/workspace/Cforall_master/libcfa/src/stdhdr/stdint.h /var/lib/jenkins/workspace/Cforall_master/libcfa/src/stdhdr/gmp.h /var/lib/jenkins/workspace/Cforall_master/libcfa/src/stdhdr/locale.h /var/lib/jenkins/workspace/Cforall_master/libcfa/src/stdhdr/string.h /var/lib/jenkins/workspace/Cforall_master/libcfa/src/stdhdr/fenv.h /var/lib/jenkins/workspace/Cforall_master/libcfa/src/stdhdr/wchar.h /var/lib/jenkins/workspace/Cforall_master/libcfa/src/stdhdr/tgmath.h /var/lib/jenkins/workspace/Cforall_master/libcfa/src/stdhdr/math.h /var/lib/jenkins/workspace/Cforall_master/libcfa/src/stdhdr/pthread.h /var/lib/jenkins/workspace/Cforall_master/libcfa/src/stdhdr/complex.h /var/lib/jenkins/workspace/Cforall_master/libcfa/src/stdhdr/wctype.h /var/lib/jenkins/workspace/Cforall_master/libcfa/src/stdhdr/unwind.h /var/lib/jenkins/workspace/Cforall_master/libcfa/src/stdhdr/float.h /var/lib/jenkins/workspace/Cforall_master/libcfa/src/stdhdr/stdarg.h /var/lib/jenkins/workspace/Cforall_master/libcfa/src/stdhdr/stdlib.h /var/lib/jenkins/workspace/Cforall_master/libcfa/src/stdhdr/iso646.h /var/lib/jenkins/workspace/Cforall_master/libcfa/src/stdhdr/stddef.h /var/lib/jenkins/workspace/Cforall_master/libcfa/src/stdhdr/stdnoreturn.h /var/lib/jenkins/workspace/Cforall_master/libcfa/src/stdhdr/assert.h /var/lib/jenkins/workspace/Cforall_master/libcfa/src/stdhdr/ctype.h /var/lib/jenkins/workspace/Cforall_master/libcfa/src/stdhdr/errno.h /var/lib/jenkins/workspace/Cforall_master/libcfa/src/stdhdr/threads.h /var/lib/jenkins/workspace/Cforall_master/libcfa/src/stdhdr/uchar.h /var/lib/jenkins/workspace/Cforall_master/libcfa/src/stdhdr/inttypes.h /var/lib/jenkins/workspace/Cforall_master/libcfa/src/stdhdr/limits.h /var/lib/jenkins/workspace/Cforall_master/libcfa/src/stdhdr/setjmp.h '/var/lib/jenkins/workspace/Cforall_master@tmp/include/cfa//stdhdr'
libtool: install: (cd /var/lib/jenkins/workspace/Cforall_master@tmp/lib/cfa/arm64-nodebug && { ln -s -f libcfa.so.1.0.0 libcfa.so.1 || { rm -f libcfa.so.1 && ln -s libcfa.so.1.0.0 libcfa.so.1; }; })
/usr/bin/mkdir -p '/var/lib/jenkins/workspace/Cforall_master@tmp/include/cfa//collections'
/usr/bin/install -c -m 644 /var/lib/jenkins/workspace/Cforall_master/libcfa/src/collections/maybe.hfa /var/lib/jenkins/workspace/Cforall_master/libcfa/src/collections/pair.hfa /var/lib/jenkins/workspace/Cforall_master/libcfa/src/collections/result.hfa /var/lib/jenkins/workspace/Cforall_master/libcfa/src/collections/string.hfa /var/lib/jenkins/workspace/Cforall_master/libcfa/src/collections/string_res.hfa /var/lib/jenkins/workspace/Cforall_master/libcfa/src/collections/vector.hfa /var/lib/jenkins/workspace/Cforall_master/libcfa/src/collections/array.hfa /var/lib/jenkins/workspace/Cforall_master/libcfa/src/collections/list.hfa /var/lib/jenkins/workspace/Cforall_master/libcfa/src/collections/list2.hfa /var/lib/jenkins/workspace/Cforall_master/libcfa/src/collections/lockfree.hfa /var/lib/jenkins/workspace/Cforall_master/libcfa/src/collections/string_sharectx.hfa /var/lib/jenkins/workspace/Cforall_master/libcfa/src/collections/vector2.hfa '/var/lib/jenkins/workspace/Cforall_master@tmp/include/cfa//collections'
libtool: install: (cd /var/lib/jenkins/workspace/Cforall_master@tmp/lib/cfa/arm64-nodebug && { ln -s -f libcfa.so.1.0.0 libcfa.so || { rm -f libcfa.so && ln -s libcfa.so.1.0.0 libcfa.so; }; })
libtool: install: /usr/bin/install -c .libs/libcfa.lai /var/lib/jenkins/workspace/Cforall_master@tmp/lib/cfa/arm64-nodebug/libcfa.la
libtool: install: /usr/bin/install -c .libs/libcfathread.so.1.0.0 /var/lib/jenkins/workspace/Cforall_master@tmp/lib/cfa/arm64-nodebug/libcfathread.so.1.0.0
libtool: install: (cd /var/lib/jenkins/workspace/Cforall_master@tmp/lib/cfa/arm64-nodebug && { ln -s -f libcfathread.so.1.0.0 libcfathread.so.1 || { rm -f libcfathread.so.1 && ln -s libcfathread.so.1.0.0 libcfathread.so.1; }; })
libtool: install: (cd /var/lib/jenkins/workspace/Cforall_master@tmp/lib/cfa/arm64-nodebug && { ln -s -f libcfathread.so.1.0.0 libcfathread.so || { rm -f libcfathread.so && ln -s libcfathread.so.1.0.0 libcfathread.so; }; })
libtool: install: /usr/bin/install -c .libs/libcfathread.lai /var/lib/jenkins/workspace/Cforall_master@tmp/lib/cfa/arm64-nodebug/libcfathread.la
libtool: warning: remember to run 'libtool --finish /var/lib/jenkins/workspace/Cforall_master@tmp/lib/cfa/arm64-nodebug/'
make[3]: Nothing to be done for 'install-exec-am'.
make[3]: Nothing to be done for 'install-data-am'.
[Pipeline] }
[Pipeline] // dir
[Pipeline] }
[Pipeline] // stage
[Pipeline] sh
+ free -h
total used free shared buff/cache available
Mem: 502Gi 7.5Gi 491Gi 3.5Mi 5.4Gi 495Gi
Swap: 127Gi 0B 127Gi
[Pipeline] sh
+ ulimit -a
time(seconds) unlimited
file(blocks) unlimited
data(kbytes) unlimited
stack(kbytes) 8192
coredump(blocks) 0
memory(kbytes) unlimited
locked memory(kbytes) 65876424
process 2058180
nofiles 1048576
vmemory(kbytes) unlimited
locks unlimited
rtprio 0
[Pipeline] echo
-------- Test: Debug --------
[Pipeline] stage
[Pipeline] { (Test: Debug)
[Pipeline] dir
Running in /var/lib/jenkins/workspace/Cforall_master@tmp
[Pipeline] {
[Pipeline] sh
+ nproc
+ make -j 96 --no-print-directory -C tests timeout=600 global-timeout=14400 tests debug=yes archive-errors=/var/lib/jenkins/workspace/Cforall_master@tmp/tests/crashes/full-debug
Running 375 tests on 96 cores (arm64 - debug)
array-ERR3 PASSED C 0:00.117 - R n/a
array-ERR2 PASSED C 0:00.129 - R n/a
...ollections/language-dim-mismatch PASSED C 0:00.361 - R n/a
concurrency/mainError PASSED C 0:00.463 - R n/a
concurrency/keywordErrors PASSED C 0:00.653 - R n/a
array-collections/symtab-collision PASSED C 0:00.886 - R n/a
castError PASSED C 0:00.903 - R n/a
concurrency/ctor-check PASSED C 0:01.209 - R n/a
array-collections/safety-summary PASSED C 0:01.294 - R n/a
attr-priority PASSED C 0:01.484 - R 0:00.004
array-ERR1 PASSED C 0:01.563 - R n/a
array PASSED C 0:01.725 - R 0:00.039
array-collections/c-dependent PASSED C 0:01.741 - R 0:00.071
cast PASSED C 0:01.730 - R 0:00.133
array-collections/array-raii-c PASSED C 0:01.899 - R 0:00.046
castReturn PASSED C 0:01.899 - R 0:00.075
builtins/sync PASSED C 0:01.993 - R 0:00.023
array-collections/dimexpr-match-c PASSED C 0:02.146 - R 0:00.022
array-collections/array-sbscr-types PASSED C 0:02.613 - R 0:00.128
concurrency/clib_tls PASSED C 0:02.757 - R 0:00.072
array-collections/dimexpr-match-cfa PASSED C 0:02.923 - R 0:00.076
...ns/vector-err-retn-perm-it-byval PASSED C 0:03.068 - R n/a
array-collections/array-basic PASSED C 0:03.118 - R 0:00.127
concurrency/clib PASSED C 0:02.852 - R 0:00.377
array-collections/boxed PASSED C 0:03.282 - R 0:00.120
...ns/vector-err-pass-perm-it-byval PASSED C 0:03.641 - R n/a
avl_test PASSED C 0:05.406 - R 0:00.021
collections/string-operator-ERR16 PASSED C 0:05.439 - R n/a
collections/string-operator-ERR15 PASSED C 0:05.472 - R n/a
collections/string-operator-ERR11 PASSED C 0:05.542 - R n/a
collections/string-operator-ERR13 PASSED C 0:05.589 - R n/a
collections/string-operator-ERR09 PASSED C 0:05.645 - R n/a
...urrency/pthread/pthread_key_test PASSED C 0:04.193 - R 0:00.037
collections/vector-demo PASSED C 0:06.164 - R 0:00.024
alloc-ERROR PASSED C 0:06.244 - R n/a
algorithms/range_test PASSED C 0:06.859 - R 0:00.037
complex PASSED C 0:07.110 - R 0:00.083
array-collections/accordion PASSED C 0:07.309 - R 0:00.024
array-collections/array-raii-cfa PASSED C 0:07.321 - R 0:00.023
collections/string-gc PASSED C 0:07.401 - R 0:00.024
collections/string-istream PASSED C 0:08.459 - R 0:00.021
concurrency/cluster PASSED C 0:08.394 - R 0:00.070
concurrency/futures/abandon PASSED C 0:08.623 - R 0:00.227
collections/stack PASSED C 0:09.265 - R 0:00.023
concurrency/futures/basic PASSED C 0:09.112 - R 0:00.176
concurrency/park/contention PASSED C 0:08.752 - R 0:00.123
concurrency/park/start_parked PASSED C 0:08.531 - R 0:00.127
collections/multi_list PASSED C 0:09.856 - R 0:00.022
collections/string-compare PASSED C 0:10.043 - R 0:00.046
collections/string-ostream PASSED C 0:10.156 - R 0:00.124
collections/queue PASSED C 0:10.594 - R 0:00.076
collections/string-ctx-manage PASSED C 0:10.805 - R 0:00.042
collections/sequence PASSED C 0:10.823 - R 0:00.044
collections/string-istream-manip PASSED C 0:11.153 - R 0:00.072
concurrency/cofor PASSED C 0:11.143 - R 0:00.130
collections/string-operator PASSED C 0:11.362 - R 0:00.075
collections/string-overwrite PASSED C 0:12.130 - R 0:00.076
...ections/string-overwrite-noshare PASSED C 0:12.183 - R 0:00.070
concurrency/migrate PASSED C 0:12.022 - R 0:00.228
concurrency/examples/matrixSum PASSED C 0:12.250 - R 0:00.125
concurrency/join PASSED C 0:12.393 - R 0:00.040
concurrency/examples/gortn PASSED C 0:12.328 - R 0:00.120
concurrency/examples/datingService PASSED C 0:12.471 - R 0:00.178
concurrency/coroutineYield PASSED C 0:12.989 - R 0:00.074
const-init PASSED C 0:01.624 - R 0:00.074
concurrency/park/force_preempt PASSED C 0:12.146 - R 0:00.421
alloc PASSED C 0:13.487 - R 0:00.072
...pthread/pthread_demo_create_join PASSED C 0:11.941 - R 0:00.076
...rrency/pthread/pthread_attr_test PASSED C 0:12.173 - R 0:00.125
...rrency/pthread/pthread_once_test PASSED C 0:12.003 - R 0:00.070
...rrency/pthread/pthread_cond_test PASSED C 0:12.288 - R 0:00.180
...ions/string-api-coverage-noshare PASSED C 0:14.083 - R 0:00.072
collections/string-api-coverage PASSED C 0:14.045 - R 0:00.121
const-ref PASSED C 0:01.992 - R 0:00.024
concurrency/readyQ/leader_spin PASSED C 0:11.886 - R 0:00.831
concurrency/barrier/order PASSED C 0:14.666 - R 0:00.182
concurrency/waitfor/parse PASSED C 0:07.475 - R 0:00.040
concurrency/examples/quickSort PASSED C 0:14.830 - R 0:00.039
concurrency/futures/wait_any PASSED C 0:14.971 - R 0:00.125
concurrency/once PASSED C 0:14.585 - R 0:00.327
concurrency/barrier/last PASSED C 0:15.117 - R 0:00.335
concurrency/mutexstmt/tuple PASSED C 0:15.277 - R 0:00.039
ctrl-flow/labelledExit PASSED C 0:01.740 - R 0:00.072
concurrency/suspend_then PASSED C 0:12.858 - R 0:00.122
ctrl-flow/loop-inc PASSED C 0:01.720 - R 0:00.122
concurrency/barrier/generation PASSED C 0:14.519 - R 0:01.630
concurrency/sleep PASSED C 0:12.624 - R 0:01.231
enum_tests/lvalue PASSED C 0:00.786 - R n/a
concurrency/signal/wait PASSED C 0:13.228 - R 0:00.940
enum PASSED C 0:01.751 - R 0:00.071
concurrency/thread PASSED C 0:13.905 - R 0:00.071
...cy/unified_locking/pthread_locks PASSED C 0:11.186 - R 0:00.376
alloc2 PASSED C 0:17.118 - R 0:00.124
concurrency/lockfree_stack PASSED C 0:11.922 - R 0:05.344
errors/declaration PASSED C 0:00.162 - R n/a
errors/scope-type PASSED C 0:00.266 - R n/a
errors/signature PASSED C 0:00.208 - R n/a
concurrency/waitfor/else PASSED C 0:10.333 - R 0:00.072
concurrency/mutexstmt/monitors PASSED C 0:09.302 - R 0:08.260
concurrency/readyQ/barrier_sleeper PASSED C 0:14.512 - R 0:01.225
...ency/unified_locking/exp_backoff PASSED C 0:14.446 - R 0:00.120
.../unified_locking/block_spin_lock PASSED C 0:14.423 - R 0:00.171
concurrency/actors/static PASSED C 0:17.507 - R 0:00.376
enum_tests/inc-dec PASSED C 0:01.880 - R 0:00.127
designations PASSED C 0:03.060 - R 0:00.045
concurrency/actors/inline PASSED C 0:17.991 - R 0:00.069
errors/scope PASSED C 0:00.829 - R n/a
enum_tests/funcEnum PASSED C 0:02.639 - R 0:00.041
concurrency/actors/poison PASSED C 0:18.174 - R 0:00.174
concurrency/actors/executor PASSED C 0:18.126 - R 0:00.227
concurrency/actors/inherit PASSED C 0:18.244 - R 0:00.124
concurrency/actors/types PASSED C 0:18.554 - R 0:00.120
...ncy/unified_locking/timeout_lock PASSED C 0:11.191 - R 0:01.433
.../unified_locking/fast_block_lock PASSED C 0:15.345 - R 0:00.224
concurrency/actors/pingpong PASSED C 0:18.863 - R 0:00.172
eval PASSED C 0:01.439 - R 0:00.042
concurrency/waitfor/barge PASSED C 0:12.400 - R 0:00.621
concurrency/actors/matrixMultiply PASSED C 0:17.989 - R 0:01.381
concurrency/signal/block PASSED C 0:12.932 - R 0:04.749
enum_tests/structEnum PASSED C 0:02.722 - R 0:00.041
...urrency/waitfor/lexical_priority PASSED C 0:12.375 - R 0:00.071
exceptions/try-ctrl-flow PASSED C 0:00.536 - R n/a
...nified_locking/simple_owner_lock PASSED C 0:14.379 - R 0:00.119
counter PASSED C 0:06.851 - R 0:00.072
exceptions/type-check PASSED C 0:00.692 - R n/a
copyfile PASSED C 0:08.143 - R 0:00.071
...fied_locking/mcs_block_spin_lock PASSED C 0:14.352 - R 0:00.982
ctrl-flow/fallthrough PASSED C 0:07.238 - R 0:00.074
coroutine/devicedriver PASSED C 0:08.579 - R 0:00.070
configs/parsebools PASSED C 0:09.720 - R 0:00.379
ctrl-flow/break-misc PASSED C 0:07.398 - R 0:00.039
concurrency/signal/disjoint PASSED C 0:12.906 - R 0:06.044
exceptions/try-leave-catch PASSED C 0:01.737 - R 0:00.020
configs/parseconfig PASSED C 0:09.946 - R 0:00.072
coroutine/fmtLines PASSED C 0:08.779 - R 0:00.036
ctrl-flow/ifwhileCtl PASSED C 0:07.322 - R 0:00.039
coroutine/pingpong PASSED C 0:08.762 - R 0:00.118
configs/usage PASSED C 0:10.184 - R 0:00.071
concurrency/waitfor/statment PASSED C 0:12.972 - R 0:00.120
exceptions/message PASSED C 0:03.262 - R 0:00.042
ctrl-flow/loop_else PASSED C 0:07.426 - R 0:00.070
coroutine/raii PASSED C 0:08.518 - R 0:00.072
expression PASSED C 0:01.758 - R 0:00.122
concurrency/futures/typed PASSED C 0:21.561 - R 0:00.222
coroutine/runningTotal PASSED C 0:08.516 - R 0:00.122
concurrency/preempt PASSED C 0:13.905 - R 0:07.013
concurrency/waitfor/when PASSED C 0:12.995 - R 0:00.476
concurrency/waituntil/timeout PASSED C 0:07.921 - R 0:03.290
coroutine/fibonacci PASSED C 0:09.674 - R 0:00.037
ctrl-flow/goto PASSED C 0:08.764 - R 0:00.071
enum_tests/anonymous PASSED C 0:07.087 - R 0:00.076
global-monomorph PASSED C 0:01.480 - R 0:00.024
init1-ERROR PASSED C 0:00.859 - R n/a
ctrl-flow/loop_else-WRN1 PASSED C 0:08.402 - R 0:00.004
...rrency/pthread/pthread_demo_lock PASSED C 0:12.006 - R 0:08.931
identFuncDeclarator PASSED C 0:01.517 - R 0:00.037
identParamDeclarator PASSED C 0:01.497 - R 0:00.024
init1 PASSED C 0:01.534 - R 0:00.021
coroutine/prodcons PASSED C 0:10.561 - R 0:00.037
enum_tests/input PASSED C 0:07.257 - R 0:00.034
enum_tests/enumInlineValue PASSED C 0:07.739 - R 0:00.124
ctrl-flow/loopctrl PASSED C 0:08.813 - R 0:00.021
enum_tests/typedIntEnum PASSED C 0:06.721 - R 0:00.040
enum_tests/stringEnum PASSED C 0:06.994 - R 0:00.021
include/vector-sequence PASSED C 0:02.182 - R 0:00.040
enum_tests/voidEnum PASSED C 0:06.866 - R 0:00.046
limits PASSED C 0:01.591 - R 0:00.042
div PASSED C 0:09.523 - R 0:00.041
include/vector-collections PASSED C 0:03.103 - R 0:00.070
linking/nostdlib PASSED C 0:01.506 - R 0:00.027
exceptions/conditional PASSED C 0:07.096 - R 0:00.123
exceptions/data-except PASSED C 0:07.010 - R 0:00.073
exceptions/finally PASSED C 0:06.951 - R 0:00.036
exceptions/defaults PASSED C 0:07.268 - R 0:00.021
exceptions/interact PASSED C 0:07.064 - R 0:00.040
enum_tests/planet PASSED C 0:09.133 - R 0:00.040
nested-types-ERR1 PASSED C 0:00.170 - R n/a
device/cpu PASSED C 0:10.523 - R 0:00.119
exceptions/polymorphic PASSED C 0:07.022 - R 0:00.127
concurrency/waitfor/dtor PASSED C 0:12.143 - R 0:06.553
linkonce PASSED C 0:01.699 - R 0:00.024
nested-types-ERR2 PASSED C 0:00.368 - R n/a
exceptions/trash PASSED C 0:06.861 - R 0:00.073
enum_tests/position PASSED C 0:09.257 - R 0:00.077
exceptions/resume PASSED C 0:07.413 - R 0:00.036
exceptions/cancel/coroutine PASSED C 0:08.506 - R 0:00.071
concurrency/channels/daisy_chain PASSED C 0:16.131 - R 0:10.120
opt-params PASSED C 0:00.119 - R n/a
exceptions/conditional-threads PASSED C 0:08.432 - R 0:00.125
exceptions/terminate PASSED C 0:07.313 - R 0:00.076
exceptions/finally-threads PASSED C 0:08.483 - R 0:00.035
nested-types PASSED C 0:01.465 - R 0:00.025
concurrency/channels/zero_size PASSED C 0:16.547 - R 0:10.232
concurrency/channels/hot_potato PASSED C 0:16.643 - R 0:10.125
exceptions/virtual-poly PASSED C 0:06.971 - R 0:00.022
concurrency/channels/pub_sub PASSED C 0:16.731 - R 0:10.164
maybe PASSED C 0:01.918 - R 0:00.074
fstream_test PASSED C 0:06.781 - R 0:00.039
polybits PASSED C 0:00.323 - R n/a
nowarn/no-autogen PASSED C 0:01.577 - R 0:00.077
nowarn/exception PASSED C 0:01.669 - R 0:00.039
concurrency/channels/churn PASSED C 0:17.118 - R 0:10.159
exceptions/defaults-threads PASSED C 0:09.251 - R 0:00.120
nowarn/zero-thunk PASSED C 0:01.434 - R 0:00.125
generator/fibonacci PASSED C 0:06.844 - R 0:00.037
nowarn/array PASSED C 0:01.788 - R 0:00.040
nowarn/printf-sizeof PASSED C 0:01.738 - R 0:00.042
nowarn/unused PASSED C 0:01.640 - R 0:00.046
operators PASSED C 0:01.501 - R 0:00.070
poly-member PASSED C 0:01.375 - R 0:00.040
genericUnion PASSED C 0:06.792 - R 0:00.021
poly-bare-assn PASSED C 0:01.567 - R 0:00.040
concurrency/waitfor/recurse PASSED C 0:12.744 - R 0:07.662
poly-d-cycle PASSED C 0:01.516 - R 0:00.072
numericConstants PASSED C 0:01.732 - R 0:00.040
generator/suspend_then PASSED C 0:06.882 - R 0:00.038
linking/exception-nothreads PASSED C 0:04.999 - R 0:00.039
exceptions/resume-threads PASSED C 0:09.094 - R 0:00.069
forall PASSED C 0:07.834 - R 0:00.041
poly-many-arsz PASSED C 0:01.756 - R 0:00.037
raii/ctor-autogen-ERR1 PASSED C 0:00.936 - R n/a
exceptions/terminate-threads PASSED C 0:08.929 - R 0:00.123
poly-selection PASSED C 0:01.434 - R 0:00.073
hello PASSED C 0:06.946 - R 0:00.074
include/stdincludes PASSED C 0:06.755 - R 0:00.021
concurrency/channels/ping_pong PASSED C 0:18.130 - R 0:10.072
identity PASSED C 0:06.858 - R 0:00.040
poly-o-cycle PASSED C 0:01.687 - R 0:00.121
concurrency/channels/contend PASSED C 0:18.157 - R 0:10.219
raii/partial-ERR1 PASSED C 0:00.980 - R n/a
poly-self-cycle PASSED C 0:01.710 - R 0:00.036
generator/fmtLines PASSED C 0:07.587 - R 0:00.125
exceptions/virtual-cast PASSED C 0:08.821 - R 0:00.077
typedefRedef-ERR1 PASSED C 0:00.196 - R n/a
concurrency/waituntil/basic_else PASSED C 0:19.484 - R 0:00.037
raii/partial PASSED C 0:01.420 - R 0:00.039
include/vector-fstream PASSED C 0:07.234 - R 0:00.039
var-assert PASSED C 0:00.260 - R n/a
raii/typeof-member PASSED C 0:01.520 - R 0:00.037
quasiKeyword PASSED C 0:02.317 - R 0:00.125
exceptions/fibonacci_nonlocal PASSED C 0:11.207 - R 0:00.127
concurrency/futures/future_except PASSED C 0:29.256 - R 0:00.074
raii/init_once PASSED C 0:02.054 - R 0:00.078
switch PASSED C 0:01.410 - R 0:00.130
io/eofType PASSED C 0:07.714 - R 0:00.127
tuple/tupleCast PASSED C 0:01.481 - R 0:00.059
concurrency/channels/big_elems PASSED C 0:17.078 - R 0:12.738
meta/fork+exec PASSED C 0:04.637 - R 0:00.177
tuple/tupleFunction PASSED C 0:01.750 - R 0:00.026
smart-pointers PASSED C 0:01.995 - R 0:00.076
simpleGenericTriple PASSED C 0:02.078 - R 0:00.069
raii/ctor-autogen PASSED C 0:02.882 - R 0:00.054
result PASSED C 0:02.177 - R 0:00.137
typedefRedef PASSED C 0:01.703 - R 0:00.063
tuple/tuplePolymorphism PASSED C 0:01.962 - R 0:00.059
exceptions/cancel/thread PASSED C 0:12.582 - R 0:00.074
tuple/tupleMember PASSED C 0:02.017 - R 0:00.039
typeof PASSED C 0:01.820 - R 0:00.023
linking/exception-withthreads PASSED C 0:07.168 - R 0:00.081
exceptions/cor_resumer PASSED C 0:12.731 - R 0:00.060
withconflict PASSED C 0:00.840 - R n/a
variableDeclarator PASSED C 0:01.866 - R 0:00.049
linking/mangling/anon PASSED C 0:07.430 - R 0:00.036
function-operator PASSED C 0:10.363 - R 0:00.077
warnings/self-assignment PASSED C 0:01.464 - R 0:00.004
...collections/dimexpr-match-c-ERRS PASSED C 0:01.048 - R n/a
exceptions/pingpong_nonlocal PASSED C 0:12.883 - R 0:00.125
KRfunctions PASSED C 0:01.502 - R 0:00.005
voidPtr PASSED C 0:01.745 - R 0:00.124
errors/completeType PASSED C 0:00.932 - R n/a
list/dlist-insert-remove PASSED C 0:07.661 - R 0:00.071
raii/memberCtors-ERR1 PASSED C 0:04.692 - R n/a
declarationSpecifier PASSED C 0:01.408 - R 0:00.008
list/dlist2-insert-remove PASSED C 0:07.776 - R 0:00.077
...llections/dimexpr-match-cfa-ERRS PASSED C 0:02.006 - R n/a
literals PASSED C 0:07.818 - R 0:00.048
linking/io-acquire PASSED C 0:09.150 - R 0:00.023
raii/dtor-early-exit-ERR2 PASSED C 0:05.307 - R n/a
collections/atomic_mpsc PASSED C 0:12.406 - R 0:20.371
raii/dtor-early-exit-ERR1 PASSED C 0:05.481 - R n/a
io/io PASSED C 0:10.792 - R 0:00.071
extension PASSED C 0:01.430 - R 0:00.002
linking/nothreads PASSED C 0:09.247 - R 0:00.071
attributes PASSED C 0:02.432 - R 0:00.002
tuple/tupleVariadic PASSED C 0:04.776 - R 0:00.037
io/manipulatorsOutput4 PASSED C 0:10.296 - R 0:00.071
linking/weakso_nothd PASSED C 0:09.269 - R 0:00.022
gccExtensions PASSED C 0:01.541 - R 0:00.005
io/manipulatorsInput-uchunk PASSED C 0:10.535 - R 0:00.122
meta/arch PASSED C 0:00.839 - R n/a
functions PASSED C 0:01.911 - R 0:00.002
arithmeticConversions PASSED C 0:03.487 - R 0:00.037
zero_one-ERR1 PASSED C 0:03.764 - R n/a
polymorphism PASSED C 0:07.100 - R 0:00.039
raii/globals PASSED C 0:06.838 - R 0:00.039
meta/dumpable PASSED C 0:09.245 - R 0:00.039
raii/boxed-types PASSED C 0:07.153 - R 0:00.124
raii/memberCtors PASSED C 0:06.969 - R 0:00.036
quotedKeyword PASSED C 0:07.449 - R 0:00.037
io/io-acquire-in PASSED C 0:12.198 - R 0:00.169
concurrency/waituntil/one_chan PASSED C 0:13.885 - R 0:10.423
tuplearray PASSED C 0:06.816 - R 0:00.037
malloc PASSED C 0:10.465 - R 0:00.038
concurrency/preempt2 PASSED C 0:12.655 - R 0:21.391
sizeof PASSED C 0:07.358 - R 0:00.035
references PASSED C 0:07.462 - R 0:00.038
io/io-acquire-out PASSED C 0:12.694 - R 0:00.171
strstream PASSED C 0:07.341 - R 0:00.038
shortCircuit PASSED C 0:07.612 - R 0:00.036
linking/withthreads PASSED C 0:11.657 - R 0:00.035
tuple/tupleAssign PASSED C 0:07.731 - R 0:00.037
io/io-acquire2 PASSED C 0:13.540 - R 0:00.375
concurrency/waituntil/channel_close PASSED C 0:17.226 - R 0:10.060
time PASSED C 0:08.475 - R 0:00.040
zero_one PASSED C 0:06.857 - R 0:00.035
vector PASSED C 0:08.277 - R 0:00.038
io/away_fair FAILED with code -6 C 0:14.846 - R 0:00.269
starting
100
200
300
400
500
600
700
800
900
1000
done
Processor (0xfffff7fb12c0) tearing down ring with 4294967295 entries allocated but not submitted, out of 256
Cforall Runtime error (UNIX pid:138368):
Stack back trace for: /var/lib/jenkins/workspace/Cforall_master@tmp/libcfa/arm64-debug/src/.libs/libcfa.so.1
(0) /var/lib/jenkins/workspace/Cforall_master@tmp/libcfa/arm64-debug/src/.libs/libcfa.so.1 : + 0xef2f8 [0xfffff7e5f2f8]
(1) /var/lib/jenkins/workspace/Cforall_master@tmp/libcfa/arm64-debug/src/.libs/libcfa.so.1 : __cabi_abort + 0 [0xfffff7e5eb10]
(2) /var/lib/jenkins/workspace/Cforall_master@tmp/libcfa/arm64-debug/src/.libs/libcfa.so.1 : _X4endsFv_S8ofstream__1 + 0x88 [0xfffff7dae888]
(3) /var/lib/jenkins/workspace/Cforall_master@tmp/libcfa/arm64-debug/src/.libs/libcfa.so.1 : _X15_operator_bitorQ1_0_0_1__X19basic_ostream_tableKS18basic_ostream_data_BD0__Fv_BD0j__1 + 0x38 [0xfffff7db8e70]
(4) /var/lib/jenkins/workspace/Cforall_master@tmp/libcfa/arm64-debug/src/.libs/libcfathread.so.1 : + 0x4b7dc [0xfffff7f3b7dc]
(5) /var/lib/jenkins/workspace/Cforall_master@tmp/libcfa/arm64-debug/src/.libs/libcfathread.so.1 : + 0x4a63c [0xfffff7f3a63c]
(6) /var/lib/jenkins/workspace/Cforall_master@tmp/libcfa/arm64-debug/src/.libs/libcfathread.so.1 : + 0x4bbd8 [0xfffff7f3bbd8]
(7) /var/lib/jenkins/workspace/Cforall_master@tmp/libcfa/arm64-debug/src/.libs/libcfathread.so.1 : + 0x56ebc [0xfffff7f46ebc]
(8) /lib/ld-linux-aarch64.so.1 : + 0xf00 [0xfffff7fbef00]
(9) /lib/ld-linux-aarch64.so.1 : + 0x4910 [0xfffff7fc2910]
(10) /lib/aarch64-linux-gnu/libc.so.6 : + 0x3f228 [0xfffff7aff228]
warning: Can't open file anon_inode:[io_uring] which was expanded to anon_inode:[io_uring] during file-backed mapping note processing
[New LWP 138368]
[Thread debugging using libthread_db enabled]
Using host libthread_db library "/lib/aarch64-linux-gnu/libthread_db.so.1".
Core was generated by `/var/lib/jenkins/workspace/Cforall_master@tmp/tests/io/away_fair'.
Program terminated with signal SIGABRT, Aborted.
#0 __pthread_kill_implementation (threadid=281474842402240, signo=signo@entry=6, no_tid=no_tid@entry=0) at ./nptl/pthread_kill.c:44
warning: 44 ./nptl/pthread_kill.c: No such file or directory
-----
#0 __pthread_kill_implementation (threadid=281474842402240, signo=signo@entry=6, no_tid=no_tid@entry=0) at ./nptl/pthread_kill.c:44
#1 0x0000fffff7b47540 in __pthread_kill_internal (signo=6, threadid=) at ./nptl/pthread_kill.c:78
#2 0x0000fffff7afcb3c in __GI_raise (sig=sig@entry=6) at ../sysdeps/posix/raise.c:26
#3 0x0000fffff7ae7e00 in __GI_abort () at ./stdlib/abort.c:79
#4 0x0000fffff7e5f058 in _X7__abortFv_bPKcY17__builtin_va_list__1 (_X11signalAbortb_1=true, _X3fmtPKc_1=0xfffff7e7e760 "Application interrupted by signal: %s.\n", _X4argsY17__builtin_va_list_1=...) at /var/lib/jenkins/workspace/Cforall_master/libcfa/src/interpose.cfa:263
#5 0x0000fffff7e5f2f8 in _X5abortFv_bPKc__1 (_X11signalAbortb_1=true, _X3fmtPKc_1=0xfffff7e7e760 "Application interrupted by signal: %s.\n") at /var/lib/jenkins/workspace/Cforall_master/libcfa/src/interpose.cfa:301
#6 0x0000fffff7e5f4bc in _X15sigHandler_termFv_iPS21__anonymous_siginfo_tPS10ucontext_t__1 (_X3sigi_1=6, _X3sfpPS21__anonymous_siginfo_t_1=0xfffff7ee1f30 , _X3cxtPS10ucontext_t_1=0xfffff7ee1fb0 ) at /var/lib/jenkins/workspace/Cforall_master/libcfa/src/interpose.cfa:337
#7
#8 __pthread_kill_implementation (threadid=281474842402240, signo=signo@entry=6, no_tid=no_tid@entry=0) at ./nptl/pthread_kill.c:44
#9 0x0000fffff7b47540 in __pthread_kill_internal (signo=6, threadid=) at ./nptl/pthread_kill.c:78
#10 0x0000fffff7afcb3c in __GI_raise (sig=sig@entry=6) at ../sysdeps/posix/raise.c:26
#11 0x0000fffff7ae7e00 in __GI_abort () at ./stdlib/abort.c:79
#12 0x0000fffff7e5f190 in _X7__abortFv_bPKcY17__builtin_va_list__1 (_X11signalAbortb_1=false, _X3fmtPKc_1=0xfffff7e7e4c0 "%s", _X4argsY17__builtin_va_list_1=...) at /var/lib/jenkins/workspace/Cforall_master/libcfa/src/interpose.cfa:286
#13 0x0000fffff7e5f2f8 in _X5abortFv_bPKc__1 (_X11signalAbortb_1=false, _X3fmtPKc_1=0xfffff7e7e4c0 "%s") at /var/lib/jenkins/workspace/Cforall_master/libcfa/src/interpose.cfa:301
#14 0x0000fffff7e5eb10 in abort () at /var/lib/jenkins/workspace/Cforall_master/libcfa/src/interpose.cfa:176
#15 0x0000fffff7dae888 in _X4endsFv_S8ofstream__1 (_X2osS8ofstream_1=0xfffff7ec1368 <_X9abortFileS8ofstream_1>) at /var/lib/jenkins/workspace/Cforall_master/libcfa/src/fstream.cfa:106
#16 0x0000fffff7db8e70 in _X15_operator_bitorQ1_0_0_1__X19basic_ostream_tableKS18basic_ostream_data_BD0__Fv_BD0j__1 (_X19basic_ostream_tableKS18basic_ostream_data_Y6ostype__1=0xfffff7ec13d8 <_X19ofstream_basic_dataS18basic_ostream_data_S8ofstream__1>, _X2osY6ostype_1=0xfffff7ec1368 <_X9abortFileS8ofstream_1>, _X1tj_1=256) at /var/lib/jenkins/workspace/Cforall_master/libcfa/src/iostream.cfa:98
#17 0x0000fffff7f3b7dc in _X19__io_uring_teardownFv_S11io_context$__1 (_X4thisS11io_context$_1=0xaaaaaaad4b00) at /var/lib/jenkins/workspace/Cforall_master/libcfa/src/concurrency/io/setup.cfa:288
#18 0x0000fffff7f3a63c in _X11_destructorFv_S11io_context$__1 (_X4thisS11io_context$_1=0xaaaaaaad4b00) at /var/lib/jenkins/workspace/Cforall_master/libcfa/src/concurrency/io/setup.cfa:125
#19 0x0000fffff7f3bbd8 in _X13__cfa_io_stopFv_PS9processor__1 (_X4procPS9processor_1=0xfffff7fb12c0 <_X21storage_mainProcessorA0c_1>) at /var/lib/jenkins/workspace/Cforall_master/libcfa/src/concurrency/io/setup.cfa:313
#20 0x0000fffff7f46ebc in _X17__kernel_shutdownFv___1 () at /var/lib/jenkins/workspace/Cforall_master/libcfa/src/concurrency/kernel/startup.cfa:312
#21 0x0000fffff7fbef00 in _dl_call_fini (closure_map=closure_map@entry=0xfffff7ff72d0) at ./elf/dl-call_fini.c:43
#22 0x0000fffff7fc2910 in _dl_fini () at ./elf/dl-fini.c:114
#23 0x0000fffff7aff228 in __run_exit_handlers (status=0, listp=0xfffff7c70670 <__exit_funcs>, run_list_atexit=run_list_atexit@entry=true, run_dtors=run_dtors@entry=true) at ./stdlib/exit.c:108
#24 0x0000fffff7aff30c in __GI_exit (status=) at ./stdlib/exit.c:138
#25 0x0000fffff7ae84c8 in __libc_start_call_main (main=main@entry=0xaaaaaaaa4e08 , argc=argc@entry=1, argv=argv@entry=0xfffffffff248) at ../sysdeps/nptl/libc_start_call_main.h:74
#26 0x0000fffff7ae8598 in __libc_start_main_impl (main=0xaaaaaaaa4e08 , argc=1, argv=0xfffffffff248, init=, fini=, rtld_fini=, stack_end=) at ../csu/libc-start.c:360
#27 0x0000aaaaaaaa31f0 in _start ()
-----
Id Target Id Frame
* 1 Thread 0xfffff7fe9dc0 (LWP 138368) __pthread_kill_implementation (threadid=281474842402240, signo=signo@entry=6, no_tid=no_tid@entry=0) at ./nptl/pthread_kill.c:44
Archiving io/away_fair (executable and core) to crashes/full-debug/io/away_fair
userLiterals PASSED C 0:08.745 - R 0:00.039
swap PASSED C 0:09.405 - R 0:00.036
io/io-acquire PASSED C 0:14.993 - R 0:00.471
minmax PASSED C 0:12.697 - R 0:00.036
raii/dtor-early-exit PASSED C 0:10.790 - R 0:00.036
sum PASSED C 0:10.288 - R 0:00.035
...collections/array-md-sbscr-cases PASSED C 0:08.185 - R 0:00.036
io/many_read PASSED C 0:15.988 - R 0:00.069
io/comp_fair PASSED C 0:16.226 - R 0:00.774
searchsort PASSED C 0:11.123 - R 0:00.036
io/comp_basic PASSED C 0:16.590 - R 0:00.620
vector_math/vec2_uint PASSED C 0:09.916 - R 0:00.037
vector_math/vec2_double PASSED C 0:10.403 - R 0:00.036
concurrency/waituntil/futures PASSED C 0:29.748 - R 0:00.068
io/manipulatorsInput PASSED C 0:08.158 - R 0:00.037
ato PASSED C 0:09.860 - R 0:00.036
gmp PASSED C 0:08.485 - R 0:00.067
abs PASSED C 0:10.226 - R 0:00.037
bitmanip1 PASSED C 0:10.430 - R 0:00.117
bitmanip2 PASSED C 0:10.525 - R 0:00.117
random PASSED C 0:08.795 - R 0:00.035
exceptions/cardgame PASSED C 0:10.440 - R 0:00.118
exceptions/hotpotato_checked PASSED C 0:10.624 - R 0:00.068
exceptions/hotpotato PASSED C 0:10.490 - R 0:00.068
bitmanip3 PASSED C 0:11.580 - R 0:00.067
io/manipulatorsOutput2 PASSED C 0:10.091 - R 0:00.035
vector_math/vec3_int PASSED C 0:13.003 - R 0:00.037
include/includes PASSED C 0:21.412 - R 0:00.021
vector_math/vec4_int PASSED C 0:13.144 - R 0:00.037
vector_math/vec2_float PASSED C 0:13.908 - R 0:00.067
vector_math/vec2_int PASSED C 0:13.941 - R 0:00.071
vector_math/vec2_ldouble PASSED C 0:10.708 - R 0:00.036
vector_math/vec3_float PASSED C 0:15.328 - R 0:00.067
mathX PASSED C 0:12.566 - R 0:00.035
math PASSED C 0:12.959 - R 0:00.035
vector_math/vec4_float PASSED C 0:16.209 - R 0:00.069
io/manipulatorsOutput1 PASSED C 0:13.942 - R 0:00.069
io/io-acquire-no-io PASSED C 0:12.178 - R 0:12.010
io/manipulatorsOutput3 PASSED C 0:14.550 - R 0:00.119
...rrency/examples/boundedBufferEXT PASSED C 0:12.455 - R 0:35.620
PRNG PASSED C 0:15.902 - R 0:02.121
...rrency/examples/boundedBufferINT PASSED C 0:12.546 - R 0:35.736
heap PASSED C 0:10.335 - R 0:18.437
concurrency/waituntil/repeat_close PASSED C 0:13.670 - R 0:30.154
rational PASSED C 0:27.673 - R 0:00.070
concurrency/waituntil/channels PASSED C 0:14.499 - R 0:32.927
concurrency/unified_locking/mcs PASSED C 0:14.008 - R 0:38.256
...ency/unified_locking/futex_mutex PASSED C 0:13.852 - R 0:42.661
concurrency/monitor PASSED C 0:12.395 - R 0:49.964
concurrency/actors/dynamic PASSED C 0:18.549 - R 0:44.721
...ency/waituntil/channel_zero_size PASSED C 0:13.489 - R 0:43.635
concurrency/waituntil/all_types PASSED C 0:34.105 - R 0:27.706
.../unified_locking/spin_queue_lock PASSED C 0:14.224 - R 0:50.739
...urrency/unified_locking/mcs_spin PASSED C 0:14.364 - R 0:54.462
concurrency/multi-monitor PASSED C 0:12.285 - R 1:08.352
concurrency/waituntil/locks PASSED C 0:15.877 - R 1:07.976
concurrency/unified_locking/locks PASSED C 0:16.156 - R 1:37.563
concurrency/mutexstmt/locks PASSED C 0:12.012 - R 2:21.563
374 passes, 1 failures, 0 timeouts, 0 cancelled, 0 other
Tests took 2:34.484
make: *** [Makefile:986: all-local] Error 1
[Pipeline] }
[Pipeline] // dir
[Pipeline] }
[Pipeline] // stage
[Pipeline] echo
Archiving core dumps
[Pipeline] dir
Running in /var/lib/jenkins/workspace/Cforall_master@tmp
[Pipeline] {
[Pipeline] fileExists
[Pipeline] sh
+ /var/lib/jenkins/workspace/Cforall_master/tools/jenkins/archive-gen.sh
[Pipeline] archiveArtifacts
Archiving artifacts
Recording fingerprints
[Pipeline] }
[Pipeline] // dir
[Pipeline] }
[Pipeline] // wrap
[Pipeline] }
[Pipeline] // node
[Pipeline] echo
hudson.AbortException: script returned exit code 2
[Pipeline] node
Running on Algol in /var/lib/jenkins/workspace/Cforall_master
[Pipeline] {
[Pipeline] echo
Notifying users of result
[Pipeline] echo
Reusing previously constructed message
[Pipeline] echo
Would send email to: cforall@lists.uwaterloo.ca
[Pipeline] echo
With title: [cforall git][BUILD# 3850 - FAILURE] - branch master
[Pipeline] echo
Content:
This is an automated email from the Jenkins build machine. It was
generated because of a git hooks/post-receive script following
a ref change which was pushed to the C∀ repository.
- Status --------------------------------------------------------------
BUILD# 3850 - FAILURE
Check console output at https://cforall.uwaterloo.ca/jenkins/job/Cforall/job/master/3850/ to view the results.
- Changes -------------------------------------------------------------
The branch master has been updated.
from 262e12b24a19d992dad599c1cc6143374ac571f4 (commit)
- Log -----------------------------------------------------------------
-----------------------------------------------------------------------
Summary of changes:
[Pipeline] }
[Pipeline] // node
[Pipeline] echo
Build Completed
[Pipeline] End of Pipeline
ERROR: script returned exit code 2
Finished: FAILURE
[Pipeline] error
[Pipeline] }
Failed in branch gcc_10_arm64_new
Build Cforall » master #3844 completed: SUCCESS
[Pipeline] echo
SUCCESS
[Pipeline] }
Build Cforall » master #3849 completed: SUCCESS
[Pipeline] echo
SUCCESS
[Pipeline] }
[Pipeline] // parallel
[Pipeline] }
[Pipeline] // stage
[Pipeline] }
[Pipeline] // wrap
[Pipeline] echo
error caught
[Pipeline] node
Running on Brokk 4 in /var/lib/jenkins/workspace/Cforall_Full_Build
[Pipeline] {
[Pipeline] echo
notifying users
[Pipeline] emailext
Sending email to: cforall@lists.uwaterloo.ca
[Pipeline] }
[Pipeline] // node
[Pipeline] }
[Pipeline] // node
[Pipeline] End of Pipeline
ERROR: FAILURE
Finished: FAILURE