Skip to content
Skipping 773 KB.. Full Log
23:02:21 Core was generated by `/var/lib/jenkins/workspace/Cforall_master@tmp/tests/concurrency/waituntil/futur'.
23:02:21 Program terminated with signal SIGABRT, Aborted.
23:02:21 #0  __pthread_kill_implementation (no_tid=0, signo=6, threadid=<optimized out>) at ./nptl/pthread_kill.c:44
23:02:21 
23:02:21 warning: 44	./nptl/pthread_kill.c: No such file or directory
23:02:21 [Current thread is 1 (Thread 0x55555562e780 (LWP 622576))]
23:02:21 -----
23:02:21 #0  __pthread_kill_implementation (no_tid=0, signo=6, threadid=<optimized out>) at ./nptl/pthread_kill.c:44
23:02:21 #1  __pthread_kill_internal (signo=6, threadid=<optimized out>) at ./nptl/pthread_kill.c:78
23:02:21 #2  __GI___pthread_kill (threadid=<optimized out>, signo=signo@entry=6) at ./nptl/pthread_kill.c:89
23:02:21 #3  0x00007ffff7a4527e in __GI_raise (sig=sig@entry=6) at ../sysdeps/posix/raise.c:26
23:02:21 #4  0x00007ffff7a288ff in __GI_abort () at ./stdlib/abort.c:79
23:02:21 #5  0x00007ffff7f1878d in _X7__abortFv_bPKcY17__builtin_va_list__1 (_X11signalAbortb_1=_X11signalAbortb_1@entry=true, _X3fmtPKc_1=0x7ffff7f2ba38 "Application interrupted by signal: %s.\n", _X4argsY17__builtin_va_list_1=_X4argsY17__builtin_va_list_1@entry=0x7ffff7f6e190 <stack+63984>) at /var/lib/jenkins/workspace/Cforall_master/libcfa/src/interpose.cfa:263
23:02:21 #6  0x00007ffff7f18cbe in _X5abortFv_bPKc__1 (_X11signalAbortb_1=_X11signalAbortb_1@entry=true, _X3fmtPKc_1=_X3fmtPKc_1@entry=0x7ffff7f2ba38 "Application interrupted by signal: %s.\n") at /var/lib/jenkins/workspace/Cforall_master/libcfa/src/interpose.cfa:301
23:02:21 #7  0x00007ffff7f18ce5 in _X15sigHandler_termFv_iPS21__anonymous_siginfo_tPS10ucontext_t__1 (_X3sigi_1=<optimized out>, _X3sfpPS21__anonymous_siginfo_t_1=<optimized out>, _X3cxtPS10ucontext_t_1=<optimized out>) at /var/lib/jenkins/workspace/Cforall_master/libcfa/src/interpose.cfa:337
23:02:21 #8  <signal handler called>
23:02:21 #9  __pthread_kill_implementation (no_tid=0, signo=6, threadid=<optimized out>) at ./nptl/pthread_kill.c:44
23:02:21 #10 __pthread_kill_internal (signo=6, threadid=<optimized out>) at ./nptl/pthread_kill.c:78
23:02:21 #11 __GI___pthread_kill (threadid=<optimized out>, signo=signo@entry=6) at ./nptl/pthread_kill.c:89
23:02:21 #12 0x00007ffff7a4527e in __GI_raise (sig=sig@entry=6) at ../sysdeps/posix/raise.c:26
23:02:21 #13 0x00007ffff7a288ff in __GI_abort () at ./stdlib/abort.c:79
23:02:21 #14 0x00007ffff7f18846 in _X7__abortFv_bPKcY17__builtin_va_list__1 (_X11signalAbortb_1=_X11signalAbortb_1@entry=false, _X3fmtPKc_1=<optimized out>, _X3fmtPKc_1@entry=0x55555555c0c0 "Attempting to fulfil a future that has already been fulfilled", _X4argsY17__builtin_va_list_1=_X4argsY17__builtin_va_list_1@entry=0x55555579ff40) at /var/lib/jenkins/workspace/Cforall_master/libcfa/src/interpose.cfa:286
23:02:21 #15 0x00007ffff7f189d7 in _X5abortFv_PKc__1 (_X3fmtPKc_1=_X3fmtPKc_1@entry=0x55555555c0c0 "Attempting to fulfil a future that has already been fulfilled") at /var/lib/jenkins/workspace/Cforall_master/libcfa/src/interpose.cfa:293
23:02:21 #16 0x0000555555558b2b in _X6fulfilQ1_0_0_4__X16_operator_assignFBD0_BD0BD0__X12_constructorFv_BD0__X12_constructorFv_BD0BD0__X11_destructorFv_BD0__Fb_S6future_BD0_BD0__1 (_sizeof_Y1T=<optimized out>, _alignof_Y1T=<optimized out>, _adapterFv_PY1TY1T__MP=<optimized out>, _adapterFY1T_PY1TY1T_P_MP=<optimized out>, _X16_operator_assignFY1T_Y1TY1T__1=<optimized out>, _X12_constructorFv_Y1T__1=<optimized out>, _X12_constructorFv_Y1TY1T__1=<optimized out>, _X11_destructorFv_Y1T__1=<optimized out>, _X3valY1T_1=<optimized out>, _X3futS6future_Y1T__1=<optimized out>) at /var/lib/jenkins/workspace/Cforall_master/libcfa/src/concurrency/future.hfa:196
23:02:21 #17 _X14_operator_callQ1_0_0_4__X16_operator_assignFBD0_BD0BD0__X12_constructorFv_BD0__X12_constructorFv_BD0BD0__X11_destructorFv_BD0__Fb_S6future_BD0_BD0__1 (_adapterFv_PY1TY1T__MP=_adapterFv_PY1TY1T__MP@entry=0x5555555582d0 <_adapterFv_Pii__MP.41263>, _X3futS6future_Y1T__1=_X3futS6future_Y1T__1@entry=0x55555555f380 <_X1CS6future_i__1>, _X3valY1T_1=_X3valY1T_1@entry=0x5555557a00b4, _X12_constructorFv_Y1T__1=<optimized out>, _X16_operator_assignFY1T_Y1TY1T__1=<optimized out>, _adapterFY1T_PY1TY1T_P_MP=<optimized out>, _X11_destructorFv_Y1T__1=<optimized out>, _X12_constructorFv_Y1TY1T__1=<optimized out>, _alignof_Y1T=4, _sizeof_Y1T=4) at /var/lib/jenkins/workspace/Cforall_master/libcfa/src/concurrency/future.hfa:200
23:02:21 #18 0x0000555555558c39 in _X4mainFv_S6Server__1 (__anonymous_object2711=__anonymous_object2711@entry=0x7fffffffdad0) at concurrency/waituntil/futures.cfa:11
23:02:21 #19 0x00007ffff7f90a9f in __cfactx_invoke_thread (main=0x555555558bc0 <_X4mainFv_S6Server__1>, this=0x7fffffffdad0) at /var/lib/jenkins/workspace/Cforall_master/libcfa/src/concurrency/invoke.c:87
23:02:21 #20 0x0000000000000000 in ?? ()
23:02:21 -----
23:02:21   Id   Target Id                          Frame 
23:02:21 * 1    Thread 0x55555562e780 (LWP 622576) __pthread_kill_implementation (no_tid=0, signo=6, threadid=<optimized out>) at ./nptl/pthread_kill.c:44
23:02:21   2    Thread 0x5555555ae5c0 (LWP 622575) 0x00007ffff7a45fc8 in __GI___sigtimedwait (set=set@entry=0x5555555adb80, info=info@entry=0x5555555adc00, timeout=timeout@entry=0x0) at ../sysdeps/unix/sysv/linux/sigtimedwait.c:31
23:02:21   3    Thread 0x7ffff7d60840 (LWP 622574) 0x00007ffff7b1bbca in __GI___libc_read (nbytes=8, buf=0x5555555ef7e8, fd=3) at ../sysdeps/unix/sysv/linux/read.c:26
23:02:21 
23:02:21 Archiving concurrency/waituntil/futures (executable and core) to crashes/full-nodebug/concurrency/waituntil/futures
23:02:21        	coroutine/prodcons                   PASSED     C 0:09.695 - R 0:00.035
23:02:21        	ctrl-flow/fallthrough                PASSED     C 0:06.279 - R 0:00.011
23:02:21        	enum                                 PASSED     C 0:01.106 - R 0:00.008
23:02:21        	ctrl-flow/goto                       PASSED     C 0:06.536 - R 0:00.019
23:02:21        	ctrl-flow/ifwhileCtl                 PASSED     C 0:06.372 - R 0:00.009
23:02:21        	designations                         PASSED     C 0:02.792 - R 0:00.005
23:02:21        	enum_tests/lvalue                    PASSED     C 0:00.509 - R n/a
23:02:21        	enum_tests/inc-dec                   PASSED     C 0:01.264 - R 0:00.020
23:02:21        	enum_tests/funcEnum                  PASSED     C 0:02.254 - R 0:00.006
23:02:21        	ctrl-flow/loop_else                  PASSED     C 0:05.874 - R 0:00.009
23:02:21        	concurrency/waituntil/all_types      PASSED     C 0:31.497 - R 0:01.119
23:02:21        	...ency/unified_locking/futex_mutex  PASSED     C 0:12.358 - R 0:38.299
23:02:21        	enum_tests/structEnum                PASSED     C 0:02.427 - R 0:00.007
23:02:21        	enum_tests/anonymous                 PASSED     C 0:06.328 - R 0:00.006
23:02:21        	errors/declaration                   PASSED     C 0:00.149 - R n/a
23:02:21        	ctrl-flow/loop_else-WRN1             PASSED     C 0:07.862 - R 0:00.001
23:02:21        	errors/signature                     PASSED     C 0:00.205 - R n/a
23:02:21        	errors/scope-type                    PASSED     C 0:00.293 - R n/a
23:02:21        	ctrl-flow/loopctrl                   PASSED     C 0:08.212 - R 0:00.020
23:02:21        	errors/scope                         PASSED     C 0:00.706 - R n/a
23:02:21        	enum_tests/enumInlineValue           PASSED     C 0:07.111 - R 0:00.012
23:02:21        	div                                  PASSED     C 0:08.260 - R 0:00.012
23:02:21        	enum_tests/input                     PASSED     C 0:06.098 - R 0:00.019
23:02:21        	eval                                 PASSED     C 0:01.315 - R 0:00.023
23:02:21        	enum_tests/stringEnum                PASSED     C 0:05.711 - R 0:00.009
23:02:21        	device/cpu                           PASSED     C 0:10.455 - R 0:00.007
23:02:21        	enum_tests/planet                    PASSED     C 0:07.982 - R 0:00.011
23:02:21        	enum_tests/typedIntEnum              PASSED     C 0:06.512 - R 0:00.012
23:02:21        	enum_tests/position                  PASSED     C 0:08.524 - R 0:00.019
23:02:21        	enum_tests/voidEnum                  PASSED     C 0:06.478 - R 0:00.011
23:02:21        	exceptions/conditional               PASSED     C 0:06.053 - R 0:00.004
23:02:21        	exceptions/data-except               PASSED     C 0:06.061 - R 0:00.005
23:02:21        	exceptions/cancel/coroutine          PASSED     C 0:07.301 - R 0:00.006
23:02:21        	exceptions/message                   PASSED     C 0:02.647 - R 0:00.019
23:02:21        	exceptions/conditional-threads       PASSED     C 0:07.433 - R 0:00.006
23:02:21        	exceptions/defaults                  PASSED     C 0:06.634 - R 0:00.014
23:02:21        	exceptions/finally                   PASSED     C 0:05.985 - R 0:00.005
23:02:21        	exceptions/defaults-threads          PASSED     C 0:07.543 - R 0:00.006
23:02:21        	exceptions/try-ctrl-flow             PASSED     C 0:00.403 - R n/a
23:02:21        	exceptions/interact                  PASSED     C 0:06.420 - R 0:00.019
23:02:21        	exceptions/try-leave-catch           PASSED     C 0:01.219 - R 0:00.029
23:02:21        	exceptions/cor_resumer               PASSED     C 0:10.713 - R 0:00.008
23:02:21        	exceptions/type-check                PASSED     C 0:00.466 - R n/a
23:02:21        	exceptions/fibonacci_nonlocal        PASSED     C 0:08.838 - R 0:00.014
23:02:21        	exceptions/cancel/thread             PASSED     C 0:11.607 - R 0:00.007
23:02:21        	exceptions/finally-threads           PASSED     C 0:08.058 - R 0:00.008
23:02:21        	expression                           PASSED     C 0:01.289 - R 0:00.022
23:02:21        	exceptions/polymorphic               PASSED     C 0:06.052 - R 0:00.005
23:02:21        	exceptions/resume                    PASSED     C 0:06.366 - R 0:00.007
23:02:21        	concurrency/waituntil/repeat_close   PASSED     C 0:13.504 - R 0:30.064
23:02:21        	exceptions/terminate                 PASSED     C 0:06.926 - R 0:00.017
23:02:21        	exceptions/trash                     PASSED     C 0:06.018 - R 0:00.007
23:02:21        	exceptions/terminate-threads         PASSED     C 0:07.915 - R 0:00.036
23:02:21        	...urrency/unified_locking/mcs_spin  PASSED     C 0:12.550 - R 0:50.017
23:02:21        	exceptions/resume-threads            PASSED     C 0:08.395 - R 0:00.007
23:02:21        	global-monomorph                     PASSED     C 0:01.184 - R 0:00.005
23:02:21        	identFuncDeclarator                  PASSED     C 0:01.226 - R 0:00.005
23:02:21        	identParamDeclarator                 PASSED     C 0:01.137 - R 0:00.015
23:02:21        	.../unified_locking/spin_queue_lock  PASSED     C 0:12.646 - R 0:51.194
23:02:21        	exceptions/pingpong_nonlocal         PASSED     C 0:11.114 - R 0:00.010
23:02:21        	exceptions/virtual-poly              PASSED     C 0:06.399 - R 0:00.005
23:02:21        	fstream_test                         PASSED     C 0:06.114 - R 0:00.007
23:02:21        	forall                               PASSED     C 0:07.157 - R 0:00.007
23:02:21        	generator/fibonacci                  PASSED     C 0:05.986 - R 0:00.007
23:02:21        	generator/fmtLines                   PASSED     C 0:05.840 - R 0:00.007
23:02:21        	init1                                PASSED     C 0:01.083 - R 0:00.006
23:02:21        	init1-ERROR                          PASSED     C 0:00.587 - R n/a
23:02:21        	include/vector-sequence              PASSED     C 0:01.654 - R 0:00.007
23:02:21        	exceptions/virtual-cast              PASSED     C 0:08.395 - R 0:00.007
23:02:21        	generator/suspend_then               PASSED     C 0:06.167 - R 0:00.006
23:02:21        	include/vector-collections           PASSED     C 0:02.716 - R 0:00.006
23:02:21        	genericUnion                         PASSED     C 0:06.601 - R 0:00.005
23:02:21        	function-operator                    PASSED     C 0:09.220 - R 0:00.006
23:02:21        	hello                                PASSED     C 0:06.016 - R 0:00.005
23:02:21        	identity                             PASSED     C 0:06.117 - R 0:00.005
23:02:21        	include/vector-fstream               PASSED     C 0:05.887 - R 0:00.005
23:02:21        	include/stdincludes                  PASSED     C 0:07.802 - R 0:00.024
23:02:21        	io/eofType                           PASSED     C 0:06.101 - R 0:00.005
23:02:21        	limits                               PASSED     C 0:01.655 - R 0:00.019
23:02:21        	io/io                                PASSED     C 0:09.545 - R 0:00.019
23:02:21        	linking/exception-nothreads          PASSED     C 0:04.560 - R 0:00.019
23:02:21        	io/io-acquire-in                     PASSED     C 0:10.981 - R 0:00.218
23:02:21        	io/io-acquire                        PASSED     C 0:11.959 - R 0:00.319
23:02:21        	io/manipulatorsInput-uchunk          PASSED     C 0:09.889 - R 0:00.035
23:02:21        	heap                                 PASSED     C 0:08.201 - R 0:08.242
23:02:21        	linking/nostdlib                     PASSED     C 0:01.137 - R 0:00.010
23:02:21        	io/away_fair                         PASSED     C 0:13.415 - R 0:00.019
23:02:21        	io/io-acquire-out                    PASSED     C 0:11.917 - R 0:00.519
23:02:21        	linking/exception-withthreads        PASSED     C 0:06.298 - R 0:00.041
23:02:21        	io/io-acquire2                       PASSED     C 0:11.326 - R 0:00.020
23:02:21        	io/io-acquire-no-io                  PASSED     C 0:10.794 - R 0:02.121
23:02:21        	linkonce                             PASSED     C 0:01.222 - R 0:00.006
23:02:21        	io/comp_fair                         PASSED     C 0:15.289 - R 0:00.118
23:02:21        	maybe                                PASSED     C 0:01.384 - R 0:00.007
23:02:21        	linking/mangling/anon                PASSED     C 0:06.079 - R 0:00.006
23:02:21        	io/comp_basic                        PASSED     C 0:17.059 - R 0:00.299
23:02:21        	nested-types-ERR1                    PASSED     C 0:00.119 - R n/a
23:02:21        	nested-types-ERR2                    PASSED     C 0:00.190 - R n/a
23:02:21        	io/many_read                         PASSED     C 0:13.516 - R 0:00.014
23:02:21        	linking/io-acquire                   PASSED     C 0:08.096 - R 0:00.014
23:02:21        	nested-types                         PASSED     C 0:01.127 - R 0:00.007
23:02:21        	nowarn/array                         PASSED     C 0:01.256 - R 0:00.008
23:02:21        	io/manipulatorsOutput4               PASSED     C 0:15.874 - R 0:00.012
23:02:21        	nowarn/exception                     PASSED     C 0:01.233 - R 0:00.007
23:02:21        	nowarn/no-autogen                    PASSED     C 0:01.106 - R 0:00.005
23:02:21        	list/dlist-insert-remove             PASSED     C 0:06.153 - R 0:00.006
23:02:21        	opt-params                           PASSED     C 0:00.081 - R n/a
23:02:21        	nowarn/printf-sizeof                 PASSED     C 0:01.329 - R 0:00.005
23:02:21        	list/dlist2-insert-remove            PASSED     C 0:06.140 - R 0:00.007
23:02:21        	nowarn/unused                        PASSED     C 0:01.158 - R 0:00.007
23:02:21        	nowarn/zero-thunk                    PASSED     C 0:01.100 - R 0:00.007
23:02:21        	literals                             PASSED     C 0:06.141 - R 0:00.006
23:02:21        	numericConstants                     PASSED     C 0:01.128 - R 0:00.006
23:02:21        	operators                            PASSED     C 0:01.132 - R 0:00.005
23:02:21        	meta/fork+exec                       PASSED     C 0:04.946 - R 0:00.036
23:02:21        	linking/nothreads                    PASSED     C 0:07.726 - R 0:00.005
23:02:21        	linking/weakso_nothd                 PASSED     C 0:07.724 - R 0:00.008
23:02:21        	polybits                             PASSED     C 0:00.235 - R n/a
23:02:21        	poly-bare-assn                       PASSED     C 0:01.108 - R 0:00.005
23:02:21        	poly-d-cycle                         PASSED     C 0:01.168 - R 0:00.007
23:02:21        	poly-many-arsz                       PASSED     C 0:01.149 - R 0:00.005
23:02:21        	poly-member                          PASSED     C 0:01.152 - R 0:00.005
23:02:21        	poly-selection                       PASSED     C 0:01.139 - R 0:00.007
23:02:21        	poly-o-cycle                         PASSED     C 0:01.189 - R 0:00.005
23:02:21        	raii/ctor-autogen-ERR1               PASSED     C 0:00.681 - R n/a
23:02:21        	include/includes                     PASSED     C 0:23.428 - R 0:00.005
23:02:21        	poly-self-cycle                      PASSED     C 0:01.245 - R 0:00.005
23:02:21        	quasiKeyword                         PASSED     C 0:01.255 - R 0:00.006
23:02:21        	raii/ctor-autogen                    PASSED     C 0:01.623 - R 0:00.006
23:02:21        	meta/dumpable                        PASSED     C 0:08.285 - R 0:00.007
23:02:21        	raii/init_once                       PASSED     C 0:01.382 - R 0:00.006
23:02:21        	raii/partial-ERR1                    PASSED     C 0:00.634 - R n/a
23:02:21        	raii/partial                         PASSED     C 0:01.148 - R 0:00.006
23:02:21        	linking/withthreads                  PASSED     C 0:10.797 - R 0:00.006
23:02:21        	raii/typeof-member                   PASSED     C 0:01.016 - R 0:00.005
23:02:21        	malloc                               PASSED     C 0:09.754 - R 0:00.005
23:02:21        	result                               PASSED     C 0:01.572 - R 0:00.008
23:02:21        	simpleGenericTriple                  PASSED     C 0:01.483 - R 0:00.006
23:02:21        	raii/memberCtors-ERR1                PASSED     C 0:03.756 - R n/a
23:02:21        	raii/dtor-early-exit-ERR1            PASSED     C 0:04.432 - R n/a
23:02:21        	raii/dtor-early-exit-ERR2            PASSED     C 0:04.452 - R n/a
23:02:21        	quotedKeyword                        PASSED     C 0:05.763 - R 0:00.006
23:02:21        	raii/boxed-types                     PASSED     C 0:05.868 - R 0:00.007
23:02:21        	minmax                               PASSED     C 0:11.108 - R 0:00.006
23:02:21        	polymorphism                         PASSED     C 0:06.165 - R 0:00.007
23:02:21        	smart-pointers                       PASSED     C 0:01.413 - R 0:00.006
23:02:21        	raii/globals                         PASSED     C 0:05.908 - R 0:00.006
23:02:21        	switch                               PASSED     C 0:01.117 - R 0:00.005
23:02:21        	raii/memberCtors                     PASSED     C 0:06.135 - R 0:00.007
23:02:21        	tuple/tupleCast                      PASSED     C 0:01.110 - R 0:00.005
23:02:21        	tuple/tupleFunction                  PASSED     C 0:01.197 - R 0:00.006
23:02:21        	tuple/tupleMember                    PASSED     C 0:01.148 - R 0:00.006
23:02:21        	typedefRedef-ERR1                    PASSED     C 0:00.112 - R n/a
23:02:21        	tuple/tuplePolymorphism              PASSED     C 0:01.501 - R 0:00.006
23:02:21        	typedefRedef                         PASSED     C 0:01.080 - R 0:00.005
23:02:21        	references                           PASSED     C 0:06.210 - R 0:00.005
23:02:21        	var-assert                           PASSED     C 0:00.143 - R n/a
23:02:21        	raii/dtor-early-exit                 PASSED     C 0:08.531 - R 0:00.006
23:02:21        	typeof                               PASSED     C 0:01.046 - R 0:00.007
23:02:21        	shortCircuit                         PASSED     C 0:05.951 - R 0:00.005
23:02:21        	variableDeclarator                   PASSED     C 0:01.080 - R 0:00.005
23:02:21        	sizeof                               PASSED     C 0:05.731 - R 0:00.005
23:02:21        	strstream                            PASSED     C 0:06.264 - R 0:00.005
23:02:21        	searchsort                           PASSED     C 0:08.398 - R 0:00.006
23:02:21        	tuple/tupleVariadic                  PASSED     C 0:04.724 - R 0:00.005
23:02:21        	tuple/tupleAssign                    PASSED     C 0:06.571 - R 0:00.006
23:02:21        	tuplearray                           PASSED     C 0:05.820 - R 0:00.009
23:02:21        	sum                                  PASSED     C 0:08.356 - R 0:00.005
23:02:21        	time                                 PASSED     C 0:07.733 - R 0:00.007
23:02:21        	voidPtr                              PASSED     C 0:01.095 - R 0:00.007
23:02:21        	withconflict                         PASSED     C 0:00.529 - R n/a
23:02:21        	warnings/self-assignment             PASSED     C 0:01.029 - R 0:00.001
23:02:21        	swap                                 PASSED     C 0:08.941 - R 0:00.006
23:02:21        	KRfunctions                          PASSED     C 0:00.982 - R 0:00.001
23:02:21        	userLiterals                         PASSED     C 0:06.706 - R 0:00.006
23:02:21        	vector                               PASSED     C 0:07.108 - R 0:00.006
23:02:21        	...collections/dimexpr-match-c-ERRS  PASSED     C 0:00.722 - R n/a
23:02:21        	zero_one-ERR1                        PASSED     C 0:03.225 - R n/a
23:02:21        	arithmeticConversions                PASSED     C 0:02.560 - R 0:00.006
23:02:21        	...llections/dimexpr-match-cfa-ERRS  PASSED     C 0:01.309 - R n/a
23:02:21        	vector_math/vec2_double              PASSED     C 0:08.918 - R 0:00.007
23:02:21        	vector_math/vec2_uint                PASSED     C 0:09.000 - R 0:00.006
23:02:21        	attributes                           PASSED     C 0:01.230 - R 0:00.001
23:02:21        	zero_one                             PASSED     C 0:05.860 - R 0:00.006
23:02:21        	abs                                  PASSED     C 0:08.011 - R 0:00.007
23:02:21        	declarationSpecifier                 PASSED     C 0:01.030 - R 0:00.001
23:02:21        	errors/completeType                  PASSED     C 0:00.604 - R n/a
23:02:21        	...collections/array-md-sbscr-cases  PASSED     C 0:09.987 - R 0:00.008
23:02:21        	ato                                  PASSED     C 0:08.843 - R 0:00.007
23:02:21        	vector_math/vec3_int                 PASSED     C 0:16.373 - R 0:00.007
23:02:21        	vector_math/vec2_float               PASSED     C 0:18.672 - R 0:00.006
23:02:21        	extension                            PASSED     C 0:00.981 - R 0:00.001
23:02:21        	configs/parsenums                    PASSED     C 0:09.007 - R 0:00.127
23:02:21        	functions                            PASSED     C 0:00.923 - R 0:00.006
23:02:21        	vector_math/vec4_int                 PASSED     C 0:17.207 - R 0:00.007
23:02:21        	PRNG                                 PASSED     C 0:14.879 - R 0:00.384
23:02:21        	gccExtensions                        PASSED     C 0:00.955 - R 0:00.008
23:02:21        	rational                             PASSED     C 0:27.117 - R 0:00.006
23:02:21        	concurrency/pthread/bounded_buffer   PASSED     C 0:10.726 - R 0:00.050
23:02:21        	bitmanip2                            PASSED     C 0:11.823 - R 0:00.011
23:02:21        	meta/arch                            PASSED     C 0:00.590 - R n/a
23:02:21        	bitmanip1                            PASSED     C 0:12.838 - R 0:00.288
23:02:21        	bitmanip3                            PASSED     C 0:12.153 - R 0:00.172
23:02:21        	vector_math/vec3_float               PASSED     C 0:22.308 - R 0:00.010
23:02:21        	vector_math/vec2_int                 PASSED     C 0:22.977 - R 0:00.005
23:02:21        	vector_math/vec4_float               PASSED     C 0:21.444 - R 0:00.009
23:02:21        	exceptions/cardgame                  PASSED     C 0:10.274 - R 0:00.009
23:02:21        	exceptions/hotpotato_checked         PASSED     C 0:09.867 - R 0:00.010
23:02:21        	exceptions/hotpotato                 PASSED     C 0:09.739 - R 0:00.009
23:02:21        	io/manipulatorsInput                 PASSED     C 0:07.862 - R 0:00.010
23:02:21        	random                               PASSED     C 0:07.963 - R 0:00.005
23:02:21        	vector_math/vec2_ldouble             PASSED     C 0:08.659 - R 0:00.005
23:02:21        	gmp                                  PASSED     C 0:11.690 - R 0:00.012
23:02:21        	nested_function                      PASSED     C 0:10.087 - R 0:00.010
23:02:21        	math                                 PASSED     C 0:10.945 - R 0:00.005
23:02:21        	mathX                                PASSED     C 0:11.686 - R 0:00.010
23:02:21        	io/manipulatorsOutput2               PASSED     C 0:12.128 - R 0:00.005
23:02:21        	io/manipulatorsOutput1               PASSED     C 0:22.209 - R 0:00.011
23:02:21        	io/manipulatorsOutput3               PASSED     C 0:24.324 - R 0:00.011
23:02:21 377 passes, 1 failures, 0 timeouts, 0 cancelled, 0 other
23:02:21 Tests took  3:39.299
23:02:21 make: *** [Makefile:986: all-local] Error 1
23:02:21 [Pipeline] }
23:02:21 [Pipeline] // dir
23:02:21 [Pipeline] }
23:02:21 [Pipeline] // stage
23:02:21 [Pipeline] echo
23:02:21 Archiving core dumps
23:02:21 [Pipeline] dir
23:02:21 Running in /var/lib/jenkins/workspace/Cforall_master@tmp
23:02:21 [Pipeline] {
23:02:21 [Pipeline] fileExists
23:02:21 [Pipeline] sh
23:02:21 + /var/lib/jenkins/workspace/Cforall_master/tools/jenkins/archive-gen.sh
23:02:21 [Pipeline] archiveArtifacts
23:02:21 Archiving artifacts
23:02:21 Recording fingerprints
23:02:21 [Pipeline] }
23:02:21 [Pipeline] // dir
23:02:21 [Pipeline] }
23:02:21 [Pipeline] // wrap
23:02:21 [Pipeline] }
23:02:21 [Pipeline] // node
23:02:21 [Pipeline] echo
23:02:21 hudson.AbortException: script returned exit code 2
23:02:21 [Pipeline] node
23:02:21 Running on Brokk 5 in /var/lib/jenkins/workspace/Cforall_master_2
23:02:21 [Pipeline] {
23:02:21 [Pipeline] echo
23:02:21 Notifying users of result
23:02:21 [Pipeline] echo
23:02:21 Reusing previously constructed message
23:02:21 [Pipeline] echo
23:02:21 Would send email to: cforall@lists.uwaterloo.ca
23:02:21 [Pipeline] echo
23:02:21 With title: [cforall git][BUILD# 3615 - FAILURE] - branch master
23:02:21 [Pipeline] echo
23:02:21 Content: 
23:02:21 <p>This is an automated email from the Jenkins build machine. It was
23:02:21 generated because of a git hooks/post-receive script following
23:02:21 a ref change which was pushed to the C∀ repository.</p>
23:02:21 
23:02:21 <p>- Status --------------------------------------------------------------</p>
23:02:21 
23:02:21 <p>BUILD# 3615 - FAILURE</p>
23:02:21 <p>Check console output at https://cforall.uwaterloo.ca/jenkins/job/Cforall/job/master/3615/ to view the results.</p>
23:02:21 
23:02:21 <p>- Changes -------------------------------------------------------------</p>
23:02:21 
23:02:21 <pre>
23:02:21 The branch master has been updated.
23:02:21       from  4ff8cb209307cd30c3626d4fbe3cc2d2ce4219ea (commit)
23:02:21 </pre>
23:02:21 
23:02:21 <p>- Log -----------------------------------------------------------------</p>
23:02:21 
23:02:21 <pre>
23:02:21 
23:02:21 </pre>
23:02:21 
23:02:21 <p>-----------------------------------------------------------------------</p>
23:02:21 <pre>
23:02:21 Summary of changes:
23:02:21 
23:02:21 </pre>
23:02:21 
23:02:21 [Pipeline] }
23:02:21 [Pipeline] // node
23:02:21 [Pipeline] echo
23:02:21 Build Completed
23:02:21 [Pipeline] End of Pipeline
23:02:21 ERROR: script returned exit code 2
23:02:21 Finished: FAILURE
[Pipeline] error
[Pipeline] }
23:02:21 Failed in branch gcc_9_x64_new
23:02:22 Build Cforall » master #3610 completed: SUCCESS
[Pipeline] echo
23:02:22 SUCCESS
[Pipeline] }
23:02:41 Build Cforall » master #3614 completed: SUCCESS
[Pipeline] echo
23:02:41 SUCCESS
[Pipeline] }
23:03:20 Build Cforall » master #3613 completed: SUCCESS
[Pipeline] echo
23:03:20 SUCCESS
[Pipeline] }
23:04:35 Build Cforall » master #3608 completed: SUCCESS
[Pipeline] echo
23:04:35 SUCCESS
[Pipeline] }
23:13:13 Build Cforall » master #3611 completed: SUCCESS
[Pipeline] echo
23:13:13 SUCCESS
[Pipeline] }
23:14:28 Build Cforall » master #3607 completed: SUCCESS
[Pipeline] echo
23:14:28 SUCCESS
[Pipeline] }
23:28:29 Build Cforall » master #3612 completed: SUCCESS
[Pipeline] echo
23:28:29 SUCCESS
[Pipeline] }
[Pipeline] // parallel
[Pipeline] }
[Pipeline] // stage
[Pipeline] }
[Pipeline] // wrap
[Pipeline] echo
error caught
[Pipeline] node
Running on Brokk 4 in /var/lib/jenkins/workspace/Cforall_Full_Build
[Pipeline] {
[Pipeline] echo
notifying users
[Pipeline] emailext
Sending email to: cforall@lists.uwaterloo.ca
[Pipeline] }
[Pipeline] // node
[Pipeline] }
[Pipeline] // node
[Pipeline] End of Pipeline
ERROR: FAILURE
Finished: FAILURE