Started by timer
Running as Jenkins Build User
Obtained Jenkins/FullBuild from git cforall@plg.uwaterloo.ca:software/cfa/cfa-cc
[Pipeline] Start of Pipeline
[Pipeline] node
Running on Brokk 3 in /var/lib/jenkins/workspace/Cforall_Full_Build
[Pipeline] {
[Pipeline] checkout
The recommended git tool is: NONE
using credential git_key_aug2025
Fetching changes from the remote Git repository
Checking out Revision 4ff8cb209307cd30c3626d4fbe3cc2d2ce4219ea (refs/remotes/origin/master)
Commit message: "fix Mesa citation"
> git rev-parse --resolve-git-dir /var/lib/jenkins/workspace/Cforall_Full_Build/.git # timeout=10
> git config remote.origin.url cforall@plg.uwaterloo.ca:software/cfa/cfa-cc # timeout=10
Fetching upstream changes from cforall@plg.uwaterloo.ca:software/cfa/cfa-cc
> git --version # timeout=10
> git --version # 'git version 2.43.0'
using GIT_SSH to set credentials Git key use to connect to the cforall git repo (August 2025)
Verifying host key using known hosts file
> git fetch --tags --force --progress -- cforall@plg.uwaterloo.ca:software/cfa/cfa-cc +refs/heads/*:refs/remotes/origin/* # timeout=10
> git rev-parse refs/remotes/origin/master^{commit} # timeout=10
> git config core.sparsecheckout # timeout=10
> git checkout -f 4ff8cb209307cd30c3626d4fbe3cc2d2ce4219ea # timeout=10
> git rev-list --no-walk 4ff8cb209307cd30c3626d4fbe3cc2d2ce4219ea # timeout=10
[Pipeline] wrap
[Pipeline] {
[Pipeline] stage
[Pipeline] { (Build)
[Pipeline] parallel
[Pipeline] { (Branch: gcc_10_x86_new)
[Pipeline] { (Branch: gcc_11_x86_new)
[Pipeline] { (Branch: gcc_12_x86_new)
[Pipeline] { (Branch: gcc_9_x64_new)
[Pipeline] { (Branch: gcc_10_x64_new)
[Pipeline] { (Branch: gcc_11_x64_new)
[Pipeline] { (Branch: gcc_12_x64_new)
[Pipeline] { (Branch: gcc_10_arm64_new)
[Pipeline] { (Branch: gcc_11_arm64_new)
[Pipeline] { (Branch: gcc_12_arm64_new)
[Pipeline] { (Branch: clang_x64_new)
[Pipeline] sleep
22:47:02Sleeping for 1 min 0 sec
[Pipeline] sleep
22:47:02No need to sleep any longer
[Pipeline] sleep
22:47:02Sleeping for 3 min 0 sec
[Pipeline] sleep
22:47:02Sleeping for 4 min 0 sec
[Pipeline] sleep
22:47:02Sleeping for 3 min 0 sec
[Pipeline] sleep
22:47:02Sleeping for 2 min 0 sec
[Pipeline] sleep
22:47:02Sleeping for 2 min 0 sec
[Pipeline] sleep
22:47:02Sleeping for 2 min 0 sec
[Pipeline] sleep
22:47:02Sleeping for 1 min 0 sec
[Pipeline] sleep
22:47:02No need to sleep any longer
[Pipeline] sleep
22:47:02Sleeping for 3 min 0 sec
[Pipeline] build
22:47:02Scheduling project: Cforall » master[Pipeline] build
22:47:02Scheduling project: Cforall » master22:47:09Starting building: Cforall » master #360522:47:09Starting building: Cforall » master #3606[Pipeline] build
22:48:02Scheduling project: Cforall » master[Pipeline] build
22:48:02Scheduling project: Cforall » master22:48:09Starting building: Cforall » master #360722:48:09Starting building: Cforall » master #3608[Pipeline] build
22:49:02Scheduling project: Cforall » master[Pipeline] build
22:49:02Scheduling project: Cforall » master[Pipeline] build
22:49:02Scheduling project: Cforall » master22:49:09Starting building: Cforall » master #360922:49:09Starting building: Cforall » master #361022:49:09Starting building: Cforall » master #3611[Pipeline] build
22:50:02Scheduling project: Cforall » master[Pipeline] build
22:50:02Scheduling project: Cforall » master[Pipeline] build
22:50:02Scheduling project: Cforall » master22:50:09Starting building: Cforall » master #361222:50:09Starting building: Cforall » master #361422:50:09Starting building: Cforall » master #3613[Pipeline] build
22:51:02Scheduling project: Cforall » master22:51:09Starting building: Cforall » master #361522:56:06Build Cforall » master #3606 completed: SUCCESS
[Pipeline] echo
22:56:06SUCCESS
[Pipeline] }
23:00:59Build Cforall » master #3605 completed: SUCCESS
[Pipeline] echo
23:00:59SUCCESS
[Pipeline] }
23:02:12Build Cforall » master #3609 completed: SUCCESS
[Pipeline] echo
23:02:12SUCCESS
[Pipeline] }
23:02:21Build Cforall » master #3615 completed: FAILURE
[Pipeline] echo
23:02:21FAILURE
[Pipeline] sh
23:02:21+ wget -q -O - https://cforall.uwaterloo.ca/jenkins/job/Cforall/job/master/3615/consoleText23:02:21Started by upstream project "Cforall_Full_Build" build number 409
23:02:21originally caused by:
23:02:21 Started by timer
23:02:21Running as Jenkins Build User
23:02:21 > git rev-parse --resolve-git-dir /var/lib/jenkins/caches/git-914b6fdde163b7e17ee75d99ca23f18a/.git # timeout=10
23:02:21Setting origin to cforall@plg.uwaterloo.ca:software/cfa/cfa-cc
23:02:21 > git config remote.origin.url cforall@plg.uwaterloo.ca:software/cfa/cfa-cc # timeout=10
23:02:21Fetching origin...
23:02:21Fetching upstream changes from origin
23:02:21 > git --version # timeout=10
23:02:21 > git --version # 'git version 2.43.0'
23:02:21 > git config --get remote.origin.url # timeout=10
23:02:21using GIT_SSH to set credentials Git key use to connect to the cforall git repo (August 2025)
23:02:21Verifying host key using known hosts file
23:02:21 > git fetch --no-tags --force --progress -- origin +refs/heads/*:refs/remotes/origin/* # timeout=10
23:02:21Seen branch in repository origin/ADT
23:02:21Seen branch in repository origin/aaron-thesis
23:02:21Seen branch in repository origin/arm-eh
23:02:21Seen branch in repository origin/ast-experimental
23:02:21Seen branch in repository origin/cleanup-dtors
23:02:21Seen branch in repository origin/ctor
23:02:21Seen branch in repository origin/deferred_resn
23:02:21Seen branch in repository origin/demangler
23:02:21Seen branch in repository origin/enum
23:02:21Seen branch in repository origin/forall-pointer-decay
23:02:21Seen branch in repository origin/gc_noraii
23:02:21Seen branch in repository origin/jacob/cs343-translation
23:02:21Seen branch in repository origin/jenkins-sandbox
23:02:21Seen branch in repository origin/master
23:02:21Seen branch in repository origin/memory
23:02:21Seen branch in repository origin/new-ast
23:02:21Seen branch in repository origin/new-ast-unique-expr
23:02:21Seen branch in repository origin/new-env
23:02:21Seen branch in repository origin/no_list
23:02:21Seen branch in repository origin/persistent-indexer
23:02:21Seen branch in repository origin/pthread-emulation
23:02:21Seen branch in repository origin/qualifiedEnum
23:02:21Seen branch in repository origin/resolv-new
23:02:21Seen branch in repository origin/string
23:02:21Seen branch in repository origin/stuck-waitfor-destruct
23:02:21Seen branch in repository origin/with_gc
23:02:21Seen 26 remote branches
23:02:21Obtained Jenkinsfile from 4ff8cb209307cd30c3626d4fbe3cc2d2ce4219ea
23:02:21[Pipeline] Start of Pipeline
23:02:21[Pipeline] node
23:02:21Running on Brokk 1 in /var/lib/jenkins/workspace/Cforall_master
23:02:21[Pipeline] {
23:02:21[Pipeline] wrap
23:02:21[Pipeline] {
23:02:21[Pipeline] properties
23:02:21WARNING: Unknown parameter(s) found for class type 'hudson.model.ChoiceParameterDefinition': defaultValue
23:02:21WARNING: Unknown parameter(s) found for class type 'hudson.model.ChoiceParameterDefinition': defaultValue
23:02:21[Pipeline] checkout
23:02:21The recommended git tool is: NONE
23:02:21using credential git_key_aug2025
23:02:21Fetching changes from the remote Git repository
23:02:21Cleaning workspace
23:02:21Fetching without tags
23:02:21Checking out Revision 4ff8cb209307cd30c3626d4fbe3cc2d2ce4219ea (master)
23:02:21Commit message: "fix Mesa citation"
23:02:21[Pipeline] load
23:02:21[Pipeline] { (Jenkins/tools.groovy)
23:02:21[Pipeline] }
23:02:21[Pipeline] // load
23:02:21[Pipeline] echo
23:02:21Compiler : gcc-9 (g++-9/gcc-9)
23:02:21Architecture : x64
23:02:21Arc Flags : --host=x86_64
23:02:21Run All Tests : true
23:02:21Run Benchmark : true
23:02:21Build Documentation : false
23:02:21Publish : true
23:02:21Silent : true
23:02:2123:02:21[Pipeline] }
23:02:21[Pipeline] // wrap
23:02:21[Pipeline] }
23:02:21 > git rev-parse --resolve-git-dir /var/lib/jenkins/workspace/Cforall_master/.git # timeout=10
23:02:21 > git config remote.origin.url cforall@plg.uwaterloo.ca:software/cfa/cfa-cc # timeout=10
23:02:21 > git rev-parse --verify HEAD # timeout=10
23:02:21Resetting working tree
23:02:21 > git reset --hard # timeout=10
23:02:21 > git clean -fdx # timeout=10
23:02:21Fetching upstream changes from cforall@plg.uwaterloo.ca:software/cfa/cfa-cc
23:02:21 > git --version # timeout=10
23:02:21 > git --version # 'git version 2.43.0'
23:02:21using GIT_SSH to set credentials Git key use to connect to the cforall git repo (August 2025)
23:02:21Verifying host key using known hosts file
23:02:21 > git fetch --no-tags --force --progress -- cforall@plg.uwaterloo.ca:software/cfa/cfa-cc +refs/heads/*:refs/remotes/origin/* # timeout=10
23:02:21 > git config core.sparsecheckout # timeout=10
23:02:21 > git checkout -f 4ff8cb209307cd30c3626d4fbe3cc2d2ce4219ea # timeout=10
23:02:21 > git rev-list --no-walk 4ff8cb209307cd30c3626d4fbe3cc2d2ce4219ea # timeout=10
23:02:21[Pipeline] // node
23:02:21[Pipeline] node
23:02:21Running on Brokk 1 in /var/lib/jenkins/workspace/Cforall_master
23:02:21[Pipeline] {
23:02:21[Pipeline] wrap
23:02:21[Pipeline] {
23:02:21[Pipeline] pwd
23:02:21[Pipeline] pwd
23:02:21[Pipeline] echo
23:02:21 -------- Cleanup --------
23:02:21[Pipeline] stage
23:02:21[Pipeline] { (Cleanup)
23:02:21[Pipeline] dir
23:02:21Running in /var/lib/jenkins/workspace/Cforall_master@tmp
23:02:21[Pipeline] {
23:02:21[Pipeline] deleteDir
23:02:21[Pipeline] }
23:02:21[Pipeline] // dir
23:02:21[Pipeline] }
23:02:21[Pipeline] // stage
23:02:21[Pipeline] echo
23:02:21 -------- Checkout --------
23:02:21[Pipeline] stage
23:02:21[Pipeline] { (Checkout)
23:02:21[Pipeline] checkout
23:02:21The recommended git tool is: NONE
23:02:21using credential git_key_aug2025
23:02:21Fetching changes from the remote Git repository
23:02:21Cleaning workspace
23:02:21Fetching without tags
23:02:21 > git rev-parse --resolve-git-dir /var/lib/jenkins/workspace/Cforall_master/.git # timeout=10
23:02:21 > git config remote.origin.url cforall@plg.uwaterloo.ca:software/cfa/cfa-cc # timeout=10
23:02:21 > git rev-parse --verify HEAD # timeout=10
23:02:21Resetting working tree
23:02:21 > git reset --hard # timeout=10
23:02:21 > git clean -fdx # timeout=10
23:02:21Fetching upstream changes from cforall@plg.uwaterloo.ca:software/cfa/cfa-cc
23:02:21 > git --version # timeout=10
23:02:21 > git --version # 'git version 2.43.0'
23:02:21using GIT_SSH to set credentials Git key use to connect to the cforall git repo (August 2025)
23:02:21Verifying host key using known hosts file
23:02:21 > git fetch --no-tags --force --progress -- cforall@plg.uwaterloo.ca:software/cfa/cfa-cc +refs/heads/*:refs/remotes/origin/* # timeout=10
23:02:21Checking out Revision 4ff8cb209307cd30c3626d4fbe3cc2d2ce4219ea (master)
23:02:21Commit message: "fix Mesa citation"
23:02:21[Pipeline] echo
23:02:21Constructing new git message
23:02:21[Pipeline] sh
23:02:21+ git rev-list 4ff8cb209307cd30c3626d4fbe3cc2d2ce4219ea..4ff8cb209307cd30c3626d4fbe3cc2d2ce4219ea
23:02:21[Pipeline] sh
23:02:21+ git cat-file -t 4ff8cb209307cd30c3626d4fbe3cc2d2ce4219ea
23:02:21[Pipeline] sh
23:02:21 > git config core.sparsecheckout # timeout=10
23:02:21 > git checkout -f 4ff8cb209307cd30c3626d4fbe3cc2d2ce4219ea # timeout=10
23:02:21+ git rev-list --format=short 4ff8cb209307cd30c3626d4fbe3cc2d2ce4219ea...4ff8cb209307cd30c3626d4fbe3cc2d2ce4219ea
23:02:21[Pipeline] sh
23:02:21+ git diff --stat --color 4ff8cb209307cd30c3626d4fbe3cc2d2ce4219ea 4ff8cb209307cd30c3626d4fbe3cc2d2ce4219ea
23:02:21[Pipeline] echo
23:02:2123:02:21<p>- Changes -------------------------------------------------------------</p>
23:02:2123:02:21<pre>
23:02:21The branch master has been updated.
23:02:21 from 4ff8cb209307cd30c3626d4fbe3cc2d2ce4219ea (commit)
23:02:21</pre>
23:02:2123:02:21<p>- Log -----------------------------------------------------------------</p>
23:02:2123:02:21<pre>
23:02:2123:02:21</pre>
23:02:2123:02:21<p>-----------------------------------------------------------------------</p>
23:02:21<pre>
23:02:21Summary of changes:
23:02:2123:02:21</pre>
23:02:2123:02:21[Pipeline] }
23:02:21[Pipeline] // stage
23:02:21[Pipeline] echo
23:02:21 -------- Build : configure --------
23:02:21[Pipeline] stage
23:02:21[Pipeline] { (Build : configure)
23:02:21[Pipeline] dir
23:02:21Running in /var/lib/jenkins/workspace/Cforall_master
23:02:21[Pipeline] {
23:02:21[Pipeline] sh
23:02:21+ ./autogen.sh
23:02:21Running aclocal in root
23:02:21Running libtoolize in root
23:02:21libtoolize: putting auxiliary files in AC_CONFIG_AUX_DIR, 'automake'.
23:02:21libtoolize: linking file 'automake/ltmain.sh'
23:02:21libtoolize: putting macros in AC_CONFIG_MACRO_DIRS, 'automake'.
23:02:21libtoolize: linking file 'automake/libtool.m4'
23:02:21libtoolize: linking file 'automake/ltoptions.m4'
23:02:21libtoolize: linking file 'automake/ltsugar.m4'
23:02:21libtoolize: linking file 'automake/ltversion.m4'
23:02:21libtoolize: linking file 'automake/lt~obsolete.m4'
23:02:21Running autoconf in root
23:02:21Running automake in root
23:02:21configure.ac:223: installing 'automake/compile'
23:02:21configure.ac:138: installing 'automake/config.guess'
23:02:21configure.ac:138: installing 'automake/config.sub'
23:02:21configure.ac:17: installing 'automake/install-sh'
23:02:21benchmark/Makefile.am: installing 'automake/depcomp'
23:02:21parallel-tests: installing 'automake/test-driver'
23:02:21configure.ac: installing 'automake/ylwrap'
23:02:21Running aclocal in libcfa
23:02:21Running libtoolize in libcfa
23:02:21libtoolize: putting auxiliary files in AC_CONFIG_AUX_DIR, 'automake'.
23:02:21libtoolize: linking file 'automake/ltmain.sh'
23:02:21libtoolize: putting macros in AC_CONFIG_MACRO_DIRS, 'automake'.
23:02:21libtoolize: linking file 'automake/libtool.m4'
23:02:21libtoolize: linking file 'automake/ltoptions.m4'
23:02:21libtoolize: linking file 'automake/ltsugar.m4'
23:02:21libtoolize: linking file 'automake/ltversion.m4'
23:02:21libtoolize: linking file 'automake/lt~obsolete.m4'
23:02:21Running autoconf in libcfa
23:02:21Running automake in libcfa
23:02:21configure.ac:119: installing 'automake/compile'
23:02:21configure.ac:119: installing 'automake/config.guess'
23:02:21configure.ac:119: installing 'automake/config.sub'
23:02:21configure.ac:12: installing 'automake/install-sh'
23:02:21src/Makefile.am: installing 'automake/depcomp'
23:02:21[Pipeline] }
23:02:21[Pipeline] // dir
23:02:21[Pipeline] dir
23:02:21Running in /var/lib/jenkins/workspace/Cforall_master@tmp
23:02:21[Pipeline] {
23:02:21[Pipeline] sh
23:02:21+ /var/lib/jenkins/workspace/Cforall_master/configure CXX=g++-9 CC=gcc-9 --host=x86_64 AR=gcc-ar RANLIB=gcc-ranlib --with-target-hosts=host:debug,host:nodebug --quiet --prefix=/var/lib/jenkins/workspace/Cforall_master@tmp
23:02:21[Pipeline] sh
23:02:21+ nproc
23:02:21+ make -j 16 --no-print-directory configure-libcfa
23:02:21libcfa/x64-debug/config.data
23:02:21Configuring libcfa (/var/lib/jenkins/workspace/Cforall_master/libcfa/configure) with ''CXX=g++-9' 'CC=gcc-9' 'AR=gcc-ar' 'RANLIB=gcc-ranlib' '--prefix=/var/lib/jenkins/workspace/Cforall_master@tmp' DRIVER_DIR=/var/lib/jenkins/workspace/Cforall_master@tmp/driver/ ARCHITECTURE=x64 CONFIGURATION=debug CFA_VERSION=1:0:0' from /var/lib/jenkins/workspace/Cforall_master@tmp / libcfa/x64-debug/
23:02:21libcfa/x64-nodebug/config.data
23:02:21Configuring libcfa (/var/lib/jenkins/workspace/Cforall_master/libcfa/configure) with ''CXX=g++-9' 'CC=gcc-9' 'AR=gcc-ar' 'RANLIB=gcc-ranlib' '--prefix=/var/lib/jenkins/workspace/Cforall_master@tmp' DRIVER_DIR=/var/lib/jenkins/workspace/Cforall_master@tmp/driver/ ARCHITECTURE=x64 CONFIGURATION=nodebug CFA_VERSION=1:0:0' from /var/lib/jenkins/workspace/Cforall_master@tmp / libcfa/x64-nodebug/
23:02:21checking whether make supports nested variables... yes
23:02:21checking for a BSD-compatible install... checking whether make supports nested variables... yes
23:02:21checking for a BSD-compatible install... /usr/bin/install -c
23:02:21checking whether build environment is sane... /usr/bin/install -c
23:02:21checking whether build environment is sane... yes
23:02:21yes
23:02:21checking for a race-free mkdir -p... /usr/bin/mkdir -p
23:02:21checking for gawk... gawk
23:02:21checking whether make sets $(MAKE)... checking for a race-free mkdir -p... /usr/bin/mkdir -p
23:02:21checking for gawk... gawk
23:02:21checking whether make sets $(MAKE)... yes
23:02:21yes
23:02:21checking for distributated build... no
23:02:21checking for distributated build... no
23:02:21checking build system type... checking build system type... x86_64-pc-linux-gnu
23:02:21checking host system type... x86_64-pc-linux-gnu
23:02:21checking how to print strings... printf
23:02:21checking whether make supports the include directive... x86_64-pc-linux-gnu
23:02:21checking host system type... x86_64-pc-linux-gnu
23:02:21checking how to print strings... printf
23:02:21checking whether make supports the include directive... yes (GNU style)
23:02:21checking for gcc... gcc-9
23:02:21yes (GNU style)
23:02:21checking for gcc... gcc-9
23:02:21checking whether the C compiler works... checking whether the C compiler works... yes
23:02:21checking for C compiler default output file name... a.out
23:02:21checking for suffix of executables... yes
23:02:21checking for C compiler default output file name... a.out
23:02:21checking for suffix of executables...
23:02:21checking whether we are cross compiling...
23:02:21checking whether we are cross compiling... no
23:02:21checking for suffix of object files... no
23:02:21checking for suffix of object files... o
23:02:21checking whether the compiler supports GNU C... o
23:02:21checking whether the compiler supports GNU C... yes
23:02:21checking whether gcc-9 accepts -g... yes
23:02:21checking whether gcc-9 accepts -g... yes
23:02:21checking for gcc-9 option to enable C11 features... yes
23:02:21checking for gcc-9 option to enable C11 features... none needed
23:02:21checking whether gcc-9 understands -c and -o together... none needed
23:02:21checking whether gcc-9 understands -c and -o together... yes
23:02:21checking dependency style of gcc-9... yes
23:02:21checking dependency style of gcc-9... gcc3
23:02:21checking for a sed that does not truncate output... /usr/bin/sed
23:02:21checking for grep that handles long lines and -e... /usr/bin/grep
23:02:21checking for egrep... gcc3
23:02:21checking for a sed that does not truncate output... /usr/bin/grep -E
23:02:21checking for fgrep... /usr/bin/grep -F
23:02:21checking for ld used by gcc-9... /usr/bin/sed
23:02:21checking for grep that handles long lines and -e... /usr/bin/grep
23:02:21checking for egrep... /usr/bin/ld
23:02:21checking if the linker (/usr/bin/ld) is GNU ld... /usr/bin/grep -E
23:02:21checking for fgrep... /usr/bin/grep -F
23:02:21yes
23:02:21checking for BSD- or MS-compatible name lister (nm)... checking for ld used by gcc-9... /usr/bin/nm -B
23:02:21checking the name lister (/usr/bin/nm -B) interface... /usr/bin/ld
23:02:21checking if the linker (/usr/bin/ld) is GNU ld... yes
23:02:21checking for BSD- or MS-compatible name lister (nm)... /usr/bin/nm -B
23:02:21checking the name lister (/usr/bin/nm -B) interface... BSD nm
23:02:21checking whether ln -s works... yes
23:02:21checking the maximum length of command line arguments... 1572864
23:02:21checking how to convert x86_64-pc-linux-gnu file names to x86_64-pc-linux-gnu format... BSD nm
23:02:21checking whether ln -s works... func_convert_file_noop
23:02:21yes
23:02:21checking the maximum length of command line arguments... checking how to convert x86_64-pc-linux-gnu file names to toolchain format... func_convert_file_noop
23:02:21checking for /usr/bin/ld option to reload object files... -r
23:02:21checking for file... file
23:02:21checking for objdump... objdump
23:02:21checking how to recognize dependent libraries... pass_all
23:02:21checking for dlltool... no
23:02:21checking how to associate runtime and link libraries... printf %s\n
23:02:21checking for archiver @FILE support... 1572864
23:02:21checking how to convert x86_64-pc-linux-gnu file names to x86_64-pc-linux-gnu format... func_convert_file_noop
23:02:21checking how to convert x86_64-pc-linux-gnu file names to toolchain format... func_convert_file_noop
23:02:21checking for /usr/bin/ld option to reload object files... -r
23:02:21checking for file... file
23:02:21checking for objdump... objdump
23:02:21checking how to recognize dependent libraries... pass_all
23:02:21checking for dlltool... no
23:02:21checking how to associate runtime and link libraries... printf %s\n
23:02:21checking for archiver @FILE support... @
23:02:21checking for strip... strip
23:02:21checking for ranlib... gcc-ranlib
23:02:21checking command to parse /usr/bin/nm -B output from gcc-9 object... @
23:02:21checking for strip... strip
23:02:21checking for ranlib... gcc-ranlib
23:02:21checking command to parse /usr/bin/nm -B output from gcc-9 object... ok
23:02:21checking for sysroot... no
23:02:21checking for a working dd... /usr/bin/dd
23:02:21checking how to truncate binary pipes... /usr/bin/dd bs=4096 count=1
23:02:21checking for mt... mt
23:02:21checking if mt is a manifest tool... ok
23:02:21checking for sysroot... no
23:02:21checking for a working dd... no
23:02:21checking for stdio.h... /usr/bin/dd
23:02:21checking how to truncate binary pipes... /usr/bin/dd bs=4096 count=1
23:02:21yes
23:02:21checking for stdlib.h... checking for mt... mt
23:02:21checking if mt is a manifest tool... no
23:02:21checking for stdio.h... yes
23:02:21checking for string.h... yes
23:02:21checking for stdlib.h... yes
23:02:21checking for inttypes.h... yes
23:02:21checking for string.h... yes
23:02:21checking for stdint.h... yes
23:02:21checking for inttypes.h... yes
23:02:21yes
23:02:21checking for stdint.h... checking for strings.h... yes
23:02:21checking for strings.h... yes
23:02:21checking for sys/stat.h... yes
23:02:21checking for sys/stat.h... yes
23:02:21checking for sys/types.h... yes
23:02:21checking for sys/types.h... yes
23:02:21checking for unistd.h... yes
23:02:21checking for unistd.h... yes
23:02:21checking for dlfcn.h... yes
23:02:21checking for dlfcn.h... yes
23:02:21checking for objdir... .libs
23:02:21yes
23:02:21checking for objdir... .libs
23:02:21checking if gcc-9 supports -fno-rtti -fno-exceptions... no
23:02:21checking for gcc-9 option to produce PIC... -fPIC -DPIC
23:02:21checking if gcc-9 PIC flag -fPIC -DPIC works... checking if gcc-9 supports -fno-rtti -fno-exceptions... yes
23:02:21checking if gcc-9 static flag -static works... no
23:02:21checking for gcc-9 option to produce PIC... -fPIC -DPIC
23:02:21checking if gcc-9 PIC flag -fPIC -DPIC works... yes
23:02:21checking if gcc-9 static flag -static works... yes
23:02:21checking if gcc-9 supports -c -o file.o... yes
23:02:21checking if gcc-9 supports -c -o file.o... yes
23:02:21checking if gcc-9 supports -c -o file.o... (cached) yes
23:02:21checking whether the gcc-9 linker (/usr/bin/ld -m elf_x86_64) supports shared libraries... yes
23:02:21checking whether -lc should be explicitly linked in... yes
23:02:21checking if gcc-9 supports -c -o file.o... (cached) yes
23:02:21checking whether the gcc-9 linker (/usr/bin/ld -m elf_x86_64) supports shared libraries... yes
23:02:21checking whether -lc should be explicitly linked in... no
23:02:21checking dynamic linker characteristics... no
23:02:21checking dynamic linker characteristics... GNU/Linux ld.so
23:02:21checking how to hardcode library paths into programs... immediate
23:02:21checking whether stripping libraries is possible... yes
23:02:21checking if libtool supports shared libraries... yes
23:02:21checking whether to build shared libraries... yes
23:02:21checking whether to build static libraries... no
23:02:21GNU/Linux ld.so
23:02:21checking how to hardcode library paths into programs... immediate
23:02:21checking whether stripping libraries is possible... yes
23:02:21checking if libtool supports shared libraries... yes
23:02:21checking whether to build shared libraries... yes
23:02:21checking whether to build static libraries... no
23:02:21checking whether the compiler supports GNU C++... yes
23:02:21checking whether g++-9 accepts -g... checking whether the compiler supports GNU C++... yes
23:02:21yes
23:02:21checking whether g++-9 accepts -g... checking for g++-9 option to enable C++11 features... yes
23:02:21checking for g++-9 option to enable C++11 features... none needed
23:02:21checking dependency style of g++-9... none needed
23:02:21checking dependency style of g++-9... gcc3
23:02:21checking how to run the C++ preprocessor... gcc3
23:02:21checking how to run the C++ preprocessor... g++-9 -E
23:02:21g++-9 -E
23:02:21checking for ld used by g++-9... /usr/bin/ld -m elf_x86_64
23:02:21checking if the linker (/usr/bin/ld -m elf_x86_64) is GNU ld... yes
23:02:21checking whether the g++-9 linker (/usr/bin/ld -m elf_x86_64) supports shared libraries... yes
23:02:21checking for ld used by g++-9... /usr/bin/ld -m elf_x86_64
23:02:21checking if the linker (/usr/bin/ld -m elf_x86_64) is GNU ld... yes
23:02:21checking whether the g++-9 linker (/usr/bin/ld -m elf_x86_64) supports shared libraries... yes
23:02:21checking for g++-9 option to produce PIC... -fPIC -DPIC
23:02:21checking if g++-9 PIC flag -fPIC -DPIC works... checking for g++-9 option to produce PIC... -fPIC -DPIC
23:02:21checking if g++-9 PIC flag -fPIC -DPIC works... yes
23:02:21checking if g++-9 static flag -static works... yes
23:02:21checking if g++-9 static flag -static works... yes
23:02:21checking if g++-9 supports -c -o file.o... yes
23:02:21checking if g++-9 supports -c -o file.o... (cached) yes
23:02:21checking whether the g++-9 linker (/usr/bin/ld -m elf_x86_64) supports shared libraries... yes
23:02:21checking dynamic linker characteristics... (cached) GNU/Linux ld.so
23:02:21checking how to hardcode library paths into programs... immediate
23:02:21yes
23:02:21checking if g++-9 supports -c -o file.o... checking for gcc... (cached) gcc-9
23:02:21yes
23:02:21checking if g++-9 supports -c -o file.o... (cached) yes
23:02:21checking whether the g++-9 linker (/usr/bin/ld -m elf_x86_64) supports shared libraries... yes
23:02:21checking dynamic linker characteristics... (cached) checking whether the compiler supports GNU C... (cached) yes
23:02:21checking whether gcc-9 accepts -g... (cached) yes
23:02:21checking for gcc-9 option to enable C11 features... (cached) none needed
23:02:21checking whether gcc-9 understands -c and -o together... (cached) yes
23:02:21checking dependency style of gcc-9... (cached) gcc3
23:02:21checking dependency style of gcc-9... GNU/Linux ld.so
23:02:21checking how to hardcode library paths into programs... immediate
23:02:21checking for gcc... (cached) gcc-9
23:02:21gcc3
23:02:21checking whether make sets $(MAKE)... (cached) yes
23:02:21checking for linux/rseq.h... checking whether the compiler supports GNU C... (cached) yes
23:02:21checking whether gcc-9 accepts -g... (cached) yes
23:02:21checking for gcc-9 option to enable C11 features... (cached) none needed
23:02:21checking whether gcc-9 understands -c and -o together... (cached) yes
23:02:21checking dependency style of gcc-9... (cached) gcc3
23:02:21checking dependency style of gcc-9... yes
23:02:21checking for rseq_available in -lrseq... gcc3
23:02:21checking whether make sets $(MAKE)... (cached) yes
23:02:21checking for linux/rseq.h... no
23:02:21checking for gcc-9 options needed to detect all undeclared functions... yes
23:02:21checking for rseq_available in -lrseq... none needed
23:02:21checking for linux/io_uring.h... no
23:02:21checking for gcc-9 options needed to detect all undeclared functions... yes
23:02:21checking for liburing.h... none needed
23:02:21checking for linux/io_uring.h... no
23:02:21checking whether IORING_OP_NOP is declared... yes
23:02:21checking for liburing.h... yes
23:02:21checking whether IORING_OP_READV is declared... no
23:02:21checking whether IORING_OP_NOP is declared... yes
23:02:21checking whether IORING_OP_WRITEV is declared... yes
23:02:21checking whether IORING_OP_READV is declared... yes
23:02:21checking whether IORING_OP_FSYNC is declared... yes
23:02:21checking whether IORING_OP_WRITEV is declared... yes
23:02:21checking whether IORING_OP_READ_FIXED is declared... yes
23:02:21checking whether IORING_OP_FSYNC is declared... yes
23:02:21checking whether IORING_OP_WRITE_FIXED is declared... yes
23:02:21checking whether IORING_OP_READ_FIXED is declared... yes
23:02:21checking whether IORING_OP_POLL_ADD is declared... yes
23:02:21checking whether IORING_OP_WRITE_FIXED is declared... yes
23:02:21checking whether IORING_OP_POLL_REMOVE is declared... yes
23:02:21checking whether IORING_OP_POLL_ADD is declared... yes
23:02:21checking whether IORING_OP_SYNC_FILE_RANGE is declared... yes
23:02:21checking whether IORING_OP_POLL_REMOVE is declared... yes
23:02:21checking whether IORING_OP_SENDMSG is declared... yes
23:02:21checking whether IORING_OP_SYNC_FILE_RANGE is declared... yes
23:02:21checking whether IORING_OP_RECVMSG is declared... yes
23:02:21checking whether IORING_OP_SENDMSG is declared... yes
23:02:21checking whether IORING_OP_TIMEOUT is declared... yes
23:02:21checking whether IORING_OP_RECVMSG is declared... yes
23:02:21checking whether IORING_OP_TIMEOUT_REMOVE is declared... yes
23:02:21checking whether IORING_OP_TIMEOUT is declared... yes
23:02:21checking whether IORING_OP_ACCEPT is declared... yes
23:02:21checking whether IORING_OP_TIMEOUT_REMOVE is declared... yes
23:02:21checking whether IORING_OP_ASYNC_CANCEL is declared... yes
23:02:21checking whether IORING_OP_ACCEPT is declared... yes
23:02:21checking whether IORING_OP_LINK_TIMEOUT is declared... yes
23:02:21checking whether IORING_OP_ASYNC_CANCEL is declared... yes
23:02:21checking whether IORING_OP_CONNECT is declared... yes
23:02:21checking whether IORING_OP_LINK_TIMEOUT is declared... yes
23:02:21checking whether IORING_OP_FALLOCATE is declared... yes
23:02:21checking whether IORING_OP_CONNECT is declared... yes
23:02:21checking whether IORING_OP_OPENAT is declared... yes
23:02:21yes
23:02:21checking whether IORING_OP_CLOSE is declared... checking whether IORING_OP_FALLOCATE is declared... yes
23:02:21checking whether IORING_OP_FILES_UPDATE is declared... yes
23:02:21checking whether IORING_OP_OPENAT is declared... yes
23:02:21checking whether IORING_OP_STATX is declared... yes
23:02:21checking whether IORING_OP_CLOSE is declared... yes
23:02:21checking whether IORING_OP_READ is declared... yes
23:02:21checking whether IORING_OP_FILES_UPDATE is declared... yes
23:02:21checking whether IORING_OP_WRITE is declared... yes
23:02:21checking whether IORING_OP_STATX is declared... yes
23:02:21checking whether IORING_OP_FADVISE is declared... yes
23:02:21checking whether IORING_OP_READ is declared... yes
23:02:21checking whether IORING_OP_MADVISE is declared... yes
23:02:21checking whether IORING_OP_WRITE is declared... yes
23:02:21checking whether IORING_OP_SEND is declared... yes
23:02:21checking whether IORING_OP_FADVISE is declared... yes
23:02:21checking whether IORING_OP_RECV is declared... yes
23:02:21checking whether IORING_OP_MADVISE is declared... yes
23:02:21checking whether IORING_OP_OPENAT2 is declared... yes
23:02:21checking whether IORING_OP_SEND is declared... yes
23:02:21checking whether IORING_OP_EPOLL_CTL is declared... yes
23:02:21checking whether IORING_OP_RECV is declared... yes
23:02:21checking whether IORING_OP_SPLICE is declared... yes
23:02:21checking whether IORING_OP_OPENAT2 is declared... yes
23:02:21checking whether IORING_OP_PROVIDE_BUFFERS is declared... yes
23:02:21checking whether IORING_OP_EPOLL_CTL is declared... yes
23:02:21checking whether IORING_OP_REMOVE_BUFFER is declared... yes
23:02:21checking whether IORING_OP_SPLICE is declared... no
23:02:21checking whether IORING_OP_TEE is declared... yes
23:02:21checking whether IORING_OP_PROVIDE_BUFFERS is declared... yes
23:02:21checking whether IOSQE_FIXED_FILE is declared... yes
23:02:21checking whether IORING_OP_REMOVE_BUFFER is declared... yes
23:02:21checking whether IOSQE_IO_DRAIN is declared... no
23:02:21checking whether IORING_OP_TEE is declared... yes
23:02:21checking whether IOSQE_IO_LINK is declared... yes
23:02:21checking whether IOSQE_FIXED_FILE is declared... yes
23:02:21checking whether IOSQE_IO_HARDLINK is declared... yes
23:02:21checking whether IOSQE_IO_DRAIN is declared... yes
23:02:21checking whether IOSQE_ASYNC is declared... yes
23:02:21checking whether IOSQE_IO_LINK is declared... yes
23:02:21checking whether IOSQE_BUFFER_SELECT is declared... yes
23:02:21checking whether IOSQE_IO_HARDLINK is declared... yes
23:02:21checking whether SPLICE_F_FD_IN_FIXED is declared... yes
23:02:21checking whether IOSQE_ASYNC is declared... yes
23:02:21checking whether IORING_SETUP_ATTACH_WQ is declared... yes
23:02:21checking whether IOSQE_BUFFER_SELECT is declared... yes
23:02:21checking whether IORING_REGISTER_IOWQ_MAX_WORKERS is declared... yes
23:02:21checking whether SPLICE_F_FD_IN_FIXED is declared... yes
23:02:21checking for preadv2... yes
23:02:21checking whether IORING_SETUP_ATTACH_WQ is declared... yes
23:02:21yes
23:02:21checking for pwritev2... checking whether IORING_REGISTER_IOWQ_MAX_WORKERS is declared... yes
23:02:21checking for preadv2... yes
23:02:21checking that generated files are newer than configure... done
23:02:21configure: creating ./config.status
23:02:21yes
23:02:21checking for pwritev2... yes
23:02:21checking that generated files are newer than configure... done
23:02:21configure: creating ./config.status
23:02:21config.status: creating Makefile
23:02:21config.status: creating src/Makefile
23:02:21config.status: creating prelude/Makefile
23:02:21config.status: creating src/concurrency/io/call.cfa
23:02:21config.status: creating Makefile
23:02:21/var/lib/jenkins/workspace/Cforall_master/libcfa/src/concurrency/io/call.cfa.in:144: SyntaxWarning: invalid escape sequence '\('
23:02:21 sig = re.search("(.*) (.*)\((.*)\)", signature)
23:02:21config.status: creating prelude/defines.hfa
23:02:21config.status: creating src/Makefile
23:02:21config.status: executing depfiles commands
23:02:21config.status: creating prelude/Makefile
23:02:21config.status: creating src/concurrency/io/call.cfa
23:02:21config.status: executing libtool commands
23:02:21/var/lib/jenkins/workspace/Cforall_master/libcfa/src/concurrency/io/call.cfa.in:144: SyntaxWarning: invalid escape sequence '\('
23:02:21 sig = re.search("(.*) (.*)\((.*)\)", signature)
23:02:21Cforall library configuraton completed. Type "make -j 8 install".
23:02:21config.status: creating prelude/defines.hfa
23:02:21config.status: executing depfiles commands
23:02:21config.status: executing libtool commands
23:02:21Cforall library configuraton completed. Type "make -j 8 install".
23:02:21[Pipeline] }
23:02:21[Pipeline] // dir
23:02:21[Pipeline] }
23:02:21[Pipeline] // stage
23:02:21[Pipeline] echo
23:02:21 -------- Build : cfa-cpp --------
23:02:21[Pipeline] stage
23:02:21[Pipeline] { (Build : cfa-cpp)
23:02:21[Pipeline] dir
23:02:21Running in /var/lib/jenkins/workspace/Cforall_master@tmp
23:02:21[Pipeline] {
23:02:21[Pipeline] sh
23:02:21+ nproc
23:02:21+ make -j 16 --no-print-directory -C driver
23:02:21 CXX as.o
23:02:21 CXX cc1.o
23:02:21 CXX cfa.o
23:02:21 CXXLD as
23:02:21 CXXLD cc1
23:02:21 CXXLD cfa
23:02:21[Pipeline] sh
23:02:21+ nproc
23:02:21+ make -j 16 --no-print-directory -C src
23:02:21 YACC Parser/parser.cc
23:02:21updating Parser/parser.output
23:02:21updating Parser/parser.hh
23:02:21make all-am
23:02:21 CXX CompilationState.o
23:02:21 CXX main.o
23:02:21 CXX MakeLibCfa.o
23:02:21 LEX Parser/lex.cc
23:02:21 CXX AST/Attribute.o
23:02:21 CXX AST/Copy.o
23:02:21 CXX AST/Create.o
23:02:21 CXX AST/Decl.o
23:02:21 CXX AST/DeclReplacer.o
23:02:21 CXX AST/Expr.o
23:02:21 CXX AST/GenericSubstitution.o
23:02:21 CXX AST/Init.o
23:02:21 CXX AST/Inspect.o
23:02:21 CXX AST/LinkageSpec.o
23:02:21 CXX AST/Node.o
23:02:21 CXX AST/Pass.o
23:02:21 CXX AST/Print.o
23:02:21 CXX AST/Stmt.o
23:02:21 CXX AST/SymbolTable.o
23:02:21 CXX AST/Type.o
23:02:21 CXX AST/TypeEnvironment.o
23:02:21 CXX AST/TypeSubstitution.o
23:02:21 CXX AST/Util.o
23:02:21 CXX CodeGen/CodeGenerator.o
23:02:21 CXX CodeGen/GenType.o
23:02:21 CXX CodeGen/OperatorTable.o
23:02:21 CXX CodeGen/FixMain.o
23:02:21 CXX CodeGen/FixNames.o
23:02:21 CXX CodeGen/Generate.o
23:02:21 CXX CodeGen/LinkOnce.o
23:02:21 CXX Concurrency/Actors.o
23:02:21 CXX Concurrency/Corun.o
23:02:21 CXX Concurrency/Keywords.o
23:02:21 CXX Concurrency/Waitfor.o
23:02:21 CXX Concurrency/Waituntil.o
23:02:21 CXX Common/Assert.o
23:02:21 CXX Common/CodeLocationTools.o
23:02:21 CXX Common/DeclStats.o
23:02:21 CXX Common/Eval.o
23:02:21 CXX Common/Examine.o
23:02:21 CXX Common/Indenter.o
23:02:21 CXX Common/ResolvProtoDump.o
23:02:21 CXX Common/SemanticError.o
23:02:21 CXX Common/Stats/Counter.o
23:02:21 CXX Common/Stats/Heap.o
23:02:21 CXX Common/Stats/ResolveTime.o
23:02:21 CXX Common/Stats/Stats.o
23:02:21 CXX Common/Stats/Time.o
23:02:21 CXX Common/Symbol.o
23:02:21 CXX Common/UniqueName.o
23:02:21 CXX Common/DebugMalloc.o
23:02:21 CXX ControlStruct/ExceptDecl.o
23:02:21 CXX ControlStruct/ExceptTranslate.o
23:02:21 CXX ControlStruct/FixLabels.o
23:02:21 CXX ControlStruct/HoistControlDecls.o
23:02:21 CXX ControlStruct/LabelGenerator.o
23:02:21 CXX ControlStruct/MultiLevelExit.o
23:02:21 CXX ControlStruct/TranslateEnumRange.o
23:02:21 CXX GenPoly/GenPoly.o
23:02:21 CXX GenPoly/Lvalue2.o
23:02:21 CXX GenPoly/Box.o
23:02:21 CXX GenPoly/FindFunction.o
23:02:21 CXX GenPoly/InstantiateGeneric.o
23:02:21 CXX GenPoly/Lvalue.o
23:02:21 CXX GenPoly/ScrubTypeVars.o
23:02:21 CXX GenPoly/Specialize.o
23:02:21 CXX InitTweak/GenInit.o
23:02:21 CXX InitTweak/InitTweak.o
23:02:21 CXX InitTweak/FixGlobalInit.o
23:02:21 CXX InitTweak/FixInit.o
23:02:21 CXX Parser/DeclarationNode.o
23:02:21 CXX Parser/ExpressionNode.o
23:02:21 CXX Parser/InitializerNode.o
23:02:21 CXX Parser/lex.o
23:02:21 CXX Parser/ParseNode.o
23:02:21 CXX Parser/parser.o
23:02:21 CXX Parser/RunParser.o
23:02:21In file included from /usr/include/x86_64-linux-gnu/c++/9/bits/os_defines.h:39,
23:02:21 from /usr/include/x86_64-linux-gnu/c++/9/bits/c++config.h:528,
23:02:21 from /usr/include/c++/9/cstdio:41,
23:02:21 from /var/lib/jenkins/workspace/Cforall_master/src/Parser/parser.yy:41:
23:02:21/usr/include/features.h:415:4: warning: #warning _FORTIFY_SOURCE requires GCC 4.1 or later [-Wcpp]
23:02:21 415 | # warning _FORTIFY_SOURCE requires GCC 4.1 or later
23:02:21 | ^~~~~~~
23:02:21 CXX Parser/StatementNode.o
23:02:21 CXX Parser/TypeData.o
23:02:21 CXX Parser/TypedefTable.o
23:02:21 CXX ResolvExpr/AdjustExprType.o
23:02:21 CXX ResolvExpr/Candidate.o
23:02:21 CXX ResolvExpr/CandidateFinder.o
23:02:21 CXX ResolvExpr/CastCost.o
23:02:21 CXX ResolvExpr/CommonType.o
23:02:21 CXX ResolvExpr/ConversionCost.o
23:02:21 CXX ResolvExpr/CurrentObject.o
23:02:21 CXX ResolvExpr/ExplodedArg.o
23:02:21 CXX ResolvExpr/FindOpenVars.o
23:02:21 CXX ResolvExpr/PolyCost.o
23:02:21 CXX ResolvExpr/PtrsAssignable.o
23:02:21 CXX ResolvExpr/PtrsCastable.o
23:02:21 CXX ResolvExpr/RenameVars.o
23:02:21 CXX ResolvExpr/Resolver.o
23:02:21 CXX ResolvExpr/ResolveTypeof.o
23:02:21 CXX ResolvExpr/SatisfyAssertions.o
23:02:21 CXX ResolvExpr/SpecCost.o
23:02:21 CXX ResolvExpr/Unify.o
23:02:21 CXX ResolvExpr/CandidatePrinter.o
23:02:21 CXX ResolvExpr/EraseWith.o
23:02:21 CXX SymTab/FixFunction.o
23:02:21 CXX SymTab/GenImplicitCall.o
23:02:21 CXX SymTab/Mangler.o
23:02:21 CXX SymTab/ManglerCommon.o
23:02:21 CXX Tuples/Explode.o
23:02:21 CXX Tuples/TupleAssignment.o
23:02:21 CXX Tuples/TupleExpansion.o
23:02:21 CXX Tuples/Tuples.o
23:02:21 CXX Validate/Autogen.o
23:02:21 CXX Validate/CheckAssertions.o
23:02:21 CXX Validate/CompoundLiteral.o
23:02:21 CXX Validate/EliminateTypedef.o
23:02:21 CXX Validate/EnumAndPointerDecay.o
23:02:21 CXX Validate/FindSpecialDecls.o
23:02:21 CXX Validate/FixQualifiedTypes.o
23:02:21 CXX Validate/FixReturnTypes.o
23:02:21 CXX Validate/ForallPointerDecay.o
23:02:21 CXX Validate/GenericParameter.o
23:02:21 CXX Validate/HoistStruct.o
23:02:21 CXX Validate/HoistTypeDecls.o
23:02:21 CXX Validate/ImplementEnumFunc.o
23:02:21 CXX Validate/InitializerLength.o
23:02:21 CXX Validate/LabelAddressFixer.o
23:02:21 CXX Validate/LinkInstanceTypes.o
23:02:21 CXX Validate/ReplaceTypedef.o
23:02:21 CXX Validate/ReturnCheck.o
23:02:21 CXX Validate/VerifyCtorDtorAssign.o
23:02:21 CXX Virtual/ExpandCasts.o
23:02:21 CXX Virtual/Tables.o
23:02:21 CXX Virtual/VirtualDtor.o
23:02:21 CXXLD ../driver/cfa-cpp
23:02:21[Pipeline] }
23:02:21[Pipeline] // dir
23:02:21[Pipeline] }
23:02:21[Pipeline] // stage
23:02:21[Pipeline] echo
23:02:21 -------- Build : libcfa(debug) --------
23:02:21[Pipeline] stage
23:02:21[Pipeline] { (Build : libcfa(debug))
23:02:21[Pipeline] dir
23:02:21Running in /var/lib/jenkins/workspace/Cforall_master@tmp
23:02:21[Pipeline] {
23:02:21[Pipeline] sh
23:02:21+ nproc
23:02:21+ make -j 16 --no-print-directory -C libcfa/x64-debug
23:02:21Making all in prelude
23:02:21mkdir .deps
23:02:21touch .deps/builtins.Po
23:02:21(CDPATH="${ZSH_VERSION+.}:" && cd /var/lib/jenkins/workspace/Cforall_master/libcfa && /bin/bash '/var/lib/jenkins/workspace/Cforall_master/libcfa/automake/missing' autoheader)
23:02:21rm -f stamp-h1
23:02:21touch /var/lib/jenkins/workspace/Cforall_master/libcfa/prelude/defines.hfa.in
23:02:21cd .. && /bin/bash ./config.status prelude/defines.hfa
23:02:21config.status: creating prelude/defines.hfa
23:02:21config.status: prelude/defines.hfa is unchanged
23:02:21make all-am
23:02:21 GEN gcc-builtins.c
23:02:21 GEN builtins.cfa
23:02:21 GEN prelude.cfa
23:02:21 GEN extras.cfa
23:02:21 GEN extras.cfa
23:02:21 GEN gcc-builtins.cfa
23:02:21 GEN bootloader.c
23:02:21Making all in src
23:02:21 CFA fstream.lo
23:02:21 CFA common.lo
23:02:21 CFA iostream.lo
23:02:21 CFA heap.lo
23:02:21 CFA limits.lo
23:02:21 CFA iterator.lo
23:02:21 CFA math.lo
23:02:21 CFA memory.lo
23:02:21 CFA parseargs.lo
23:02:21 CFA parseconfig.lo
23:02:21 CFA rational.lo
23:02:21 CFA stdlib.lo
23:02:21 CFA strstream.lo
23:02:21 CFA time.lo
23:02:21 CFA assert.lo
23:02:21 CFA bits/debug.lo
23:02:21 CC exception.lo
23:02:21 CFA interpose.lo
23:02:21 CFA prelude-inline.lo
23:02:21 CFA startup.lo
23:02:21 CC virtual.lo
23:02:21 GEN prelude.lo
23:02:21 CFA concurrency/locks.lo
23:02:21 CFA concurrency/monitor.lo
23:02:21 CFA concurrency/mutex.lo
23:02:21 CFA concurrency/select.lo
23:02:21 CFA concurrency/thread.lo
23:02:21 CFA concurrency/cofor.lo
23:02:21 CFA interpose_thread.lo
23:02:21 CPPAS concurrency/CtxSwitch-x64.lo
23:02:21 CC concurrency/invoke.lo
23:02:21 CFA concurrency/io.lo
23:02:21 CFA concurrency/kernel/startup.lo
23:02:21 CFA concurrency/preemption.lo
23:02:21 CFA concurrency/ready_queue.lo
23:02:21 CFA concurrency/stats.lo
23:02:21 CFA concurrency/pthread.lo
23:02:21 CFA bits/weakso_locks.lo
23:02:21 CFA algorithms/range_iterator.lo
23:02:21 CFA collections/maybe.lo
23:02:21 CFA collections/pair.lo
23:02:21 CFA collections/result.lo
23:02:21 CFA collections/string.lo
23:02:21 CFA collections/string_res.lo
23:02:21 CFA collections/vector.lo
23:02:21 CFA device/cpu.lo
23:02:21 CFA concurrency/alarm.lo
23:02:21 CFA concurrency/coroutine.lo
23:02:21 CFA concurrency/exception.lo
23:02:21 CFA concurrency/kernel.lo
23:02:21 CFA concurrency/kernel/cluster.lo
23:02:21 CFA concurrency/clib/cfathread.lo
23:02:21 CFA concurrency/io/setup.lo
23:02:21 CFA concurrency/io/call.lo
23:02:21/usr/include/linux/io_uring.h:83:36: warning: 'packed' attribute ignored for field of type 'union __io_uring_sqe____anonymous131' [-Wattributes]
23:02:21 83 | } __attribute__((packed));
23:02:21 | ^
23:02:21/usr/include/linux/io_uring.h:83:36: warning: 'packed' attribute ignored for field of type 'union __io_uring_sqe____anonymous55' [-Wattributes]
23:02:21 83 | } __attribute__((packed));
23:02:21 | ^
23:02:21 CCLD libcfa.la
23:02:21/usr/bin/ld: warning: .libs/common.o: requires executable stack (because the .note.GNU-stack section is executable)
23:02:21/usr/bin/ld: .libs/exception.o: warning: relocation against `__gcfa_personality_v0' in read-only section `.rodata'
23:02:21/usr/bin/ld: warning: creating DT_TEXTREL in a shared object
23:02:21/usr/include/linux/io_uring.h:83:36: warning: 'packed' attribute ignored for field of type 'union __io_uring_sqe____anonymous65' [-Wattributes]
23:02:21 83 | } __attribute__((packed));
23:02:21 | ^
23:02:21/usr/include/linux/io_uring.h:83:36: warning: 'packed' attribute ignored for field of type 'union __io_uring_sqe____anonymous121' [-Wattributes]
23:02:21 83 | } __attribute__((packed));
23:02:21 | ^
23:02:21/usr/include/linux/io_uring.h:83:36: warning: 'packed' attribute ignored for field of type 'union __io_uring_sqe____anonymous121' [-Wattributes]
23:02:21 83 | } __attribute__((packed));
23:02:21 | ^
23:02:21/usr/include/linux/io_uring.h:83:36: warning: 'packed' attribute ignored for field of type 'union __io_uring_sqe____anonymous32' [-Wattributes]
23:02:21 83 | } __attribute__((packed));
23:02:21 | ^
23:02:21/usr/include/linux/io_uring.h:83:36: warning: 'packed' attribute ignored for field of type 'union __io_uring_sqe____anonymous97' [-Wattributes]
23:02:21 83 | } __attribute__((packed));
23:02:21 | ^
23:02:21 CCLD libcfathread.la
23:02:21/usr/bin/ld: warning: concurrency/.libs/alarm.o: requires executable stack (because the .note.GNU-stack section is executable)
23:02:21make[1]: Nothing to be done for 'all-am'.
23:02:21[Pipeline] }
23:02:21[Pipeline] // dir
23:02:21[Pipeline] }
23:02:21[Pipeline] // stage
23:02:21[Pipeline] echo
23:02:21 -------- Build : libcfa(nodebug) --------
23:02:21[Pipeline] stage
23:02:21[Pipeline] { (Build : libcfa(nodebug))
23:02:21[Pipeline] dir
23:02:21Running in /var/lib/jenkins/workspace/Cforall_master@tmp
23:02:21[Pipeline] {
23:02:21[Pipeline] sh
23:02:21+ nproc
23:02:21+ make -j 16 --no-print-directory -C libcfa/x64-nodebug
23:02:21Making all in prelude
23:02:21mkdir .deps
23:02:21touch .deps/builtins.Po
23:02:21cd .. && /bin/bash ./config.status prelude/defines.hfa
23:02:21config.status: creating prelude/defines.hfa
23:02:21config.status: prelude/defines.hfa is unchanged
23:02:21make all-am
23:02:21 GEN gcc-builtins.c
23:02:21 GEN builtins.cfa
23:02:21 GEN prelude.cfa
23:02:21 GEN extras.cfa
23:02:21 GEN gcc-builtins.cfa
23:02:21 GEN extras.cfa
23:02:21 GEN bootloader.c
23:02:21Making all in src
23:02:21 CFA common.lo
23:02:21 CFA fstream.lo
23:02:21 CFA heap.lo
23:02:21 CFA iostream.lo
23:02:21 CFA iterator.lo
23:02:21 CFA limits.lo
23:02:21 CFA math.lo
23:02:21 CFA memory.lo
23:02:21 CFA parseargs.lo
23:02:21 CFA parseconfig.lo
23:02:21 CFA rational.lo
23:02:21 CFA stdlib.lo
23:02:21 CFA strstream.lo
23:02:21 CFA time.lo
23:02:21 CFA assert.lo
23:02:21 CFA bits/debug.lo
23:02:21 CC exception.lo
23:02:21/var/lib/jenkins/workspace/Cforall_master/libcfa/src/exception.c: In function '__cfaehm_allocate_exception':
23:02:21/var/lib/jenkins/workspace/Cforall_master/libcfa/src/exception.c:142:3: warning: ignoring return value of 'write', declared with attribute warn_unused_result [-Wunused-result]
23:02:21 142 | write( 2, "abort2\n", 7 );
23:02:21 | ^~~~~~~~~~~~~~~~~~~~~~~~~
23:02:21/var/lib/jenkins/workspace/Cforall_master/libcfa/src/exception.c: In function '__cfaehm_exception_cleanup':
23:02:21/var/lib/jenkins/workspace/Cforall_master/libcfa/src/exception.c:127:3: warning: ignoring return value of 'write', declared with attribute warn_unused_result [-Wunused-result]
23:02:21 127 | write( 2, "abort1\n", 7 );
23:02:21 | ^~~~~~~~~~~~~~~~~~~~~~~~~
23:02:21/var/lib/jenkins/workspace/Cforall_master/libcfa/src/exception.c: In function '__cfaehm_cancel_stack':
23:02:21/var/lib/jenkins/workspace/Cforall_master/libcfa/src/exception.c:230:2: warning: ignoring return value of 'write', declared with attribute warn_unused_result [-Wunused-result]
23:02:21 230 | write( 2, "abort3\n", 7 );
23:02:21 | ^~~~~~~~~~~~~~~~~~~~~~~~~
23:02:21/var/lib/jenkins/workspace/Cforall_master/libcfa/src/exception.c: In function '__cfaehm_begin_unwind':
23:02:21/var/lib/jenkins/workspace/Cforall_master/libcfa/src/exception.c:252:3: warning: ignoring return value of 'write', declared with attribute warn_unused_result [-Wunused-result]
23:02:21 252 | write( 2, "abort4\n", 7 );
23:02:21 | ^~~~~~~~~~~~~~~~~~~~~~~~~
23:02:21/var/lib/jenkins/workspace/Cforall_master/libcfa/src/exception.c:278:3: warning: ignoring return value of 'write', declared with attribute warn_unused_result [-Wunused-result]
23:02:21 278 | write( 2, "abort5\n", 7 );
23:02:21 | ^~~~~~~~~~~~~~~~~~~~~~~~~
23:02:21/var/lib/jenkins/workspace/Cforall_master/libcfa/src/exception.c: In function '__cfaehm_rethrow_terminate':
23:02:21/var/lib/jenkins/workspace/Cforall_master/libcfa/src/exception.c:308:2: warning: ignoring return value of 'write', declared with attribute warn_unused_result [-Wunused-result]
23:02:21 308 | write( 2, "abort7\n", 7 );
23:02:21 | ^~~~~~~~~~~~~~~~~~~~~~~~~
23:02:21/var/lib/jenkins/workspace/Cforall_master/libcfa/src/exception.c: In function '__cfaehm_rethrow_adapter':
23:02:21/var/lib/jenkins/workspace/Cforall_master/libcfa/src/exception.c:300:2: warning: ignoring return value of 'write', declared with attribute warn_unused_result [-Wunused-result]
23:02:21 300 | write( 2, "abort6\n", 7 );
23:02:21 | ^~~~~~~~~~~~~~~~~~~~~~~~~
23:02:21 CFA interpose.lo
23:02:21 CFA prelude-inline.lo
23:02:21 CFA startup.lo
23:02:21 CC virtual.lo
23:02:21 GEN prelude.lo
23:02:21 CFA concurrency/locks.lo
23:02:21 CFA concurrency/monitor.lo
23:02:21 CFA concurrency/mutex.lo
23:02:21 CFA concurrency/select.lo
23:02:21 CFA concurrency/thread.lo
23:02:21 CFA concurrency/cofor.lo
23:02:21 CFA interpose_thread.lo
23:02:21 CPPAS concurrency/CtxSwitch-x64.lo
23:02:21 CC concurrency/invoke.lo
23:02:21 CFA concurrency/io.lo
23:02:21 CFA concurrency/kernel/startup.lo
23:02:21 CFA concurrency/preemption.lo
23:02:21 CFA concurrency/ready_queue.lo
23:02:21 CFA concurrency/stats.lo
23:02:21 CFA concurrency/pthread.lo
23:02:21 CFA bits/weakso_locks.lo
23:02:21 CFA algorithms/range_iterator.lo
23:02:21 CFA collections/maybe.lo
23:02:21 CFA collections/pair.lo
23:02:21 CFA collections/result.lo
23:02:21 CFA collections/string.lo
23:02:21 CFA collections/string_res.lo
23:02:21 CFA collections/vector.lo
23:02:21 CFA device/cpu.lo
23:02:21 CFA concurrency/alarm.lo
23:02:21 CFA concurrency/coroutine.lo
23:02:21 CFA concurrency/exception.lo
23:02:21 CFA concurrency/kernel.lo
23:02:21 CFA concurrency/kernel/cluster.lo
23:02:21 CFA concurrency/clib/cfathread.lo
23:02:21 CFA concurrency/io/setup.lo
23:02:21 CFA concurrency/io/call.lo
23:02:21/usr/include/linux/io_uring.h:83:36: warning: 'packed' attribute ignored for field of type 'union __io_uring_sqe____anonymous55' [-Wattributes]
23:02:21 83 | } __attribute__((packed));
23:02:21 | ^
23:02:21/usr/include/linux/io_uring.h:83:36: warning: 'packed' attribute ignored for field of type 'union __io_uring_sqe____anonymous131' [-Wattributes]
23:02:21 83 | } __attribute__((packed));
23:02:21 | ^
23:02:21/usr/include/x86_64-linux-gnu/bits/socket2.h:70:95: warning: '_X12_constructorFv_U26__anonymous___SOCKADDR_ARGU26__anonymous___SOCKADDR_ARG_autogen___1' is static but used in inline function 'recvfrom' which is not static
23:02:21 70 | return __recvfrom_chk (__fd, __buf, __n, sz, __flags, __addr, __addr_len);
23:02:21 | ^
23:02:21/usr/include/x86_64-linux-gnu/bits/socket2.h:70:125: warning: '_X11_destructorFv_U26__anonymous___SOCKADDR_ARG_autogen___1' is static but used in inline function 'recvfrom' which is not static
23:02:21 70 | return __recvfrom_chk (__fd, __buf, __n, sz, __flags, __addr, __addr_len);
23:02:21 | ^
23:02:21/usr/include/x86_64-linux-gnu/bits/socket2.h:68:104: warning: '_X12_constructorFv_U26__anonymous___SOCKADDR_ARGU26__anonymous___SOCKADDR_ARG_autogen___1' is static but used in inline function 'recvfrom' which is not static
23:02:21 68 | return __recvfrom_chk_warn (__fd, __buf, __n, sz, __flags, __addr,
23:02:21 | ^
23:02:21/usr/include/x86_64-linux-gnu/bits/socket2.h:68:129: warning: '_X11_destructorFv_U26__anonymous___SOCKADDR_ARG_autogen___1' is static but used in inline function 'recvfrom' which is not static
23:02:21 68 | return __recvfrom_chk_warn (__fd, __buf, __n, sz, __flags, __addr,
23:02:21 | ^
23:02:21/usr/include/x86_64-linux-gnu/bits/socket2.h:66:97: warning: '_X12_constructorFv_U26__anonymous___SOCKADDR_ARGU26__anonymous___SOCKADDR_ARG_autogen___1' is static but used in inline function 'recvfrom' which is not static
23:02:21 66 | return __recvfrom_alias (__fd, __buf, __n, __flags, __addr, __addr_len);
23:02:21 | ^
23:02:21/usr/include/x86_64-linux-gnu/bits/socket2.h:66:129: warning: '_X11_destructorFv_U26__anonymous___SOCKADDR_ARG_autogen___1' is static but used in inline function 'recvfrom' which is not static
23:02:21 66 | return __recvfrom_alias (__fd, __buf, __n, __flags, __addr, __addr_len);
23:02:21 | ^
23:02:21/usr/include/x86_64-linux-gnu/bits/socket2.h:70:95: warning: '_X12_constructorFv_U26__anonymous___SOCKADDR_ARGU26__anonymous___SOCKADDR_ARG_autogen___1' is static but used in inline function 'recvfrom' which is not static
23:02:21 70 | return __recvfrom_chk (__fd, __buf, __n, sz, __flags, __addr, __addr_len);
23:02:21 | ^
23:02:21/usr/include/x86_64-linux-gnu/bits/socket2.h:70:125: warning: '_X11_destructorFv_U26__anonymous___SOCKADDR_ARG_autogen___1' is static but used in inline function 'recvfrom' which is not static
23:02:21 70 | return __recvfrom_chk (__fd, __buf, __n, sz, __flags, __addr, __addr_len);
23:02:21 | ^
23:02:21/usr/include/x86_64-linux-gnu/bits/socket2.h:68:104: warning: '_X12_constructorFv_U26__anonymous___SOCKADDR_ARGU26__anonymous___SOCKADDR_ARG_autogen___1' is static but used in inline function 'recvfrom' which is not static
23:02:21 68 | return __recvfrom_chk_warn (__fd, __buf, __n, sz, __flags, __addr,
23:02:21 | ^
23:02:21/usr/include/x86_64-linux-gnu/bits/socket2.h:68:129: warning: '_X11_destructorFv_U26__anonymous___SOCKADDR_ARG_autogen___1' is static but used in inline function 'recvfrom' which is not static
23:02:21 68 | return __recvfrom_chk_warn (__fd, __buf, __n, sz, __flags, __addr,
23:02:21 | ^
23:02:21/usr/include/x86_64-linux-gnu/bits/socket2.h:66:97: warning: '_X12_constructorFv_U26__anonymous___SOCKADDR_ARGU26__anonymous___SOCKADDR_ARG_autogen___1' is static but used in inline function 'recvfrom' which is not static
23:02:21 66 | return __recvfrom_alias (__fd, __buf, __n, __flags, __addr, __addr_len);
23:02:21 | ^
23:02:21/usr/include/x86_64-linux-gnu/bits/socket2.h:66:129: warning: '_X11_destructorFv_U26__anonymous___SOCKADDR_ARG_autogen___1' is static but used in inline function 'recvfrom' which is not static
23:02:21 66 | return __recvfrom_alias (__fd, __buf, __n, __flags, __addr, __addr_len);
23:02:21 | ^
23:02:21 CCLD libcfa.la
23:02:21/usr/bin/ld: warning: .libs/common.o: requires executable stack (because the .note.GNU-stack section is executable)
23:02:21/usr/bin/ld: .libs/exception.o: warning: relocation against `__gcfa_personality_v0' in read-only section `.rodata'
23:02:21/usr/bin/ld: warning: creating DT_TEXTREL in a shared object
23:02:21/usr/include/linux/io_uring.h:83:36: warning: 'packed' attribute ignored for field of type 'union __io_uring_sqe____anonymous65' [-Wattributes]
23:02:21 83 | } __attribute__((packed));
23:02:21 | ^
23:02:21/usr/include/x86_64-linux-gnu/bits/socket2.h:70:94: warning: '_X12_constructorFv_U26__anonymous___SOCKADDR_ARGU26__anonymous___SOCKADDR_ARG_autogen___1' is static but used in inline function 'recvfrom' which is not static
23:02:21 70 | return __recvfrom_chk (__fd, __buf, __n, sz, __flags, __addr, __addr_len);
23:02:21 | ^
23:02:21/usr/include/x86_64-linux-gnu/bits/socket2.h:70:124: warning: '_X11_destructorFv_U26__anonymous___SOCKADDR_ARG_autogen___1' is static but used in inline function 'recvfrom' which is not static
23:02:21 70 | return __recvfrom_chk (__fd, __buf, __n, sz, __flags, __addr, __addr_len);
23:02:21 | ^
23:02:21/usr/include/x86_64-linux-gnu/bits/socket2.h:68:103: warning: '_X12_constructorFv_U26__anonymous___SOCKADDR_ARGU26__anonymous___SOCKADDR_ARG_autogen___1' is static but used in inline function 'recvfrom' which is not static
23:02:21 68 | return __recvfrom_chk_warn (__fd, __buf, __n, sz, __flags, __addr,
23:02:21 | ^
23:02:21/usr/include/x86_64-linux-gnu/bits/socket2.h:68:128: warning: '_X11_destructorFv_U26__anonymous___SOCKADDR_ARG_autogen___1' is static but used in inline function 'recvfrom' which is not static
23:02:21 68 | return __recvfrom_chk_warn (__fd, __buf, __n, sz, __flags, __addr,
23:02:21 | ^
23:02:21/usr/include/x86_64-linux-gnu/bits/socket2.h:66:96: warning: '_X12_constructorFv_U26__anonymous___SOCKADDR_ARGU26__anonymous___SOCKADDR_ARG_autogen___1' is static but used in inline function 'recvfrom' which is not static
23:02:21 66 | return __recvfrom_alias (__fd, __buf, __n, __flags, __addr, __addr_len);
23:02:21 | ^
23:02:21/usr/include/x86_64-linux-gnu/bits/socket2.h:66:128: warning: '_X11_destructorFv_U26__anonymous___SOCKADDR_ARG_autogen___1' is static but used in inline function 'recvfrom' which is not static
23:02:21 66 | return __recvfrom_alias (__fd, __buf, __n, __flags, __addr, __addr_len);
23:02:21 | ^
23:02:21/usr/include/linux/io_uring.h:83:36: warning: 'packed' attribute ignored for field of type 'union __io_uring_sqe____anonymous121' [-Wattributes]
23:02:21 83 | } __attribute__((packed));
23:02:21 | ^
23:02:21/usr/include/linux/io_uring.h:83:36: warning: 'packed' attribute ignored for field of type 'union __io_uring_sqe____anonymous121' [-Wattributes]
23:02:21 83 | } __attribute__((packed));
23:02:21 | ^
23:02:21/usr/include/x86_64-linux-gnu/bits/socket2.h:70:95: warning: '_X12_constructorFv_U26__anonymous___SOCKADDR_ARGU26__anonymous___SOCKADDR_ARG_autogen___1' is static but used in inline function 'recvfrom' which is not static
23:02:21 70 | return __recvfrom_chk (__fd, __buf, __n, sz, __flags, __addr, __addr_len);
23:02:21 | ^
23:02:21/usr/include/x86_64-linux-gnu/bits/socket2.h:70:125: warning: '_X11_destructorFv_U26__anonymous___SOCKADDR_ARG_autogen___1' is static but used in inline function 'recvfrom' which is not static
23:02:21 70 | return __recvfrom_chk (__fd, __buf, __n, sz, __flags, __addr, __addr_len);
23:02:21 | ^
23:02:21/usr/include/x86_64-linux-gnu/bits/socket2.h:68:104: warning: '_X12_constructorFv_U26__anonymous___SOCKADDR_ARGU26__anonymous___SOCKADDR_ARG_autogen___1' is static but used in inline function 'recvfrom' which is not static
23:02:21 68 | return __recvfrom_chk_warn (__fd, __buf, __n, sz, __flags, __addr,
23:02:21 | ^
23:02:21/usr/include/x86_64-linux-gnu/bits/socket2.h:68:129: warning: '_X11_destructorFv_U26__anonymous___SOCKADDR_ARG_autogen___1' is static but used in inline function 'recvfrom' which is not static
23:02:21 68 | return __recvfrom_chk_warn (__fd, __buf, __n, sz, __flags, __addr,
23:02:21 | ^
23:02:21/usr/include/x86_64-linux-gnu/bits/socket2.h:66:97: warning: '_X12_constructorFv_U26__anonymous___SOCKADDR_ARGU26__anonymous___SOCKADDR_ARG_autogen___1' is static but used in inline function 'recvfrom' which is not static
23:02:21 66 | return __recvfrom_alias (__fd, __buf, __n, __flags, __addr, __addr_len);
23:02:21 | ^
23:02:21/usr/include/x86_64-linux-gnu/bits/socket2.h:66:129: warning: '_X11_destructorFv_U26__anonymous___SOCKADDR_ARG_autogen___1' is static but used in inline function 'recvfrom' which is not static
23:02:21 66 | return __recvfrom_alias (__fd, __buf, __n, __flags, __addr, __addr_len);
23:02:21 | ^
23:02:21/usr/include/x86_64-linux-gnu/bits/socket2.h:70:95: warning: '_X12_constructorFv_U26__anonymous___SOCKADDR_ARGU26__anonymous___SOCKADDR_ARG_autogen___1' is static but used in inline function 'recvfrom' which is not static
23:02:21 70 | return __recvfrom_chk (__fd, __buf, __n, sz, __flags, __addr, __addr_len);
23:02:21 | ^
23:02:21/usr/include/x86_64-linux-gnu/bits/socket2.h:70:125: warning: '_X11_destructorFv_U26__anonymous___SOCKADDR_ARG_autogen___1' is static but used in inline function 'recvfrom' which is not static
23:02:21 70 | return __recvfrom_chk (__fd, __buf, __n, sz, __flags, __addr, __addr_len);
23:02:21 | ^
23:02:21/usr/include/x86_64-linux-gnu/bits/socket2.h:68:104: warning: '_X12_constructorFv_U26__anonymous___SOCKADDR_ARGU26__anonymous___SOCKADDR_ARG_autogen___1' is static but used in inline function 'recvfrom' which is not static
23:02:21 68 | return __recvfrom_chk_warn (__fd, __buf, __n, sz, __flags, __addr,
23:02:21 | ^
23:02:21/usr/include/x86_64-linux-gnu/bits/socket2.h:68:129: warning: '_X11_destructorFv_U26__anonymous___SOCKADDR_ARG_autogen___1' is static but used in inline function 'recvfrom' which is not static
23:02:21 68 | return __recvfrom_chk_warn (__fd, __buf, __n, sz, __flags, __addr,
23:02:21 | ^
23:02:21/usr/include/x86_64-linux-gnu/bits/socket2.h:66:97: warning: '_X12_constructorFv_U26__anonymous___SOCKADDR_ARGU26__anonymous___SOCKADDR_ARG_autogen___1' is static but used in inline function 'recvfrom' which is not static
23:02:21 66 | return __recvfrom_alias (__fd, __buf, __n, __flags, __addr, __addr_len);
23:02:21 | ^
23:02:21/usr/include/x86_64-linux-gnu/bits/socket2.h:66:129: warning: '_X11_destructorFv_U26__anonymous___SOCKADDR_ARG_autogen___1' is static but used in inline function 'recvfrom' which is not static
23:02:21 66 | return __recvfrom_alias (__fd, __buf, __n, __flags, __addr, __addr_len);
23:02:21 | ^
23:02:21/usr/include/linux/io_uring.h:83:36: warning: 'packed' attribute ignored for field of type 'union __io_uring_sqe____anonymous32' [-Wattributes]
23:02:21 83 | } __attribute__((packed));
23:02:21 | ^
23:02:21/usr/include/x86_64-linux-gnu/bits/socket2.h:70:94: warning: '_X12_constructorFv_U26__anonymous___SOCKADDR_ARGU26__anonymous___SOCKADDR_ARG_autogen___1' is static but used in inline function 'recvfrom' which is not static
23:02:21 70 | return __recvfrom_chk (__fd, __buf, __n, sz, __flags, __addr, __addr_len);
23:02:21 | ^
23:02:21/usr/include/x86_64-linux-gnu/bits/socket2.h:70:124: warning: '_X11_destructorFv_U26__anonymous___SOCKADDR_ARG_autogen___1' is static but used in inline function 'recvfrom' which is not static
23:02:21 70 | return __recvfrom_chk (__fd, __buf, __n, sz, __flags, __addr, __addr_len);
23:02:21 | ^
23:02:21/usr/include/x86_64-linux-gnu/bits/socket2.h:68:103: warning: '_X12_constructorFv_U26__anonymous___SOCKADDR_ARGU26__anonymous___SOCKADDR_ARG_autogen___1' is static but used in inline function 'recvfrom' which is not static
23:02:21 68 | return __recvfrom_chk_warn (__fd, __buf, __n, sz, __flags, __addr,
23:02:21 | ^
23:02:21/usr/include/x86_64-linux-gnu/bits/socket2.h:68:128: warning: '_X11_destructorFv_U26__anonymous___SOCKADDR_ARG_autogen___1' is static but used in inline function 'recvfrom' which is not static
23:02:21 68 | return __recvfrom_chk_warn (__fd, __buf, __n, sz, __flags, __addr,
23:02:21 | ^
23:02:21/usr/include/x86_64-linux-gnu/bits/socket2.h:66:96: warning: '_X12_constructorFv_U26__anonymous___SOCKADDR_ARGU26__anonymous___SOCKADDR_ARG_autogen___1' is static but used in inline function 'recvfrom' which is not static
23:02:21 66 | return __recvfrom_alias (__fd, __buf, __n, __flags, __addr, __addr_len);
23:02:21 | ^
23:02:21/usr/include/x86_64-linux-gnu/bits/socket2.h:66:128: warning: '_X11_destructorFv_U26__anonymous___SOCKADDR_ARG_autogen___1' is static but used in inline function 'recvfrom' which is not static
23:02:21 66 | return __recvfrom_alias (__fd, __buf, __n, __flags, __addr, __addr_len);
23:02:21 | ^
23:02:21/usr/include/linux/io_uring.h:83:36: warning: 'packed' attribute ignored for field of type 'union __io_uring_sqe____anonymous97' [-Wattributes]
23:02:21 83 | } __attribute__((packed));
23:02:21 | ^
23:02:21/usr/include/x86_64-linux-gnu/bits/socket2.h:70:95: warning: '_X12_constructorFv_U26__anonymous___SOCKADDR_ARGU26__anonymous___SOCKADDR_ARG_autogen___1' is static but used in inline function 'recvfrom' which is not static
23:02:21 70 | return __recvfrom_chk (__fd, __buf, __n, sz, __flags, __addr, __addr_len);
23:02:21 | ^
23:02:21/usr/include/x86_64-linux-gnu/bits/socket2.h:70:125: warning: '_X11_destructorFv_U26__anonymous___SOCKADDR_ARG_autogen___1' is static but used in inline function 'recvfrom' which is not static
23:02:21 70 | return __recvfrom_chk (__fd, __buf, __n, sz, __flags, __addr, __addr_len);
23:02:21 | ^
23:02:21/usr/include/x86_64-linux-gnu/bits/socket2.h:68:104: warning: '_X12_constructorFv_U26__anonymous___SOCKADDR_ARGU26__anonymous___SOCKADDR_ARG_autogen___1' is static but used in inline function 'recvfrom' which is not static
23:02:21 68 | return __recvfrom_chk_warn (__fd, __buf, __n, sz, __flags, __addr,
23:02:21 | ^
23:02:21/usr/include/x86_64-linux-gnu/bits/socket2.h:68:129: warning: '_X11_destructorFv_U26__anonymous___SOCKADDR_ARG_autogen___1' is static but used in inline function 'recvfrom' which is not static
23:02:21 68 | return __recvfrom_chk_warn (__fd, __buf, __n, sz, __flags, __addr,
23:02:21 | ^
23:02:21/usr/include/x86_64-linux-gnu/bits/socket2.h:66:97: warning: '_X12_constructorFv_U26__anonymous___SOCKADDR_ARGU26__anonymous___SOCKADDR_ARG_autogen___1' is static but used in inline function 'recvfrom' which is not static
23:02:21 66 | return __recvfrom_alias (__fd, __buf, __n, __flags, __addr, __addr_len);
23:02:21 | ^
23:02:21/usr/include/x86_64-linux-gnu/bits/socket2.h:66:129: warning: '_X11_destructorFv_U26__anonymous___SOCKADDR_ARG_autogen___1' is static but used in inline function 'recvfrom' which is not static
23:02:21 66 | return __recvfrom_alias (__fd, __buf, __n, __flags, __addr, __addr_len);
23:02:21 | ^
23:02:21 CCLD libcfathread.la
23:02:21/usr/bin/ld: warning: concurrency/.libs/coroutine.o: requires executable stack (because the .note.GNU-stack section is executable)
23:02:21make[1]: Nothing to be done for 'all-am'.
23:02:21[Pipeline] }
23:02:21[Pipeline] // dir
23:02:21[Pipeline] }
23:02:21[Pipeline] // stage
23:02:21[Pipeline] echo
23:02:21 -------- Build : install --------
23:02:21[Pipeline] stage
23:02:21[Pipeline] { (Build : install)
23:02:21[Pipeline] dir
23:02:21Running in /var/lib/jenkins/workspace/Cforall_master@tmp
23:02:21[Pipeline] {
23:02:21[Pipeline] sh
23:02:21+ nproc
23:02:21+ make -j 16 --no-print-directory install
23:02:21Making install in driver
23:02:21make install-exec-hook
23:02:21 /usr/bin/mkdir -p '/var/lib/jenkins/workspace/Cforall_master@tmp/lib/cfa/'
23:02:21 /usr/bin/install -c cfa '/var/lib/jenkins/workspace/Cforall_master@tmp/bin//cfa'
23:02:21 /bin/bash ../libtool --mode=install /usr/bin/install -c as cc1 '/var/lib/jenkins/workspace/Cforall_master@tmp/lib/cfa/'
23:02:21libtool: install: /usr/bin/install -c as /var/lib/jenkins/workspace/Cforall_master@tmp/lib/cfa/as
23:02:21libtool: install: /usr/bin/install -c cc1 /var/lib/jenkins/workspace/Cforall_master@tmp/lib/cfa/cc1
23:02:21Making install in src
23:02:21make install-am
23:02:21make[3]: Nothing to be done for 'install-exec-am'.
23:02:21 /usr/bin/mkdir -p '/var/lib/jenkins/workspace/Cforall_master@tmp/lib/cfa/'
23:02:21 /bin/bash ../libtool --mode=install /usr/bin/install -c ../driver/cfa-cpp '/var/lib/jenkins/workspace/Cforall_master@tmp/lib/cfa/'
23:02:21libtool: install: /usr/bin/install -c ../driver/cfa-cpp /var/lib/jenkins/workspace/Cforall_master@tmp/lib/cfa/cfa-cpp
23:02:21Making install in .
23:02:21(CDPATH="${ZSH_VERSION+.}:" && cd /var/lib/jenkins/workspace/Cforall_master && /bin/bash '/var/lib/jenkins/workspace/Cforall_master/automake/missing' autoheader)
23:02:21rm -f stamp-h1
23:02:21touch /var/lib/jenkins/workspace/Cforall_master/src/config.h.in
23:02:21cd . && /bin/bash ./config.status config.h
23:02:21config.status: creating config.h
23:02:21config.status: config.h is unchanged
23:02:21make[2]: Nothing to be done for 'install-exec-am'.
23:02:21 /usr/bin/mkdir -p '/var/lib/jenkins/workspace/Cforall_master@tmp/share/man/man1'
23:02:21 /usr/bin/install -c -m 644 /var/lib/jenkins/workspace/Cforall_master/doc/man/cfa.1 '/var/lib/jenkins/workspace/Cforall_master@tmp/share/man/man1'
23:02:21Making install in libcfa/x64-debug
23:02:21Making install in prelude
23:02:21make[3]: Nothing to be done for 'install-exec-am'.
23:02:21 /usr/bin/mkdir -p '/var/lib/jenkins/workspace/Cforall_master@tmp/lib/cfa/x64-debug/'
23:02:21 /usr/bin/install -c -m 644 gcc-builtins.cfa builtins.cfa extras.cfa prelude.cfa bootloader.c defines.hfa '/var/lib/jenkins/workspace/Cforall_master@tmp/lib/cfa/x64-debug/'
23:02:21Making install in src
23:02:21 /usr/bin/mkdir -p '/var/lib/jenkins/workspace/Cforall_master@tmp/lib/cfa/x64-debug/'
23:02:21 /bin/bash ../libtool --mode=install /usr/bin/install -c libcfa.la libcfathread.la '/var/lib/jenkins/workspace/Cforall_master@tmp/lib/cfa/x64-debug/'
23:02:21 /usr/bin/mkdir -p '/var/lib/jenkins/workspace/Cforall_master@tmp/include/cfa/'
23:02:21 /usr/bin/mkdir -p '/var/lib/jenkins/workspace/Cforall_master@tmp/include/cfa//stdhdr/sys'
23:02:21 /usr/bin/install -c -m 644 /var/lib/jenkins/workspace/Cforall_master/libcfa/src/stdhdr/sys/time.h /var/lib/jenkins/workspace/Cforall_master/libcfa/src/stdhdr/sys/mman.h /var/lib/jenkins/workspace/Cforall_master/libcfa/src/stdhdr/sys/socket.h '/var/lib/jenkins/workspace/Cforall_master@tmp/include/cfa//stdhdr/sys'
23:02:21 /usr/bin/mkdir -p '/var/lib/jenkins/workspace/Cforall_master@tmp/include/cfa//algorithms'
23:02:21 /usr/bin/install -c -m 644 /var/lib/jenkins/workspace/Cforall_master/libcfa/src/algorithms/range_iterator.hfa '/var/lib/jenkins/workspace/Cforall_master@tmp/include/cfa//algorithms'
23:02:21 /usr/bin/mkdir -p '/var/lib/jenkins/workspace/Cforall_master@tmp/include/cfa//concurrency/kernel'
23:02:21 /usr/bin/install -c -m 644 /var/lib/jenkins/workspace/Cforall_master/libcfa/src/concurrency/kernel/cluster.hfa /var/lib/jenkins/workspace/Cforall_master/libcfa/src/concurrency/kernel/fwd.hfa '/var/lib/jenkins/workspace/Cforall_master@tmp/include/cfa//concurrency/kernel'
23:02:21 /usr/bin/install -c -m 644 /var/lib/jenkins/workspace/Cforall_master/libcfa/src/common.hfa /var/lib/jenkins/workspace/Cforall_master/libcfa/src/fstream.hfa /var/lib/jenkins/workspace/Cforall_master/libcfa/src/heap.hfa /var/lib/jenkins/workspace/Cforall_master/libcfa/src/iostream.hfa /var/lib/jenkins/workspace/Cforall_master/libcfa/src/iterator.hfa /var/lib/jenkins/workspace/Cforall_master/libcfa/src/limits.hfa /var/lib/jenkins/workspace/Cforall_master/libcfa/src/math.hfa /var/lib/jenkins/workspace/Cforall_master/libcfa/src/memory.hfa /var/lib/jenkins/workspace/Cforall_master/libcfa/src/parseargs.hfa /var/lib/jenkins/workspace/Cforall_master/libcfa/src/parseconfig.hfa /var/lib/jenkins/workspace/Cforall_master/libcfa/src/rational.hfa /var/lib/jenkins/workspace/Cforall_master/libcfa/src/stdlib.hfa /var/lib/jenkins/workspace/Cforall_master/libcfa/src/strstream.hfa /var/lib/jenkins/workspace/Cforall_master/libcfa/src/time.hfa /var/lib/jenkins/workspace/Cforall_master/libcfa/src/Exception.hfa /var/lib/jenkins/workspace/Cforall_master/libcfa/src/bitmanip.hfa /var/lib/jenkins/workspace/Cforall_master/libcfa/src/clock.hfa /var/lib/jenkins/workspace/Cforall_master/libcfa/src/exception.hfa /var/lib/jenkins/workspace/Cforall_master/libcfa/src/exception.h /var/lib/jenkins/workspace/Cforall_master/libcfa/src/gmp.hfa /var/lib/jenkins/workspace/Cforall_master/libcfa/src/math.trait.hfa /var/lib/jenkins/workspace/Cforall_master/libcfa/src/raii.hfa /var/lib/jenkins/workspace/Cforall_master/libcfa/src/time_t.hfa /var/lib/jenkins/workspace/Cforall_master/libcfa/src/virtual_dtor.hfa '/var/lib/jenkins/workspace/Cforall_master@tmp/include/cfa//.'
23:02:21 /usr/bin/mkdir -p '/var/lib/jenkins/workspace/Cforall_master@tmp/include/cfa//concurrency'
23:02:21 /usr/bin/install -c -m 644 /var/lib/jenkins/workspace/Cforall_master/libcfa/src/concurrency/iofwd.hfa /var/lib/jenkins/workspace/Cforall_master/libcfa/src/concurrency/barrier.hfa /var/lib/jenkins/workspace/Cforall_master/libcfa/src/concurrency/alarm.hfa /var/lib/jenkins/workspace/Cforall_master/libcfa/src/concurrency/coroutine.hfa /var/lib/jenkins/workspace/Cforall_master/libcfa/src/concurrency/exception.hfa /var/lib/jenkins/workspace/Cforall_master/libcfa/src/concurrency/kernel.hfa /var/lib/jenkins/workspace/Cforall_master/libcfa/src/concurrency/locks.hfa /var/lib/jenkins/workspace/Cforall_master/libcfa/src/concurrency/monitor.hfa /var/lib/jenkins/workspace/Cforall_master/libcfa/src/concurrency/mutex.hfa /var/lib/jenkins/workspace/Cforall_master/libcfa/src/concurrency/select.hfa /var/lib/jenkins/workspace/Cforall_master/libcfa/src/concurrency/thread.hfa /var/lib/jenkins/workspace/Cforall_master/libcfa/src/concurrency/cofor.hfa /var/lib/jenkins/workspace/Cforall_master/libcfa/src/concurrency/invoke.h /var/lib/jenkins/workspace/Cforall_master/libcfa/src/concurrency/future.hfa /var/lib/jenkins/workspace/Cforall_master/libcfa/src/concurrency/once.hfa /var/lib/jenkins/workspace/Cforall_master/libcfa/src/concurrency/mutex_stmt.hfa /var/lib/jenkins/workspace/Cforall_master/libcfa/src/concurrency/channel.hfa /var/lib/jenkins/workspace/Cforall_master/libcfa/src/concurrency/actor.hfa '/var/lib/jenkins/workspace/Cforall_master@tmp/include/cfa//concurrency'
23:02:21 /usr/bin/mkdir -p '/var/lib/jenkins/workspace/Cforall_master@tmp/include/cfa//concurrency/clib'
23:02:21 /usr/bin/install -c -m 644 /var/lib/jenkins/workspace/Cforall_master/libcfa/src/concurrency/clib/cfathread.h '/var/lib/jenkins/workspace/Cforall_master@tmp/include/cfa//concurrency/clib'
23:02:21 /usr/bin/mkdir -p '/var/lib/jenkins/workspace/Cforall_master@tmp/include/cfa//device'
23:02:21 /usr/bin/install -c -m 644 /var/lib/jenkins/workspace/Cforall_master/libcfa/src/device/cpu.hfa '/var/lib/jenkins/workspace/Cforall_master@tmp/include/cfa//device'
23:02:21 /usr/bin/mkdir -p '/var/lib/jenkins/workspace/Cforall_master@tmp/include/cfa//stdhdr/libltdl'
23:02:21 /usr/bin/install -c -m 644 /var/lib/jenkins/workspace/Cforall_master/libcfa/src/stdhdr/libltdl/lt_dlloader.h '/var/lib/jenkins/workspace/Cforall_master@tmp/include/cfa//stdhdr/libltdl'
23:02:21 /usr/bin/mkdir -p '/var/lib/jenkins/workspace/Cforall_master@tmp/include/cfa//vec'
23:02:21libtool: install: /usr/bin/install -c .libs/libcfa.so.1.0.0 /var/lib/jenkins/workspace/Cforall_master@tmp/lib/cfa/x64-debug/libcfa.so.1.0.0
23:02:21 /usr/bin/install -c -m 644 /var/lib/jenkins/workspace/Cforall_master/libcfa/src/vec/vec.hfa /var/lib/jenkins/workspace/Cforall_master/libcfa/src/vec/vec2.hfa /var/lib/jenkins/workspace/Cforall_master/libcfa/src/vec/vec3.hfa /var/lib/jenkins/workspace/Cforall_master/libcfa/src/vec/vec4.hfa '/var/lib/jenkins/workspace/Cforall_master@tmp/include/cfa//vec'
23:02:21 /usr/bin/mkdir -p '/var/lib/jenkins/workspace/Cforall_master@tmp/include/cfa//bits'
23:02:21 /usr/bin/install -c -m 644 /var/lib/jenkins/workspace/Cforall_master/libcfa/src/bits/weakso_locks.hfa /var/lib/jenkins/workspace/Cforall_master/libcfa/src/bits/algorithm.hfa /var/lib/jenkins/workspace/Cforall_master/libcfa/src/bits/align.hfa /var/lib/jenkins/workspace/Cforall_master/libcfa/src/bits/collections.hfa /var/lib/jenkins/workspace/Cforall_master/libcfa/src/bits/debug.hfa /var/lib/jenkins/workspace/Cforall_master/libcfa/src/bits/defs.hfa /var/lib/jenkins/workspace/Cforall_master/libcfa/src/bits/locks.hfa /var/lib/jenkins/workspace/Cforall_master/libcfa/src/bits/collection.hfa /var/lib/jenkins/workspace/Cforall_master/libcfa/src/bits/stack.hfa /var/lib/jenkins/workspace/Cforall_master/libcfa/src/bits/queue.hfa /var/lib/jenkins/workspace/Cforall_master/libcfa/src/bits/sequence.hfa /var/lib/jenkins/workspace/Cforall_master/libcfa/src/bits/atomic.hfa /var/lib/jenkins/workspace/Cforall_master/libcfa/src/bits/random.hfa '/var/lib/jenkins/workspace/Cforall_master@tmp/include/cfa//bits'
23:02:21libtool: install: (cd /var/lib/jenkins/workspace/Cforall_master@tmp/lib/cfa/x64-debug && { ln -s -f libcfa.so.1.0.0 libcfa.so.1 || { rm -f libcfa.so.1 && ln -s libcfa.so.1.0.0 libcfa.so.1; }; })
23:02:21libtool: install: (cd /var/lib/jenkins/workspace/Cforall_master@tmp/lib/cfa/x64-debug && { ln -s -f libcfa.so.1.0.0 libcfa.so || { rm -f libcfa.so && ln -s libcfa.so.1.0.0 libcfa.so; }; })
23:02:21 /usr/bin/mkdir -p '/var/lib/jenkins/workspace/Cforall_master@tmp/include/cfa//stdhdr'
23:02:21 /usr/bin/install -c -m 644 /var/lib/jenkins/workspace/Cforall_master/libcfa/src/stdhdr/iso646.h /var/lib/jenkins/workspace/Cforall_master/libcfa/src/stdhdr/wchar.h /var/lib/jenkins/workspace/Cforall_master/libcfa/src/stdhdr/limits.h /var/lib/jenkins/workspace/Cforall_master/libcfa/src/stdhdr/tgmath.h /var/lib/jenkins/workspace/Cforall_master/libcfa/src/stdhdr/stdbool.h /var/lib/jenkins/workspace/Cforall_master/libcfa/src/stdhdr/errno.h /var/lib/jenkins/workspace/Cforall_master/libcfa/src/stdhdr/stdlib.h /var/lib/jenkins/workspace/Cforall_master/libcfa/src/stdhdr/time.h /var/lib/jenkins/workspace/Cforall_master/libcfa/src/stdhdr/malloc.h /var/lib/jenkins/workspace/Cforall_master/libcfa/src/stdhdr/signal.h /var/lib/jenkins/workspace/Cforall_master/libcfa/src/stdhdr/fenv.h /var/lib/jenkins/workspace/Cforall_master/libcfa/src/stdhdr/stdnoreturn.h /var/lib/jenkins/workspace/Cforall_master/libcfa/src/stdhdr/uchar.h /var/lib/jenkins/workspace/Cforall_master/libcfa/src/stdhdr/complex.h /var/lib/jenkins/workspace/Cforall_master/libcfa/src/stdhdr/unistd.h /var/lib/jenkins/workspace/Cforall_master/libcfa/src/stdhdr/stdalign.h /var/lib/jenkins/workspace/Cforall_master/libcfa/src/stdhdr/unwind.h /var/lib/jenkins/workspace/Cforall_master/libcfa/src/stdhdr/stddef.h /var/lib/jenkins/workspace/Cforall_master/libcfa/src/stdhdr/setjmp.h /var/lib/jenkins/workspace/Cforall_master/libcfa/src/stdhdr/stdatomic.h /var/lib/jenkins/workspace/Cforall_master/libcfa/src/stdhdr/assert.h /var/lib/jenkins/workspace/Cforall_master/libcfa/src/stdhdr/inttypes.h /var/lib/jenkins/workspace/Cforall_master/libcfa/src/stdhdr/threads.h /var/lib/jenkins/workspace/Cforall_master/libcfa/src/stdhdr/stdio.h /var/lib/jenkins/workspace/Cforall_master/libcfa/src/stdhdr/stdint.h /var/lib/jenkins/workspace/Cforall_master/libcfa/src/stdhdr/gmp.h /var/lib/jenkins/workspace/Cforall_master/libcfa/src/stdhdr/string.h /var/lib/jenkins/workspace/Cforall_master/libcfa/src/stdhdr/locale.h /var/lib/jenkins/workspace/Cforall_master/libcfa/src/stdhdr/float.h /var/lib/jenkins/workspace/Cforall_master/libcfa/src/stdhdr/math.h /var/lib/jenkins/workspace/Cforall_master/libcfa/src/stdhdr/ctype.h /var/lib/jenkins/workspace/Cforall_master/libcfa/src/stdhdr/wctype.h /var/lib/jenkins/workspace/Cforall_master/libcfa/src/stdhdr/stdarg.h /var/lib/jenkins/workspace/Cforall_master/libcfa/src/stdhdr/pthread.h '/var/lib/jenkins/workspace/Cforall_master@tmp/include/cfa//stdhdr'
23:02:21 /usr/bin/mkdir -p '/var/lib/jenkins/workspace/Cforall_master@tmp/include/cfa//collections'
23:02:21libtool: install: /usr/bin/install -c .libs/libcfa.lai /var/lib/jenkins/workspace/Cforall_master@tmp/lib/cfa/x64-debug/libcfa.la
23:02:21 /usr/bin/install -c -m 644 /var/lib/jenkins/workspace/Cforall_master/libcfa/src/collections/maybe.hfa /var/lib/jenkins/workspace/Cforall_master/libcfa/src/collections/pair.hfa /var/lib/jenkins/workspace/Cforall_master/libcfa/src/collections/result.hfa /var/lib/jenkins/workspace/Cforall_master/libcfa/src/collections/string.hfa /var/lib/jenkins/workspace/Cforall_master/libcfa/src/collections/string_res.hfa /var/lib/jenkins/workspace/Cforall_master/libcfa/src/collections/vector.hfa /var/lib/jenkins/workspace/Cforall_master/libcfa/src/collections/array.hfa /var/lib/jenkins/workspace/Cforall_master/libcfa/src/collections/list.hfa /var/lib/jenkins/workspace/Cforall_master/libcfa/src/collections/list2.hfa /var/lib/jenkins/workspace/Cforall_master/libcfa/src/collections/lockfree.hfa /var/lib/jenkins/workspace/Cforall_master/libcfa/src/collections/string_sharectx.hfa /var/lib/jenkins/workspace/Cforall_master/libcfa/src/collections/vector2.hfa '/var/lib/jenkins/workspace/Cforall_master@tmp/include/cfa//collections'
23:02:21libtool: install: /usr/bin/install -c .libs/libcfathread.so.1.0.0 /var/lib/jenkins/workspace/Cforall_master@tmp/lib/cfa/x64-debug/libcfathread.so.1.0.0
23:02:21libtool: install: (cd /var/lib/jenkins/workspace/Cforall_master@tmp/lib/cfa/x64-debug && { ln -s -f libcfathread.so.1.0.0 libcfathread.so.1 || { rm -f libcfathread.so.1 && ln -s libcfathread.so.1.0.0 libcfathread.so.1; }; })
23:02:21libtool: install: (cd /var/lib/jenkins/workspace/Cforall_master@tmp/lib/cfa/x64-debug && { ln -s -f libcfathread.so.1.0.0 libcfathread.so || { rm -f libcfathread.so && ln -s libcfathread.so.1.0.0 libcfathread.so; }; })
23:02:21libtool: install: /usr/bin/install -c .libs/libcfathread.lai /var/lib/jenkins/workspace/Cforall_master@tmp/lib/cfa/x64-debug/libcfathread.la
23:02:21libtool: warning: remember to run 'libtool --finish /var/lib/jenkins/workspace/Cforall_master@tmp/lib/cfa/x64-debug/'
23:02:21make[3]: Nothing to be done for 'install-exec-am'.
23:02:21make[3]: Nothing to be done for 'install-data-am'.
23:02:21Making install in libcfa/x64-nodebug
23:02:21Making install in prelude
23:02:21touch .deps/builtins.Po
23:02:21make[3]: Nothing to be done for 'install-exec-am'.
23:02:21 /usr/bin/mkdir -p '/var/lib/jenkins/workspace/Cforall_master@tmp/lib/cfa/x64-nodebug/'
23:02:21 /usr/bin/install -c -m 644 gcc-builtins.cfa builtins.cfa extras.cfa prelude.cfa bootloader.c defines.hfa '/var/lib/jenkins/workspace/Cforall_master@tmp/lib/cfa/x64-nodebug/'
23:02:21Making install in src
23:02:21 /usr/bin/mkdir -p '/var/lib/jenkins/workspace/Cforall_master@tmp/lib/cfa/x64-nodebug/'
23:02:21 /bin/bash ../libtool --mode=install /usr/bin/install -c libcfa.la libcfathread.la '/var/lib/jenkins/workspace/Cforall_master@tmp/lib/cfa/x64-nodebug/'
23:02:21 /usr/bin/mkdir -p '/var/lib/jenkins/workspace/Cforall_master@tmp/include/cfa/'
23:02:21 /usr/bin/mkdir -p '/var/lib/jenkins/workspace/Cforall_master@tmp/include/cfa//stdhdr/sys'
23:02:21 /usr/bin/install -c -m 644 /var/lib/jenkins/workspace/Cforall_master/libcfa/src/stdhdr/sys/time.h /var/lib/jenkins/workspace/Cforall_master/libcfa/src/stdhdr/sys/mman.h /var/lib/jenkins/workspace/Cforall_master/libcfa/src/stdhdr/sys/socket.h '/var/lib/jenkins/workspace/Cforall_master@tmp/include/cfa//stdhdr/sys'
23:02:21 /usr/bin/mkdir -p '/var/lib/jenkins/workspace/Cforall_master@tmp/include/cfa//algorithms'
23:02:21 /usr/bin/install -c -m 644 /var/lib/jenkins/workspace/Cforall_master/libcfa/src/algorithms/range_iterator.hfa '/var/lib/jenkins/workspace/Cforall_master@tmp/include/cfa//algorithms'
23:02:21 /usr/bin/mkdir -p '/var/lib/jenkins/workspace/Cforall_master@tmp/include/cfa//concurrency/kernel'
23:02:21 /usr/bin/install -c -m 644 /var/lib/jenkins/workspace/Cforall_master/libcfa/src/concurrency/kernel/cluster.hfa /var/lib/jenkins/workspace/Cforall_master/libcfa/src/concurrency/kernel/fwd.hfa '/var/lib/jenkins/workspace/Cforall_master@tmp/include/cfa//concurrency/kernel'
23:02:21 /usr/bin/install -c -m 644 /var/lib/jenkins/workspace/Cforall_master/libcfa/src/common.hfa /var/lib/jenkins/workspace/Cforall_master/libcfa/src/fstream.hfa /var/lib/jenkins/workspace/Cforall_master/libcfa/src/heap.hfa /var/lib/jenkins/workspace/Cforall_master/libcfa/src/iostream.hfa /var/lib/jenkins/workspace/Cforall_master/libcfa/src/iterator.hfa /var/lib/jenkins/workspace/Cforall_master/libcfa/src/limits.hfa /var/lib/jenkins/workspace/Cforall_master/libcfa/src/math.hfa /var/lib/jenkins/workspace/Cforall_master/libcfa/src/memory.hfa /var/lib/jenkins/workspace/Cforall_master/libcfa/src/parseargs.hfa /var/lib/jenkins/workspace/Cforall_master/libcfa/src/parseconfig.hfa /var/lib/jenkins/workspace/Cforall_master/libcfa/src/rational.hfa /var/lib/jenkins/workspace/Cforall_master/libcfa/src/stdlib.hfa /var/lib/jenkins/workspace/Cforall_master/libcfa/src/strstream.hfa /var/lib/jenkins/workspace/Cforall_master/libcfa/src/time.hfa /var/lib/jenkins/workspace/Cforall_master/libcfa/src/Exception.hfa /var/lib/jenkins/workspace/Cforall_master/libcfa/src/bitmanip.hfa /var/lib/jenkins/workspace/Cforall_master/libcfa/src/clock.hfa /var/lib/jenkins/workspace/Cforall_master/libcfa/src/exception.hfa /var/lib/jenkins/workspace/Cforall_master/libcfa/src/exception.h /var/lib/jenkins/workspace/Cforall_master/libcfa/src/gmp.hfa /var/lib/jenkins/workspace/Cforall_master/libcfa/src/math.trait.hfa /var/lib/jenkins/workspace/Cforall_master/libcfa/src/raii.hfa /var/lib/jenkins/workspace/Cforall_master/libcfa/src/time_t.hfa /var/lib/jenkins/workspace/Cforall_master/libcfa/src/virtual_dtor.hfa '/var/lib/jenkins/workspace/Cforall_master@tmp/include/cfa//.'
23:02:21 /usr/bin/mkdir -p '/var/lib/jenkins/workspace/Cforall_master@tmp/include/cfa//concurrency'
23:02:21 /usr/bin/install -c -m 644 /var/lib/jenkins/workspace/Cforall_master/libcfa/src/concurrency/iofwd.hfa /var/lib/jenkins/workspace/Cforall_master/libcfa/src/concurrency/barrier.hfa /var/lib/jenkins/workspace/Cforall_master/libcfa/src/concurrency/alarm.hfa /var/lib/jenkins/workspace/Cforall_master/libcfa/src/concurrency/coroutine.hfa /var/lib/jenkins/workspace/Cforall_master/libcfa/src/concurrency/exception.hfa /var/lib/jenkins/workspace/Cforall_master/libcfa/src/concurrency/kernel.hfa /var/lib/jenkins/workspace/Cforall_master/libcfa/src/concurrency/locks.hfa /var/lib/jenkins/workspace/Cforall_master/libcfa/src/concurrency/monitor.hfa /var/lib/jenkins/workspace/Cforall_master/libcfa/src/concurrency/mutex.hfa /var/lib/jenkins/workspace/Cforall_master/libcfa/src/concurrency/select.hfa /var/lib/jenkins/workspace/Cforall_master/libcfa/src/concurrency/thread.hfa /var/lib/jenkins/workspace/Cforall_master/libcfa/src/concurrency/cofor.hfa /var/lib/jenkins/workspace/Cforall_master/libcfa/src/concurrency/invoke.h /var/lib/jenkins/workspace/Cforall_master/libcfa/src/concurrency/future.hfa /var/lib/jenkins/workspace/Cforall_master/libcfa/src/concurrency/once.hfa /var/lib/jenkins/workspace/Cforall_master/libcfa/src/concurrency/mutex_stmt.hfa /var/lib/jenkins/workspace/Cforall_master/libcfa/src/concurrency/channel.hfa /var/lib/jenkins/workspace/Cforall_master/libcfa/src/concurrency/actor.hfa '/var/lib/jenkins/workspace/Cforall_master@tmp/include/cfa//concurrency'
23:02:21 /usr/bin/mkdir -p '/var/lib/jenkins/workspace/Cforall_master@tmp/include/cfa//concurrency/clib'
23:02:21 /usr/bin/install -c -m 644 /var/lib/jenkins/workspace/Cforall_master/libcfa/src/concurrency/clib/cfathread.h '/var/lib/jenkins/workspace/Cforall_master@tmp/include/cfa//concurrency/clib'
23:02:21 /usr/bin/mkdir -p '/var/lib/jenkins/workspace/Cforall_master@tmp/include/cfa//device'
23:02:21 /usr/bin/install -c -m 644 /var/lib/jenkins/workspace/Cforall_master/libcfa/src/device/cpu.hfa '/var/lib/jenkins/workspace/Cforall_master@tmp/include/cfa//device'
23:02:21 /usr/bin/mkdir -p '/var/lib/jenkins/workspace/Cforall_master@tmp/include/cfa//stdhdr/libltdl'
23:02:21 /usr/bin/install -c -m 644 /var/lib/jenkins/workspace/Cforall_master/libcfa/src/stdhdr/libltdl/lt_dlloader.h '/var/lib/jenkins/workspace/Cforall_master@tmp/include/cfa//stdhdr/libltdl'
23:02:21 /usr/bin/mkdir -p '/var/lib/jenkins/workspace/Cforall_master@tmp/include/cfa//vec'
23:02:21libtool: install: /usr/bin/install -c .libs/libcfa.so.1.0.0 /var/lib/jenkins/workspace/Cforall_master@tmp/lib/cfa/x64-nodebug/libcfa.so.1.0.0
23:02:21 /usr/bin/install -c -m 644 /var/lib/jenkins/workspace/Cforall_master/libcfa/src/vec/vec.hfa /var/lib/jenkins/workspace/Cforall_master/libcfa/src/vec/vec2.hfa /var/lib/jenkins/workspace/Cforall_master/libcfa/src/vec/vec3.hfa /var/lib/jenkins/workspace/Cforall_master/libcfa/src/vec/vec4.hfa '/var/lib/jenkins/workspace/Cforall_master@tmp/include/cfa//vec'
23:02:21 /usr/bin/mkdir -p '/var/lib/jenkins/workspace/Cforall_master@tmp/include/cfa//bits'
23:02:21 /usr/bin/install -c -m 644 /var/lib/jenkins/workspace/Cforall_master/libcfa/src/bits/weakso_locks.hfa /var/lib/jenkins/workspace/Cforall_master/libcfa/src/bits/algorithm.hfa /var/lib/jenkins/workspace/Cforall_master/libcfa/src/bits/align.hfa /var/lib/jenkins/workspace/Cforall_master/libcfa/src/bits/collections.hfa /var/lib/jenkins/workspace/Cforall_master/libcfa/src/bits/debug.hfa /var/lib/jenkins/workspace/Cforall_master/libcfa/src/bits/defs.hfa /var/lib/jenkins/workspace/Cforall_master/libcfa/src/bits/locks.hfa /var/lib/jenkins/workspace/Cforall_master/libcfa/src/bits/collection.hfa /var/lib/jenkins/workspace/Cforall_master/libcfa/src/bits/stack.hfa /var/lib/jenkins/workspace/Cforall_master/libcfa/src/bits/queue.hfa /var/lib/jenkins/workspace/Cforall_master/libcfa/src/bits/sequence.hfa /var/lib/jenkins/workspace/Cforall_master/libcfa/src/bits/atomic.hfa /var/lib/jenkins/workspace/Cforall_master/libcfa/src/bits/random.hfa '/var/lib/jenkins/workspace/Cforall_master@tmp/include/cfa//bits'
23:02:21libtool: install: (cd /var/lib/jenkins/workspace/Cforall_master@tmp/lib/cfa/x64-nodebug && { ln -s -f libcfa.so.1.0.0 libcfa.so.1 || { rm -f libcfa.so.1 && ln -s libcfa.so.1.0.0 libcfa.so.1; }; })
23:02:21 /usr/bin/mkdir -p '/var/lib/jenkins/workspace/Cforall_master@tmp/include/cfa//stdhdr'
23:02:21libtool: install: (cd /var/lib/jenkins/workspace/Cforall_master@tmp/lib/cfa/x64-nodebug && { ln -s -f libcfa.so.1.0.0 libcfa.so || { rm -f libcfa.so && ln -s libcfa.so.1.0.0 libcfa.so; }; })
23:02:21 /usr/bin/install -c -m 644 /var/lib/jenkins/workspace/Cforall_master/libcfa/src/stdhdr/iso646.h /var/lib/jenkins/workspace/Cforall_master/libcfa/src/stdhdr/wchar.h /var/lib/jenkins/workspace/Cforall_master/libcfa/src/stdhdr/limits.h /var/lib/jenkins/workspace/Cforall_master/libcfa/src/stdhdr/tgmath.h /var/lib/jenkins/workspace/Cforall_master/libcfa/src/stdhdr/stdbool.h /var/lib/jenkins/workspace/Cforall_master/libcfa/src/stdhdr/errno.h /var/lib/jenkins/workspace/Cforall_master/libcfa/src/stdhdr/stdlib.h /var/lib/jenkins/workspace/Cforall_master/libcfa/src/stdhdr/time.h /var/lib/jenkins/workspace/Cforall_master/libcfa/src/stdhdr/malloc.h /var/lib/jenkins/workspace/Cforall_master/libcfa/src/stdhdr/signal.h /var/lib/jenkins/workspace/Cforall_master/libcfa/src/stdhdr/fenv.h /var/lib/jenkins/workspace/Cforall_master/libcfa/src/stdhdr/stdnoreturn.h /var/lib/jenkins/workspace/Cforall_master/libcfa/src/stdhdr/uchar.h /var/lib/jenkins/workspace/Cforall_master/libcfa/src/stdhdr/complex.h /var/lib/jenkins/workspace/Cforall_master/libcfa/src/stdhdr/unistd.h /var/lib/jenkins/workspace/Cforall_master/libcfa/src/stdhdr/stdalign.h /var/lib/jenkins/workspace/Cforall_master/libcfa/src/stdhdr/unwind.h /var/lib/jenkins/workspace/Cforall_master/libcfa/src/stdhdr/stddef.h /var/lib/jenkins/workspace/Cforall_master/libcfa/src/stdhdr/setjmp.h /var/lib/jenkins/workspace/Cforall_master/libcfa/src/stdhdr/stdatomic.h /var/lib/jenkins/workspace/Cforall_master/libcfa/src/stdhdr/assert.h /var/lib/jenkins/workspace/Cforall_master/libcfa/src/stdhdr/inttypes.h /var/lib/jenkins/workspace/Cforall_master/libcfa/src/stdhdr/threads.h /var/lib/jenkins/workspace/Cforall_master/libcfa/src/stdhdr/stdio.h /var/lib/jenkins/workspace/Cforall_master/libcfa/src/stdhdr/stdint.h /var/lib/jenkins/workspace/Cforall_master/libcfa/src/stdhdr/gmp.h /var/lib/jenkins/workspace/Cforall_master/libcfa/src/stdhdr/string.h /var/lib/jenkins/workspace/Cforall_master/libcfa/src/stdhdr/locale.h /var/lib/jenkins/workspace/Cforall_master/libcfa/src/stdhdr/float.h /var/lib/jenkins/workspace/Cforall_master/libcfa/src/stdhdr/math.h /var/lib/jenkins/workspace/Cforall_master/libcfa/src/stdhdr/ctype.h /var/lib/jenkins/workspace/Cforall_master/libcfa/src/stdhdr/wctype.h /var/lib/jenkins/workspace/Cforall_master/libcfa/src/stdhdr/stdarg.h /var/lib/jenkins/workspace/Cforall_master/libcfa/src/stdhdr/pthread.h '/var/lib/jenkins/workspace/Cforall_master@tmp/include/cfa//stdhdr'
23:02:21 /usr/bin/mkdir -p '/var/lib/jenkins/workspace/Cforall_master@tmp/include/cfa//collections'
23:02:21 /usr/bin/install -c -m 644 /var/lib/jenkins/workspace/Cforall_master/libcfa/src/collections/maybe.hfa /var/lib/jenkins/workspace/Cforall_master/libcfa/src/collections/pair.hfa /var/lib/jenkins/workspace/Cforall_master/libcfa/src/collections/result.hfa /var/lib/jenkins/workspace/Cforall_master/libcfa/src/collections/string.hfa /var/lib/jenkins/workspace/Cforall_master/libcfa/src/collections/string_res.hfa /var/lib/jenkins/workspace/Cforall_master/libcfa/src/collections/vector.hfa /var/lib/jenkins/workspace/Cforall_master/libcfa/src/collections/array.hfa /var/lib/jenkins/workspace/Cforall_master/libcfa/src/collections/list.hfa /var/lib/jenkins/workspace/Cforall_master/libcfa/src/collections/list2.hfa /var/lib/jenkins/workspace/Cforall_master/libcfa/src/collections/lockfree.hfa /var/lib/jenkins/workspace/Cforall_master/libcfa/src/collections/string_sharectx.hfa /var/lib/jenkins/workspace/Cforall_master/libcfa/src/collections/vector2.hfa '/var/lib/jenkins/workspace/Cforall_master@tmp/include/cfa//collections'
23:02:21libtool: install: /usr/bin/install -c .libs/libcfa.lai /var/lib/jenkins/workspace/Cforall_master@tmp/lib/cfa/x64-nodebug/libcfa.la
23:02:21libtool: install: /usr/bin/install -c .libs/libcfathread.so.1.0.0 /var/lib/jenkins/workspace/Cforall_master@tmp/lib/cfa/x64-nodebug/libcfathread.so.1.0.0
23:02:21libtool: install: (cd /var/lib/jenkins/workspace/Cforall_master@tmp/lib/cfa/x64-nodebug && { ln -s -f libcfathread.so.1.0.0 libcfathread.so.1 || { rm -f libcfathread.so.1 && ln -s libcfathread.so.1.0.0 libcfathread.so.1; }; })
23:02:21libtool: install: (cd /var/lib/jenkins/workspace/Cforall_master@tmp/lib/cfa/x64-nodebug && { ln -s -f libcfathread.so.1.0.0 libcfathread.so || { rm -f libcfathread.so && ln -s libcfathread.so.1.0.0 libcfathread.so; }; })
23:02:21libtool: install: /usr/bin/install -c .libs/libcfathread.lai /var/lib/jenkins/workspace/Cforall_master@tmp/lib/cfa/x64-nodebug/libcfathread.la
23:02:21libtool: warning: remember to run 'libtool --finish /var/lib/jenkins/workspace/Cforall_master@tmp/lib/cfa/x64-nodebug/'
23:02:21make[3]: Nothing to be done for 'install-exec-am'.
23:02:21make[3]: Nothing to be done for 'install-data-am'.
23:02:21[Pipeline] }
23:02:21[Pipeline] // dir
23:02:21[Pipeline] }
23:02:21[Pipeline] // stage
23:02:21[Pipeline] sh
23:02:21+ free -h
23:02:21 total used free shared buff/cache available
23:02:21Mem: 62Gi 1.9Gi 57Gi 4.9Mi 4.3Gi 60Gi
23:02:21Swap: 8.0Gi 0B 8.0Gi
23:02:21[Pipeline] sh
23:02:21+ ulimit -a
23:02:21time(seconds) unlimited
23:02:21file(blocks) unlimited
23:02:21data(kbytes) unlimited
23:02:21stack(kbytes) 8192
23:02:21coredump(blocks) 0
23:02:21memory(kbytes) unlimited
23:02:21locked memory(kbytes) 8238440
23:02:21process 257124
23:02:21nofiles 1048576
23:02:21vmemory(kbytes) unlimited
23:02:21locks unlimited
23:02:21rtprio 0
23:02:21[Pipeline] echo
23:02:21 -------- Test: Debug --------
23:02:21[Pipeline] stage
23:02:21[Pipeline] { (Test: Debug)
23:02:21[Pipeline] dir
23:02:21Running in /var/lib/jenkins/workspace/Cforall_master@tmp
23:02:21[Pipeline] {
23:02:21[Pipeline] sh
23:02:21+ nproc
23:02:21+ make -j 16 --no-print-directory -C tests timeout=600 global-timeout=14400 tests debug=yes archive-errors=/var/lib/jenkins/workspace/Cforall_master@tmp/tests/crashes/full-debug
23:02:21Running 378 tests on 16 cores (x64 - debug)
23:02:21 array-ERR2 PASSED C 0:00.065 - R n/a
23:02:21 array-ERR3 PASSED C 0:00.069 - R n/a
23:02:21 ...ollections/language-dim-mismatch PASSED C 0:00.241 - R n/a
23:02:21 array-ERR1 PASSED C 0:01.114 - R n/a
23:02:21 array PASSED C 0:01.260 - R 0:00.013
23:02:21 array-collections/c-dependent PASSED C 0:01.343 - R 0:00.006
23:02:21 array-collections/safety-summary PASSED C 0:01.015 - R n/a
23:02:21 array-collections/array-raii-c PASSED C 0:01.593 - R 0:00.022
23:02:21 array-collections/dimexpr-match-c PASSED C 0:01.609 - R 0:00.027
23:02:21 array-collections/symtab-collision PASSED C 0:00.767 - R n/a
23:02:21 array-collections/array-sbscr-types PASSED C 0:02.105 - R 0:00.023
23:02:21 array-collections/array-basic PASSED C 0:02.280 - R 0:00.024
23:02:21 attr-priority PASSED C 0:01.075 - R 0:00.001
23:02:21 array-collections/boxed PASSED C 0:02.706 - R 0:00.020
23:02:21 castError PASSED C 0:01.112 - R n/a
23:02:21 castReturn PASSED C 0:01.208 - R 0:00.007
23:02:21 builtins/sync PASSED C 0:01.781 - R 0:00.020
23:02:21 array-collections/dimexpr-match-cfa PASSED C 0:03.354 - R 0:00.020
23:02:21 cast PASSED C 0:01.928 - R 0:00.034
23:02:21 alloc-ERROR PASSED C 0:06.507 - R n/a
23:02:21 array-collections/accordion PASSED C 0:06.643 - R 0:00.018
23:02:21 algorithms/range_test PASSED C 0:07.066 - R 0:00.008
23:02:21 array-collections/array-raii-cfa PASSED C 0:07.070 - R 0:00.007
23:02:21 avl_test PASSED C 0:05.977 - R 0:00.006
23:02:21 collections/stack PASSED C 0:08.336 - R 0:00.006
23:02:21 alloc PASSED C 0:11.275 - R 0:00.010
23:02:21 collections/queue PASSED C 0:09.026 - R 0:00.007
23:02:21 collections/multi_list PASSED C 0:09.621 - R 0:00.007
23:02:21 collections/sequence PASSED C 0:09.319 - R 0:00.006
23:02:21 collections/string-compare PASSED C 0:08.714 - R 0:00.006
23:02:21 collections/string-operator-ERR09 PASSED C 0:04.911 - R n/a
23:02:21 collections/string-gc PASSED C 0:06.628 - R 0:00.007
23:02:21 collections/string-ctx-manage PASSED C 0:09.549 - R 0:00.006
23:02:21 collections/string-istream PASSED C 0:07.052 - R 0:00.007
23:02:21 alloc2 PASSED C 0:14.523 - R 0:00.010
23:02:21 collections/string-operator-ERR11 PASSED C 0:04.863 - R n/a
23:02:21 ...ns/vector-err-pass-perm-it-byval PASSED C 0:02.817 - R n/a
23:02:21 collections/string-operator PASSED C 0:09.057 - R 0:00.008
23:02:21 collections/string-operator-ERR13 PASSED C 0:04.897 - R n/a
23:02:21 ...ns/vector-err-retn-perm-it-byval PASSED C 0:02.508 - R n/a
23:02:21 collections/string-operator-ERR15 PASSED C 0:04.873 - R n/a
23:02:21 collections/string-api-coverage PASSED C 0:13.379 - R 0:00.007
23:02:21 collections/string-istream-manip PASSED C 0:09.600 - R 0:00.011
23:02:21 collections/string-operator-ERR16 PASSED C 0:04.890 - R n/a
23:02:21 ...ions/string-api-coverage-noshare PASSED C 0:13.669 - R 0:00.013
23:02:21 collections/vector-demo PASSED C 0:05.197 - R 0:00.007
23:02:21 collections/atomic_mpsc PASSED C 0:11.154 - R 0:07.217
23:02:21 complex PASSED C 0:05.923 - R 0:00.050
23:02:21 collections/string-ostream PASSED C 0:08.449 - R 0:00.013
23:02:21 ...ections/string-overwrite-noshare PASSED C 0:10.532 - R 0:00.011
23:02:21 collections/string-overwrite PASSED C 0:11.224 - R 0:00.011
23:02:21 concurrency/barrier/generation PASSED C 0:12.429 - R 0:00.323
23:02:21 concurrency/barrier/last PASSED C 0:12.364 - R 0:00.053
23:02:21 concurrency/actors/inline PASSED C 0:15.975 - R 0:00.046
23:02:21 concurrency/actors/executor PASSED C 0:16.199 - R 0:00.038
23:02:21 concurrency/actors/inherit PASSED C 0:16.092 - R 0:00.091
23:02:21 concurrency/actors/poison PASSED C 0:15.688 - R 0:00.178
23:02:21 concurrency/actors/pingpong PASSED C 0:15.958 - R 0:00.168
23:02:21 concurrency/actors/static PASSED C 0:15.528 - R 0:00.226
23:02:21 concurrency/actors/matrixMultiply PASSED C 0:15.941 - R 0:00.816
23:02:21 concurrency/barrier/order PASSED C 0:12.491 - R 0:00.076
23:02:21 concurrency/actors/types PASSED C 0:16.382 - R 0:00.041
23:02:21 concurrency/ctor-check PASSED C 0:00.835 - R n/a
23:02:21 concurrency/actors/dynamic PASSED C 0:15.423 - R 0:03.132
23:02:21 concurrency/clib PASSED C 0:02.313 - R 0:00.070
23:02:21 concurrency/clib_tls PASSED C 0:02.361 - R 0:00.027
23:02:21 concurrency/cluster PASSED C 0:07.372 - R 0:00.019
23:02:21 concurrency/cofor PASSED C 0:09.105 - R 0:00.116
23:02:21 concurrency/coroutineYield PASSED C 0:10.473 - R 0:00.033
23:02:21 concurrency/channels/churn PASSED C 0:14.091 - R 0:10.068
23:02:21 concurrency/examples/matrixSum PASSED C 0:10.010 - R 0:00.007
23:02:21 concurrency/examples/gortn PASSED C 0:10.164 - R 0:00.009
23:02:21 concurrency/examples/datingService PASSED C 0:10.590 - R 0:00.019
23:02:21 concurrency/channels/big_elems PASSED C 0:14.936 - R 0:10.725
23:02:21 concurrency/keywordErrors PASSED C 0:00.375 - R n/a
23:02:21 concurrency/channels/contend PASSED C 0:14.072 - R 0:10.105
23:02:21 concurrency/channels/daisy_chain PASSED C 0:13.673 - R 0:10.026
23:02:21 concurrency/mainError PASSED C 0:00.277 - R n/a
23:02:21 concurrency/futures/abandon PASSED C 0:07.477 - R 0:00.070
23:02:21 ...rrency/examples/boundedBufferEXT PASSED C 0:10.624 - R 0:05.835
23:02:21 ...rrency/examples/boundedBufferINT PASSED C 0:10.625 - R 0:05.691
23:02:21 concurrency/futures/basic PASSED C 0:07.654 - R 0:00.065
23:02:21 concurrency/examples/quickSort PASSED C 0:12.190 - R 0:00.011
23:02:21 concurrency/channels/hot_potato PASSED C 0:13.526 - R 0:10.055
23:02:21 concurrency/channels/ping_pong PASSED C 0:13.921 - R 0:10.051
23:02:21 concurrency/join PASSED C 0:10.206 - R 0:00.010
23:02:21 concurrency/channels/zero_size PASSED C 0:13.627 - R 0:10.048
23:02:21 concurrency/channels/pub_sub PASSED C 0:14.600 - R 0:10.043
23:02:21 concurrency/migrate PASSED C 0:10.472 - R 0:00.068
23:02:21 concurrency/futures/wait_any PASSED C 0:13.308 - R 0:00.035
23:02:21 concurrency/lockfree_stack PASSED C 0:10.076 - R 0:02.781
23:02:21 concurrency/mutexstmt/monitors PASSED C 0:08.571 - R 0:01.674
23:02:21 concurrency/park/contention PASSED C 0:08.349 - R 0:00.119
23:02:21 concurrency/futures/typed PASSED C 0:17.014 - R 0:00.318
23:02:21 concurrency/park/start_parked PASSED C 0:07.528 - R 0:00.035
23:02:21 concurrency/mutexstmt/tuple PASSED C 0:13.078 - R 0:00.007
23:02:21 ...urrency/pthread/pthread_key_test PASSED C 0:03.355 - R 0:00.008
23:02:21 concurrency/once PASSED C 0:13.666 - R 0:00.069
23:02:21 concurrency/park/force_preempt PASSED C 0:11.001 - R 0:00.369
23:02:21 ...rrency/pthread/pthread_attr_test PASSED C 0:10.242 - R 0:00.031
23:02:21 ...rrency/pthread/pthread_cond_test PASSED C 0:10.330 - R 0:00.010
23:02:21 ...pthread/pthread_demo_create_join PASSED C 0:10.185 - R 0:00.011
23:02:21 concurrency/monitor PASSED C 0:11.194 - R 0:11.606
23:02:21 concurrency/futures/future_except PASSED C 0:25.797 - R 0:00.039
23:02:21 ...rrency/pthread/pthread_once_test PASSED C 0:10.602 - R 0:00.035
23:02:21 concurrency/multi-monitor PASSED C 0:11.088 - R 0:12.662
23:02:21 concurrency/readyQ/barrier_sleeper PASSED C 0:12.032 - R 0:00.469
23:02:21 concurrency/readyQ/leader_spin PASSED C 0:10.319 - R 0:00.920
23:02:21 ...rrency/pthread/pthread_demo_lock PASSED C 0:10.119 - R 0:06.085
23:02:21 concurrency/signal/block PASSED C 0:11.198 - R 0:00.971
23:02:21 concurrency/signal/wait PASSED C 0:11.094 - R 0:00.167
23:02:21 concurrency/preempt PASSED C 0:11.701 - R 0:11.696
23:02:21 concurrency/suspend_then PASSED C 0:10.955 - R 0:00.035
23:02:21 concurrency/signal/disjoint PASSED C 0:12.078 - R 0:01.778
23:02:21 concurrency/sleep PASSED C 0:11.406 - R 0:01.174
23:02:21 concurrency/thread PASSED C 0:12.772 - R 0:00.009
23:02:21 ...ency/unified_locking/exp_backoff PASSED C 0:12.742 - R 0:00.019
23:02:21 .../unified_locking/fast_block_lock PASSED C 0:12.023 - R 0:00.035
23:02:21 .../unified_locking/block_spin_lock PASSED C 0:13.336 - R 0:01.525
23:02:21 ...cy/unified_locking/pthread_locks PASSED C 0:09.555 - R 0:00.068
23:02:21 concurrency/preempt2 PASSED C 0:11.618 - R 0:20.125
23:02:21 ...fied_locking/mcs_block_spin_lock PASSED C 0:12.098 - R 0:00.066
23:02:21 ...ncy/unified_locking/timeout_lock PASSED C 0:09.701 - R 0:01.119
23:02:21 concurrency/waitfor/barge PASSED C 0:10.337 - R 0:00.266
23:02:21 concurrency/waitfor/parse PASSED C 0:06.285 - R 0:00.021
23:02:21 ...nified_locking/simple_owner_lock PASSED C 0:12.076 - R 0:00.040
23:02:21 concurrency/waitfor/else PASSED C 0:08.707 - R 0:00.035
23:02:21 concurrency/waitfor/dtor PASSED C 0:10.570 - R 0:01.574
23:02:21 concurrency/unified_locking/mcs PASSED C 0:12.052 - R 0:07.295
23:02:21 ...urrency/waitfor/lexical_priority PASSED C 0:10.649 - R 0:00.012
23:02:21 concurrency/waitfor/statment PASSED C 0:10.449 - R 0:00.034
23:02:21 concurrency/waitfor/recurse PASSED C 0:11.040 - R 0:01.119
23:02:21 concurrency/waitfor/when PASSED C 0:11.288 - R 0:00.118
23:02:21 concurrency/waituntil/one_chan PASSED C 0:10.893 - R 0:01.825
23:02:21 concurrency/waituntil/basic_else PASSED C 0:17.344 - R 0:00.012
23:02:21 configs/parsebools PASSED C 0:08.296 - R 0:00.065
23:02:21 concurrency/waituntil/timeout PASSED C 0:06.333 - R 0:03.126
23:02:21 const-init PASSED C 0:00.969 - R 0:00.006
23:02:21 const-ref PASSED C 0:01.111 - R 0:00.012
23:02:21 ...ency/waituntil/channel_zero_size PASSED C 0:11.178 - R 0:07.636
23:02:21 concurrency/waituntil/channels PASSED C 0:10.936 - R 0:07.389
23:02:21 copyfile PASSED C 0:05.501 - R 0:00.007
23:02:21 concurrency/waituntil/channel_close PASSED C 0:13.991 - R 0:10.034
23:02:21 configs/parseconfig PASSED C 0:08.261 - R 0:00.020
23:02:21 configs/usage PASSED C 0:08.418 - R 0:00.035
23:02:21 coroutine/fibonacci PASSED C 0:06.886 - R 0:00.011
23:02:21 coroutine/fmtLines PASSED C 0:06.974 - R 0:00.035
23:02:21 coroutine/devicedriver PASSED C 0:07.641 - R 0:00.021
23:02:21 concurrency/waituntil/futures PASSED C 0:24.207 - R 0:00.010
23:02:21 coroutine/pingpong PASSED C 0:06.891 - R 0:00.010
23:02:21 counter PASSED C 0:05.506 - R 0:00.009
23:02:21 ctrl-flow/fallthrough PASSED C 0:05.724 - R 0:00.007
23:02:21 ctrl-flow/break-misc PASSED C 0:05.887 - R 0:00.016
23:02:21 ...ency/unified_locking/futex_mutex PASSED C 0:12.632 - R 0:37.875
23:02:21 ctrl-flow/labelledExit PASSED C 0:00.931 - R 0:00.007
23:02:21 coroutine/raii PASSED C 0:07.209 - R 0:00.011
23:02:21 coroutine/runningTotal PASSED C 0:07.077 - R 0:00.009
23:02:21 ctrl-flow/goto PASSED C 0:05.459 - R 0:00.012
23:02:21 ctrl-flow/loop-inc PASSED C 0:01.077 - R 0:00.013
23:02:21 coroutine/prodcons PASSED C 0:09.177 - R 0:00.035
23:02:21 enum PASSED C 0:01.120 - R 0:00.005
23:02:21 designations PASSED C 0:02.466 - R 0:00.010
23:02:21 concurrency/waituntil/all_types PASSED C 0:29.110 - R 0:07.892
23:02:21 ctrl-flow/ifwhileCtl PASSED C 0:05.452 - R 0:00.009
23:02:21 enum_tests/funcEnum PASSED C 0:02.107 - R 0:00.008
23:02:21 enum_tests/inc-dec PASSED C 0:01.017 - R 0:00.006
23:02:21 enum_tests/lvalue PASSED C 0:00.653 - R n/a
23:02:21 ctrl-flow/loop_else PASSED C 0:05.940 - R 0:00.010
23:02:21 enum_tests/anonymous PASSED C 0:06.001 - R 0:00.009
23:02:21 ctrl-flow/loop_else-WRN1 PASSED C 0:07.112 - R 0:00.003
23:02:21 ctrl-flow/loopctrl PASSED C 0:07.060 - R 0:00.006
23:02:21 enum_tests/enumInlineValue PASSED C 0:06.477 - R 0:00.017
23:02:21 errors/declaration PASSED C 0:00.137 - R n/a
23:02:21 concurrency/mutexstmt/locks PASSED C 0:10.161 - R 1:12.531
23:02:21 div PASSED C 0:08.308 - R 0:00.009
23:02:21 errors/scope-type PASSED C 0:00.282 - R n/a
23:02:21 errors/scope PASSED C 0:00.527 - R n/a
23:02:21 errors/signature PASSED C 0:00.097 - R n/a
23:02:21 enum_tests/structEnum PASSED C 0:02.366 - R 0:00.006
23:02:21 device/cpu PASSED C 0:09.283 - R 0:00.009
23:02:21 eval PASSED C 0:01.070 - R 0:00.018
23:02:21 enum_tests/input PASSED C 0:06.358 - R 0:00.008
23:02:21 enum_tests/stringEnum PASSED C 0:06.649 - R 0:00.005
23:02:21 enum_tests/planet PASSED C 0:07.708 - R 0:00.006
23:02:21 enum_tests/typedIntEnum PASSED C 0:05.856 - R 0:00.020
23:02:21 enum_tests/voidEnum PASSED C 0:05.973 - R 0:00.007
23:02:21 enum_tests/position PASSED C 0:08.955 - R 0:00.012
23:02:21 ...urrency/unified_locking/mcs_spin PASSED C 0:12.089 - R 0:49.273
23:02:21 .../unified_locking/spin_queue_lock PASSED C 0:11.949 - R 0:47.305
23:02:21 exceptions/conditional PASSED C 0:06.027 - R 0:00.008
23:02:21 exceptions/data-except PASSED C 0:05.900 - R 0:00.009
23:02:21 concurrency/waituntil/repeat_close PASSED C 0:11.165 - R 0:30.049
23:02:21 exceptions/cancel/coroutine PASSED C 0:07.830 - R 0:00.017
23:02:21 exceptions/conditional-threads PASSED C 0:07.676 - R 0:00.011
23:02:21 exceptions/message PASSED C 0:02.542 - R 0:00.006
23:02:21 exceptions/defaults PASSED C 0:06.097 - R 0:00.007
23:02:21 exceptions/finally PASSED C 0:05.899 - R 0:00.007
23:02:21 exceptions/try-ctrl-flow PASSED C 0:00.329 - R n/a
23:02:21 exceptions/defaults-threads PASSED C 0:07.501 - R 0:00.034
23:02:21 exceptions/cor_resumer PASSED C 0:10.254 - R 0:00.011
23:02:21 exceptions/try-leave-catch PASSED C 0:01.122 - R 0:00.005
23:02:21 exceptions/type-check PASSED C 0:00.443 - R n/a
23:02:21 exceptions/cancel/thread PASSED C 0:11.584 - R 0:00.008
23:02:21 exceptions/interact PASSED C 0:06.092 - R 0:00.007
23:02:21 expression PASSED C 0:01.193 - R 0:00.005
23:02:21 exceptions/finally-threads PASSED C 0:07.701 - R 0:00.037
23:02:21 exceptions/polymorphic PASSED C 0:06.080 - R 0:00.007
23:02:21 exceptions/fibonacci_nonlocal PASSED C 0:09.683 - R 0:00.011
23:02:21 exceptions/resume PASSED C 0:06.219 - R 0:00.007
23:02:21 exceptions/terminate PASSED C 0:06.131 - R 0:00.007
23:02:21 exceptions/trash PASSED C 0:05.907 - R 0:00.020
23:02:21 exceptions/resume-threads PASSED C 0:07.476 - R 0:00.007
23:02:21 global-monomorph PASSED C 0:00.992 - R 0:00.007
23:02:21 identFuncDeclarator PASSED C 0:01.066 - R 0:00.007
23:02:21 exceptions/terminate-threads PASSED C 0:07.997 - R 0:00.011
23:02:21 exceptions/pingpong_nonlocal PASSED C 0:11.268 - R 0:00.011
23:02:21 identParamDeclarator PASSED C 0:01.118 - R 0:00.006
23:02:21 exceptions/virtual-poly PASSED C 0:06.351 - R 0:00.012
23:02:21 fstream_test PASSED C 0:05.843 - R 0:00.020
23:02:21 forall PASSED C 0:06.787 - R 0:00.020
23:02:21 generator/fibonacci PASSED C 0:05.735 - R 0:00.007
23:02:21 generator/fmtLines PASSED C 0:05.790 - R 0:00.007
23:02:21 exceptions/virtual-cast PASSED C 0:07.849 - R 0:00.007
23:02:21 generator/suspend_then PASSED C 0:05.807 - R 0:00.011
23:02:21 init1-ERROR PASSED C 0:00.626 - R n/a
23:02:21 init1 PASSED C 0:01.105 - R 0:00.005
23:02:21 include/vector-sequence PASSED C 0:01.677 - R 0:00.011
23:02:21 genericUnion PASSED C 0:06.325 - R 0:00.007
23:02:21 include/vector-collections PASSED C 0:02.609 - R 0:00.008
23:02:21 function-operator PASSED C 0:08.038 - R 0:00.006
23:02:21 hello PASSED C 0:05.766 - R 0:00.006
23:02:21 identity PASSED C 0:05.948 - R 0:00.005
23:02:21 include/vector-fstream PASSED C 0:06.042 - R 0:00.009
23:02:21 include/stdincludes PASSED C 0:06.210 - R 0:00.007
23:02:21 io/eofType PASSED C 0:05.805 - R 0:00.006
23:02:21 io/io PASSED C 0:09.676 - R 0:00.007
23:02:21 limits PASSED C 0:01.139 - R 0:00.022
23:02:21 io/io-acquire-in PASSED C 0:11.441 - R 0:00.070
23:02:21 io/io-acquire PASSED C 0:11.598 - R 0:00.218
23:02:21 io/io-acquire-out PASSED C 0:11.280 - R 0:00.167
23:02:21 io/manipulatorsOutput4 PASSED C 0:08.535 - R 0:00.036
23:02:21 io/away_fair PASSED C 0:13.302 - R 0:00.168
23:02:21 io/manipulatorsInput-uchunk PASSED C 0:08.935 - R 0:00.070
23:02:21 linking/nostdlib PASSED C 0:01.550 - R 0:00.038
23:02:21 io/comp_basic PASSED C 0:14.816 - R 0:00.118
23:02:21 io/io-acquire-no-io PASSED C 0:10.739 - R 0:02.879
23:02:21 io/io-acquire2 PASSED C 0:11.652 - R 0:00.121
23:02:21 linking/exception-nothreads PASSED C 0:04.400 - R 0:00.006
23:02:21 linkonce PASSED C 0:01.427 - R 0:00.006
23:02:21 io/comp_fair PASSED C 0:15.485 - R 0:00.572
23:02:21 maybe PASSED C 0:01.388 - R 0:00.007
23:02:21 concurrency/waituntil/locks PASSED C 0:12.523 - R 1:03.251
23:02:21 linking/exception-withthreads PASSED C 0:06.492 - R 0:00.025
23:02:21 io/many_read PASSED C 0:13.414 - R 0:00.067
23:02:21 linking/mangling/anon PASSED C 0:06.809 - R 0:00.020
23:02:21 nested-types-ERR1 PASSED C 0:00.234 - R n/a
23:02:21 nested-types-ERR2 PASSED C 0:00.197 - R n/a
23:02:21 include/includes PASSED C 0:22.925 - R 0:00.005
23:02:21 list/dlist-insert-remove PASSED C 0:06.140 - R 0:00.023
23:02:21 nested-types PASSED C 0:01.313 - R 0:00.011
23:02:21 linking/io-acquire PASSED C 0:08.580 - R 0:00.005
23:02:21 linking/weakso_nothd PASSED C 0:07.719 - R 0:00.006
23:02:21 linking/nothreads PASSED C 0:08.293 - R 0:00.006
23:02:21 list/dlist2-insert-remove PASSED C 0:07.002 - R 0:00.012
23:02:21 nowarn/array PASSED C 0:01.698 - R 0:00.021
23:02:21 nowarn/zero-thunk PASSED C 0:00.968 - R 0:00.007
23:02:21 nowarn/no-autogen PASSED C 0:01.158 - R 0:00.017
23:02:21 opt-params PASSED C 0:00.109 - R n/a
23:02:21 nowarn/unused PASSED C 0:01.186 - R 0:00.006
23:02:21 nowarn/exception PASSED C 0:01.309 - R 0:00.011
23:02:21 numericConstants PASSED C 0:01.160 - R 0:00.006
23:02:21 literals PASSED C 0:06.833 - R 0:00.019
23:02:21 nowarn/printf-sizeof PASSED C 0:01.628 - R 0:00.009
23:02:21 polybits PASSED C 0:00.260 - R n/a
23:02:21 meta/fork+exec PASSED C 0:04.661 - R 0:00.018
23:02:21 operators PASSED C 0:01.242 - R 0:00.014
23:02:21 poly-member PASSED C 0:01.046 - R 0:00.011
23:02:21 poly-bare-assn PASSED C 0:01.151 - R 0:00.011
23:02:21 poly-d-cycle PASSED C 0:01.261 - R 0:00.022
23:02:21 poly-o-cycle PASSED C 0:01.181 - R 0:00.006
23:02:21 poly-many-arsz PASSED C 0:01.273 - R 0:00.019
23:02:21 poly-selection PASSED C 0:01.235 - R 0:00.020
23:02:21 raii/ctor-autogen-ERR1 PASSED C 0:00.690 - R n/a
23:02:21 poly-self-cycle PASSED C 0:01.525 - R 0:00.007
23:02:21 quasiKeyword PASSED C 0:01.274 - R 0:00.007
23:02:21 raii/ctor-autogen PASSED C 0:01.938 - R 0:00.007
23:02:21 meta/dumpable PASSED C 0:07.909 - R 0:00.019
23:02:21 raii/init_once PASSED C 0:01.285 - R 0:00.007
23:02:21 heap PASSED C 0:08.057 - R 0:21.939
23:02:21 malloc PASSED C 0:09.595 - R 0:00.021
23:02:21 raii/partial-ERR1 PASSED C 0:00.628 - R n/a
23:02:21 linking/withthreads PASSED C 0:11.683 - R 0:00.011
23:02:21 raii/partial PASSED C 0:01.110 - R 0:00.006
23:02:21 raii/typeof-member PASSED C 0:01.009 - R 0:00.005
23:02:21 result PASSED C 0:01.458 - R 0:00.007
23:02:21 raii/dtor-early-exit-ERR1 PASSED C 0:04.596 - R n/a
23:02:21 raii/dtor-early-exit-ERR2 PASSED C 0:04.567 - R n/a
23:02:21 minmax PASSED C 0:09.971 - R 0:00.007
23:02:21 simpleGenericTriple PASSED C 0:01.247 - R 0:00.007
23:02:21 polymorphism PASSED C 0:06.084 - R 0:00.007
23:02:21 quotedKeyword PASSED C 0:05.921 - R 0:00.010
23:02:21 raii/memberCtors-ERR1 PASSED C 0:03.824 - R n/a
23:02:21 raii/boxed-types PASSED C 0:05.927 - R 0:00.012
23:02:21 smart-pointers PASSED C 0:01.334 - R 0:00.006
23:02:21 switch PASSED C 0:01.169 - R 0:00.011
23:02:21 raii/globals PASSED C 0:06.118 - R 0:00.007
23:02:21 raii/memberCtors PASSED C 0:06.079 - R 0:00.006
23:02:21 tuple/tupleCast PASSED C 0:01.133 - R 0:00.005
23:02:21 raii/dtor-early-exit PASSED C 0:07.785 - R 0:00.006
23:02:21 tuple/tupleMember PASSED C 0:01.182 - R 0:00.013
23:02:21 tuple/tupleFunction PASSED C 0:01.246 - R 0:00.009
23:02:21 typedefRedef-ERR1 PASSED C 0:00.117 - R n/a
23:02:21 tuple/tuplePolymorphism PASSED C 0:01.305 - R 0:00.007
23:02:21 references PASSED C 0:05.935 - R 0:00.005
23:02:21 var-assert PASSED C 0:00.142 - R n/a
23:02:21 typedefRedef PASSED C 0:00.971 - R 0:00.006
23:02:21 shortCircuit PASSED C 0:05.761 - R 0:00.007
23:02:21 typeof PASSED C 0:01.098 - R 0:00.007
23:02:21 variableDeclarator PASSED C 0:01.101 - R 0:00.007
23:02:21 sizeof PASSED C 0:05.753 - R 0:00.007
23:02:21 searchsort PASSED C 0:08.003 - R 0:00.010
23:02:21 tuple/tupleVariadic PASSED C 0:04.046 - R 0:00.006
23:02:21 strstream PASSED C 0:06.353 - R 0:00.007
23:02:21 tuple/tupleAssign PASSED C 0:06.360 - R 0:00.006
23:02:21 time PASSED C 0:07.401 - R 0:00.006
23:02:21 tuplearray PASSED C 0:06.096 - R 0:00.024
23:02:21 swap PASSED C 0:08.507 - R 0:00.005
23:02:21 voidPtr PASSED C 0:01.071 - R 0:00.011
23:02:21 sum PASSED C 0:08.992 - R 0:00.007
23:02:21 userLiterals PASSED C 0:06.236 - R 0:00.005
23:02:21 withconflict PASSED C 0:00.561 - R n/a
23:02:21 warnings/self-assignment PASSED C 0:00.905 - R 0:00.001
23:02:21 KRfunctions PASSED C 0:01.003 - R 0:00.001
23:02:21 vector PASSED C 0:07.531 - R 0:00.006
23:02:21 zero_one-ERR1 PASSED C 0:03.188 - R n/a
23:02:21 vector_math/vec2_double PASSED C 0:08.761 - R 0:00.007
23:02:21 arithmeticConversions PASSED C 0:02.390 - R 0:00.007
23:02:21 ...collections/dimexpr-match-c-ERRS PASSED C 0:00.746 - R n/a
23:02:21 vector_math/vec2_uint PASSED C 0:08.471 - R 0:00.021
23:02:21 ...llections/dimexpr-match-cfa-ERRS PASSED C 0:01.320 - R n/a
23:02:21 attributes PASSED C 0:01.194 - R 0:00.001
23:02:21 zero_one PASSED C 0:05.908 - R 0:00.007
23:02:21 vector_math/vec2_float PASSED C 0:11.836 - R 0:00.009
23:02:21 vector_math/vec2_int PASSED C 0:12.010 - R 0:00.019
23:02:21 vector_math/vec3_int PASSED C 0:11.338 - R 0:00.006
23:02:21 declarationSpecifier PASSED C 0:01.095 - R 0:00.001
23:02:21 abs PASSED C 0:08.185 - R 0:00.013
23:02:21 ...collections/array-md-sbscr-cases PASSED C 0:06.702 - R 0:00.006
23:02:21 vector_math/vec3_float PASSED C 0:12.247 - R 0:00.010
23:02:21 errors/completeType PASSED C 0:00.565 - R n/a
23:02:21 vector_math/vec4_float PASSED C 0:11.828 - R 0:00.008
23:02:21 vector_math/vec4_int PASSED C 0:11.635 - R 0:00.008
23:02:21 extension PASSED C 0:01.082 - R 0:00.001
23:02:21 functions PASSED C 0:01.077 - R 0:00.001
23:02:21 gccExtensions PASSED C 0:01.057 - R 0:00.001
23:02:21 ato PASSED C 0:08.546 - R 0:00.011
23:02:21 rational PASSED C 0:24.505 - R 0:00.010
23:02:21 bitmanip1 PASSED C 0:09.594 - R 0:00.012
23:02:21 bitmanip2 PASSED C 0:09.761 - R 0:00.029
23:02:21 meta/arch PASSED C 0:00.577 - R n/a
23:02:21 configs/parsenums PASSED C 0:08.218 - R 0:00.170
23:02:21 bitmanip3 PASSED C 0:11.373 - R 0:00.039
23:02:21 concurrency/pthread/bounded_buffer PASSED C 0:11.018 - R 0:00.118
23:02:21 gmp PASSED C 0:07.745 - R 0:00.020
23:02:21 io/manipulatorsInput PASSED C 0:07.655 - R 0:00.035
23:02:21 PRNG PASSED C 0:15.789 - R 0:02.081
23:02:21 exceptions/cardgame PASSED C 0:09.570 - R 0:00.019
23:02:21 exceptions/hotpotato_checked PASSED C 0:09.755 - R 0:00.017
23:02:21 exceptions/hotpotato PASSED C 0:09.589 - R 0:00.009
23:02:21 io/manipulatorsOutput2 PASSED C 0:08.812 - R 0:00.009
23:02:21 concurrency/unified_locking/locks PASSED C 0:12.838 - R 2:03.786
23:02:21 io/manipulatorsOutput1 PASSED C 0:12.066 - R 0:00.009
23:02:21 random PASSED C 0:07.440 - R 0:00.005
23:02:21 mathX PASSED C 0:11.155 - R 0:00.017
23:02:21 io/manipulatorsOutput3 PASSED C 0:12.228 - R 0:00.009
23:02:21 vector_math/vec2_ldouble PASSED C 0:07.817 - R 0:00.010
23:02:21 nested_function PASSED C 0:09.888 - R 0:00.012
23:02:21 math PASSED C 0:10.896 - R 0:00.010
23:02:21378 passes, 0 failures, 0 timeouts, 0 cancelled, 0 other
23:02:21Tests took 3:36.029
23:02:21[Pipeline] }
23:02:21[Pipeline] // dir
23:02:21[Pipeline] }
23:02:21[Pipeline] // stage
23:02:21[Pipeline] echo
23:02:21 -------- Test: Release --------
23:02:21[Pipeline] stage
23:02:21[Pipeline] { (Test: Release)
23:02:21[Pipeline] dir
23:02:21Running in /var/lib/jenkins/workspace/Cforall_master@tmp
23:02:21[Pipeline] {
23:02:21[Pipeline] sh
23:02:21+ nproc
23:02:21+ make -j 16 --no-print-directory -C tests timeout=600 global-timeout=14400 tests debug=no archive-errors=/var/lib/jenkins/workspace/Cforall_master@tmp/tests/crashes/full-nodebug
23:02:21Running 378 tests on 16 cores (x64 - no debug)
23:02:21 array-ERR2 PASSED C 0:00.070 - R n/a
23:02:21 array-ERR3 PASSED C 0:00.074 - R n/a
23:02:21 ...ollections/language-dim-mismatch PASSED C 0:00.272 - R n/a
23:02:21 array-ERR1 PASSED C 0:01.084 - R n/a
23:02:21 array-collections/safety-summary PASSED C 0:00.720 - R n/a
23:02:21 array PASSED C 0:01.211 - R 0:00.023
23:02:21 array-collections/c-dependent PASSED C 0:01.338 - R 0:00.021
23:02:21 array-collections/symtab-collision PASSED C 0:00.619 - R n/a
23:02:21 array-collections/array-raii-c PASSED C 0:01.778 - R 0:00.008
23:02:21 array-collections/dimexpr-match-c PASSED C 0:02.080 - R 0:00.026
23:02:21 array-collections/array-sbscr-types PASSED C 0:02.276 - R 0:00.006
23:02:21 castError PASSED C 0:00.877 - R n/a
23:02:21 attr-priority PASSED C 0:01.912 - R 0:00.004
23:02:21 builtins/sync PASSED C 0:01.639 - R 0:00.012
23:02:21 array-collections/boxed PASSED C 0:03.031 - R 0:00.021
23:02:21 array-collections/array-basic PASSED C 0:03.176 - R 0:00.023
23:02:21 cast PASSED C 0:01.564 - R 0:00.019
23:02:21 castReturn PASSED C 0:01.599 - R 0:00.016
23:02:21 array-collections/dimexpr-match-cfa PASSED C 0:04.928 - R 0:00.021
23:02:21 alloc-ERROR PASSED C 0:06.056 - R n/a
23:02:21 algorithms/range_test PASSED C 0:06.623 - R 0:00.006
23:02:21 avl_test PASSED C 0:06.232 - R 0:00.006
23:02:21 array-collections/accordion PASSED C 0:07.541 - R 0:00.006
23:02:21 array-collections/array-raii-cfa PASSED C 0:08.028 - R 0:00.005
23:02:21 collections/multi_list PASSED C 0:08.942 - R 0:00.007
23:02:21 collections/queue PASSED C 0:09.543 - R 0:00.006
23:02:21 collections/string-gc PASSED C 0:06.761 - R 0:00.007
23:02:21 collections/stack PASSED C 0:09.853 - R 0:00.005
23:02:21 collections/string-operator-ERR09 PASSED C 0:04.962 - R n/a
23:02:21 collections/string-istream PASSED C 0:07.241 - R 0:00.020
23:02:21 collections/sequence PASSED C 0:10.876 - R 0:00.011
23:02:21 collections/atomic_mpsc PASSED C 0:11.369 - R 0:00.870
23:02:21 collections/string-ctx-manage PASSED C 0:09.818 - R 0:00.007
23:02:21 alloc PASSED C 0:15.446 - R 0:00.022
23:02:21 collections/string-compare PASSED C 0:12.227 - R 0:00.007
23:02:21 collections/string-operator-ERR11 PASSED C 0:04.931 - R n/a
23:02:21 collections/string-istream-manip PASSED C 0:10.061 - R 0:00.007
23:02:21 collections/string-operator-ERR13 PASSED C 0:05.117 - R n/a
23:02:21 collections/string-operator-ERR15 PASSED C 0:04.942 - R n/a
23:02:21 collections/string-operator-ERR16 PASSED C 0:04.971 - R n/a
23:02:21 ...ns/vector-err-pass-perm-it-byval PASSED C 0:03.022 - R n/a
23:02:21 ...ns/vector-err-retn-perm-it-byval PASSED C 0:02.600 - R n/a
23:02:21 collections/string-api-coverage PASSED C 0:16.487 - R 0:00.026
23:02:21 ...ions/string-api-coverage-noshare PASSED C 0:16.551 - R 0:00.043
23:02:21 collections/vector-demo PASSED C 0:06.727 - R 0:00.007
23:02:21 complex PASSED C 0:06.027 - R 0:00.007
23:02:21 collections/string-operator PASSED C 0:14.951 - R 0:00.007
23:02:21 collections/string-ostream PASSED C 0:09.689 - R 0:00.006
23:02:21 collections/string-overwrite PASSED C 0:11.115 - R 0:00.009
23:02:21 ...ections/string-overwrite-noshare PASSED C 0:11.316 - R 0:00.011
23:02:21 alloc2 PASSED C 0:25.684 - R 0:00.007
23:02:21 concurrency/actors/dynamic PASSED C 0:15.789 - R 0:00.268
23:02:21 concurrency/actors/executor PASSED C 0:16.060 - R 0:00.036
23:02:21 concurrency/actors/inline PASSED C 0:16.001 - R 0:00.036
23:02:21 concurrency/actors/poison PASSED C 0:15.700 - R 0:00.067
23:02:21 concurrency/barrier/generation PASSED C 0:12.592 - R 0:00.117
23:02:21 concurrency/actors/pingpong PASSED C 0:16.047 - R 0:00.066
23:02:21 concurrency/actors/matrixMultiply PASSED C 0:15.925 - R 0:00.218
23:02:21 concurrency/actors/inherit PASSED C 0:16.879 - R 0:00.036
23:02:21 concurrency/barrier/last PASSED C 0:12.598 - R 0:00.019
23:02:21 concurrency/barrier/order PASSED C 0:12.599 - R 0:00.020
23:02:21 concurrency/actors/static PASSED C 0:15.715 - R 0:00.117
23:02:21 concurrency/ctor-check PASSED C 0:00.860 - R n/a
23:02:21 concurrency/clib_tls PASSED C 0:02.899 - R 0:00.020
23:02:21 concurrency/clib PASSED C 0:02.925 - R 0:00.038
23:02:21 concurrency/actors/types PASSED C 0:17.148 - R 0:00.119
23:02:21 concurrency/cluster PASSED C 0:07.280 - R 0:00.009
23:02:21 concurrency/cofor PASSED C 0:09.554 - R 0:00.010
23:02:21 concurrency/coroutineYield PASSED C 0:10.877 - R 0:00.020
23:02:21 concurrency/examples/gortn PASSED C 0:10.242 - R 0:00.014
23:02:21 concurrency/examples/matrixSum PASSED C 0:10.159 - R 0:00.009
23:02:21 ...rrency/examples/boundedBufferEXT PASSED C 0:11.041 - R 0:01.170
23:02:21 concurrency/examples/datingService PASSED C 0:10.877 - R 0:00.006
23:02:21 ...rrency/examples/boundedBufferINT PASSED C 0:11.077 - R 0:01.420
23:02:21 concurrency/channels/big_elems PASSED C 0:15.487 - R 0:10.489
23:02:21 concurrency/keywordErrors PASSED C 0:00.420 - R n/a
23:02:21 concurrency/mainError PASSED C 0:00.315 - R n/a
23:02:21 concurrency/channels/churn PASSED C 0:15.480 - R 0:10.064
23:02:21 concurrency/channels/daisy_chain PASSED C 0:15.049 - R 0:10.055
23:02:21 concurrency/futures/abandon PASSED C 0:07.560 - R 0:00.017
23:02:21 concurrency/channels/contend PASSED C 0:16.413 - R 0:10.153
23:02:21 concurrency/futures/basic PASSED C 0:07.442 - R 0:00.419
23:02:21 concurrency/examples/quickSort PASSED C 0:12.331 - R 0:00.007
23:02:21 concurrency/channels/hot_potato PASSED C 0:14.794 - R 0:10.049
23:02:21 concurrency/join PASSED C 0:10.435 - R 0:00.021
23:02:21 concurrency/channels/ping_pong PASSED C 0:15.146 - R 0:10.013
23:02:21 concurrency/channels/zero_size PASSED C 0:15.235 - R 0:10.044
23:02:21 concurrency/channels/pub_sub PASSED C 0:15.445 - R 0:10.048
23:02:21 concurrency/migrate PASSED C 0:10.645 - R 0:00.042
23:02:21 concurrency/mutexstmt/monitors PASSED C 0:08.712 - R 0:00.417
23:02:21 concurrency/futures/wait_any PASSED C 0:13.329 - R 0:00.019
23:02:21 concurrency/lockfree_stack PASSED C 0:10.309 - R 0:02.627
23:02:21 concurrency/monitor PASSED C 0:11.243 - R 0:01.273
23:02:21 concurrency/multi-monitor PASSED C 0:10.769 - R 0:01.678
23:02:21 concurrency/park/contention PASSED C 0:07.546 - R 0:00.036
23:02:21 concurrency/futures/typed PASSED C 0:18.156 - R 0:00.035
23:02:21 concurrency/once PASSED C 0:12.664 - R 0:00.036
23:02:21 concurrency/park/start_parked PASSED C 0:07.833 - R 0:00.036
23:02:21 concurrency/mutexstmt/tuple PASSED C 0:13.327 - R 0:00.018
23:02:21 ...urrency/pthread/pthread_key_test PASSED C 0:03.715 - R 0:00.009
23:02:21 concurrency/park/force_preempt PASSED C 0:10.496 - R 0:00.268
23:02:21 ...rrency/pthread/pthread_attr_test PASSED C 0:10.410 - R 0:00.021
23:02:21 ...rrency/pthread/pthread_cond_test PASSED C 0:10.775 - R 0:00.011
23:02:21 ...pthread/pthread_demo_create_join PASSED C 0:10.686 - R 0:00.018
23:02:21 concurrency/futures/future_except PASSED C 0:24.680 - R 0:00.026
23:02:21 concurrency/mutexstmt/locks PASSED C 0:11.577 - R 0:09.498
23:02:21 ...rrency/pthread/pthread_once_test PASSED C 0:10.118 - R 0:00.014
23:02:21 concurrency/readyQ/leader_spin PASSED C 0:10.869 - R 0:01.223
23:02:21 concurrency/readyQ/barrier_sleeper PASSED C 0:12.634 - R 0:00.218
23:02:21 concurrency/signal/disjoint PASSED C 0:11.451 - R 0:00.318
23:02:21 ...rrency/pthread/pthread_demo_lock PASSED C 0:10.432 - R 0:06.443
23:02:21 concurrency/signal/wait PASSED C 0:11.832 - R 0:00.036
23:02:21 concurrency/sleep PASSED C 0:10.755 - R 0:01.169
23:02:21 concurrency/signal/block PASSED C 0:12.811 - R 0:00.219
23:02:21 concurrency/suspend_then PASSED C 0:11.350 - R 0:00.019
23:02:21 concurrency/preempt PASSED C 0:12.288 - R 0:09.192
23:02:21 concurrency/thread PASSED C 0:12.181 - R 0:00.007
23:02:21 ...ency/unified_locking/exp_backoff PASSED C 0:12.538 - R 0:00.011
23:02:21 .../unified_locking/fast_block_lock PASSED C 0:12.600 - R 0:00.018
23:02:21 .../unified_locking/block_spin_lock PASSED C 0:13.486 - R 0:00.011
23:02:21 ...cy/unified_locking/pthread_locks PASSED C 0:10.047 - R 0:00.469
23:02:21 ...ncy/unified_locking/timeout_lock PASSED C 0:09.594 - R 0:01.139
23:02:21 ...fied_locking/mcs_block_spin_lock PASSED C 0:12.489 - R 0:00.011
23:02:21 concurrency/waitfor/barge PASSED C 0:10.362 - R 0:00.067
23:02:21 concurrency/waitfor/parse PASSED C 0:06.390 - R 0:00.010
23:02:21 ...nified_locking/simple_owner_lock PASSED C 0:12.319 - R 0:00.010
23:02:21 concurrency/waitfor/dtor PASSED C 0:10.249 - R 0:00.166
23:02:21 concurrency/waitfor/else PASSED C 0:08.551 - R 0:00.009
23:02:21 concurrency/unified_locking/mcs PASSED C 0:12.682 - R 0:01.270
23:02:21 concurrency/preempt2 PASSED C 0:12.489 - R 0:20.352
23:02:21 ...urrency/waitfor/lexical_priority PASSED C 0:10.779 - R 0:00.021
23:02:21 concurrency/waitfor/recurse PASSED C 0:10.616 - R 0:00.368
23:02:21 concurrency/waitfor/statment PASSED C 0:10.552 - R 0:00.012
23:02:21 concurrency/waitfor/when PASSED C 0:10.454 - R 0:00.036
23:02:21 concurrency/unified_locking/locks PASSED C 0:13.655 - R 0:15.031
23:02:21 ...ency/waituntil/channel_zero_size PASSED C 0:12.373 - R 0:00.321
23:02:21 concurrency/waituntil/channels PASSED C 0:13.172 - R 0:00.570
23:02:21 concurrency/waituntil/one_chan PASSED C 0:12.510 - R 0:00.118
23:02:21 const-init PASSED C 0:01.177 - R 0:00.005
23:02:21 concurrency/waituntil/timeout PASSED C 0:06.227 - R 0:03.076
23:02:21 const-ref PASSED C 0:01.147 - R 0:00.019
23:02:21 concurrency/waituntil/basic_else PASSED C 0:16.888 - R 0:00.018
23:02:21 configs/parsebools PASSED C 0:09.027 - R 0:00.036
23:02:21 concurrency/waituntil/locks PASSED C 0:14.305 - R 0:02.988
23:02:21 configs/parseconfig PASSED C 0:08.958 - R 0:00.007
23:02:21 copyfile PASSED C 0:06.043 - R 0:00.006
23:02:21 configs/usage PASSED C 0:09.257 - R 0:00.008
23:02:21 coroutine/devicedriver PASSED C 0:07.191 - R 0:00.007
23:02:21 coroutine/fmtLines PASSED C 0:07.218 - R 0:00.035
23:02:21 coroutine/fibonacci PASSED C 0:07.813 - R 0:00.037
23:02:21 coroutine/pingpong PASSED C 0:07.154 - R 0:00.007
23:02:21 ctrl-flow/labelledExit PASSED C 0:01.217 - R 0:00.005
23:02:21 coroutine/raii PASSED C 0:07.310 - R 0:00.011
23:02:21 counter PASSED C 0:06.041 - R 0:00.006
23:02:21 concurrency/waituntil/channel_close PASSED C 0:16.094 - R 0:10.044
23:02:21 ctrl-flow/break-misc PASSED C 0:05.796 - R 0:00.010
23:02:21 ctrl-flow/loop-inc PASSED C 0:01.109 - R 0:00.011
23:02:21 coroutine/runningTotal PASSED C 0:07.743 - R 0:00.011
23:02:21 concurrency/waituntil/futures FAILED with code -6 C 0:25.020 - R 0:00.166
23:02:21start
23:02:21Cforall Runtime error (UNIX pid:622574): Attempting to fulfil a future that has already been fulfilled
23:02:21Stack back trace for: /var/lib/jenkins/workspace/Cforall_master@tmp/libcfa/x64-nodebug/src/.libs/libcfa.so.1
23:02:2123:02:21warning: Can't open file anon_inode:[io_uring] which was expanded to anon_inode:[io_uring] during file-backed mapping note processing
23:02:21[New LWP 622576]
23:02:21[New LWP 622575]
23:02:21[New LWP 622574]
23:02:21[Thread debugging using libthread_db enabled]
23:02:21Using host libthread_db library "/lib/x86_64-linux-gnu/libthread_db.so.1".
23:02:21Core was generated by `/var/lib/jenkins/workspace/Cforall_master@tmp/tests/concurrency/waituntil/futur'.
23:02:21Program terminated with signal SIGABRT, Aborted.
23:02:21#0 __pthread_kill_implementation (no_tid=0, signo=6, threadid=<optimized out>) at ./nptl/pthread_kill.c:44
23:02:2123:02:21warning: 44 ./nptl/pthread_kill.c: No such file or directory
23:02:21[Current thread is 1 (Thread 0x55555562e780 (LWP 622576))]
23:02:21-----
23:02:21#0 __pthread_kill_implementation (no_tid=0, signo=6, threadid=<optimized out>) at ./nptl/pthread_kill.c:44
23:02:21#1 __pthread_kill_internal (signo=6, threadid=<optimized out>) at ./nptl/pthread_kill.c:78
23:02:21#2 __GI___pthread_kill (threadid=<optimized out>, signo=signo@entry=6) at ./nptl/pthread_kill.c:89
23:02:21#3 0x00007ffff7a4527e in __GI_raise (sig=sig@entry=6) at ../sysdeps/posix/raise.c:26
23:02:21#4 0x00007ffff7a288ff in __GI_abort () at ./stdlib/abort.c:79
23:02:21#5 0x00007ffff7f1878d in _X7__abortFv_bPKcY17__builtin_va_list__1 (_X11signalAbortb_1=_X11signalAbortb_1@entry=true, _X3fmtPKc_1=0x7ffff7f2ba38 "Application interrupted by signal: %s.\n", _X4argsY17__builtin_va_list_1=_X4argsY17__builtin_va_list_1@entry=0x7ffff7f6e190 <stack+63984>) at /var/lib/jenkins/workspace/Cforall_master/libcfa/src/interpose.cfa:263
23:02:21#6 0x00007ffff7f18cbe in _X5abortFv_bPKc__1 (_X11signalAbortb_1=_X11signalAbortb_1@entry=true, _X3fmtPKc_1=_X3fmtPKc_1@entry=0x7ffff7f2ba38 "Application interrupted by signal: %s.\n") at /var/lib/jenkins/workspace/Cforall_master/libcfa/src/interpose.cfa:301
23:02:21#7 0x00007ffff7f18ce5 in _X15sigHandler_termFv_iPS21__anonymous_siginfo_tPS10ucontext_t__1 (_X3sigi_1=<optimized out>, _X3sfpPS21__anonymous_siginfo_t_1=<optimized out>, _X3cxtPS10ucontext_t_1=<optimized out>) at /var/lib/jenkins/workspace/Cforall_master/libcfa/src/interpose.cfa:337
23:02:21#8 <signal handler called>
23:02:21#9 __pthread_kill_implementation (no_tid=0, signo=6, threadid=<optimized out>) at ./nptl/pthread_kill.c:44
23:02:21#10 __pthread_kill_internal (signo=6, threadid=<optimized out>) at ./nptl/pthread_kill.c:78
23:02:21#11 __GI___pthread_kill (threadid=<optimized out>, signo=signo@entry=6) at ./nptl/pthread_kill.c:89
23:02:21#12 0x00007ffff7a4527e in __GI_raise (sig=sig@entry=6) at ../sysdeps/posix/raise.c:26
23:02:21#13 0x00007ffff7a288ff in __GI_abort () at ./stdlib/abort.c:79
23:02:21#14 0x00007ffff7f18846 in _X7__abortFv_bPKcY17__builtin_va_list__1 (_X11signalAbortb_1=_X11signalAbortb_1@entry=false, _X3fmtPKc_1=<optimized out>, _X3fmtPKc_1@entry=0x55555555c0c0 "Attempting to fulfil a future that has already been fulfilled", _X4argsY17__builtin_va_list_1=_X4argsY17__builtin_va_list_1@entry=0x55555579ff40) at /var/lib/jenkins/workspace/Cforall_master/libcfa/src/interpose.cfa:286
23:02:21#15 0x00007ffff7f189d7 in _X5abortFv_PKc__1 (_X3fmtPKc_1=_X3fmtPKc_1@entry=0x55555555c0c0 "Attempting to fulfil a future that has already been fulfilled") at /var/lib/jenkins/workspace/Cforall_master/libcfa/src/interpose.cfa:293
23:02:21#16 0x0000555555558b2b in _X6fulfilQ1_0_0_4__X16_operator_assignFBD0_BD0BD0__X12_constructorFv_BD0__X12_constructorFv_BD0BD0__X11_destructorFv_BD0__Fb_S6future_BD0_BD0__1 (_sizeof_Y1T=<optimized out>, _alignof_Y1T=<optimized out>, _adapterFv_PY1TY1T__MP=<optimized out>, _adapterFY1T_PY1TY1T_P_MP=<optimized out>, _X16_operator_assignFY1T_Y1TY1T__1=<optimized out>, _X12_constructorFv_Y1T__1=<optimized out>, _X12_constructorFv_Y1TY1T__1=<optimized out>, _X11_destructorFv_Y1T__1=<optimized out>, _X3valY1T_1=<optimized out>, _X3futS6future_Y1T__1=<optimized out>) at /var/lib/jenkins/workspace/Cforall_master/libcfa/src/concurrency/future.hfa:196
23:02:21#17 _X14_operator_callQ1_0_0_4__X16_operator_assignFBD0_BD0BD0__X12_constructorFv_BD0__X12_constructorFv_BD0BD0__X11_destructorFv_BD0__Fb_S6future_BD0_BD0__1 (_adapterFv_PY1TY1T__MP=_adapterFv_PY1TY1T__MP@entry=0x5555555582d0 <_adapterFv_Pii__MP.41263>, _X3futS6future_Y1T__1=_X3futS6future_Y1T__1@entry=0x55555555f380 <_X1CS6future_i__1>, _X3valY1T_1=_X3valY1T_1@entry=0x5555557a00b4, _X12_constructorFv_Y1T__1=<optimized out>, _X16_operator_assignFY1T_Y1TY1T__1=<optimized out>, _adapterFY1T_PY1TY1T_P_MP=<optimized out>, _X11_destructorFv_Y1T__1=<optimized out>, _X12_constructorFv_Y1TY1T__1=<optimized out>, _alignof_Y1T=4, _sizeof_Y1T=4) at /var/lib/jenkins/workspace/Cforall_master/libcfa/src/concurrency/future.hfa:200
23:02:21#18 0x0000555555558c39 in _X4mainFv_S6Server__1 (__anonymous_object2711=__anonymous_object2711@entry=0x7fffffffdad0) at concurrency/waituntil/futures.cfa:11
23:02:21#19 0x00007ffff7f90a9f in __cfactx_invoke_thread (main=0x555555558bc0 <_X4mainFv_S6Server__1>, this=0x7fffffffdad0) at /var/lib/jenkins/workspace/Cforall_master/libcfa/src/concurrency/invoke.c:87
23:02:21#20 0x0000000000000000 in ?? ()
23:02:21-----
23:02:21 Id Target Id Frame
23:02:21* 1 Thread 0x55555562e780 (LWP 622576) __pthread_kill_implementation (no_tid=0, signo=6, threadid=<optimized out>) at ./nptl/pthread_kill.c:44
23:02:21 2 Thread 0x5555555ae5c0 (LWP 622575) 0x00007ffff7a45fc8 in __GI___sigtimedwait (set=set@entry=0x5555555adb80, info=info@entry=0x5555555adc00, timeout=timeout@entry=0x0) at ../sysdeps/unix/sysv/linux/sigtimedwait.c:31
23:02:21 3 Thread 0x7ffff7d60840 (LWP 622574) 0x00007ffff7b1bbca in __GI___libc_read (nbytes=8, buf=0x5555555ef7e8, fd=3) at ../sysdeps/unix/sysv/linux/read.c:26
23:02:2123:02:21Archiving concurrency/waituntil/futures (executable and core) to crashes/full-nodebug/concurrency/waituntil/futures
23:02:21 coroutine/prodcons PASSED C 0:09.695 - R 0:00.035
23:02:21 ctrl-flow/fallthrough PASSED C 0:06.279 - R 0:00.011
23:02:21 enum PASSED C 0:01.106 - R 0:00.008
23:02:21 ctrl-flow/goto PASSED C 0:06.536 - R 0:00.019
23:02:21 ctrl-flow/ifwhileCtl PASSED C 0:06.372 - R 0:00.009
23:02:21 designations PASSED C 0:02.792 - R 0:00.005
23:02:21 enum_tests/lvalue PASSED C 0:00.509 - R n/a
23:02:21 enum_tests/inc-dec PASSED C 0:01.264 - R 0:00.020
23:02:21 enum_tests/funcEnum PASSED C 0:02.254 - R 0:00.006
23:02:21 ctrl-flow/loop_else PASSED C 0:05.874 - R 0:00.009
23:02:21 concurrency/waituntil/all_types PASSED C 0:31.497 - R 0:01.119
23:02:21 ...ency/unified_locking/futex_mutex PASSED C 0:12.358 - R 0:38.299
23:02:21 enum_tests/structEnum PASSED C 0:02.427 - R 0:00.007
23:02:21 enum_tests/anonymous PASSED C 0:06.328 - R 0:00.006
23:02:21 errors/declaration PASSED C 0:00.149 - R n/a
23:02:21 ctrl-flow/loop_else-WRN1 PASSED C 0:07.862 - R 0:00.001
23:02:21 errors/signature PASSED C 0:00.205 - R n/a
23:02:21 errors/scope-type PASSED C 0:00.293 - R n/a
23:02:21 ctrl-flow/loopctrl PASSED C 0:08.212 - R 0:00.020
23:02:21 errors/scope PASSED C 0:00.706 - R n/a
23:02:21 enum_tests/enumInlineValue PASSED C 0:07.111 - R 0:00.012
23:02:21 div PASSED C 0:08.260 - R 0:00.012
23:02:21 enum_tests/input PASSED C 0:06.098 - R 0:00.019
23:02:21 eval PASSED C 0:01.315 - R 0:00.023
23:02:21 enum_tests/stringEnum PASSED C 0:05.711 - R 0:00.009
23:02:21 device/cpu PASSED C 0:10.455 - R 0:00.007
23:02:21 enum_tests/planet PASSED C 0:07.982 - R 0:00.011
23:02:21 enum_tests/typedIntEnum PASSED C 0:06.512 - R 0:00.012
23:02:21 enum_tests/position PASSED C 0:08.524 - R 0:00.019
23:02:21 enum_tests/voidEnum PASSED C 0:06.478 - R 0:00.011
23:02:21 exceptions/conditional PASSED C 0:06.053 - R 0:00.004
23:02:21 exceptions/data-except PASSED C 0:06.061 - R 0:00.005
23:02:21 exceptions/cancel/coroutine PASSED C 0:07.301 - R 0:00.006
23:02:21 exceptions/message PASSED C 0:02.647 - R 0:00.019
23:02:21 exceptions/conditional-threads PASSED C 0:07.433 - R 0:00.006
23:02:21 exceptions/defaults PASSED C 0:06.634 - R 0:00.014
23:02:21 exceptions/finally PASSED C 0:05.985 - R 0:00.005
23:02:21 exceptions/defaults-threads PASSED C 0:07.543 - R 0:00.006
23:02:21 exceptions/try-ctrl-flow PASSED C 0:00.403 - R n/a
23:02:21 exceptions/interact PASSED C 0:06.420 - R 0:00.019
23:02:21 exceptions/try-leave-catch PASSED C 0:01.219 - R 0:00.029
23:02:21 exceptions/cor_resumer PASSED C 0:10.713 - R 0:00.008
23:02:21 exceptions/type-check PASSED C 0:00.466 - R n/a
23:02:21 exceptions/fibonacci_nonlocal PASSED C 0:08.838 - R 0:00.014
23:02:21 exceptions/cancel/thread PASSED C 0:11.607 - R 0:00.007
23:02:21 exceptions/finally-threads PASSED C 0:08.058 - R 0:00.008
23:02:21 expression PASSED C 0:01.289 - R 0:00.022
23:02:21 exceptions/polymorphic PASSED C 0:06.052 - R 0:00.005
23:02:21 exceptions/resume PASSED C 0:06.366 - R 0:00.007
23:02:21 concurrency/waituntil/repeat_close PASSED C 0:13.504 - R 0:30.064
23:02:21 exceptions/terminate PASSED C 0:06.926 - R 0:00.017
23:02:21 exceptions/trash PASSED C 0:06.018 - R 0:00.007
23:02:21 exceptions/terminate-threads PASSED C 0:07.915 - R 0:00.036
23:02:21 ...urrency/unified_locking/mcs_spin PASSED C 0:12.550 - R 0:50.017
23:02:21 exceptions/resume-threads PASSED C 0:08.395 - R 0:00.007
23:02:21 global-monomorph PASSED C 0:01.184 - R 0:00.005
23:02:21 identFuncDeclarator PASSED C 0:01.226 - R 0:00.005
23:02:21 identParamDeclarator PASSED C 0:01.137 - R 0:00.015
23:02:21 .../unified_locking/spin_queue_lock PASSED C 0:12.646 - R 0:51.194
23:02:21 exceptions/pingpong_nonlocal PASSED C 0:11.114 - R 0:00.010
23:02:21 exceptions/virtual-poly PASSED C 0:06.399 - R 0:00.005
23:02:21 fstream_test PASSED C 0:06.114 - R 0:00.007
23:02:21 forall PASSED C 0:07.157 - R 0:00.007
23:02:21 generator/fibonacci PASSED C 0:05.986 - R 0:00.007
23:02:21 generator/fmtLines PASSED C 0:05.840 - R 0:00.007
23:02:21 init1 PASSED C 0:01.083 - R 0:00.006
23:02:21 init1-ERROR PASSED C 0:00.587 - R n/a
23:02:21 include/vector-sequence PASSED C 0:01.654 - R 0:00.007
23:02:21 exceptions/virtual-cast PASSED C 0:08.395 - R 0:00.007
23:02:21 generator/suspend_then PASSED C 0:06.167 - R 0:00.006
23:02:21 include/vector-collections PASSED C 0:02.716 - R 0:00.006
23:02:21 genericUnion PASSED C 0:06.601 - R 0:00.005
23:02:21 function-operator PASSED C 0:09.220 - R 0:00.006
23:02:21 hello PASSED C 0:06.016 - R 0:00.005
23:02:21 identity PASSED C 0:06.117 - R 0:00.005
23:02:21 include/vector-fstream PASSED C 0:05.887 - R 0:00.005
23:02:21 include/stdincludes PASSED C 0:07.802 - R 0:00.024
23:02:21 io/eofType PASSED C 0:06.101 - R 0:00.005
23:02:21 limits PASSED C 0:01.655 - R 0:00.019
23:02:21 io/io PASSED C 0:09.545 - R 0:00.019
23:02:21 linking/exception-nothreads PASSED C 0:04.560 - R 0:00.019
23:02:21 io/io-acquire-in PASSED C 0:10.981 - R 0:00.218
23:02:21 io/io-acquire PASSED C 0:11.959 - R 0:00.319
23:02:21 io/manipulatorsInput-uchunk PASSED C 0:09.889 - R 0:00.035
23:02:21 heap PASSED C 0:08.201 - R 0:08.242
23:02:21 linking/nostdlib PASSED C 0:01.137 - R 0:00.010
23:02:21 io/away_fair PASSED C 0:13.415 - R 0:00.019
23:02:21 io/io-acquire-out PASSED C 0:11.917 - R 0:00.519
23:02:21 linking/exception-withthreads PASSED C 0:06.298 - R 0:00.041
23:02:21 io/io-acquire2 PASSED C 0:11.326 - R 0:00.020
23:02:21 io/io-acquire-no-io PASSED C 0:10.794 - R 0:02.121
23:02:21 linkonce PASSED C 0:01.222 - R 0:00.006
23:02:21 io/comp_fair PASSED C 0:15.289 - R 0:00.118
23:02:21 maybe PASSED C 0:01.384 - R 0:00.007
23:02:21 linking/mangling/anon PASSED C 0:06.079 - R 0:00.006
23:02:21 io/comp_basic PASSED C 0:17.059 - R 0:00.299
23:02:21 nested-types-ERR1 PASSED C 0:00.119 - R n/a
23:02:21 nested-types-ERR2 PASSED C 0:00.190 - R n/a
23:02:21 io/many_read PASSED C 0:13.516 - R 0:00.014
23:02:21 linking/io-acquire PASSED C 0:08.096 - R 0:00.014
23:02:21 nested-types PASSED C 0:01.127 - R 0:00.007
23:02:21 nowarn/array PASSED C 0:01.256 - R 0:00.008
23:02:21 io/manipulatorsOutput4 PASSED C 0:15.874 - R 0:00.012
23:02:21 nowarn/exception PASSED C 0:01.233 - R 0:00.007
23:02:21 nowarn/no-autogen PASSED C 0:01.106 - R 0:00.005
23:02:21 list/dlist-insert-remove PASSED C 0:06.153 - R 0:00.006
23:02:21 opt-params PASSED C 0:00.081 - R n/a
23:02:21 nowarn/printf-sizeof PASSED C 0:01.329 - R 0:00.005
23:02:21 list/dlist2-insert-remove PASSED C 0:06.140 - R 0:00.007
23:02:21 nowarn/unused PASSED C 0:01.158 - R 0:00.007
23:02:21 nowarn/zero-thunk PASSED C 0:01.100 - R 0:00.007
23:02:21 literals PASSED C 0:06.141 - R 0:00.006
23:02:21 numericConstants PASSED C 0:01.128 - R 0:00.006
23:02:21 operators PASSED C 0:01.132 - R 0:00.005
23:02:21 meta/fork+exec PASSED C 0:04.946 - R 0:00.036
23:02:21 linking/nothreads PASSED C 0:07.726 - R 0:00.005
23:02:21 linking/weakso_nothd PASSED C 0:07.724 - R 0:00.008
23:02:21 polybits PASSED C 0:00.235 - R n/a
23:02:21 poly-bare-assn PASSED C 0:01.108 - R 0:00.005
23:02:21 poly-d-cycle PASSED C 0:01.168 - R 0:00.007
23:02:21 poly-many-arsz PASSED C 0:01.149 - R 0:00.005
23:02:21 poly-member PASSED C 0:01.152 - R 0:00.005
23:02:21 poly-selection PASSED C 0:01.139 - R 0:00.007
23:02:21 poly-o-cycle PASSED C 0:01.189 - R 0:00.005
23:02:21 raii/ctor-autogen-ERR1 PASSED C 0:00.681 - R n/a
23:02:21 include/includes PASSED C 0:23.428 - R 0:00.005
23:02:21 poly-self-cycle PASSED C 0:01.245 - R 0:00.005
23:02:21 quasiKeyword PASSED C 0:01.255 - R 0:00.006
23:02:21 raii/ctor-autogen PASSED C 0:01.623 - R 0:00.006
23:02:21 meta/dumpable PASSED C 0:08.285 - R 0:00.007
23:02:21 raii/init_once PASSED C 0:01.382 - R 0:00.006
23:02:21 raii/partial-ERR1 PASSED C 0:00.634 - R n/a
23:02:21 raii/partial PASSED C 0:01.148 - R 0:00.006
23:02:21 linking/withthreads PASSED C 0:10.797 - R 0:00.006
23:02:21 raii/typeof-member PASSED C 0:01.016 - R 0:00.005
23:02:21 malloc PASSED C 0:09.754 - R 0:00.005
23:02:21 result PASSED C 0:01.572 - R 0:00.008
23:02:21 simpleGenericTriple PASSED C 0:01.483 - R 0:00.006
23:02:21 raii/memberCtors-ERR1 PASSED C 0:03.756 - R n/a
23:02:21 raii/dtor-early-exit-ERR1 PASSED C 0:04.432 - R n/a
23:02:21 raii/dtor-early-exit-ERR2 PASSED C 0:04.452 - R n/a
23:02:21 quotedKeyword PASSED C 0:05.763 - R 0:00.006
23:02:21 raii/boxed-types PASSED C 0:05.868 - R 0:00.007
23:02:21 minmax PASSED C 0:11.108 - R 0:00.006
23:02:21 polymorphism PASSED C 0:06.165 - R 0:00.007
23:02:21 smart-pointers PASSED C 0:01.413 - R 0:00.006
23:02:21 raii/globals PASSED C 0:05.908 - R 0:00.006
23:02:21 switch PASSED C 0:01.117 - R 0:00.005
23:02:21 raii/memberCtors PASSED C 0:06.135 - R 0:00.007
23:02:21 tuple/tupleCast PASSED C 0:01.110 - R 0:00.005
23:02:21 tuple/tupleFunction PASSED C 0:01.197 - R 0:00.006
23:02:21 tuple/tupleMember PASSED C 0:01.148 - R 0:00.006
23:02:21 typedefRedef-ERR1 PASSED C 0:00.112 - R n/a
23:02:21 tuple/tuplePolymorphism PASSED C 0:01.501 - R 0:00.006
23:02:21 typedefRedef PASSED C 0:01.080 - R 0:00.005
23:02:21 references PASSED C 0:06.210 - R 0:00.005
23:02:21 var-assert PASSED C 0:00.143 - R n/a
23:02:21 raii/dtor-early-exit PASSED C 0:08.531 - R 0:00.006
23:02:21 typeof PASSED C 0:01.046 - R 0:00.007
23:02:21 shortCircuit PASSED C 0:05.951 - R 0:00.005
23:02:21 variableDeclarator PASSED C 0:01.080 - R 0:00.005
23:02:21 sizeof PASSED C 0:05.731 - R 0:00.005
23:02:21 strstream PASSED C 0:06.264 - R 0:00.005
23:02:21 searchsort PASSED C 0:08.398 - R 0:00.006
23:02:21 tuple/tupleVariadic PASSED C 0:04.724 - R 0:00.005
23:02:21 tuple/tupleAssign PASSED C 0:06.571 - R 0:00.006
23:02:21 tuplearray PASSED C 0:05.820 - R 0:00.009
23:02:21 sum PASSED C 0:08.356 - R 0:00.005
23:02:21 time PASSED C 0:07.733 - R 0:00.007
23:02:21 voidPtr PASSED C 0:01.095 - R 0:00.007
23:02:21 withconflict PASSED C 0:00.529 - R n/a
23:02:21 warnings/self-assignment PASSED C 0:01.029 - R 0:00.001
23:02:21 swap PASSED C 0:08.941 - R 0:00.006
23:02:21 KRfunctions PASSED C 0:00.982 - R 0:00.001
23:02:21 userLiterals PASSED C 0:06.706 - R 0:00.006
23:02:21 vector PASSED C 0:07.108 - R 0:00.006
23:02:21 ...collections/dimexpr-match-c-ERRS PASSED C 0:00.722 - R n/a
23:02:21 zero_one-ERR1 PASSED C 0:03.225 - R n/a
23:02:21 arithmeticConversions PASSED C 0:02.560 - R 0:00.006
23:02:21 ...llections/dimexpr-match-cfa-ERRS PASSED C 0:01.309 - R n/a
23:02:21 vector_math/vec2_double PASSED C 0:08.918 - R 0:00.007
23:02:21 vector_math/vec2_uint PASSED C 0:09.000 - R 0:00.006
23:02:21 attributes PASSED C 0:01.230 - R 0:00.001
23:02:21 zero_one PASSED C 0:05.860 - R 0:00.006
23:02:21 abs PASSED C 0:08.011 - R 0:00.007
23:02:21 declarationSpecifier PASSED C 0:01.030 - R 0:00.001
23:02:21 errors/completeType PASSED C 0:00.604 - R n/a
23:02:21 ...collections/array-md-sbscr-cases PASSED C 0:09.987 - R 0:00.008
23:02:21 ato PASSED C 0:08.843 - R 0:00.007
23:02:21 vector_math/vec3_int PASSED C 0:16.373 - R 0:00.007
23:02:21 vector_math/vec2_float PASSED C 0:18.672 - R 0:00.006
23:02:21 extension PASSED C 0:00.981 - R 0:00.001
23:02:21 configs/parsenums PASSED C 0:09.007 - R 0:00.127
23:02:21 functions PASSED C 0:00.923 - R 0:00.006
23:02:21 vector_math/vec4_int PASSED C 0:17.207 - R 0:00.007
23:02:21 PRNG PASSED C 0:14.879 - R 0:00.384
23:02:21 gccExtensions PASSED C 0:00.955 - R 0:00.008
23:02:21 rational PASSED C 0:27.117 - R 0:00.006
23:02:21 concurrency/pthread/bounded_buffer PASSED C 0:10.726 - R 0:00.050
23:02:21 bitmanip2 PASSED C 0:11.823 - R 0:00.011
23:02:21 meta/arch PASSED C 0:00.590 - R n/a
23:02:21 bitmanip1 PASSED C 0:12.838 - R 0:00.288
23:02:21 bitmanip3 PASSED C 0:12.153 - R 0:00.172
23:02:21 vector_math/vec3_float PASSED C 0:22.308 - R 0:00.010
23:02:21 vector_math/vec2_int PASSED C 0:22.977 - R 0:00.005
23:02:21 vector_math/vec4_float PASSED C 0:21.444 - R 0:00.009
23:02:21 exceptions/cardgame PASSED C 0:10.274 - R 0:00.009
23:02:21 exceptions/hotpotato_checked PASSED C 0:09.867 - R 0:00.010
23:02:21 exceptions/hotpotato PASSED C 0:09.739 - R 0:00.009
23:02:21 io/manipulatorsInput PASSED C 0:07.862 - R 0:00.010
23:02:21 random PASSED C 0:07.963 - R 0:00.005
23:02:21 vector_math/vec2_ldouble PASSED C 0:08.659 - R 0:00.005
23:02:21 gmp PASSED C 0:11.690 - R 0:00.012
23:02:21 nested_function PASSED C 0:10.087 - R 0:00.010
23:02:21 math PASSED C 0:10.945 - R 0:00.005
23:02:21 mathX PASSED C 0:11.686 - R 0:00.010
23:02:21 io/manipulatorsOutput2 PASSED C 0:12.128 - R 0:00.005
23:02:21 io/manipulatorsOutput1 PASSED C 0:22.209 - R 0:00.011
23:02:21 io/manipulatorsOutput3 PASSED C 0:24.324 - R 0:00.011
23:02:21377 passes, 1 failures, 0 timeouts, 0 cancelled, 0 other
23:02:21Tests took 3:39.299
23:02:21make: *** [Makefile:986: all-local] Error 1
23:02:21[Pipeline] }
23:02:21[Pipeline] // dir
23:02:21[Pipeline] }
23:02:21[Pipeline] // stage
23:02:21[Pipeline] echo
23:02:21Archiving core dumps
23:02:21[Pipeline] dir
23:02:21Running in /var/lib/jenkins/workspace/Cforall_master@tmp
23:02:21[Pipeline] {
23:02:21[Pipeline] fileExists
23:02:21[Pipeline] sh
23:02:21+ /var/lib/jenkins/workspace/Cforall_master/tools/jenkins/archive-gen.sh
23:02:21[Pipeline] archiveArtifacts
23:02:21Archiving artifacts
23:02:21Recording fingerprints
23:02:21[Pipeline] }
23:02:21[Pipeline] // dir
23:02:21[Pipeline] }
23:02:21[Pipeline] // wrap
23:02:21[Pipeline] }
23:02:21[Pipeline] // node
23:02:21[Pipeline] echo
23:02:21hudson.AbortException: script returned exit code 2
23:02:21[Pipeline] node
23:02:21Running on Brokk 5 in /var/lib/jenkins/workspace/Cforall_master_2
23:02:21[Pipeline] {
23:02:21[Pipeline] echo
23:02:21Notifying users of result
23:02:21[Pipeline] echo
23:02:21Reusing previously constructed message
23:02:21[Pipeline] echo
23:02:21Would send email to: cforall@lists.uwaterloo.ca
23:02:21[Pipeline] echo
23:02:21With title: [cforall git][BUILD# 3615 - FAILURE] - branch master
23:02:21[Pipeline] echo
23:02:21Content:
23:02:21<p>This is an automated email from the Jenkins build machine. It was
23:02:21generated because of a git hooks/post-receive script following
23:02:21a ref change which was pushed to the C∀ repository.</p>
23:02:2123:02:21<p>- Status --------------------------------------------------------------</p>
23:02:2123:02:21<p>BUILD# 3615 - FAILURE</p>
23:02:21<p>Check console output at https://cforall.uwaterloo.ca/jenkins/job/Cforall/job/master/3615/ to view the results.</p>
23:02:2123:02:21<p>- Changes -------------------------------------------------------------</p>
23:02:2123:02:21<pre>
23:02:21The branch master has been updated.
23:02:21 from 4ff8cb209307cd30c3626d4fbe3cc2d2ce4219ea (commit)
23:02:21</pre>
23:02:2123:02:21<p>- Log -----------------------------------------------------------------</p>
23:02:2123:02:21<pre>
23:02:2123:02:21</pre>
23:02:2123:02:21<p>-----------------------------------------------------------------------</p>
23:02:21<pre>
23:02:21Summary of changes:
23:02:2123:02:21</pre>
23:02:2123:02:21[Pipeline] }
23:02:21[Pipeline] // node
23:02:21[Pipeline] echo
23:02:21Build Completed
23:02:21[Pipeline] End of Pipeline
23:02:21ERROR: script returned exit code 2
23:02:21Finished: FAILURE
[Pipeline] error
[Pipeline] }
23:02:21Failed in branch gcc_9_x64_new
23:02:22Build Cforall » master #3610 completed: SUCCESS
[Pipeline] echo
23:02:22SUCCESS
[Pipeline] }
23:02:41Build Cforall » master #3614 completed: SUCCESS
[Pipeline] echo
23:02:41SUCCESS
[Pipeline] }
23:03:20Build Cforall » master #3613 completed: SUCCESS
[Pipeline] echo
23:03:20SUCCESS
[Pipeline] }
23:04:35Build Cforall » master #3608 completed: SUCCESS
[Pipeline] echo
23:04:35SUCCESS
[Pipeline] }
23:13:13Build Cforall » master #3611 completed: SUCCESS
[Pipeline] echo
23:13:13SUCCESS
[Pipeline] }
23:14:28Build Cforall » master #3607 completed: SUCCESS
[Pipeline] echo
23:14:28SUCCESS
[Pipeline] }
23:28:29Build Cforall » master #3612 completed: SUCCESS
[Pipeline] echo
23:28:29SUCCESS
[Pipeline] }
[Pipeline] // parallel
[Pipeline] }
[Pipeline] // stage
[Pipeline] }
[Pipeline] // wrap
[Pipeline] echo
error caught
[Pipeline] node
Running on Brokk 4 in /var/lib/jenkins/workspace/Cforall_Full_Build
[Pipeline] {
[Pipeline] echo
notifying users
[Pipeline] emailext
Sending email to: cforall@lists.uwaterloo.ca
[Pipeline] }
[Pipeline] // node
[Pipeline] }
[Pipeline] // node
[Pipeline] End of Pipeline
ERROR: FAILURE
Finished: FAILURE