Skip to content

Console Output

Skipping 724 KB.. Full Log
yIAAAAzB+LCAAAAAAAAP9b85aBtbiIQSOjNKU4P0+vIKc0PTOvWK8kMze1uCQxtyC1SC8ExvbLL0llgABGJgYmLwaB3MycnMzi4My85FTXgvzkDB8G3tScxILi1BRfsEwJg4BPVmJZon5OYl66vk9+Xrp1RRGDFNSy5Py84vycVD1nCI1qPENFAZBe6PPZWwHoPj6QKXogU/TApnQ/mXCmX/k+EwOjFwNrWWJOaSrQXAGEIr/S3KTUorY1U2W5pzzohpoGBNwttwF+3rvQ8gAAAA==[Current thread is 1 (Thread 0x7ffff7d61840 (LWP 446590))]
22:59:35 -----
22:59:35 #0  __pthread_kill_implementation (no_tid=0, signo=6, threadid=<optimized out>) at ./nptl/pthread_kill.c:44
22:59:35 #1  __pthread_kill_internal (signo=6, threadid=<optimized out>) at ./nptl/pthread_kill.c:78
22:59:35 #2  __GI___pthread_kill (threadid=<optimized out>, signo=signo@entry=6) at ./nptl/pthread_kill.c:89
22:59:35 #3  0x00007ffff7a4527e in __GI_raise (sig=sig@entry=6) at ../sysdeps/posix/raise.c:26
22:59:35 #4  0x00007ffff7a288ff in __GI_abort () at ./stdlib/abort.c:79
22:59:35 #5  0x00007ffff7f1680f in _X7__abortFv_bPKcY17__builtin_va_list__1 (_X11signalAbortb_1=_X11signalAbortb_1@entry=true, _X3fmtPKc_1=0x7ffff7f29a50 "Application interrupted by signal: %s.\n", _X4argsY17__builtin_va_list_1=_X4argsY17__builtin_va_list_1@entry=0x7ffff7f6cdd0 <stack+61952>) at /var/lib/jenkins/workspace/Cforall_master_2/libcfa/src/interpose.cfa:263
22:59:35 #6  0x00007ffff7f16d3e in _X5abortFv_bPKc__1 (_X11signalAbortb_1=_X11signalAbortb_1@entry=true, _X3fmtPKc_1=_X3fmtPKc_1@entry=0x7ffff7f29a50 "Application interrupted by signal: %s.\n") at /var/lib/jenkins/workspace/Cforall_master_2/libcfa/src/interpose.cfa:301
22:59:35 #7  0x00007ffff7f16d65 in _X15sigHandler_termFv_iPS21__anonymous_siginfo_tPS10ucontext_t__1 (_X3sigi_1=<optimized out>, _X3sfpPS21__anonymous_siginfo_t_1=<optimized out>, _X3cxtPS10ucontext_t_1=<optimized out>) at /var/lib/jenkins/workspace/Cforall_master_2/libcfa/src/interpose.cfa:337
22:59:35 #8  <signal handler called>
22:59:35 #9  __pthread_kill_implementation (no_tid=0, signo=6, threadid=<optimized out>) at ./nptl/pthread_kill.c:44
22:59:35 #10 __pthread_kill_internal (signo=6, threadid=<optimized out>) at ./nptl/pthread_kill.c:78
22:59:35 #11 __GI___pthread_kill (threadid=<optimized out>, signo=signo@entry=6) at ./nptl/pthread_kill.c:89
22:59:35 #12 0x00007ffff7a4527e in __GI_raise (sig=sig@entry=6) at ../sysdeps/posix/raise.c:26
22:59:35 #13 0x00007ffff7a288ff in __GI_abort () at ./stdlib/abort.c:79
22:59:35 #14 0x00007ffff7f168c2 in _X7__abortFv_bPKcY17__builtin_va_list__1 (_X11signalAbortb_1=_X11signalAbortb_1@entry=true, _X3fmtPKc_1=0x7ffff7f29af8 "Null pointer (0p) dereference.\n", _X4argsY17__builtin_va_list_1=_X4argsY17__builtin_va_list_1@entry=0x7ffff7f6d5d0 <stack+64000>) at /var/lib/jenkins/workspace/Cforall_master_2/libcfa/src/interpose.cfa:286
22:59:35 #15 0x00007ffff7f16d3e in _X5abortFv_bPKc__1 (_X11signalAbortb_1=_X11signalAbortb_1@entry=true, _X3fmtPKc_1=_X3fmtPKc_1@entry=0x7ffff7f29af8 "Null pointer (0p) dereference.\n") at /var/lib/jenkins/workspace/Cforall_master_2/libcfa/src/interpose.cfa:301
22:59:35 #16 0x00007ffff7f16e5e in _X15sigHandler_segvFv_iPS21__anonymous_siginfo_tPS10ucontext_t__1 (_X3sigi_1=<optimized out>, _X3sfpPS21__anonymous_siginfo_t_1=<optimized out>, _X3cxtPS10ucontext_t_1=<optimized out>) at /var/lib/jenkins/workspace/Cforall_master_2/libcfa/src/interpose.cfa:308
22:59:35 #17 <signal handler called>
22:59:35 #18 0x00007ffff7f829f9 in _X13__must_unparkFb_PS7thread$__1 (_X4thrdPS7thread$_1=0x281483d16b033) at /var/lib/jenkins/workspace/Cforall_master_2/libcfa/src/concurrency/kernel.cfa:526
22:59:35 #19 _X6unparkFv_PS7thread$M11unpark_hint__1 (_X4thrdPS7thread$_1=0x281483d16b033, _X4hintM11unpark_hint_1=_X4hintM11unpark_hint_1@entry=_X12UNPARK_LOCALKM11unpark_hint_1) at /var/lib/jenkins/workspace/Cforall_master_2/libcfa/src/concurrency/kernel.cfa:559
22:59:35 #20 0x00007ffff7f85339 in _X6unparkFv_PS7thread$__1 (_X4thrdPS7thread$_1=<optimized out>) at /var/lib/jenkins/workspace/Cforall_master_2/libcfa/src/concurrency/kernel/fwd.hfa:106
22:59:35 #21 _X8wake_oneFv_S5dlist_S11select_nodeS5dlink_S11select_node__S11select_node__1 (__anonymous_object2369=0x55555555b1e8 <_X1mS25multiple_acquisition_lock_1+8>, _X6poppedS11select_node_1=<optimized out>) at /var/lib/jenkins/workspace/Cforall_master_2/libcfa/src/concurrency/select.hfa:190
22:59:35 #22 _X8pop_nodeFv_S13blocking_lock__1 (_X4thisS13blocking_lock_1=0x55555555b1e0 <_X1mS25multiple_acquisition_lock_1>) at /var/lib/jenkins/workspace/Cforall_master_2/libcfa/src/concurrency/locks.cfa:124
22:59:35 #23 _X7on_waitFm_S13blocking_lockFv_Pv_Pv__1 (_X4thisS13blocking_lock_1=0x55555555b1e0 <_X1mS25multiple_acquisition_lock_1>, _X5pp_fnFv_Pv__1=0x5555556daf78, _X8pp_datumPv_1=0x5555556daf10) at /var/lib/jenkins/workspace/Cforall_master_2/libcfa/src/concurrency/locks.cfa:172
22:59:35 #24 0x00007ffff7f85b03 in _X23block_and_get_recursionQ1_0_0_3__X9on_notifyFv_BD0PS7thread$__X7on_waitFm_BD0Fv_Pv_Pv__X9on_wakeupFv_BD0m__Fm_S11info_thread_BD0_Fv_Pv_Pv__1 (_X8pp_datumPv_1=0x5555556daf10, _X5pp_fnFv_Pv__1=0x5555556daf78, _X1iS11info_thread_Y1L__1=0x5555556db040, _X9on_wakeupFv_Y1Lm__1=<optimized out>, _X7on_waitFm_Y1LFv_Pv_Pv__1=<optimized out>, _X9on_notifyFv_Y1LPS7thread$__1=<optimized out>) at /var/lib/jenkins/workspace/Cforall_master_2/libcfa/src/concurrency/locks.cfa:387
22:59:35 #25 _X25queue_info_thread_timeoutQ1_0_0_3__X9on_notifyFv_BD0PS7thread$__X7on_waitFm_BD0Fv_Pv_Pv__X9on_wakeupFv_BD0m__Fv_S9cond_lock_BD0_S11info_thread_BD0_S8DurationFv_S12alarm_node_t___1 (_X9on_notifyFv_Y1LPS7thread$__1=<optimized out>, _X7on_waitFm_Y1LFv_Pv_Pv__1=<optimized out>, _X9on_wakeupFv_Y1Lm__1=<optimized out>, _X4thisS9cond_lock_Y1L__1=_X4thisS9cond_lock_Y1L__1@entry=0x55555555b180 <_X3c_mS9cond_lock_S25multiple_acquisition_lock__1>, _X4infoS11info_thread_Y1L__1=_X4infoS11info_thread_Y1L__1@entry=0x5555556db040, _X1tS8Duration_1=_X1tS8Duration_1@entry=..., _X8callbackFv_S12alarm_node_t__1=<optimized out>) at /var/lib/jenkins/workspace/Cforall_master_2/libcfa/src/concurrency/locks.cfa:421
22:59:35 #26 0x00007ffff7f86bcc in _X4waitQ1_0_0_3__X9on_notifyFv_BD0PS7thread$__X7on_waitFm_BD0Fv_Pv_Pv__X9on_wakeupFv_BD0m__Fb_S9cond_lock_BD0_BD0S8Duration__1 (_X9on_notifyFv_Y1LPS7thread$__1=_X9on_notifyFv_Y1LPS7thread$__1@entry=0x555555557820 <_X9on_notifyFv_S25multiple_acquisition_lockPS7thread$__1>, _X7on_waitFm_Y1LFv_Pv_Pv__1=_X7on_waitFm_Y1LFv_Pv_Pv__1@entry=0x555555557810 <_X7on_waitFm_S25multiple_acquisition_lockFv_Pv_Pv__1>, _X9on_wakeupFv_Y1Lm__1=_X9on_wakeupFv_Y1Lm__1@entry=0x555555557800 <_X9on_wakeupFv_S25multiple_acquisition_lockm__1>, _X4thisS9cond_lock_Y1L__1=_X4thisS9cond_lock_Y1L__1@entry=0x55555555b180 <_X3c_mS9cond_lock_S25multiple_acquisition_lock__1>, _X1lY1L_1=_X1lY1L_1@entry=0x55555555b1e0 <_X1mS25multiple_acquisition_lock_1>, _X8durationS8Duration_1=_X8durationS8Duration_1@entry=...) at /var/lib/jenkins/workspace/Cforall_master_2/libcfa/src/time_t.hfa:23
22:59:35 #27 0x0000555555557a7f in _X4mainFv_S2T1__1 (__anonymous_object2393=__anonymous_object2393@entry=0x7fffffffdb00) at concurrency/unified_locking/timeout_lock.cfa:35
22:59:35 #28 0x00007ffff7f8e03f in __cfactx_invoke_thread (main=0x555555557960 <_X4mainFv_S2T1__1>, this=0x7fffffffdb00) at /var/lib/jenkins/workspace/Cforall_master_2/libcfa/src/concurrency/invoke.c:87
22:59:35 #29 0x0000000000000000 in ?? ()
22:59:35 -----
22:59:35   Id   Target Id                          Frame 
22:59:35 * 1    Thread 0x7ffff7d61840 (LWP 446590) __pthread_kill_implementation (no_tid=0, signo=6, threadid=<optimized out>) at ./nptl/pthread_kill.c:44
22:59:35   2    Thread 0x55555562a780 (LWP 446592) 0x00007ffff7b1bd6a in __GI___libc_read (nbytes=8, buf=0x555555629b28, fd=5) at ../sysdeps/unix/sysv/linux/read.c:26
22:59:35   3    Thread 0x555555699ec0 (LWP 446593) 0x00007ffff7b1bd6a in __GI___libc_read (nbytes=8, buf=0x555555699268, fd=6) at ../sysdeps/unix/sysv/linux/read.c:26
22:59:35   4    Thread 0x5555555aa5c0 (LWP 446591) 0x00007ffff7a45fc8 in __GI___sigtimedwait (set=set@entry=0x5555555a9b80, info=info@entry=0x5555555a9c00, timeout=timeout@entry=0x0) at ../sysdeps/unix/sysv/linux/sigtimedwait.c:31
22:59:35 
22:59:35 Archiving concurrency/unified_locking/timeout_lock (executable and core) to crashes/full-nodebug/concurrency/unified_locking/timeout_lock
22:59:35        	concurrency/waitfor/dtor             PASSED     C 0:11.161 - R 0:00.167
22:59:35        	concurrency/waitfor/parse            PASSED     C 0:06.727 - R 0:00.020
22:59:35        	concurrency/preempt2                 PASSED     C 0:12.285 - R 0:20.147
22:59:35        	concurrency/waitfor/else             PASSED     C 0:08.626 - R 0:00.035
22:59:35        	...urrency/waitfor/lexical_priority  PASSED     C 0:11.346 - R 0:00.005
22:59:35        	concurrency/unified_locking/locks    PASSED     C 0:13.407 - R 0:07.387
22:59:35        	concurrency/waitfor/recurse          PASSED     C 0:10.436 - R 0:00.217
22:59:35        	concurrency/waitfor/statment         PASSED     C 0:10.870 - R 0:00.039
22:59:35        	concurrency/waitfor/when             PASSED     C 0:11.450 - R 0:00.118
22:59:35        	concurrency/waituntil/one_chan       PASSED     C 0:11.508 - R 0:00.218
22:59:35        	...ency/waituntil/channel_zero_size  PASSED     C 0:12.755 - R 0:00.516
22:59:35        	const-init                           PASSED     C 0:01.064 - R 0:00.011
22:59:35        	concurrency/waituntil/timeout        PASSED     C 0:06.752 - R 0:03.079
22:59:35        	concurrency/waituntil/channels       PASSED     C 0:12.635 - R 0:01.233
22:59:35        	const-ref                            PASSED     C 0:01.147 - R 0:00.017
22:59:35        	configs/parsebools                   PASSED     C 0:09.301 - R 0:00.069
22:59:35        	concurrency/waituntil/basic_else     PASSED     C 0:16.646 - R 0:00.017
22:59:35        	configs/parseconfig                  PASSED     C 0:09.045 - R 0:00.018
22:59:35        	copyfile                             PASSED     C 0:05.945 - R 0:00.006
22:59:35        	configs/usage                        PASSED     C 0:09.380 - R 0:00.011
22:59:35        	coroutine/fibonacci                  PASSED     C 0:06.763 - R 0:00.009
22:59:35        	coroutine/devicedriver               PASSED     C 0:07.214 - R 0:00.019
22:59:35        	coroutine/fmtLines                   PASSED     C 0:07.034 - R 0:00.013
22:59:35        	coroutine/pingpong                   PASSED     C 0:06.877 - R 0:00.021
22:59:35        	coroutine/raii                       PASSED     C 0:07.867 - R 0:00.021
22:59:35        	ctrl-flow/labelledExit               PASSED     C 0:01.104 - R 0:00.030
22:59:35        	coroutine/prodcons                   PASSED     C 0:09.405 - R 0:00.018
22:59:35        	concurrency/waituntil/channel_close  PASSED     C 0:16.022 - R 0:10.055
22:59:35        	counter                              PASSED     C 0:05.735 - R 0:00.010
22:59:35        	concurrency/waituntil/locks          PASSED     C 0:13.823 - R 0:11.554
22:59:35        	ctrl-flow/loop-inc                   PASSED     C 0:01.094 - R 0:00.010
22:59:35        	coroutine/runningTotal               PASSED     C 0:07.120 - R 0:00.009
22:59:35        	ctrl-flow/break-misc                 PASSED     C 0:05.841 - R 0:00.018
22:59:35        	ctrl-flow/fallthrough                PASSED     C 0:05.858 - R 0:00.005
22:59:35        	ctrl-flow/goto                       PASSED     C 0:05.690 - R 0:00.006
22:59:35        	ctrl-flow/ifwhileCtl                 PASSED     C 0:05.714 - R 0:00.012
22:59:35        	enum                                 PASSED     C 0:01.055 - R 0:00.009
22:59:35        	concurrency/waituntil/futures        PASSED     C 0:27.463 - R 0:00.017
22:59:35        	designations                         PASSED     C 0:02.563 - R 0:00.005
22:59:35        	enum_tests/lvalue                    PASSED     C 0:00.513 - R n/a
22:59:35        	enum_tests/inc-dec                   PASSED     C 0:01.339 - R 0:00.022
22:59:35        	...ency/unified_locking/futex_mutex  PASSED     C 0:12.373 - R 0:34.181
22:59:35        	enum_tests/funcEnum                  PASSED     C 0:02.548 - R 0:00.018
22:59:35        	ctrl-flow/loop_else                  PASSED     C 0:05.993 - R 0:00.010
22:59:35        	ctrl-flow/loop_else-WRN1             PASSED     C 0:06.742 - R 0:00.001
22:59:35        	concurrency/waituntil/all_types      PASSED     C 0:32.673 - R 0:00.770
22:59:35        	errors/declaration                   PASSED     C 0:00.123 - R n/a
22:59:35        	enum_tests/structEnum                PASSED     C 0:02.340 - R 0:00.021
22:59:35        	enum_tests/anonymous                 PASSED     C 0:05.690 - R 0:00.008
22:59:35        	errors/signature                     PASSED     C 0:00.154 - R n/a
22:59:35        	errors/scope-type                    PASSED     C 0:00.260 - R n/a
22:59:35        	errors/scope                         PASSED     C 0:00.578 - R n/a
22:59:35        	ctrl-flow/loopctrl                   PASSED     C 0:08.308 - R 0:00.036
22:59:35        	enum_tests/enumInlineValue           PASSED     C 0:06.727 - R 0:00.007
22:59:35        	eval                                 PASSED     C 0:01.213 - R 0:00.007
22:59:35        	enum_tests/input                     PASSED     C 0:06.480 - R 0:00.019
22:59:35        	div                                  PASSED     C 0:08.004 - R 0:00.019
22:59:35        	enum_tests/stringEnum                PASSED     C 0:06.167 - R 0:00.020
22:59:35        	enum_tests/typedIntEnum              PASSED     C 0:05.743 - R 0:00.009
22:59:35        	enum_tests/planet                    PASSED     C 0:08.037 - R 0:00.010
22:59:35        	device/cpu                           PASSED     C 0:10.926 - R 0:00.010
22:59:35        	enum_tests/position                  PASSED     C 0:08.025 - R 0:00.019
22:59:35        	enum_tests/voidEnum                  PASSED     C 0:05.767 - R 0:00.007
22:59:35        	exceptions/conditional               PASSED     C 0:06.181 - R 0:00.006
22:59:35        	exceptions/cancel/coroutine          PASSED     C 0:07.406 - R 0:00.020
22:59:35        	exceptions/data-except               PASSED     C 0:06.103 - R 0:00.006
22:59:35        	exceptions/message                   PASSED     C 0:02.610 - R 0:00.025
22:59:35        	exceptions/conditional-threads       PASSED     C 0:06.980 - R 0:00.017
22:59:35        	exceptions/defaults                  PASSED     C 0:06.468 - R 0:00.018
22:59:35        	exceptions/defaults-threads          PASSED     C 0:07.552 - R 0:00.010
22:59:35        	exceptions/finally                   PASSED     C 0:06.375 - R 0:00.034
22:59:35        	exceptions/interact                  PASSED     C 0:06.429 - R 0:00.012
22:59:35        	exceptions/try-ctrl-flow             PASSED     C 0:00.344 - R n/a
22:59:35        	exceptions/cancel/thread             PASSED     C 0:10.902 - R 0:00.024
22:59:35        	exceptions/type-check                PASSED     C 0:00.499 - R n/a
22:59:35        	exceptions/cor_resumer               PASSED     C 0:10.534 - R 0:00.011
22:59:35        	exceptions/finally-threads           PASSED     C 0:07.765 - R 0:00.006
22:59:35        	exceptions/try-leave-catch           PASSED     C 0:01.368 - R 0:00.018
22:59:35        	expression                           PASSED     C 0:01.273 - R 0:00.006
22:59:35        	exceptions/polymorphic               PASSED     C 0:06.383 - R 0:00.021
22:59:35        	exceptions/fibonacci_nonlocal        PASSED     C 0:09.842 - R 0:00.019
22:59:35        	exceptions/resume                    PASSED     C 0:06.668 - R 0:00.017
22:59:35        	concurrency/waituntil/repeat_close   PASSED     C 0:13.200 - R 0:30.050
22:59:35        	exceptions/terminate                 PASSED     C 0:06.359 - R 0:00.021
22:59:35        	exceptions/resume-threads            PASSED     C 0:07.784 - R 0:00.007
22:59:35        	global-monomorph                     PASSED     C 0:01.321 - R 0:00.009
22:59:35        	exceptions/terminate-threads         PASSED     C 0:07.703 - R 0:00.010
22:59:35        	exceptions/trash                     PASSED     C 0:06.221 - R 0:00.020
22:59:35        	...urrency/unified_locking/mcs_spin  PASSED     C 0:12.188 - R 0:51.490
22:59:35        	identParamDeclarator                 PASSED     C 0:01.084 - R 0:00.005
22:59:35        	identFuncDeclarator                  PASSED     C 0:01.388 - R 0:00.021
22:59:35        	exceptions/virtual-poly              PASSED     C 0:06.047 - R 0:00.023
22:59:35        	exceptions/pingpong_nonlocal         PASSED     C 0:10.994 - R 0:00.022
22:59:35        	fstream_test                         PASSED     C 0:06.126 - R 0:00.007
22:59:35        	.../unified_locking/spin_queue_lock  PASSED     C 0:13.396 - R 0:51.938
22:59:35        	forall                               PASSED     C 0:07.189 - R 0:00.006
22:59:35        	exceptions/virtual-cast              PASSED     C 0:08.279 - R 0:00.005
22:59:35        	init1-ERROR                          PASSED     C 0:00.571 - R n/a
22:59:35        	init1                                PASSED     C 0:01.089 - R 0:00.007
22:59:35        	generator/fibonacci                  PASSED     C 0:06.126 - R 0:00.005
22:59:35        	generator/suspend_then               PASSED     C 0:05.816 - R 0:00.005
22:59:35        	include/vector-sequence              PASSED     C 0:01.849 - R 0:00.006
22:59:35        	include/vector-collections           PASSED     C 0:02.760 - R 0:00.005
22:59:35        	generator/fmtLines                   PASSED     C 0:06.359 - R 0:00.007
22:59:35        	genericUnion                         PASSED     C 0:06.363 - R 0:00.006
22:59:35        	hello                                PASSED     C 0:06.017 - R 0:00.007
22:59:35        	function-operator                    PASSED     C 0:09.096 - R 0:00.007
22:59:35        	identity                             PASSED     C 0:06.281 - R 0:00.005
22:59:35        	include/vector-fstream               PASSED     C 0:05.854 - R 0:00.005
22:59:35        	include/stdincludes                  PASSED     C 0:07.384 - R 0:00.005
22:59:35        	limits                               PASSED     C 0:01.186 - R 0:00.022
22:59:35        	io/eofType                           PASSED     C 0:06.091 - R 0:00.007
22:59:35        	linking/exception-nothreads          PASSED     C 0:04.419 - R 0:00.017
22:59:35        	io/io                                PASSED     C 0:10.812 - R 0:00.013
22:59:35        	io/io-acquire-in                     PASSED     C 0:11.112 - R 0:00.068
22:59:35        	io/manipulatorsInput-uchunk          PASSED     C 0:09.381 - R 0:00.019
22:59:35        	io/io-acquire                        PASSED     C 0:11.511 - R 0:00.068
22:59:35        	io/io-acquire-out                    PASSED     C 0:11.439 - R 0:00.072
22:59:35        	linking/exception-withthreads        PASSED     C 0:06.273 - R 0:00.007
22:59:35        	heap                                 PASSED     C 0:09.107 - R 0:07.943
22:59:35        	linking/nostdlib                     PASSED     C 0:01.246 - R 0:00.022
22:59:35        	io/io-acquire2                       PASSED     C 0:11.040 - R 0:00.035
22:59:35        	io/away_fair                         PASSED     C 0:13.531 - R 0:00.034
22:59:35        	linkonce                             PASSED     C 0:01.276 - R 0:00.005
22:59:35        	io/comp_basic                        PASSED     C 0:14.606 - R 0:00.619
22:59:35        	maybe                                PASSED     C 0:01.242 - R 0:00.005
22:59:35        	io/io-acquire-no-io                  PASSED     C 0:12.380 - R 0:02.725
22:59:35        	io/comp_fair                         PASSED     C 0:15.610 - R 0:00.118
22:59:35        	io/manipulatorsOutput4               PASSED     C 0:12.946 - R 0:00.018
22:59:35        	nested-types-ERR1                    PASSED     C 0:00.117 - R n/a
22:59:35        	nested-types-ERR2                    PASSED     C 0:00.188 - R n/a
22:59:35        	nested-types                         PASSED     C 0:01.099 - R 0:00.007
22:59:35        	linking/mangling/anon                PASSED     C 0:06.095 - R 0:00.008
22:59:35        	nowarn/array                         PASSED     C 0:01.238 - R 0:00.006
22:59:35        	io/many_read                         PASSED     C 0:13.839 - R 0:00.011
22:59:35        	nowarn/exception                     PASSED     C 0:01.187 - R 0:00.007
22:59:35        	nowarn/no-autogen                    PASSED     C 0:01.007 - R 0:00.006
22:59:35        	list/dlist-insert-remove             PASSED     C 0:05.662 - R 0:00.009
22:59:35        	nowarn/printf-sizeof                 PASSED     C 0:01.260 - R 0:00.008
22:59:35        	opt-params                           PASSED     C 0:00.121 - R n/a
22:59:35        	nowarn/unused                        PASSED     C 0:01.112 - R 0:00.005
22:59:35        	linking/nothreads                    PASSED     C 0:07.539 - R 0:00.027
22:59:35        	nowarn/zero-thunk                    PASSED     C 0:01.089 - R 0:00.005
22:59:35        	numericConstants                     PASSED     C 0:01.093 - R 0:00.008
22:59:35        	linking/io-acquire                   PASSED     C 0:08.666 - R 0:00.013
22:59:35        	operators                            PASSED     C 0:01.135 - R 0:00.012
22:59:35        	literals                             PASSED     C 0:06.765 - R 0:00.005
22:59:35        	poly-bare-assn                       PASSED     C 0:01.033 - R 0:00.006
22:59:35        	list/dlist2-insert-remove            PASSED     C 0:07.235 - R 0:00.006
22:59:35        	linking/weakso_nothd                 PASSED     C 0:08.231 - R 0:00.008
22:59:35        	polybits                             PASSED     C 0:00.223 - R n/a
22:59:35        	poly-d-cycle                         PASSED     C 0:01.085 - R 0:00.007
22:59:35        	poly-many-arsz                       PASSED     C 0:01.075 - R 0:00.006
22:59:35        	poly-member                          PASSED     C 0:01.083 - R 0:00.008
22:59:35        	poly-selection                       PASSED     C 0:01.104 - R 0:00.006
22:59:35        	poly-o-cycle                         PASSED     C 0:01.135 - R 0:00.005
22:59:35        	include/includes                     PASSED     C 0:23.019 - R 0:00.006
22:59:35        	poly-self-cycle                      PASSED     C 0:01.194 - R 0:00.007
22:59:35        	meta/fork+exec                       PASSED     C 0:05.595 - R 0:00.021
22:59:35        	raii/ctor-autogen-ERR1               PASSED     C 0:00.663 - R n/a
22:59:35        	quasiKeyword                         PASSED     C 0:01.228 - R 0:00.005
22:59:35        	raii/ctor-autogen                    PASSED     C 0:01.612 - R 0:00.007
22:59:35        	raii/init_once                       PASSED     C 0:01.368 - R 0:00.005
22:59:35        	raii/partial-ERR1                    PASSED     C 0:00.598 - R n/a
22:59:35        	linking/withthreads                  PASSED     C 0:10.151 - R 0:00.007
22:59:35        	raii/partial                         PASSED     C 0:01.178 - R 0:00.005
22:59:35        	raii/typeof-member                   PASSED     C 0:01.004 - R 0:00.005
22:59:35        	malloc                               PASSED     C 0:10.094 - R 0:00.006
22:59:35        	meta/dumpable                        PASSED     C 0:08.290 - R 0:00.006
22:59:35        	result                               PASSED     C 0:01.639 - R 0:00.007
22:59:35        	raii/memberCtors-ERR1                PASSED     C 0:03.669 - R n/a
22:59:35        	raii/dtor-early-exit-ERR1            PASSED     C 0:04.361 - R n/a
22:59:35        	raii/dtor-early-exit-ERR2            PASSED     C 0:04.388 - R n/a
22:59:35        	simpleGenericTriple                  PASSED     C 0:01.480 - R 0:00.005
22:59:35        	quotedKeyword                        PASSED     C 0:05.817 - R 0:00.006
22:59:35        	raii/boxed-types                     PASSED     C 0:05.826 - R 0:00.007
22:59:35        	polymorphism                         PASSED     C 0:06.112 - R 0:00.005
22:59:35        	smart-pointers                       PASSED     C 0:01.421 - R 0:00.005
22:59:35        	raii/globals                         PASSED     C 0:05.856 - R 0:00.007
22:59:35        	minmax                               PASSED     C 0:10.942 - R 0:00.006
22:59:35        	raii/memberCtors                     PASSED     C 0:06.071 - R 0:00.007
22:59:35        	switch                               PASSED     C 0:01.082 - R 0:00.007
22:59:35        	tuple/tupleCast                      PASSED     C 0:01.078 - R 0:00.005
22:59:35        	tuple/tupleFunction                  PASSED     C 0:01.187 - R 0:00.004
22:59:35        	tuple/tupleMember                    PASSED     C 0:01.140 - R 0:00.005
22:59:35        	typedefRedef-ERR1                    PASSED     C 0:00.115 - R n/a
22:59:35        	raii/dtor-early-exit                 PASSED     C 0:07.922 - R 0:00.007
22:59:35        	tuple/tuplePolymorphism              PASSED     C 0:01.488 - R 0:00.006
22:59:35        	var-assert                           PASSED     C 0:00.138 - R n/a
22:59:35        	references                           PASSED     C 0:06.080 - R 0:00.006
22:59:35        	typedefRedef                         PASSED     C 0:01.047 - R 0:00.005
22:59:35        	typeof                               PASSED     C 0:01.033 - R 0:00.005
22:59:35        	shortCircuit                         PASSED     C 0:05.807 - R 0:00.006
22:59:35        	variableDeclarator                   PASSED     C 0:01.032 - R 0:00.005
22:59:35        	sizeof                               PASSED     C 0:05.671 - R 0:00.007
22:59:35        	strstream                            PASSED     C 0:06.172 - R 0:00.005
22:59:35        	tuple/tupleVariadic                  PASSED     C 0:04.409 - R 0:00.006
22:59:35        	searchsort                           PASSED     C 0:08.396 - R 0:00.005
22:59:35        	tuple/tupleAssign                    PASSED     C 0:06.364 - R 0:00.006
22:59:35        	tuplearray                           PASSED     C 0:05.759 - R 0:00.005
22:59:35        	sum                                  PASSED     C 0:08.321 - R 0:00.007
22:59:35        	voidPtr                              PASSED     C 0:00.947 - R 0:00.006
22:59:35        	swap                                 PASSED     C 0:08.809 - R 0:00.007
22:59:35        	withconflict                         PASSED     C 0:00.561 - R n/a
22:59:35        	time                                 PASSED     C 0:07.823 - R 0:00.007
22:59:35        	warnings/self-assignment             PASSED     C 0:00.988 - R 0:00.001
22:59:35        	KRfunctions                          PASSED     C 0:01.145 - R 0:00.001
22:59:35        	userLiterals                         PASSED     C 0:06.684 - R 0:00.015
22:59:35        	vector                               PASSED     C 0:07.176 - R 0:00.007
22:59:35        	...collections/dimexpr-match-c-ERRS  PASSED     C 0:00.690 - R n/a
22:59:35        	zero_one-ERR1                        PASSED     C 0:03.139 - R n/a
22:59:35        	vector_math/vec2_double              PASSED     C 0:08.317 - R 0:00.007
22:59:35        	arithmeticConversions                PASSED     C 0:02.513 - R 0:00.007
22:59:35        	...llections/dimexpr-match-cfa-ERRS  PASSED     C 0:01.258 - R n/a
22:59:35        	vector_math/vec2_uint                PASSED     C 0:08.323 - R 0:00.006
22:59:35        	attributes                           PASSED     C 0:01.163 - R 0:00.001
22:59:35        	zero_one                             PASSED     C 0:05.966 - R 0:00.005
22:59:35        	abs                                  PASSED     C 0:07.910 - R 0:00.005
22:59:35        	declarationSpecifier                 PASSED     C 0:00.975 - R 0:00.001
22:59:35        	errors/completeType                  PASSED     C 0:00.576 - R n/a
22:59:35        	...collections/array-md-sbscr-cases  PASSED     C 0:09.497 - R 0:00.007
22:59:35        	vector_math/vec2_float               PASSED     C 0:15.839 - R 0:00.006
22:59:35        	vector_math/vec3_int                 PASSED     C 0:14.251 - R 0:00.006
22:59:35        	ato                                  PASSED     C 0:08.710 - R 0:00.007
22:59:35        	vector_math/vec2_int                 PASSED     C 0:16.610 - R 0:00.007
22:59:35        	extension                            PASSED     C 0:01.030 - R 0:00.002
22:59:35        	functions                            PASSED     C 0:00.986 - R 0:00.001
22:59:35        	gccExtensions                        PASSED     C 0:00.988 - R 0:00.002
22:59:35        	vector_math/vec4_int                 PASSED     C 0:15.290 - R 0:00.005
22:59:35        	vector_math/vec3_float               PASSED     C 0:17.288 - R 0:00.007
22:59:35        	vector_math/vec4_float               PASSED     C 0:16.225 - R 0:00.009
22:59:35        	configs/parsenums                    PASSED     C 0:08.919 - R 0:00.066
22:59:35        	concurrency/pthread/bounded_buffer   PASSED     C 0:10.486 - R 0:00.036
22:59:35        	PRNG                                 PASSED     C 0:14.715 - R 0:00.519
22:59:35        	bitmanip1                            PASSED     C 0:11.649 - R 0:00.009
22:59:35        	meta/arch                            PASSED     C 0:00.535 - R n/a
22:59:35        	rational                             PASSED     C 0:26.952 - R 0:00.007
22:59:35        	bitmanip2                            PASSED     C 0:11.638 - R 0:00.017
22:59:35        	bitmanip3                            PASSED     C 0:11.764 - R 0:00.017
22:59:35        	exceptions/cardgame                  PASSED     C 0:09.476 - R 0:00.009
22:59:35        	exceptions/hotpotato_checked         PASSED     C 0:09.749 - R 0:00.009
22:59:35        	exceptions/hotpotato                 PASSED     C 0:09.654 - R 0:00.009
22:59:35        	io/manipulatorsInput                 PASSED     C 0:08.343 - R 0:00.009
22:59:35        	gmp                                  PASSED     C 0:09.643 - R 0:00.009
22:59:35        	random                               PASSED     C 0:07.841 - R 0:00.005
22:59:35        	vector_math/vec2_ldouble             PASSED     C 0:08.201 - R 0:00.005
22:59:35        	io/manipulatorsOutput2               PASSED     C 0:11.652 - R 0:00.005
22:59:35        	nested_function                      PASSED     C 0:09.875 - R 0:00.009
22:59:35        	math                                 PASSED     C 0:11.107 - R 0:00.009
22:59:35        	mathX                                PASSED     C 0:11.867 - R 0:00.019
22:59:35        	io/manipulatorsOutput1               PASSED     C 0:20.973 - R 0:00.011
22:59:35        	io/manipulatorsOutput3               PASSED     C 0:35.781 - R 0:00.010
22:59:35 377 passes, 1 failures, 0 timeouts, 0 cancelled, 0 other
22:59:35 Tests took  3:46.226
22:59:35 make: *** [Makefile:986: all-local] Error 1
22:59:35 [Pipeline] }
22:59:35 [Pipeline] // dir
22:59:35 [Pipeline] }
22:59:35 [Pipeline] // stage
22:59:35 [Pipeline] echo
22:59:35 Archiving core dumps
22:59:35 [Pipeline] dir
22:59:35 Running in /var/lib/jenkins/workspace/Cforall_master_2@tmp
22:59:35 [Pipeline] {
22:59:35 [Pipeline] fileExists
22:59:35 [Pipeline] sh
22:59:35 + /var/lib/jenkins/workspace/Cforall_master_2/tools/jenkins/archive-gen.sh
22:59:35 [Pipeline] archiveArtifacts
22:59:35 Archiving artifacts
22:59:35 Recording fingerprints
22:59:35 [Pipeline] }
22:59:35 [Pipeline] // dir
22:59:35 [Pipeline] }
22:59:35 [Pipeline] // wrap
22:59:35 [Pipeline] }
22:59:35 [Pipeline] // node
22:59:35 [Pipeline] echo
22:59:35 hudson.AbortException: script returned exit code 2
22:59:35 [Pipeline] node
22:59:35 Running on Brokk 5 in /var/lib/jenkins/workspace/Cforall_master_2
22:59:35 [Pipeline] {
22:59:35 [Pipeline] echo
22:59:35 Notifying users of result
22:59:35 [Pipeline] echo
22:59:35 Reusing previously constructed message
22:59:35 [Pipeline] echo
22:59:35 Would send email to: cforall@lists.uwaterloo.ca
22:59:35 [Pipeline] echo
22:59:35 With title: [cforall git][BUILD# 3939 - FAILURE] - branch master
22:59:35 [Pipeline] echo
22:59:35 Content: 
22:59:35 <p>This is an automated email from the Jenkins build machine. It was
22:59:35 generated because of a git hooks/post-receive script following
22:59:35 a ref change which was pushed to the Cāˆ€ repository.</p>
22:59:35 
22:59:35 <p>- Status --------------------------------------------------------------</p>
22:59:35 
22:59:35 <p>BUILD# 3939 - FAILURE</p>
22:59:35 <p>Check console output at https://cforall.uwaterloo.ca/jenkins/job/Cforall/job/master/3939/ to view the results.</p>
22:59:35 
22:59:35 <p>- Changes -------------------------------------------------------------</p>
22:59:35 
22:59:35 <pre>
22:59:35 The branch master has been updated.
22:59:35       from  880968bf0c0545a6330ce6fb2a90567fd5f026cb (commit)
22:59:35 </pre>
22:59:35 
22:59:35 <p>- Log -----------------------------------------------------------------</p>
22:59:35 
22:59:35 <pre>
22:59:35 
22:59:35 </pre>
22:59:35 
22:59:35 <p>-----------------------------------------------------------------------</p>
22:59:35 <pre>
22:59:35 Summary of changes:
22:59:35 
22:59:35 </pre>
22:59:35 
22:59:35 [Pipeline] }
22:59:35 [Pipeline] // node
22:59:35 [Pipeline] echo
22:59:35 Build Completed
22:59:35 [Pipeline] End of Pipeline
22:59:35 ERROR: script returned exit code 2
22:59:35 Finished: FAILURE