23:00:45 device/cpu PASSED C 0:09.892 - R 0:00.035
23:00:45 enum_tests/stringEnum PASSED C 0:05.850 - R 0:00.005
23:00:45 enum_tests/planet PASSED C 0:08.428 - R 0:00.020
23:00:45 enum_tests/typedIntEnum PASSED C 0:05.875 - R 0:00.019
23:00:45 enum_tests/position PASSED C 0:08.278 - R 0:00.018
23:00:45 enum_tests/voidEnum PASSED C 0:06.069 - R 0:00.007
23:00:45 exceptions/data-except PASSED C 0:06.144 - R 0:00.024
23:00:45 exceptions/conditional PASSED C 0:06.745 - R 0:00.006
23:00:45 exceptions/cancel/coroutine PASSED C 0:07.464 - R 0:00.014
23:00:45 exceptions/message PASSED C 0:02.728 - R 0:00.005
23:00:45 exceptions/defaults PASSED C 0:06.898 - R 0:00.009
23:00:45 exceptions/conditional-threads PASSED C 0:07.445 - R 0:00.009
23:00:45 exceptions/defaults-threads PASSED C 0:07.907 - R 0:00.007
23:00:45 exceptions/finally PASSED C 0:06.186 - R 0:00.009
23:00:45 exceptions/try-ctrl-flow PASSED C 0:00.470 - R n/a
23:00:45 exceptions/interact PASSED C 0:06.760 - R 0:00.008
23:00:45 exceptions/finally-threads PASSED C 0:07.240 - R 0:00.007
23:00:45 exceptions/type-check PASSED C 0:00.402 - R n/a
23:00:45 exceptions/cancel/thread PASSED C 0:10.833 - R 0:00.009
23:00:45 exceptions/fibonacci_nonlocal PASSED C 0:09.068 - R 0:00.017
23:00:45 exceptions/try-leave-catch PASSED C 0:01.203 - R 0:00.005
23:00:45 exceptions/cor_resumer PASSED C 0:11.328 - R 0:00.006
23:00:45 expression PASSED C 0:01.361 - R 0:00.019
23:00:45 concurrency/waituntil/repeat_close PASSED C 0:13.457 - R 0:30.062
23:00:45 exceptions/polymorphic PASSED C 0:06.460 - R 0:00.009
23:00:45 exceptions/resume PASSED C 0:06.585 - R 0:00.007
23:00:45 ...urrency/unified_locking/mcs_spin PASSED C 0:13.194 - R 0:49.932
23:00:45 exceptions/terminate PASSED C 0:07.207 - R 0:00.017
23:00:45 exceptions/trash PASSED C 0:06.252 - R 0:00.019
23:00:45 exceptions/resume-threads PASSED C 0:08.006 - R 0:00.038
23:00:45 exceptions/terminate-threads PASSED C 0:07.980 - R 0:00.006
23:00:45 global-monomorph PASSED C 0:01.340 - R 0:00.020
23:00:45 exceptions/virtual-poly PASSED C 0:05.932 - R 0:00.007
23:00:45 identParamDeclarator PASSED C 0:01.051 - R 0:00.022
23:00:45 .../unified_locking/spin_queue_lock PASSED C 0:12.736 - R 0:51.967
23:00:45 identFuncDeclarator PASSED C 0:01.438 - R 0:00.005
23:00:45 fstream_test PASSED C 0:05.947 - R 0:00.006
23:00:45 exceptions/pingpong_nonlocal PASSED C 0:11.237 - R 0:00.008
23:00:45 generator/fibonacci PASSED C 0:05.859 - R 0:00.007
23:00:45 forall PASSED C 0:07.683 - R 0:00.007
23:00:45 init1-ERROR PASSED C 0:00.582 - R n/a
23:00:45 exceptions/virtual-cast PASSED C 0:08.102 - R 0:00.005
23:00:45 include/vector-sequence PASSED C 0:01.679 - R 0:00.006
23:00:45 init1 PASSED C 0:01.101 - R 0:00.006
23:00:45 generator/fmtLines PASSED C 0:06.151 - R 0:00.007
23:00:45 generator/suspend_then PASSED C 0:06.040 - R 0:00.009
23:00:45 include/vector-collections PASSED C 0:02.743 - R 0:00.006
23:00:45 genericUnion PASSED C 0:06.142 - R 0:00.006
23:00:45 function-operator PASSED C 0:09.389 - R 0:00.007
23:00:45 hello PASSED C 0:05.994 - R 0:00.007
23:00:45 identity PASSED C 0:06.272 - R 0:00.007
23:00:45 include/vector-fstream PASSED C 0:06.055 - R 0:00.007
23:00:45 include/stdincludes PASSED C 0:07.578 - R 0:00.020
23:00:45 io/eofType PASSED C 0:06.170 - R 0:00.010
23:00:45 limits PASSED C 0:01.447 - R 0:00.011
23:00:45 io/io PASSED C 0:10.363 - R 0:00.020
23:00:45 linking/exception-nothreads PASSED C 0:04.526 - R 0:00.007
23:00:45 io/io-acquire PASSED C 0:11.890 - R 0:00.067
23:00:45 heap PASSED C 0:08.733 - R 0:07.696
23:00:45 io/io-acquire-in PASSED C 0:12.044 - R 0:00.008
23:00:45 io/manipulatorsInput-uchunk PASSED C 0:10.449 - R 0:00.018
23:00:45 io/io-acquire-out PASSED C 0:11.574 - R 0:00.269
23:00:45 io/away_fair PASSED C 0:13.556 - R 0:00.020
23:00:45 linking/nostdlib PASSED C 0:01.135 - R 0:00.019
23:00:45 linking/exception-withthreads PASSED C 0:06.662 - R 0:00.020
23:00:45 io/io-acquire2 PASSED C 0:12.096 - R 0:00.068
23:00:45 linkonce PASSED C 0:01.447 - R 0:00.009
23:00:45 io/manipulatorsOutput4 PASSED C 0:11.694 - R 0:00.011
23:00:45 io/comp_basic PASSED C 0:15.418 - R 0:00.187
23:00:45 io/io-acquire-no-io PASSED C 0:11.045 - R 0:03.547
23:00:45 io/comp_fair FAILED with code -6 C 0:15.330 - R 0:00.416
23:00:45starting
23:00:45100
23:00:45200
23:00:45300
23:00:45400
23:00:45500
23:00:45600
23:00:45700
23:00:45800
23:00:45900
23:00:451000
23:00:45done
23:00:45Processor (0x7fffffffd9c0) tearing down ring with 4294967295 entries allocated but not submitted, out of 256
23:00:45Cforall Runtime error (UNIX pid:187514):
23:00:45Stack back trace for: /var/lib/jenkins/workspace/Cforall_master_2@tmp/libcfa/x64-nodebug/src/.libs/libcfa.so.1
23:00:45(0) /var/lib/jenkins/workspace/Cforall_master_2@tmp/libcfa/x64-nodebug/src/.libs/libcfa.so.1 : + 0x8e96e [0x7ffff7f1996e]
23:00:45(1) /var/lib/jenkins/workspace/Cforall_master_2@tmp/libcfa/x64-nodebug/src/.libs/libcfa.so.1 : + 0x46c85 [0x7ffff7ed1c85]
23:00:45(2) /var/lib/jenkins/workspace/Cforall_master_2@tmp/libcfa/x64-nodebug/src/.libs/libcfa.so.1 : + 0x3f12f [0x7ffff7eca12f]
23:00:45(3) /var/lib/jenkins/workspace/Cforall_master_2@tmp/libcfa/x64-nodebug/src/.libs/libcfathread.so.1 : + 0x20fc6 [0x7ffff7f92fc6]
23:00:4523:00:45warning: Can't open file anon_inode:[io_uring] which was expanded to anon_inode:[io_uring] during file-backed mapping note processing
23:00:45[New LWP 187519]
23:00:45[New LWP 187518]
23:00:45[New LWP 187514]
23:00:45[Thread debugging using libthread_db enabled]
23:00:45Using host libthread_db library "/lib/x86_64-linux-gnu/libthread_db.so.1".
23:00:45Core was generated by `/var/lib/jenkins/workspace/Cforall_master_2@tmp/tests/io/comp_fair'.
23:00:45Program terminated with signal SIGABRT, Aborted.
23:00:45#0 __pthread_kill_implementation (no_tid=0, signo=6, threadid=<optimized out>) at ./nptl/pthread_kill.c:44
23:00:4523:00:45warning: 44 ./nptl/pthread_kill.c: No such file or directory
23:00:45[Current thread is 1 (Thread 0x55555562b780 (LWP 187519))]
23:00:45-----
23:00:45#0 __pthread_kill_implementation (no_tid=0, signo=6, threadid=<optimized out>) at ./nptl/pthread_kill.c:44
23:00:45#1 __pthread_kill_internal (signo=6, threadid=<optimized out>) at ./nptl/pthread_kill.c:78
23:00:45#2 __GI___pthread_kill (threadid=<optimized out>, signo=signo@entry=6) at ./nptl/pthread_kill.c:89
23:00:45#3 0x00007ffff7a4527e in __GI_raise (sig=sig@entry=6) at ../sysdeps/posix/raise.c:26
23:00:45#4 0x00007ffff7a288ff in __GI_abort () at ./stdlib/abort.c:79
23:00:45#5 0x00007ffff7f1945f in _X7__abortFv_bPKcY17__builtin_va_list__1 (_X11signalAbortb_1=_X11signalAbortb_1@entry=true, _X3fmtPKc_1=0x7ffff7f2da50 "Application interrupted by signal: %s.\n", _X4argsY17__builtin_va_list_1=_X4argsY17__builtin_va_list_1@entry=0x55555562a290) at /var/lib/jenkins/workspace/Cforall_master_2/libcfa/src/interpose.cfa:263
23:00:45#6 0x00007ffff7f1996e in _X5abortFv_bPKc__1 (_X11signalAbortb_1=_X11signalAbortb_1@entry=true, _X3fmtPKc_1=_X3fmtPKc_1@entry=0x7ffff7f2da50 "Application interrupted by signal: %s.\n") at /var/lib/jenkins/workspace/Cforall_master_2/libcfa/src/interpose.cfa:301
23:00:45#7 0x00007ffff7f19995 in _X15sigHandler_termFv_iPS21__anonymous_siginfo_tPS10ucontext_t__1 (_X3sigi_1=<optimized out>, _X3sfpPS21__anonymous_siginfo_t_1=<optimized out>, _X3cxtPS10ucontext_t_1=<optimized out>) at /var/lib/jenkins/workspace/Cforall_master_2/libcfa/src/interpose.cfa:337
23:00:45#8 <signal handler called>
23:00:45#9 __pthread_kill_implementation (no_tid=0, signo=6, threadid=<optimized out>) at ./nptl/pthread_kill.c:44
23:00:45#10 __pthread_kill_internal (signo=6, threadid=<optimized out>) at ./nptl/pthread_kill.c:78
23:00:45#11 __GI___pthread_kill (threadid=<optimized out>, signo=signo@entry=6) at ./nptl/pthread_kill.c:89
23:00:45#12 0x00007ffff7a4527e in __GI_raise (sig=sig@entry=6) at ../sysdeps/posix/raise.c:26
23:00:45#13 0x00007ffff7a288ff in __GI_abort () at ./stdlib/abort.c:79
23:00:45#14 0x00007ffff7f19501 in _X7__abortFv_bPKcY17__builtin_va_list__1 (_X11signalAbortb_1=_X11signalAbortb_1@entry=false, _X3fmtPKc_1=0x7ffff7f2c233 "%s", _X4argsY17__builtin_va_list_1=_X4argsY17__builtin_va_list_1@entry=0x55555562aa80) at /var/lib/jenkins/workspace/Cforall_master_2/libcfa/src/interpose.cfa:286
23:00:45#15 0x00007ffff7f1996e in _X5abortFv_bPKc__1 (_X11signalAbortb_1=_X11signalAbortb_1@entry=false, _X3fmtPKc_1=_X3fmtPKc_1@entry=0x7ffff7f2c233 "%s") at /var/lib/jenkins/workspace/Cforall_master_2/libcfa/src/interpose.cfa:301
23:00:45#16 0x00007ffff7ed1c85 in abort () at /var/lib/jenkins/workspace/Cforall_master_2/libcfa/src/interpose.cfa:176
23:00:45#17 0x00007ffff7eca12f in _X4endsFv_S8ofstream__1 (_X2osS8ofstream_1=0x7ffff7f4f240 <_X9abortFileS8ofstream_1>) at /var/lib/jenkins/workspace/Cforall_master_2/libcfa/src/fstream.cfa:106
23:00:45#18 0x00007ffff7f92fc6 in _X19__io_uring_teardownFv_S11io_context$__1 (_X4thisS11io_context$_1=0x55555585d040) at /var/lib/jenkins/workspace/Cforall_master_2/libcfa/src/concurrency/io/setup.cfa:288
23:00:45#19 0x00007ffff7f93df4 in _X11_destructorFv_S11io_context$__1 (_X4thisS11io_context$_1=<optimized out>) at /var/lib/jenkins/workspace/Cforall_master_2/libcfa/src/concurrency/io/setup.cfa:125
23:00:45#20 _X13__cfa_io_stopFv_PS9processor__1 (_X4procPS9processor_1=_X4procPS9processor_1@entry=0x7fffffffd9c0) at /var/lib/jenkins/workspace/Cforall_master_2/libcfa/src/concurrency/io/setup.cfa:313
23:00:45#21 0x00007ffff7f98359 in _X18__invoke_processorFPv_Pv__1 (_X3argPv_1=0x7fffffffd9c0) at /var/lib/jenkins/workspace/Cforall_master_2/libcfa/src/concurrency/kernel/startup.cfa:406
23:00:45#22 0x00007ffff7a9cb84 in start_thread (arg=<optimized out>) at ./nptl/pthread_create.c:447
23:00:45#23 0x00007ffff7b29ecc in clone3 () at ../sysdeps/unix/sysv/linux/x86_64/clone3.S:78
23:00:45-----
23:00:45 Id Target Id Frame
23:00:45* 1 Thread 0x55555562b780 (LWP 187519) __pthread_kill_implementation (no_tid=0, signo=6, threadid=<optimized out>) at ./nptl/pthread_kill.c:44
23:00:45 2 Thread 0x5555555ab5c0 (LWP 187518) 0x00007ffff7a45fc8 in __GI___sigtimedwait (set=set@entry=0x5555555aab80, info=info@entry=0x5555555aac00, timeout=timeout@entry=0x0) at ../sysdeps/unix/sysv/linux/sigtimedwait.c:31
23:00:45 3 Thread 0x7ffff7d65840 (LWP 187514) 0x00007ffff7a98e51 in __futex_abstimed_wait_common64 (private=128, cancel=true, abstime=0x0, op=265, expected=187519, futex_word=0x55555562ba50) at ./nptl/futex-internal.c:57
23:00:4523:00:45Archiving io/comp_fair (executable and core) to crashes/full-nodebug/io/comp_fair
23:00:45 maybe PASSED C 0:01.724 - R 0:00.005
23:00:45 nested-types-ERR1 PASSED C 0:00.123 - R n/a
23:00:45 nested-types-ERR2 PASSED C 0:00.194 - R n/a
23:00:45 nested-types PASSED C 0:01.145 - R 0:00.006
23:00:45 linking/mangling/anon PASSED C 0:06.658 - R 0:00.005
23:00:45 nowarn/array PASSED C 0:01.229 - R 0:00.007
23:00:45 nowarn/exception PASSED C 0:01.258 - R 0:00.007
23:00:45 nowarn/no-autogen PASSED C 0:01.068 - R 0:00.006
23:00:45 linking/io-acquire PASSED C 0:08.266 - R 0:00.007
23:00:45 nowarn/printf-sizeof PASSED C 0:01.299 - R 0:00.007
23:00:45 io/many_read PASSED C 0:15.147 - R 0:00.010
23:00:45 list/dlist-insert-remove PASSED C 0:06.090 - R 0:00.011
23:00:45 opt-params PASSED C 0:00.084 - R n/a
23:00:45 nowarn/unused PASSED C 0:01.108 - R 0:00.007
23:00:45 nowarn/zero-thunk PASSED C 0:01.118 - R 0:00.005
23:00:45 numericConstants PASSED C 0:01.116 - R 0:00.005
23:00:45 literals PASSED C 0:06.481 - R 0:00.007
23:00:45 operators PASSED C 0:01.114 - R 0:00.006
23:00:45 list/dlist2-insert-remove PASSED C 0:06.670 - R 0:00.007
23:00:45 include/includes PASSED C 0:22.532 - R 0:00.006
23:00:45 linking/nothreads PASSED C 0:07.951 - R 0:00.005
23:00:45 polybits PASSED C 0:00.228 - R n/a
23:00:45 meta/fork+exec PASSED C 0:04.984 - R 0:00.020
23:00:45 poly-bare-assn PASSED C 0:01.112 - R 0:00.016
23:00:45 poly-d-cycle PASSED C 0:01.155 - R 0:00.006
23:00:45 poly-many-arsz PASSED C 0:01.153 - R 0:00.007
23:00:45 poly-member PASSED C 0:01.140 - R 0:00.006
23:00:45 linking/weakso_nothd PASSED C 0:08.552 - R 0:00.005
23:00:45 poly-o-cycle PASSED C 0:01.176 - R 0:00.007
23:00:45 poly-selection PASSED C 0:01.169 - R 0:00.005
23:00:45 raii/ctor-autogen-ERR1 PASSED C 0:00.672 - R n/a
23:00:45 poly-self-cycle PASSED C 0:01.260 - R 0:00.006
23:00:45 quasiKeyword PASSED C 0:01.273 - R 0:00.007
23:00:45 raii/ctor-autogen PASSED C 0:01.686 - R 0:00.006
23:00:45 raii/init_once PASSED C 0:01.463 - R 0:00.005
23:00:45 raii/partial-ERR1 PASSED C 0:00.584 - R n/a
23:00:45 raii/partial PASSED C 0:01.219 - R 0:00.009
23:00:45 linking/withthreads PASSED C 0:10.364 - R 0:00.007
23:00:45 meta/dumpable PASSED C 0:08.307 - R 0:00.007
23:00:45 malloc PASSED C 0:09.261 - R 0:00.005
23:00:45 raii/typeof-member PASSED C 0:01.135 - R 0:00.007
23:00:45 result PASSED C 0:01.701 - R 0:00.005
23:00:45 raii/memberCtors-ERR1 PASSED C 0:03.711 - R n/a
23:00:45 raii/dtor-early-exit-ERR1 PASSED C 0:04.376 - R n/a
23:00:45 raii/dtor-early-exit-ERR2 PASSED C 0:04.395 - R n/a
23:00:45 simpleGenericTriple PASSED C 0:01.612 - R 0:00.005
23:00:45 quotedKeyword PASSED C 0:05.833 - R 0:00.006
23:00:45 raii/boxed-types PASSED C 0:05.930 - R 0:00.007
23:00:45 polymorphism PASSED C 0:06.193 - R 0:00.005
23:00:45 smart-pointers PASSED C 0:01.424 - R 0:00.007
23:00:45 minmax PASSED C 0:11.294 - R 0:00.006
23:00:45 raii/globals PASSED C 0:05.933 - R 0:00.007
23:00:45 switch PASSED C 0:01.119 - R 0:00.006
23:00:45 raii/memberCtors PASSED C 0:06.212 - R 0:00.005
23:00:45 tuple/tupleCast PASSED C 0:01.093 - R 0:00.007
23:00:45 tuple/tupleFunction PASSED C 0:01.238 - R 0:00.007
23:00:45 tuple/tupleMember PASSED C 0:01.173 - R 0:00.006
23:00:45 typedefRedef-ERR1 PASSED C 0:00.118 - R n/a
23:00:45 raii/dtor-early-exit PASSED C 0:08.134 - R 0:00.007
23:00:45 tuple/tuplePolymorphism PASSED C 0:01.529 - R 0:00.007
23:00:45 var-assert PASSED C 0:00.135 - R n/a
23:00:45 typedefRedef PASSED C 0:01.094 - R 0:00.005
23:00:45 references PASSED C 0:06.224 - R 0:00.006
23:00:45 shortCircuit PASSED C 0:05.883 - R 0:00.005
23:00:45 typeof PASSED C 0:01.065 - R 0:00.007
23:00:45 variableDeclarator PASSED C 0:01.072 - R 0:00.006
23:00:45 sizeof PASSED C 0:05.806 - R 0:00.005
23:00:45 strstream PASSED C 0:06.351 - R 0:00.006
23:00:45 tuple/tupleVariadic PASSED C 0:04.496 - R 0:00.006
23:00:45 searchsort PASSED C 0:08.681 - R 0:00.006
23:00:45 tuple/tupleAssign PASSED C 0:06.512 - R 0:00.006
23:00:45 tuplearray PASSED C 0:05.935 - R 0:00.005
23:00:45 sum PASSED C 0:08.444 - R 0:00.006
23:00:45 voidPtr PASSED C 0:01.077 - R 0:00.006
23:00:45 time PASSED C 0:07.912 - R 0:00.006
23:00:45 withconflict PASSED C 0:00.566 - R n/a
23:00:45 warnings/self-assignment PASSED C 0:00.988 - R 0:00.001
23:00:45 swap PASSED C 0:09.165 - R 0:00.006
23:00:45 KRfunctions PASSED C 0:00.986 - R 0:00.001
23:00:45 userLiterals PASSED C 0:06.798 - R 0:00.007
23:00:45 vector PASSED C 0:07.340 - R 0:00.006
23:00:45 ...collections/dimexpr-match-c-ERRS PASSED C 0:00.713 - R n/a
23:00:45 zero_one-ERR1 PASSED C 0:03.189 - R n/a
23:00:45 vector_math/vec2_double PASSED C 0:08.597 - R 0:00.006
23:00:45 arithmeticConversions PASSED C 0:02.587 - R 0:00.007
23:00:45 ...llections/dimexpr-match-cfa-ERRS PASSED C 0:01.280 - R n/a
23:00:45 vector_math/vec2_uint PASSED C 0:08.673 - R 0:00.006
23:00:45 attributes PASSED C 0:01.191 - R 0:00.001
23:00:45 zero_one PASSED C 0:05.945 - R 0:00.005
23:00:45 abs PASSED C 0:08.083 - R 0:00.005
23:00:45 declarationSpecifier PASSED C 0:00.922 - R 0:00.001
23:00:45 errors/completeType PASSED C 0:00.541 - R n/a
23:00:45 ...collections/array-md-sbscr-cases PASSED C 0:10.574 - R 0:00.007
23:00:45 vector_math/vec2_float PASSED C 0:16.991 - R 0:00.012
23:00:45 ato PASSED C 0:08.923 - R 0:00.007
23:00:45 vector_math/vec2_int PASSED C 0:16.985 - R 0:00.006
23:00:45 vector_math/vec3_int PASSED C 0:15.270 - R 0:00.007
23:00:45 extension PASSED C 0:01.050 - R 0:00.001
23:00:45 functions PASSED C 0:00.997 - R 0:00.001
23:00:45 gccExtensions PASSED C 0:00.980 - R 0:00.001
23:00:45 vector_math/vec4_int PASSED C 0:16.226 - R 0:00.011
23:00:45 vector_math/vec3_float PASSED C 0:17.794 - R 0:00.007
23:00:45 configs/parsenums PASSED C 0:08.988 - R 0:00.070
23:00:45 vector_math/vec4_float PASSED C 0:17.233 - R 0:00.006
23:00:45 rational PASSED C 0:26.526 - R 0:00.005
23:00:45 concurrency/pthread/bounded_buffer PASSED C 0:10.786 - R 0:00.068
23:00:45 meta/arch PASSED C 0:00.558 - R n/a
23:00:45 bitmanip1 PASSED C 0:11.820 - R 0:00.012
23:00:45 PRNG PASSED C 0:14.986 - R 0:00.469
23:00:45 bitmanip2 PASSED C 0:11.765 - R 0:00.009
23:00:45 bitmanip3 PASSED C 0:11.954 - R 0:00.017
23:00:45 exceptions/cardgame PASSED C 0:09.640 - R 0:00.009
23:00:45 io/manipulatorsInput PASSED C 0:08.552 - R 0:00.005
23:00:45 exceptions/hotpotato_checked PASSED C 0:09.935 - R 0:00.009
23:00:45 exceptions/hotpotato PASSED C 0:09.867 - R 0:00.009
23:00:45 gmp PASSED C 0:10.086 - R 0:00.009
23:00:45 random PASSED C 0:08.022 - R 0:00.005
23:00:45 vector_math/vec2_ldouble PASSED C 0:09.025 - R 0:00.005
23:00:45 io/manipulatorsOutput2 PASSED C 0:10.667 - R 0:00.005
23:00:45 nested_function PASSED C 0:10.060 - R 0:00.010
23:00:45 math PASSED C 0:11.484 - R 0:00.005
23:00:45 mathX PASSED C 0:11.802 - R 0:00.033
23:00:45 io/manipulatorsOutput1 PASSED C 0:16.381 - R 0:00.011
23:00:45 io/manipulatorsOutput3 PASSED C 0:17.297 - R 0:00.010
23:00:45377 passes, 1 failures, 0 timeouts, 0 cancelled, 0 other
23:00:45Tests took 3:31.206
23:00:45make: *** [Makefile:986: all-local] Error 1
23:00:45[Pipeline] }
23:00:45[Pipeline] // dir
23:00:45[Pipeline] }
23:00:45[Pipeline] // stage
23:00:45[Pipeline] echo
23:00:45Archiving core dumps
23:00:45[Pipeline] dir
23:00:45Running in /var/lib/jenkins/workspace/Cforall_master_2@tmp
23:00:45[Pipeline] {
23:00:45[Pipeline] fileExists
23:00:45[Pipeline] sh
23:00:45+ /var/lib/jenkins/workspace/Cforall_master_2/tools/jenkins/archive-gen.sh
23:00:45[Pipeline] archiveArtifacts
23:00:45Archiving artifacts
23:00:45Recording fingerprints
23:00:45[Pipeline] }
23:00:45[Pipeline] // dir
23:00:45[Pipeline] }
23:00:45[Pipeline] // wrap
23:00:45[Pipeline] }
23:00:45[Pipeline] // node
23:00:45[Pipeline] echo
23:00:45hudson.AbortException: script returned exit code 2
23:00:45[Pipeline] node
23:00:45Running on Brokk 5 in /var/lib/jenkins/workspace/Cforall_master_2
23:00:45[Pipeline] {
23:00:45[Pipeline] echo
23:00:45Notifying users of result
23:00:45[Pipeline] echo
23:00:45Reusing previously constructed message
23:00:45[Pipeline] echo
23:00:45Would send email to: cforall@lists.uwaterloo.ca
23:00:45[Pipeline] echo
23:00:45With title: [cforall git][BUILD# 3885 - FAILURE] - branch master
23:00:45[Pipeline] echo
23:00:45Content:
23:00:45<p>This is an automated email from the Jenkins build machine. It was
23:00:45generated because of a git hooks/post-receive script following
23:00:45a ref change which was pushed to the C∀ repository.</p>
23:00:4523:00:45<p>- Status --------------------------------------------------------------</p>
23:00:4523:00:45<p>BUILD# 3885 - FAILURE</p>
23:00:45<p>Check console output at https://cforall.uwaterloo.ca/jenkins/job/Cforall/job/master/3885/ to view the results.</p>
23:00:4523:00:45<p>- Changes -------------------------------------------------------------</p>
23:00:4523:00:45<pre>
23:00:45The branch master has been updated.
23:00:45 from e2563b2a147d3a25fbf6bfab7e5e5efc06c56824 (commit)
23:00:45</pre>
23:00:4523:00:45<p>- Log -----------------------------------------------------------------</p>
23:00:4523:00:45<pre>
23:00:4523:00:45</pre>
23:00:4523:00:45<p>-----------------------------------------------------------------------</p>
23:00:45<pre>
23:00:45Summary of changes:
23:00:4523:00:45</pre>
23:00:4523:00:45[Pipeline] }
23:00:45[Pipeline] // node
23:00:45[Pipeline] echo
23:00:45Build Completed
23:00:45[Pipeline] End of Pipeline
23:00:45ERROR: script returned exit code 2
23:00:45Finished: FAILURE
[Pipeline] error
[Pipeline] }
23:00:45Failed in branch gcc_12_x64_new
23:01:24Build Cforall » master #3886 completed: SUCCESS
[Pipeline] echo
23:01:24SUCCESS
[Pipeline] }
23:02:18Build Cforall » master #3884 completed: SUCCESS
[Pipeline] echo
23:02:18SUCCESS
[Pipeline] }
23:03:18Build Cforall » master #3883 completed: SUCCESS
[Pipeline] echo
23:03:18SUCCESS
[Pipeline] }
23:05:31Build Cforall » master #3882 completed: SUCCESS
[Pipeline] echo
23:05:31SUCCESS
[Pipeline] }
23:13:57Build Cforall » master #3888 completed: SUCCESS
[Pipeline] echo
23:13:57SUCCESS
[Pipeline] }
23:17:00Build Cforall » master #3887 completed: SUCCESS
[Pipeline] echo
23:17:00SUCCESS
[Pipeline] }
23:30:32Build Cforall » master #3889 completed: SUCCESS
[Pipeline] echo
23:30:32SUCCESS
[Pipeline] }
[Pipeline] // parallel
[Pipeline] }
[Pipeline] // stage
[Pipeline] }
[Pipeline] // wrap
[Pipeline] echo
error caught
[Pipeline] node
Running on Brokk 4 in /var/lib/jenkins/workspace/Cforall_Full_Build
[Pipeline] {
[Pipeline] echo
notifying users
[Pipeline] emailext
Sending email to: cforall@lists.uwaterloo.ca
[Pipeline] }
[Pipeline] // node
[Pipeline] }
[Pipeline] // node
[Pipeline] End of Pipeline
ERROR: FAILURE
Finished: FAILURE