Skip to content
Skipping 1,489 KB.. Full Log
23:01:18        	concurrency/actors/pingpong          PASSED     C 0:18.693 - R 0:00.180
23:01:18        	concurrency/actors/executor          PASSED     C 0:18.759 - R 0:00.133
23:01:18        	copyfile                             PASSED     C 0:06.878 - R 0:00.071
23:01:18        	concurrency/actors/types             PASSED     C 0:19.014 - R 0:00.171
23:01:18        	eval                                 PASSED     C 0:01.480 - R 0:00.037
23:01:18        	concurrency/actors/static            PASSED     C 0:19.348 - R 0:00.326
23:01:18        	enum_tests/structEnum                PASSED     C 0:02.568 - R 0:00.068
23:01:18        	concurrency/actors/matrixMultiply    PASSED     C 0:18.626 - R 0:01.177
23:01:18        	concurrency/waitfor/barge            PASSED     C 0:12.478 - R 0:01.233
23:01:18        	concurrency/readyQ/barrier_sleeper   PASSED     C 0:16.618 - R 0:01.224
23:01:18        	concurrency/actors/inherit           PASSED     C 0:19.914 - R 0:00.072
23:01:18        	concurrency/signal/block             PASSED     C 0:12.554 - R 0:05.251
23:01:18        	...urrency/waitfor/lexical_priority  PASSED     C 0:12.619 - R 0:00.070
23:01:18        	exceptions/try-ctrl-flow             PASSED     C 0:00.603 - R n/a
23:01:18        	ctrl-flow/fallthrough                PASSED     C 0:06.820 - R 0:00.039
23:01:18        	counter                              PASSED     C 0:07.292 - R 0:00.037
23:01:18        	exceptions/type-check                PASSED     C 0:00.745 - R n/a
23:01:18        	ctrl-flow/loop_else                  PASSED     C 0:06.278 - R 0:00.073
23:01:18        	configs/parseconfig                  PASSED     C 0:09.713 - R 0:00.177
23:01:18        	ctrl-flow/goto                       PASSED     C 0:07.159 - R 0:00.039
23:01:18        	...nified_locking/simple_owner_lock  PASSED     C 0:14.599 - R 0:00.424
23:01:18        	...fied_locking/mcs_block_spin_lock  PASSED     C 0:15.113 - R 0:00.172
23:01:18        	ctrl-flow/ifwhileCtl                 PASSED     C 0:07.238 - R 0:00.036
23:01:18        	configs/usage                        PASSED     C 0:09.600 - R 0:00.071
23:01:18        	coroutine/fmtLines                   PASSED     C 0:08.482 - R 0:00.120
23:01:18        	coroutine/devicedriver               PASSED     C 0:08.760 - R 0:00.071
23:01:18        	coroutine/fibonacci                  PASSED     C 0:08.726 - R 0:00.075
23:01:18        	exceptions/try-leave-catch           PASSED     C 0:01.582 - R 0:00.119
23:01:18        	ctrl-flow/break-misc                 PASSED     C 0:08.081 - R 0:00.038
23:01:18        	coroutine/pingpong                   PASSED     C 0:08.877 - R 0:00.071
23:01:18        	exceptions/message                   PASSED     C 0:03.107 - R 0:00.041
23:01:18        	configs/parsebools                   PASSED     C 0:10.745 - R 0:00.224
23:01:18        	enum_tests/anonymous                 PASSED     C 0:06.674 - R 0:00.041
23:01:18        	concurrency/waitfor/statment         PASSED     C 0:13.357 - R 0:00.122
23:01:18        	coroutine/runningTotal               PASSED     C 0:09.046 - R 0:00.070
23:01:18        	...rrency/pthread/pthread_demo_lock  PASSED     C 0:12.045 - R 0:08.416
23:01:18        	global-monomorph                     PASSED     C 0:01.538 - R 0:00.039
23:01:18        	init1-ERROR                          PASSED     C 0:00.790 - R n/a
23:01:18        	concurrency/waituntil/timeout        PASSED     C 0:07.984 - R 0:03.893
23:01:18        	identFuncDeclarator                  PASSED     C 0:01.535 - R 0:00.042
23:01:18        	expression                           PASSED     C 0:02.396 - R 0:00.130
23:01:18        	identParamDeclarator                 PASSED     C 0:01.638 - R 0:00.021
23:01:18        	coroutine/raii                       PASSED     C 0:10.002 - R 0:00.074
23:01:18        	concurrency/waitfor/when             PASSED     C 0:13.674 - R 0:00.523
23:01:18        	ctrl-flow/loop_else-WRN1             PASSED     C 0:08.589 - R 0:00.005
23:01:18        	init1                                PASSED     C 0:01.670 - R 0:00.036
23:01:18        	ctrl-flow/loopctrl                   PASSED     C 0:08.636 - R 0:00.125
23:01:18        	enum_tests/enumInlineValue           PASSED     C 0:07.936 - R 0:00.038
23:01:18        	enum_tests/input                     PASSED     C 0:07.666 - R 0:00.045
23:01:18        	coroutine/prodcons                   PASSED     C 0:11.198 - R 0:00.072
23:01:18        	enum_tests/stringEnum                PASSED     C 0:07.129 - R 0:00.037
23:01:18        	include/vector-sequence              PASSED     C 0:02.598 - R 0:00.039
23:01:18        	enum_tests/voidEnum                  PASSED     C 0:06.656 - R 0:00.042
23:01:18        	concurrency/waitfor/recurse          PASSED     C 0:12.187 - R 0:04.553
23:01:18        	enum_tests/typedIntEnum              PASSED     C 0:07.224 - R 0:00.076
23:01:18        	include/vector-collections           PASSED     C 0:03.208 - R 0:00.127
23:01:18        	limits                               PASSED     C 0:01.704 - R 0:00.037
23:01:18        	exceptions/conditional               PASSED     C 0:07.041 - R 0:00.074
23:01:18        	div                                  PASSED     C 0:10.033 - R 0:00.036
23:01:18        	exceptions/data-except               PASSED     C 0:07.197 - R 0:00.077
23:01:18        	enum_tests/position                  PASSED     C 0:09.028 - R 0:00.076
23:01:18        	device/cpu                           PASSED     C 0:10.821 - R 0:00.224
23:01:18        	exceptions/defaults                  PASSED     C 0:07.735 - R 0:00.041
23:01:18        	exceptions/polymorphic               PASSED     C 0:07.207 - R 0:00.022
23:01:18        	concurrency/channels/daisy_chain     PASSED     C 0:15.984 - R 0:10.061
23:01:18        	linking/nostdlib                     PASSED     C 0:02.055 - R 0:00.129
23:01:18        	linkonce                             PASSED     C 0:01.799 - R 0:00.042
23:01:18        	concurrency/channels/hot_potato      PASSED     C 0:16.060 - R 0:10.121
23:01:18        	nested-types-ERR1                    PASSED     C 0:00.195 - R n/a
23:01:18        	concurrency/waitfor/dtor             PASSED     C 0:12.098 - R 0:07.457
23:01:18        	nested-types-ERR2                    PASSED     C 0:00.280 - R n/a
23:01:18        	exceptions/terminate                 PASSED     C 0:07.286 - R 0:00.039
23:01:18        	concurrency/channels/contend         PASSED     C 0:16.346 - R 0:10.124
23:01:18        	exceptions/trash                     PASSED     C 0:06.973 - R 0:00.126
23:01:18        	exceptions/finally                   PASSED     C 0:08.020 - R 0:00.074
23:01:18        	exceptions/resume                    PASSED     C 0:07.604 - R 0:00.072
23:01:18        	exceptions/conditional-threads       PASSED     C 0:08.549 - R 0:00.038
23:01:18        	opt-params                           PASSED     C 0:00.128 - R n/a
23:01:18        	exceptions/interact                  PASSED     C 0:08.061 - R 0:00.124
23:01:18        	enum_tests/planet                    PASSED     C 0:10.316 - R 0:00.038
23:01:18        	concurrency/channels/zero_size       PASSED     C 0:16.587 - R 0:10.278
23:01:18        	concurrency/channels/ping_pong       PASSED     C 0:16.931 - R 0:10.074
23:01:18        	fstream_test                         PASSED     C 0:06.944 - R 0:00.038
23:01:18        	exceptions/finally-threads           PASSED     C 0:08.638 - R 0:00.073
23:01:18        	maybe                                PASSED     C 0:01.839 - R 0:00.023
23:01:18        	exceptions/virtual-poly              PASSED     C 0:07.087 - R 0:00.126
23:01:18        	polybits                             PASSED     C 0:00.374 - R n/a
23:01:18        	concurrency/channels/pub_sub         PASSED     C 0:17.347 - R 0:10.164
23:01:18        	generator/fibonacci                  PASSED     C 0:07.066 - R 0:00.041
23:01:18        	nested-types                         PASSED     C 0:01.617 - R 0:00.039
23:01:18        	genericUnion                         PASSED     C 0:06.916 - R 0:00.128
23:01:18        	identity                             PASSED     C 0:06.581 - R 0:00.045
23:01:18        	generator/suspend_then               PASSED     C 0:07.033 - R 0:00.073
23:01:18        	linking/exception-nothreads          PASSED     C 0:04.464 - R 0:00.038
23:01:18        	exceptions/resume-threads            PASSED     C 0:08.807 - R 0:00.074
23:01:18        	nowarn/zero-thunk                    PASSED     C 0:01.477 - R 0:00.036
23:01:18        	exceptions/cancel/coroutine          PASSED     C 0:09.920 - R 0:00.069
23:01:18        	numericConstants                     PASSED     C 0:01.474 - R 0:00.042
23:01:18        	nowarn/no-autogen                    PASSED     C 0:01.661 - R 0:00.039
23:01:18        	include/stdincludes                  PASSED     C 0:06.779 - R 0:00.046
23:01:18        	nowarn/unused                        PASSED     C 0:01.614 - R 0:00.037
23:01:18        	hello                                PASSED     C 0:07.112 - R 0:00.037
23:01:18        	operators                            PASSED     C 0:01.506 - R 0:00.037
23:01:18        	nowarn/array                         PASSED     C 0:01.833 - R 0:00.122
23:01:18        	nowarn/printf-sizeof                 PASSED     C 0:01.738 - R 0:00.038
23:01:18        	nowarn/exception                     PASSED     C 0:01.867 - R 0:00.042
23:01:18        	poly-bare-assn                       PASSED     C 0:01.570 - R 0:00.041
23:01:18        	poly-many-arsz                       PASSED     C 0:01.526 - R 0:00.037
23:01:18        	concurrency/channels/churn           PASSED     C 0:18.115 - R 0:10.105
23:01:18        	concurrency/preempt                  PASSED     C 0:13.883 - R 0:13.369
23:01:18        	poly-selection                       PASSED     C 0:01.416 - R 0:00.036
23:01:18        	raii/ctor-autogen-ERR1               PASSED     C 0:00.838 - R n/a
23:01:18        	forall                               PASSED     C 0:08.380 - R 0:00.077
23:01:18        	concurrency/channels/big_elems       PASSED     C 0:16.409 - R 0:12.088
23:01:18        	poly-o-cycle                         PASSED     C 0:01.739 - R 0:00.127
23:01:18        	poly-d-cycle                         PASSED     C 0:01.845 - R 0:00.126
23:01:18        	exceptions/defaults-threads          PASSED     C 0:10.380 - R 0:00.252
23:01:18        	poly-self-cycle                      PASSED     C 0:01.746 - R 0:00.151
23:01:18        	concurrency/waituntil/basic_else     PASSED     C 0:18.911 - R 0:00.360
23:01:18        	include/vector-fstream               PASSED     C 0:07.119 - R 0:00.256
23:01:18        	raii/partial-ERR1                    PASSED     C 0:00.971 - R n/a
23:01:18        	exceptions/virtual-cast              PASSED     C 0:09.023 - R 0:00.169
23:01:18        	typedefRedef-ERR1                    PASSED     C 0:00.242 - R n/a
23:01:18        	poly-member                          PASSED     C 0:02.240 - R 0:00.203
23:01:18        	quasiKeyword                         PASSED     C 0:01.875 - R 0:00.103
23:01:18        	generator/fmtLines                   PASSED     C 0:08.503 - R 0:00.151
23:01:18        	io/eofType                           PASSED     C 0:07.154 - R 0:00.022
23:01:18        	concurrency/futures/future_except    PASSED     C 0:29.288 - R 0:00.069
23:01:18        	exceptions/fibonacci_nonlocal        PASSED     C 0:11.121 - R 0:00.038
23:01:18        	var-assert                           PASSED     C 0:00.256 - R n/a
23:01:18        	raii/typeof-member                   PASSED     C 0:01.555 - R 0:00.040
23:01:18        	exceptions/terminate-threads         PASSED     C 0:10.252 - R 0:00.128
23:01:18        	raii/init_once                       PASSED     C 0:01.744 - R 0:00.118
23:01:18        	raii/partial                         PASSED     C 0:01.709 - R 0:00.021
23:01:18        	raii/ctor-autogen                    PASSED     C 0:02.379 - R 0:00.024
23:01:18        	smart-pointers                       PASSED     C 0:01.733 - R 0:00.039
23:01:18        	exceptions/cancel/thread             PASSED     C 0:11.923 - R 0:00.039
23:01:18        	switch                               PASSED     C 0:01.545 - R 0:00.074
23:01:18        	simpleGenericTriple                  PASSED     C 0:01.873 - R 0:00.024
23:01:18        	result                               PASSED     C 0:02.072 - R 0:00.122
23:01:18        	tuple/tupleFunction                  PASSED     C 0:01.890 - R 0:00.040
23:01:18        	tuple/tupleCast                      PASSED     C 0:01.967 - R 0:00.073
23:01:18        	typedefRedef                         PASSED     C 0:01.630 - R 0:00.076
23:01:18        	function-operator                    PASSED     C 0:10.238 - R 0:00.041
23:01:18        	tuple/tupleMember                    PASSED     C 0:01.948 - R 0:00.075
23:01:18        	withconflict                         PASSED     C 0:00.805 - R n/a
23:01:18        	tuple/tuplePolymorphism              PASSED     C 0:02.184 - R 0:00.043
23:01:18        	typeof                               PASSED     C 0:01.795 - R 0:00.122
23:01:18        	meta/fork+exec                       PASSED     C 0:05.096 - R 0:00.172
23:01:18        	variableDeclarator                   PASSED     C 0:01.781 - R 0:00.041
23:01:18        	exceptions/cor_resumer               PASSED     C 0:12.856 - R 0:00.178
23:01:18        	voidPtr                              PASSED     C 0:01.489 - R 0:00.041
23:01:18        	warnings/self-assignment             PASSED     C 0:01.417 - R 0:00.005
23:01:18        	KRfunctions                          PASSED     C 0:01.370 - R 0:00.002
23:01:18        	linking/mangling/anon                PASSED     C 0:07.598 - R 0:00.043
23:01:18        	literals                             PASSED     C 0:06.817 - R 0:00.074
23:01:18        	...collections/dimexpr-match-c-ERRS  PASSED     C 0:01.042 - R n/a
23:01:18        	linking/exception-withthreads        PASSED     C 0:08.241 - R 0:00.071
23:01:18        	list/dlist-insert-remove             PASSED     C 0:07.475 - R 0:00.070
23:01:18        	exceptions/pingpong_nonlocal         PASSED     C 0:13.243 - R 0:00.072
23:01:18        	errors/completeType                  PASSED     C 0:00.916 - R n/a
23:01:18        	raii/memberCtors-ERR1                PASSED     C 0:04.475 - R n/a
23:01:18        	...llections/dimexpr-match-cfa-ERRS  PASSED     C 0:01.681 - R n/a
23:01:18        	attributes                           PASSED     C 0:01.662 - R 0:00.003
23:01:18        	io/manipulatorsOutput4               PASSED     C 0:09.689 - R 0:00.120
23:01:18        	declarationSpecifier                 PASSED     C 0:01.540 - R 0:00.002
23:01:18        	...rrency/examples/boundedBufferINT  PASSED     C 0:12.309 - R 0:20.413
23:01:18        	raii/dtor-early-exit-ERR2            PASSED     C 0:05.220 - R n/a
23:01:18        	extension                            PASSED     C 0:01.377 - R 0:00.005
23:01:18        	io/manipulatorsInput-uchunk          PASSED     C 0:10.225 - R 0:00.223
23:01:18        	functions                            PASSED     C 0:01.490 - R 0:00.002
23:01:18        	list/dlist2-insert-remove            PASSED     C 0:08.446 - R 0:00.225
23:01:18        	linking/weakso_nothd                 PASSED     C 0:09.091 - R 0:00.024
23:01:18        	io/io                                PASSED     C 0:11.098 - R 0:00.041
23:01:18        	gccExtensions                        PASSED     C 0:01.399 - R 0:00.002
23:01:18        	linking/io-acquire                   PASSED     C 0:09.601 - R 0:00.024
23:01:18        	arithmeticConversions                PASSED     C 0:02.859 - R 0:00.039
23:01:18        	raii/dtor-early-exit-ERR1            PASSED     C 0:05.884 - R n/a
23:01:18        	concurrency/waituntil/one_chan       PASSED     C 0:12.876 - R 0:10.262
23:01:18        	meta/arch                            PASSED     C 0:00.976 - R n/a
23:01:18        	collections/atomic_mpsc              PASSED     C 0:12.535 - R 0:21.225
23:01:18        	tuple/tupleVariadic                  PASSED     C 0:05.120 - R 0:00.024
23:01:18        	polymorphism                         PASSED     C 0:06.930 - R 0:00.023
23:01:18        	zero_one-ERR1                        PASSED     C 0:04.399 - R n/a
23:01:18        	linking/nothreads                    PASSED     C 0:10.386 - R 0:00.027
23:01:18        	meta/dumpable                        PASSED     C 0:09.049 - R 0:00.022
23:01:18        	raii/globals                         PASSED     C 0:06.818 - R 0:00.038
23:01:18        	raii/boxed-types                     PASSED     C 0:07.486 - R 0:00.021
23:01:18        	raii/memberCtors                     PASSED     C 0:07.091 - R 0:00.021
23:01:18        	quotedKeyword                        PASSED     C 0:07.779 - R 0:00.022
23:01:18        	shortCircuit                         PASSED     C 0:06.906 - R 0:00.037
23:01:18        	malloc                               PASSED     C 0:09.842 - R 0:00.039
23:01:18        	references                           PASSED     C 0:07.059 - R 0:00.037
23:01:18        	concurrency/preempt2                 PASSED     C 0:12.426 - R 0:21.632
23:01:18        	strstream                            PASSED     C 0:07.054 - R 0:00.037
23:01:18        	tuplearray                           PASSED     C 0:06.802 - R 0:00.019
23:01:18        	tuple/tupleAssign                    PASSED     C 0:07.361 - R 0:00.037
23:01:18        	sizeof                               PASSED     C 0:07.745 - R 0:00.023
23:01:18        	io/io-acquire                        PASSED     C 0:13.331 - R 0:00.218
23:01:18        	userLiterals                         PASSED     C 0:07.062 - R 0:00.021
23:01:18        	raii/dtor-early-exit                 PASSED     C 0:08.813 - R 0:00.038
23:01:18        	linking/withthreads                  PASSED     C 0:12.107 - R 0:00.120
23:01:18        	io/io-acquire-in                     PASSED     C 0:13.918 - R 0:00.221
23:01:18        	concurrency/waituntil/channel_close  PASSED     C 0:16.915 - R 0:10.120
23:01:18        	time                                 PASSED     C 0:08.710 - R 0:00.036
23:01:18        	io/io-acquire2                       PASSED     C 0:14.464 - R 0:00.269
23:01:18        	searchsort                           PASSED     C 0:09.228 - R 0:00.036
23:01:18        	sum                                  PASSED     C 0:09.457 - R 0:00.019
23:01:18        	io/io-acquire-out                    PASSED     C 0:15.007 - R 0:00.169
23:01:18        	vector                               PASSED     C 0:08.502 - R 0:00.039
23:01:18        	swap                                 PASSED     C 0:09.496 - R 0:00.038
23:01:18        	concurrency/actors/dynamic           PASSED     C 0:18.230 - R 0:19.813
23:01:18        	minmax                               PASSED     C 0:12.101 - R 0:00.035
23:01:18        	zero_one                             PASSED     C 0:08.349 - R 0:00.019
23:01:18        	io/many_read                         PASSED     C 0:15.562 - R 0:00.035
23:01:18        	concurrency/waituntil/futures        PASSED     C 0:28.879 - R 0:00.035
23:01:18        	vector_math/vec2_double              PASSED     C 0:09.720 - R 0:00.020
23:01:18        	io/comp_fair                         PASSED     C 0:16.586 - R 0:00.520
23:01:18        	vector_math/vec2_uint                PASSED     C 0:09.865 - R 0:00.036
23:01:18        	abs                                  PASSED     C 0:08.901 - R 0:00.036
23:01:18        	...collections/array-md-sbscr-cases  PASSED     C 0:08.812 - R 0:00.037
23:01:18        	io/away_fair                         PASSED     C 0:17.892 - R 0:00.320
23:01:18        	ato                                  PASSED     C 0:09.718 - R 0:00.035
23:01:18        	io/manipulatorsInput                 PASSED     C 0:08.450 - R 0:00.035
23:01:18        	gmp                                  PASSED     C 0:08.577 - R 0:00.036
23:01:18        	random                               PASSED     C 0:08.576 - R 0:00.020
23:01:18        	...rrency/examples/boundedBufferEXT  PASSED     C 0:12.777 - R 0:28.753
23:01:18        	io/comp_basic                        PASSED     C 0:19.495 - R 0:00.268
23:01:18        	exceptions/cardgame                  PASSED     C 0:10.449 - R 0:00.068
23:01:18        	exceptions/hotpotato_checked         PASSED     C 0:10.486 - R 0:00.067
23:01:18        	vector_math/vec2_ldouble             PASSED     C 0:09.171 - R 0:00.021
23:01:18        	bitmanip1                            PASSED     C 0:11.513 - R 0:00.069
23:01:18        	vector_math/vec3_int                 PASSED     C 0:13.000 - R 0:00.037
23:01:18        	io/manipulatorsOutput2               PASSED     C 0:10.338 - R 0:00.035
23:01:18        	exceptions/hotpotato                 PASSED     C 0:11.589 - R 0:00.119
23:01:18        	bitmanip2                            PASSED     C 0:12.196 - R 0:00.118
23:01:18        	vector_math/vec2_int                 PASSED     C 0:13.866 - R 0:00.036
23:01:18        	bitmanip3                            PASSED     C 0:12.356 - R 0:00.068
23:01:18        	vector_math/vec2_float               PASSED     C 0:14.473 - R 0:00.067
23:01:18        	vector_math/vec3_float               PASSED     C 0:14.543 - R 0:00.035
23:01:18        	vector_math/vec4_float               PASSED     C 0:14.681 - R 0:00.035
23:01:18        	vector_math/vec4_int                 PASSED     C 0:15.074 - R 0:00.067
23:01:18        	concurrency/unified_locking/mcs      PASSED     C 0:15.233 - R 0:24.267
23:01:18        	math                                 PASSED     C 0:12.715 - R 0:00.034
23:01:18        	include/includes                     PASSED     C 0:24.339 - R 0:00.035
23:01:18        	mathX                                PASSED     C 0:13.672 - R 0:00.036
23:01:18        	io/manipulatorsOutput1               PASSED     C 0:14.240 - R 0:00.035
23:01:18        	io/io-acquire-no-io                  PASSED     C 0:12.764 - R 0:11.311
23:01:18        	io/manipulatorsOutput3               PASSED     C 0:14.148 - R 0:00.119
23:01:18        	PRNG                                 PASSED     C 0:15.975 - R 0:02.176
23:01:18        	heap                                 PASSED     C 0:09.685 - R 0:18.633
23:01:18        	concurrency/waituntil/channels       PASSED     C 0:14.105 - R 0:27.059
23:01:18        	concurrency/waituntil/repeat_close   PASSED     C 0:13.820 - R 0:30.165
23:01:18        	rational                             PASSED     C 0:27.025 - R 0:00.036
23:01:18        	...ency/unified_locking/futex_mutex  PASSED     C 0:14.089 - R 0:39.163
23:01:18        	concurrency/waituntil/all_types      PASSED     C 0:33.465 - R 0:20.001
23:01:18        	...ency/waituntil/channel_zero_size  PASSED     C 0:12.926 - R 0:42.505
23:01:18        	...urrency/unified_locking/mcs_spin  PASSED     C 0:13.939 - R 0:49.608
23:01:18        	concurrency/monitor                  PASSED     C 0:12.053 - R 1:00.260
23:01:18        	.../unified_locking/spin_queue_lock  PASSED     C 0:15.148 - R 0:52.136
23:01:18        	concurrency/multi-monitor            PASSED     C 0:11.983 - R 1:07.958
23:01:18        	concurrency/waituntil/locks          PASSED     C 0:15.511 - R 1:08.668
23:01:18        	concurrency/unified_locking/locks    PASSED     C 0:14.887 - R 1:24.248
23:01:18        	concurrency/mutexstmt/locks          PASSED     C 0:12.261 - R 2:19.115
23:01:18 374 passes, 1 failures, 0 timeouts, 0 cancelled, 0 other
23:01:18 Tests took  2:32.307
23:01:18 make: *** [Makefile:986: all-local] Error 1
23:01:18 [Pipeline] }
23:01:18 [Pipeline] // dir
23:01:18 [Pipeline] }
23:01:18 [Pipeline] // stage
23:01:18 [Pipeline] echo
23:01:18 Archiving core dumps
23:01:18 [Pipeline] dir
23:01:18 Running in /var/lib/jenkins/workspace/Cforall_master@tmp
23:01:18 [Pipeline] {
23:01:18 [Pipeline] fileExists
23:01:18 [Pipeline] sh
23:01:18 + /var/lib/jenkins/workspace/Cforall_master/tools/jenkins/archive-gen.sh
23:01:18 [Pipeline] archiveArtifacts
23:01:18 Archiving artifacts
23:01:18 Recording fingerprints
23:01:18 [Pipeline] }
23:01:18 [Pipeline] // dir
23:01:18 [Pipeline] }
23:01:18 [Pipeline] // wrap
23:01:18 [Pipeline] }
23:01:18 [Pipeline] // node
23:01:18 [Pipeline] echo
23:01:18 hudson.AbortException: script returned exit code 2
23:01:18 [Pipeline] node
23:01:18 Running on Brokk 5 in /var/lib/jenkins/workspace/Cforall_master_2
23:01:18 [Pipeline] {
23:01:18 [Pipeline] echo
23:01:18 Notifying users of result
23:01:18 [Pipeline] echo
23:01:18 Reusing previously constructed message
23:01:18 [Pipeline] echo
23:01:18 Would send email to: cforall@lists.uwaterloo.ca
23:01:18 [Pipeline] echo
23:01:18 With title: [cforall git][BUILD# 3657 - FAILURE] - branch master
23:01:18 [Pipeline] echo
23:01:18 Content: 
23:01:18 <p>This is an automated email from the Jenkins build machine. It was
23:01:18 generated because of a git hooks/post-receive script following
23:01:18 a ref change which was pushed to the C∀ repository.</p>
23:01:18 
23:01:18 <p>- Status --------------------------------------------------------------</p>
23:01:18 
23:01:18 <p>BUILD# 3657 - FAILURE</p>
23:01:18 <p>Check console output at https://cforall.uwaterloo.ca/jenkins/job/Cforall/job/master/3657/ to view the results.</p>
23:01:18 
23:01:18 <p>- Changes -------------------------------------------------------------</p>
23:01:18 
23:01:18 <pre>
23:01:18 The branch master has been updated.
23:01:18       from  4ff8cb209307cd30c3626d4fbe3cc2d2ce4219ea (commit)
23:01:18 </pre>
23:01:18 
23:01:18 <p>- Log -----------------------------------------------------------------</p>
23:01:18 
23:01:18 <pre>
23:01:18 
23:01:18 </pre>
23:01:18 
23:01:18 <p>-----------------------------------------------------------------------</p>
23:01:18 <pre>
23:01:18 Summary of changes:
23:01:18 
23:01:18 </pre>
23:01:18 
23:01:18 [Pipeline] }
23:01:18 [Pipeline] // node
23:01:18 [Pipeline] echo
23:01:18 Build Completed
23:01:18 [Pipeline] End of Pipeline
23:01:18 ERROR: script returned exit code 2
23:01:18 Finished: FAILURE
[Pipeline] error
[Pipeline] }
23:01:18 Failed in branch gcc_11_arm64_new
23:01:22 Build Cforall » master #3651 completed: SUCCESS
[Pipeline] echo
23:01:22 SUCCESS
[Pipeline] }
23:02:19 Build Cforall » master #3655 completed: SUCCESS
[Pipeline] echo
23:02:19 SUCCESS
[Pipeline] }
23:03:45 Build Cforall » master #3659 completed: SUCCESS
[Pipeline] echo
23:03:45 SUCCESS
[Pipeline] }
23:09:47 Build Cforall » master #3658 completed: SUCCESS
[Pipeline] echo
23:09:47 SUCCESS
[Pipeline] }
23:15:04 Build Cforall » master #3650 completed: SUCCESS
[Pipeline] echo
23:15:04 SUCCESS
[Pipeline] }
23:28:37 Build Cforall » master #3649 completed: SUCCESS
[Pipeline] echo
23:28:37 SUCCESS
[Pipeline] }
[Pipeline] // parallel
[Pipeline] }
[Pipeline] // stage
[Pipeline] }
[Pipeline] // wrap
[Pipeline] echo
error caught
[Pipeline] node
Running on Brokk 4 in /var/lib/jenkins/workspace/Cforall_Full_Build
[Pipeline] {
[Pipeline] echo
notifying users
[Pipeline] emailext
Sending email to: cforall@lists.uwaterloo.ca
[Pipeline] }
[Pipeline] // node
[Pipeline] }
[Pipeline] // node
[Pipeline] End of Pipeline
ERROR: FAILURE
Finished: FAILURE