Console Output

Skipping 893 KB.. Full Log
23:31:31 Making dvi in src
23:31:31 make[3]: Entering directory '/var/lib/jenkins/workspace/Cforall_Distribute_Ref@tmp/cfa-cc-1.0.0.1846/_build/sub/libcfa/x64-debug/src'
23:31:31 make[3]: Nothing to be done for 'dvi'.
23:31:31 make[3]: Leaving directory '/var/lib/jenkins/workspace/Cforall_Distribute_Ref@tmp/cfa-cc-1.0.0.1846/_build/sub/libcfa/x64-debug/src'
23:31:31 make[3]: Entering directory '/var/lib/jenkins/workspace/Cforall_Distribute_Ref@tmp/cfa-cc-1.0.0.1846/_build/sub/libcfa/x64-debug'
23:31:31 make[3]: Nothing to be done for 'dvi-am'.
23:31:31 make[3]: Leaving directory '/var/lib/jenkins/workspace/Cforall_Distribute_Ref@tmp/cfa-cc-1.0.0.1846/_build/sub/libcfa/x64-debug'
23:31:31 make[2]: Leaving directory '/var/lib/jenkins/workspace/Cforall_Distribute_Ref@tmp/cfa-cc-1.0.0.1846/_build/sub/libcfa/x64-debug'
23:31:31 Making dvi in libcfa/x64-nodebug
23:31:31 make[2]: Entering directory '/var/lib/jenkins/workspace/Cforall_Distribute_Ref@tmp/cfa-cc-1.0.0.1846/_build/sub/libcfa/x64-nodebug'
23:31:31 Making dvi in prelude
23:31:31 make[3]: Entering directory '/var/lib/jenkins/workspace/Cforall_Distribute_Ref@tmp/cfa-cc-1.0.0.1846/_build/sub/libcfa/x64-nodebug/prelude'
23:31:31 make[3]: Nothing to be done for 'dvi'.
23:31:31 make[3]: Leaving directory '/var/lib/jenkins/workspace/Cforall_Distribute_Ref@tmp/cfa-cc-1.0.0.1846/_build/sub/libcfa/x64-nodebug/prelude'
23:31:31 Making dvi in src
23:31:31 make[3]: Entering directory '/var/lib/jenkins/workspace/Cforall_Distribute_Ref@tmp/cfa-cc-1.0.0.1846/_build/sub/libcfa/x64-nodebug/src'
23:31:31 make[3]: Nothing to be done for 'dvi'.
23:31:31 make[3]: Leaving directory '/var/lib/jenkins/workspace/Cforall_Distribute_Ref@tmp/cfa-cc-1.0.0.1846/_build/sub/libcfa/x64-nodebug/src'
23:31:31 make[3]: Entering directory '/var/lib/jenkins/workspace/Cforall_Distribute_Ref@tmp/cfa-cc-1.0.0.1846/_build/sub/libcfa/x64-nodebug'
23:31:31 make[3]: Nothing to be done for 'dvi-am'.
23:31:31 make[3]: Leaving directory '/var/lib/jenkins/workspace/Cforall_Distribute_Ref@tmp/cfa-cc-1.0.0.1846/_build/sub/libcfa/x64-nodebug'
23:31:31 make[2]: Leaving directory '/var/lib/jenkins/workspace/Cforall_Distribute_Ref@tmp/cfa-cc-1.0.0.1846/_build/sub/libcfa/x64-nodebug'
23:31:31 make[1]: Leaving directory '/var/lib/jenkins/workspace/Cforall_Distribute_Ref@tmp/cfa-cc-1.0.0.1846/_build/sub'
23:31:31 make[1]: Entering directory '/var/lib/jenkins/workspace/Cforall_Distribute_Ref@tmp/cfa-cc-1.0.0.1846/_build/sub'
23:31:31 Making check in driver
23:31:31 make[2]: Entering directory '/var/lib/jenkins/workspace/Cforall_Distribute_Ref@tmp/cfa-cc-1.0.0.1846/_build/sub/driver'
23:31:31 make[2]: Nothing to be done for 'check'.
23:31:31 make[2]: Leaving directory '/var/lib/jenkins/workspace/Cforall_Distribute_Ref@tmp/cfa-cc-1.0.0.1846/_build/sub/driver'
23:31:31 Making check in src
23:31:31 make[2]: Entering directory '/var/lib/jenkins/workspace/Cforall_Distribute_Ref@tmp/cfa-cc-1.0.0.1846/_build/sub/src'
23:31:31 make  check-am
23:31:31 make[3]: Entering directory '/var/lib/jenkins/workspace/Cforall_Distribute_Ref@tmp/cfa-cc-1.0.0.1846/_build/sub/src'
23:31:31 make[3]: Nothing to be done for 'check-am'.
23:31:31 make[3]: Leaving directory '/var/lib/jenkins/workspace/Cforall_Distribute_Ref@tmp/cfa-cc-1.0.0.1846/_build/sub/src'
23:31:31 make[2]: Leaving directory '/var/lib/jenkins/workspace/Cforall_Distribute_Ref@tmp/cfa-cc-1.0.0.1846/_build/sub/src'
23:31:31 Making check in .
23:31:31 make[2]: Entering directory '/var/lib/jenkins/workspace/Cforall_Distribute_Ref@tmp/cfa-cc-1.0.0.1846/_build/sub'
23:31:31 make[2]: Leaving directory '/var/lib/jenkins/workspace/Cforall_Distribute_Ref@tmp/cfa-cc-1.0.0.1846/_build/sub'
23:31:31 Making check in libcfa/x64-debug
23:31:31 make[2]: Entering directory '/var/lib/jenkins/workspace/Cforall_Distribute_Ref@tmp/cfa-cc-1.0.0.1846/_build/sub/libcfa/x64-debug'
23:31:31 Making check in prelude
23:31:31 make[3]: Entering directory '/var/lib/jenkins/workspace/Cforall_Distribute_Ref@tmp/cfa-cc-1.0.0.1846/_build/sub/libcfa/x64-debug/prelude'
23:31:31 make[3]: Leaving directory '/var/lib/jenkins/workspace/Cforall_Distribute_Ref@tmp/cfa-cc-1.0.0.1846/_build/sub/libcfa/x64-debug/prelude'
23:31:31 Making check in src
23:31:31 make[3]: Entering directory '/var/lib/jenkins/workspace/Cforall_Distribute_Ref@tmp/cfa-cc-1.0.0.1846/_build/sub/libcfa/x64-debug/src'
23:31:32 make[3]: Nothing to be done for 'check'.
23:31:32 make[3]: Leaving directory '/var/lib/jenkins/workspace/Cforall_Distribute_Ref@tmp/cfa-cc-1.0.0.1846/_build/sub/libcfa/x64-debug/src'
23:31:32 make[3]: Entering directory '/var/lib/jenkins/workspace/Cforall_Distribute_Ref@tmp/cfa-cc-1.0.0.1846/_build/sub/libcfa/x64-debug'
23:31:32 make[3]: Nothing to be done for 'check-am'.
23:31:32 make[3]: Leaving directory '/var/lib/jenkins/workspace/Cforall_Distribute_Ref@tmp/cfa-cc-1.0.0.1846/_build/sub/libcfa/x64-debug'
23:31:32 make[2]: Leaving directory '/var/lib/jenkins/workspace/Cforall_Distribute_Ref@tmp/cfa-cc-1.0.0.1846/_build/sub/libcfa/x64-debug'
23:31:32 Making check in libcfa/x64-nodebug
23:31:32 make[2]: Entering directory '/var/lib/jenkins/workspace/Cforall_Distribute_Ref@tmp/cfa-cc-1.0.0.1846/_build/sub/libcfa/x64-nodebug'
23:31:32 Making check in prelude
23:31:32 make[3]: Entering directory '/var/lib/jenkins/workspace/Cforall_Distribute_Ref@tmp/cfa-cc-1.0.0.1846/_build/sub/libcfa/x64-nodebug/prelude'
23:31:32 make[3]: Leaving directory '/var/lib/jenkins/workspace/Cforall_Distribute_Ref@tmp/cfa-cc-1.0.0.1846/_build/sub/libcfa/x64-nodebug/prelude'
23:31:32 Making check in src
23:31:32 make[3]: Entering directory '/var/lib/jenkins/workspace/Cforall_Distribute_Ref@tmp/cfa-cc-1.0.0.1846/_build/sub/libcfa/x64-nodebug/src'
23:31:32 make[3]: Nothing to be done for 'check'.
23:31:32 make[3]: Leaving directory '/var/lib/jenkins/workspace/Cforall_Distribute_Ref@tmp/cfa-cc-1.0.0.1846/_build/sub/libcfa/x64-nodebug/src'
23:31:32 make[3]: Entering directory '/var/lib/jenkins/workspace/Cforall_Distribute_Ref@tmp/cfa-cc-1.0.0.1846/_build/sub/libcfa/x64-nodebug'
23:31:32 make[3]: Nothing to be done for 'check-am'.
23:31:32 make[3]: Leaving directory '/var/lib/jenkins/workspace/Cforall_Distribute_Ref@tmp/cfa-cc-1.0.0.1846/_build/sub/libcfa/x64-nodebug'
23:31:32 make[2]: Leaving directory '/var/lib/jenkins/workspace/Cforall_Distribute_Ref@tmp/cfa-cc-1.0.0.1846/_build/sub/libcfa/x64-nodebug'
23:31:32 make -C tests all-tests installed=no debug=yes
23:31:32 make[2]: Entering directory '/var/lib/jenkins/workspace/Cforall_Distribute_Ref@tmp/cfa-cc-1.0.0.1846/_build/sub/tests'
23:31:32 Running 222 tests on 7 cores (Default AST (new):x64 - debug)
23:33:09        	array-container/language-dim-mismatch      PASSED     C 0:00.105 - R n/a
23:33:09        	array                                      PASSED     C 0:00.453 - R 0:00.001
23:33:09        	builtins/sync                              PASSED     C 0:00.606 - R 0:00.001
23:33:09        	cast                                       PASSED     C 0:00.477 - R 0:00.001
23:33:09        	castError                                  PASSED     C 0:00.246 - R n/a
23:33:09        	array-container/array-basic                PASSED     C 0:01.303 - R 0:00.017
23:33:09        	avl_test                                   PASSED     C 0:01.940 - R 0:00.016
23:33:09        	alloc-ERROR                                PASSED     C 0:03.519 - R n/a
23:33:09        	alloc                                      PASSED     C 0:07.111 - R 0:00.016
23:33:09        	collections/multi_list                     PASSED     C 0:06.348 - R 0:00.016
23:33:09        	alloc2                                     PASSED     C 0:08.560 - R 0:00.016
23:33:09        	collections/vector-err-pass-perm-it-byval  PASSED     C 0:01.199 - R n/a
23:33:09        	collections/vector-demo                    PASSED     C 0:02.653 - R 0:00.016
23:33:09        	collections/stack                          PASSED     C 0:06.900 - R 0:00.016
23:33:09        	collections/vector-err-retn-perm-it-byval  PASSED     C 0:00.977 - R n/a
23:33:09        	collections/queue                          PASSED     C 0:09.894 - R 0:00.008
23:33:09        	collections/sequence                       PASSED     C 0:10.045 - R 0:00.008
23:33:09        	collections/atomic_mpsc                    PASSED     C 0:08.340 - R 0:03.622
23:33:09        	concurrent/clib                            PASSED     C 0:02.888 - R 0:00.165
23:33:09        	concurrent/clib_tls                        PASSED     C 0:02.759 - R 0:00.164
23:33:09        	collections/string-api-coverage            PASSED     C 0:07.351 - R 0:00.016
23:33:09        	complex                                    PASSED     C 0:04.789 - R 0:00.016
23:33:09        	concurrent/cluster                         PASSED     C 0:06.142 - R 0:00.115
23:33:09        	concurrent/coroutineYield                  PASSED     C 0:08.587 - R 0:00.115
23:33:09        	concurrent/examples/datingService          PASSED     C 0:08.427 - R 0:00.114
23:33:09        	concurrent/examples/gortn                  PASSED     C 0:08.478 - R 0:00.064
23:33:09        	concurrent/examples/matrixSum              PASSED     C 0:08.143 - R 0:00.114
23:33:09        	concurrent/examples/quickSort              PASSED     C 0:08.654 - R 0:00.064
23:33:09        	concurrent/futures/abandon                 PASSED     C 0:06.614 - R 0:00.165
23:33:09        	concurrent/keywordErrors                   PASSED     C 0:00.133 - R n/a
23:33:09        	concurrent/examples/boundedBufferINT       PASSED     C 0:08.583 - R 0:05.826
23:33:09        	concurrent/examples/boundedBufferEXT       PASSED     C 0:08.698 - R 0:06.577
23:33:09        	concurrent/futures/basic                   PASSED     C 0:06.300 - R 0:00.164
23:33:09        	concurrent/futures/typed                   PASSED     C 0:06.588 - R 0:00.165
23:33:09        	concurrent/futures/multi                   PASSED     C 0:07.458 - R 0:00.165
23:33:09        	concurrent/join                            PASSED     C 0:08.587 - R 0:00.115
23:33:09        	concurrent/park/contention                 PASSED     C 0:06.401 - R 0:00.215
23:33:09        	concurrent/mutexstmt/monitors              PASSED     C 0:07.020 - R 0:02.871
23:33:09        	concurrent/park/force_preempt              PASSED     C 0:09.331 - R 0:00.378
23:33:09        	concurrent/park/start_parked               PASSED     C 0:06.529 - R 0:00.178
23:33:09        	concurrent/mutexstmt/locks                 PASSED     C 0:08.403 - R 0:06.168
23:33:09        	concurrent/semaphore                       PASSED     C 0:09.809 - R 0:00.064
23:33:09        	concurrent/signal/wait                     PASSED     C 0:08.507 - R 0:00.214
23:33:09        	concurrent/signal/block                    PASSED     C 0:09.607 - R 0:01.467
23:33:09        	concurrent/signal/disjoint                 PASSED     C 0:08.759 - R 0:01.917
23:33:09        	concurrent/monitor                         PASSED     C 0:08.903 - R 0:19.823
23:33:09        	concurrent/preempt                         PASSED     C 0:06.553 - R 0:14.939
23:33:09        	concurrent/sleep                           PASSED     C 0:08.475 - R 0:01.216
23:33:09        	concurrent/multi-monitor                   PASSED     C 0:08.639 - R 0:21.752
23:33:09        	concurrent/suspend_then                    PASSED     C 0:08.548 - R 0:00.114
23:33:09        	concurrent/spinaphore                      PASSED     C 0:09.348 - R 0:00.415
23:33:09        	concurrent/thread                          PASSED     C 0:09.254 - R 0:00.115
23:33:09        	const-init                                 PASSED     C 0:00.676 - R 0:00.016
23:33:09        	concurrent/waitfor/barge                   PASSED     C 0:08.422 - R 0:00.265
23:33:09        	concurrent/waitfor/else                    PASSED     C 0:06.932 - R 0:00.115
23:33:09        	concurrent/waitfor/dtor                    PASSED     C 0:08.224 - R 0:01.218
23:33:09        	copyfile                                   PASSED     C 0:05.049 - R 0:00.016
23:33:09        	concurrent/waitfor/recurse                 PASSED     C 0:08.569 - R 0:00.966
23:33:09        	concurrent/waitfor/statment                PASSED     C 0:09.448 - R 0:00.114
23:33:09        	concurrent/waitfor/when                    PASSED     C 0:08.917 - R 0:00.215
23:33:09        	coroutine/devicedriver                     PASSED     C 0:05.774 - R 0:00.064
23:33:09        	coroutine/fibonacci                        PASSED     C 0:05.528 - R 0:00.064
23:33:09        	designations                               PASSED     C 0:00.623 - R 0:00.016
23:33:09        	coroutine/fmtLines                         PASSED     C 0:05.702 - R 0:00.115
23:33:09        	coroutine/pingpong                         PASSED     C 0:05.714 - R 0:00.064
23:33:09        	enum                                       PASSED     C 0:00.507 - R 0:00.016
23:33:09        	errors/declaration                         PASSED     C 0:00.059 - R n/a
23:33:09        	errors/scope                               PASSED     C 0:00.102 - R n/a
23:33:09        	errors/signature                           PASSED     C 0:00.066 - R n/a
23:33:09        	coroutine/prodcons                         PASSED     C 0:06.842 - R 0:00.114
23:33:09        	coroutine/raii                             PASSED     C 0:05.732 - R 0:00.064
23:33:09        	counter                                    PASSED     C 0:04.659 - R 0:00.016
23:33:09        	coroutine/runningTotal                     PASSED     C 0:05.661 - R 0:00.064
23:33:09        	exceptions/conditional                     PASSED     C 0:00.590 - R 0:00.016
23:33:09        	exceptions/data-except                     PASSED     C 0:00.581 - R 0:00.016
23:33:09        	exceptions/defaults                        PASSED     C 0:00.933 - R 0:00.016
23:33:09        	exceptions/finally                         PASSED     C 0:00.624 - R 0:00.016
23:33:09        	exceptions/finally-error                   PASSED     C 0:00.134 - R n/a
23:33:09        	exceptions/cancel/coroutine                PASSED     C 0:03.834 - R 0:00.065
23:33:09        	device/cpu                                 PASSED     C 0:06.804 - R 0:00.016
23:33:09        	exceptions/interact                        PASSED     C 0:00.718 - R 0:00.016
23:33:09        	div                                        PASSED     C 0:05.836 - R 0:00.016
23:33:09        	exceptions/polymorphic                     PASSED     C 0:00.824 - R 0:00.016
23:33:09        	exceptions/conditional-threads             PASSED     C 0:03.826 - R 0:00.065
23:33:09        	exceptions/resume                          PASSED     C 0:00.760 - R 0:00.016
23:33:09        	exceptions/terminate                       PASSED     C 0:00.793 - R 0:00.016
23:33:09        	exceptions/type-check                      PASSED     C 0:00.134 - R n/a
23:33:09        	exceptions/trash                           PASSED     C 0:00.630 - R 0:00.016
23:33:09        	exceptions/cancel/thread                   PASSED     C 0:06.102 - R 0:00.064
23:33:09        	exceptions/virtual-poly                    PASSED     C 0:00.690 - R 0:00.016
23:33:09        	exceptions/defaults-threads                PASSED     C 0:04.193 - R 0:00.064
23:33:09        	expression                                 PASSED     C 0:00.482 - R 0:00.001
23:33:09        	exceptions/virtual-cast                    PASSED     C 0:01.469 - R 0:00.016
23:33:09        	forall                                     PASSED     C 0:00.899 - R 0:00.001
23:33:09        	exceptions/finally-threads                 PASSED     C 0:03.844 - R 0:00.114
23:33:35        	exceptions/resume-threads                  PASSED     C 0:03.981 - R 0:00.064
23:33:35        	exceptions/terminate-threads               PASSED     C 0:04.113 - R 0:00.064
23:33:35        	genericUnion                               PASSED     C 0:00.578 - R 0:00.016
23:33:35        	global-monomorph                           PASSED     C 0:00.567 - R 0:00.016
23:33:35        	fallthrough                                PASSED     C 0:05.199 - R 0:00.016
23:33:35        	fstream_test                               PASSED     C 0:04.882 - R 0:00.016
23:33:35        	generator/fibonacci                        PASSED     C 0:04.657 - R 0:00.016
23:33:35        	generator/fmtLines                         PASSED     C 0:04.651 - R 0:00.016
23:33:35        	identFuncDeclarator                        PASSED     C 0:00.462 - R 0:00.001
23:33:35        	identParamDeclarator                       PASSED     C 0:00.516 - R 0:00.016
23:33:35        	generator/suspend_then                     PASSED     C 0:04.579 - R 0:00.016
23:33:35        	function-operator                          PASSED     C 0:06.103 - R 0:00.016
23:33:35        	include/vector-containers                  PASSED     C 0:02.443 - R 0:00.016
23:33:35        	hello                                      PASSED     C 0:04.660 - R 0:00.016
23:33:35        	ifwhileCtl                                 PASSED     C 0:04.709 - R 0:00.016
23:33:35        	identity                                   PASSED     C 0:05.005 - R 0:00.016
23:33:35        	init1-ERROR                                PASSED     C 0:00.242 - R n/a
23:33:35        	include/vector-sequence                    PASSED     C 0:00.999 - R 0:00.016
23:33:35        	init1                                      PASSED     C 0:00.597 - R 0:00.001
23:33:35        	include/stdincludes                        PASSED     C 0:05.364 - R 0:00.001
23:33:35        	include/vector-fstream                     PASSED     C 0:04.677 - R 0:00.016
23:33:35        	labelledExit                               PASSED     C 0:00.483 - R 0:00.001
23:33:35        	limits                                     PASSED     C 0:00.492 - R 0:00.001
23:33:35        	linking/exception-nothreads                PASSED     C 0:01.444 - R 0:00.016
23:33:35        	io/manipulatorsOutput4                     PASSED     C 0:07.546 - R 0:00.016
23:33:35        	io/io-acquire                              PASSED     C 0:09.370 - R 0:00.164
23:33:35        	linking/nostdlib                           PASSED     C 0:00.526 - R 0:00.016
23:33:35        	linking/exception-withthreads              PASSED     C 0:04.789 - R 0:00.064
23:33:35        	include/includes                           PASSED     C 0:16.023 - R 0:00.001
23:33:35        	io/many_read                               PASSED     C 0:10.321 - R 0:00.117
23:33:35        	linkonce                                   PASSED     C 0:00.595 - R 0:00.016
23:33:35        	io/io                                      PASSED     C 0:13.205 - R 0:00.016
23:33:35        	linking/io-acquire                         PASSED     C 0:05.923 - R 0:00.016
23:33:35        	heap                                       PASSED     C 0:06.886 - R 0:15.294
23:33:35        	linking/nothreads                          PASSED     C 0:05.821 - R 0:00.016
23:33:35        	linking/weakso_nothd                       PASSED     C 0:05.632 - R 0:00.016
23:33:35        	maybe                                      PASSED     C 0:00.739 - R 0:00.016
23:33:35        	nested-types                               PASSED     C 0:00.480 - R 0:00.001
23:33:35        	nested-types-ERR1                          PASSED     C 0:00.065 - R n/a
23:33:35        	nested-types-ERR2                          PASSED     C 0:00.072 - R n/a
23:33:35        	numericConstants                           PASSED     C 0:00.461 - R 0:00.001
23:33:35        	literals                                   PASSED     C 0:04.989 - R 0:00.016
23:33:35        	operators                                  PASSED     C 0:00.537 - R 0:00.016
23:33:35        	poly-d-cycle                               PASSED     C 0:00.587 - R 0:00.016
23:33:35        	poly-o-cycle                               PASSED     C 0:00.538 - R 0:00.016
23:33:35        	linking/withthreads                        PASSED     C 0:08.352 - R 0:00.115
23:33:35        	poly-selection                             PASSED     C 0:00.525 - R 0:00.016
23:33:35        	loopctrl                                   PASSED     C 0:06.774 - R 0:00.016
23:33:35        	quasiKeyword                               PASSED     C 0:00.495 - R 0:00.001
23:33:35        	malloc                                     PASSED     C 0:06.022 - R 0:00.016
23:33:35        	raii/ctor-autogen                          PASSED     C 0:01.055 - R 0:00.016
23:33:35        	list/dlist-insert-remove                   PASSED     C 0:10.089 - R 0:00.016
23:33:35        	raii/ctor-autogen-ERR1                     PASSED     C 0:00.294 - R n/a
23:33:35        	minmax                                     PASSED     C 0:07.483 - R 0:00.016
23:33:35        	polymorphism                               PASSED     C 0:04.874 - R 0:00.016
23:33:35        	quotedKeyword                              PASSED     C 0:04.613 - R 0:00.016
23:33:35        	raii/boxed-types                           PASSED     C 0:04.804 - R 0:00.016
23:33:35        	raii/init_once                             PASSED     C 0:00.656 - R 0:00.016
23:33:35        	raii/memberCtors                           PASSED     C 0:00.594 - R 0:00.016
23:33:35        	raii/dtor-early-exit-ERR1                  PASSED     C 0:03.583 - R n/a
23:33:35        	raii/memberCtors-ERR1                      PASSED     C 0:00.316 - R n/a
23:33:35        	raii/dtor-early-exit-ERR2                  PASSED     C 0:03.540 - R n/a
23:33:35        	result                                     PASSED     C 0:00.971 - R 0:00.016
23:33:35        	parseconfig                                FAILED with code -6    C 0:07.195 - R 0:00.465
23:33:35 Different types of destination addresses
23:33:35 Cforall Runtime error (UNIX pid:88367) Segment fault at memory location 0x20.
23:33:35 Possible cause is reading outside the address space or writing to a protected area within the address space with an invalid pointer or subscript.
23:33:35 Stack back trace for: /var/lib/jenkins/workspace/Cforall_Distribute_Ref@tmp/cfa-cc-1.0.0.1846/_build/sub/libcfa/x64-debug/src/.libs/libcfa.so.1
23:33:35 (0) /lib/x86_64-linux-gnu/libc.so.6 :  + 0x46210  [0x7ffab3a68210]
23:33:35 (1) /var/lib/jenkins/workspace/Cforall_Distribute_Ref@tmp/cfa-cc-1.0.0.1846/_build/sub/libcfa/x64-debug/src/.libs/libcfa.so.1 :  + 0xdcefb  [0x7ffab3e6defb]
23:33:35 (2) /var/lib/jenkins/workspace/Cforall_Distribute_Ref@tmp/cfa-cc-1.0.0.1846/_build/sub/libcfa/x64-debug/src/.libs/libcfa.so.1 :  + 0xdd0a2  [0x7ffab3e6e0a2]
23:33:35 (3) /var/lib/jenkins/workspace/Cforall_Distribute_Ref@tmp/cfa-cc-1.0.0.1846/_build/sub/libcfa/x64-debug/src/.libs/libcfa.so.1 :  + 0xdd169  [0x7ffab3e6e169]
23:33:35 (4) /var/lib/jenkins/workspace/Cforall_Distribute_Ref@tmp/cfa-cc-1.0.0.1846/_build/sub/libcfa/x64-debug/src/.libs/libcfa.so.1 : __cfaehm_throw_terminate + 0x2c  [0x7ffab3e6e1d6]
23:33:35 (5) /var/lib/jenkins/workspace/Cforall_Distribute_Ref@tmp/cfa-cc-1.0.0.1846/_build/sub/libcfa/x64-debug/src/.libs/libcfa.so.1 :  + 0x6ec83  [0x7ffab3dffc83]
23:33:35 (6) /var/lib/jenkins/workspace/Cforall_Distribute_Ref@tmp/cfa-cc-1.0.0.1846/_build/sub/libcfa/x64-debug/src/.libs/libcfa.so.1 :  + 0x73fc3  [0x7ffab3e04fc3]
23:33:35 (7) /var/lib/jenkins/workspace/Cforall_Distribute_Ref@tmp/cfa-cc-1.0.0.1846/_build/sub/libcfa/x64-debug/src/.libs/libcfa.so.1 : __cfaehm_try_terminate + 0x54  [0x7ffab3e6e545]
23:33:35 (8) /var/lib/jenkins/workspace/Cforall_Distribute_Ref@tmp/cfa-cc-1.0.0.1846/_build/sub/libcfa/x64-debug/src/.libs/libcfa.so.1 : _X27parse_tabular_config_formatFPS7KVPairs_PKcm__1 + 0x285  [0x7ffab3e04b71]
23:33:35 (9) /var/lib/jenkins/workspace/Cforall_Distribute_Ref@tmp/cfa-cc-1.0.0.1846/_build/sub/libcfa/x64-debug/src/.libs/libcfa.so.1 : _X12parse_configFv_PKcPS12config_entrymFPS7KVPairs_PKcm___1 + 0x274  [0x7ffab3e0530d]
23:33:35 (10) /var/lib/jenkins/workspace/Cforall_Distribute_Ref@tmp/cfa-cc-1.0.0.1846/_build/sub/tests/parseconfig : _X4mainFi___1 + 0x93b  [0x5624dbb2b7da]
23:33:35 [New LWP 88367]
23:33:35 [Thread debugging using libthread_db enabled]
23:33:35 Using host libthread_db library "/lib/x86_64-linux-gnu/libthread_db.so.1".
23:33:35 Core was generated by `/var/lib/jenkins/workspace/Cforall_Distribute_Ref@tmp/cfa-cc-1.0.0.1846/_build/'.
23:33:35 Program terminated with signal SIGABRT, Aborted.
23:33:35 #0  __GI_raise (sig=sig@entry=6) at ../sysdeps/unix/sysv/linux/raise.c:50
23:33:35 50	../sysdeps/unix/sysv/linux/raise.c: No such file or directory.
23:33:35 -----
23:33:35 #0  __GI_raise (sig=sig@entry=6) at ../sysdeps/unix/sysv/linux/raise.c:50
23:33:35 #1  0x00007ffab3a47859 in __GI_abort () at abort.c:79
23:33:35 #2  0x00007ffab3e6f030 in _X7__abortFv_bPKcY17__builtin_va_list__1 (_X11signalAbortb_1=true, _X3fmtPKc_1=0x7ffab3e86758 "Application interrupted by signal: %s.\n", _X4argsY17__builtin_va_list_1=0x7ffab3eccae0 <stack+61520>) at /var/lib/jenkins/workspace/Cforall_Distribute_Ref@tmp/cfa-cc-1.0.0.1846/_build/sub/../../libcfa/src/interpose.cfa:241
23:33:35 #3  0x00007ffab3e6f2c6 in _X5abortFv_bPKc__1 (_X11signalAbortb_1=true, _X3fmtPKc_1=0x7ffab3e86758 "Application interrupted by signal: %s.\n") at /var/lib/jenkins/workspace/Cforall_Distribute_Ref@tmp/cfa-cc-1.0.0.1846/_build/sub/../../libcfa/src/interpose.cfa:279
23:33:35 #4  0x00007ffab3e6f47b in _X15sigHandler_termFv_iPS13__anonymous17PS10ucontext_t__1 (_X3sigi_1=6, _X3sfpPS13__anonymous17_1=0x7ffab3eccd30 <stack+62112>, _X3cxtPS10ucontext_t_1=0x7ffab3eccc00 <stack+61808>) at /var/lib/jenkins/workspace/Cforall_Distribute_Ref@tmp/cfa-cc-1.0.0.1846/_build/sub/../../libcfa/src/interpose.cfa:315
23:33:35 #5  <signal handler called>
23:33:35 #6  __GI_raise (sig=sig@entry=6) at ../sysdeps/unix/sysv/linux/raise.c:50
23:33:35 #7  0x00007ffab3a47859 in __GI_abort () at abort.c:79
23:33:35 #8  0x00007ffab3e6f153 in _X7__abortFv_bPKcY17__builtin_va_list__1 (_X11signalAbortb_1=true, _X3fmtPKc_1=0x7ffab3e865c0 "%s at memory location %p.\nPossible cause is reading outside the address space or writing to a protected area within the address space with an invalid pointer or subscript.\n", _X4argsY17__builtin_va_list_1=0x7ffab3ecd460 <stack+63952>) at /var/lib/jenkins/workspace/Cforall_Distribute_Ref@tmp/cfa-cc-1.0.0.1846/_build/sub/../../libcfa/src/interpose.cfa:264
23:33:35 #9  0x00007ffab3e6f2c6 in _X5abortFv_bPKc__1 (_X11signalAbortb_1=true, _X3fmtPKc_1=0x7ffab3e865c0 "%s at memory location %p.\nPossible cause is reading outside the address space or writing to a protected area within the address space with an invalid pointer or subscript.\n") at /var/lib/jenkins/workspace/Cforall_Distribute_Ref@tmp/cfa-cc-1.0.0.1846/_build/sub/../../libcfa/src/interpose.cfa:279
23:33:35 #10 0x00007ffab3e6f345 in _X15sigHandler_segvFv_iPS13__anonymous17PS10ucontext_t__1 (_X3sigi_1=11, _X3sfpPS13__anonymous17_1=0x7ffab3ecd6b0 <stack+64544>, _X3cxtPS10ucontext_t_1=0x7ffab3ecd580 <stack+64240>) at /var/lib/jenkins/workspace/Cforall_Distribute_Ref@tmp/cfa-cc-1.0.0.1846/_build/sub/../../libcfa/src/interpose.cfa:290
23:33:35 #11 <signal handler called>
23:33:35 #12 0x00007ffab3e6defb in __cfaehm_delete_exception (except=0x5624dd9b10b0) at /var/lib/jenkins/workspace/Cforall_Distribute_Ref@tmp/cfa-cc-1.0.0.1846/_build/sub/../../libcfa/src/exception.c:162
23:33:35 #13 0x00007ffab3e6e0a2 in __cfaehm_cleanup_default (except=0x7ffccb6b8170) at /var/lib/jenkins/workspace/Cforall_Distribute_Ref@tmp/cfa-cc-1.0.0.1846/_build/sub/../../libcfa/src/exception.c:233
23:33:35 #14 0x00007ffab3e6e169 in __cfaehm_begin_unwind (defaultHandler=0x7ffccb6b8220) at /var/lib/jenkins/workspace/Cforall_Distribute_Ref@tmp/cfa-cc-1.0.0.1846/_build/sub/../../libcfa/src/exception.c:274
23:33:35 #15 0x00007ffab3e6e1d6 in __cfaehm_throw_terminate (val=0x5624dd9b1040, defaultHandler=0x7ffccb6b8220) at /var/lib/jenkins/workspace/Cforall_Distribute_Ref@tmp/cfa-cc-1.0.0.1846/_build/sub/../../libcfa/src/exception.c:282
23:33:35 #16 0x00007ffab3dffc83 in _X6$throwQ2_0_0_1__X25defaultTerminationHandlerFv_BD0__Fv_BD0__1 (_X25defaultTerminationHandlerFv_Y7exceptT__1=0x7ffccb6b8220, _X6exceptY7exceptT_1=0x5624dd9b1040) at prelude.cfa:80
23:33:35 #17 0x00007ffab3e04fc3 in catch (__handler_index=1, __exception_inst=0x5624dd9b1040) at /var/lib/jenkins/workspace/Cforall_Distribute_Ref@tmp/cfa-cc-1.0.0.1846/_build/sub/../../libcfa/src/parseconfig.cfa:146
23:33:35 #18 0x00007ffab3e6e545 in __cfaehm_try_terminate (try_block=0x7ffccb6b83a8, catch_block=0x7ffccb6b838c, match_block=0x7ffccb6b8370) at /var/lib/jenkins/workspace/Cforall_Distribute_Ref@tmp/cfa-cc-1.0.0.1846/_build/sub/../../libcfa/src/exception.c:521
23:33:35 #19 0x00007ffab3e04b71 in _X27parse_tabular_config_formatFPS7KVPairs_PKcm__1 (_X11config_filePKc_1=0x5624dbb300c8 "/var/lib/jenkins/workspace/Cforall_Distribute_Ref@tmp/cfa-cc-1.0.0.1846/tests/.in/parseconfig-all.txt", _X11num_entriesm_1=11) at /var/lib/jenkins/workspace/Cforall_Distribute_Ref@tmp/cfa-cc-1.0.0.1846/_build/sub/../../libcfa/src/parseconfig.cfa:121
23:33:35 #20 0x00007ffab3e0530d in _X12parse_configFv_PKcPS12config_entrymFPS7KVPairs_PKcm___1 (_X11config_filePKc_1=0x5624dbb300c8 "/var/lib/jenkins/workspace/Cforall_Distribute_Ref@tmp/cfa-cc-1.0.0.1846/tests/.in/parseconfig-all.txt", _X7entriesPS12config_entry_1=0x7ffccb6b86d0, _X11num_entriesm_1=11, _X6parserFPS7KVPairs_PKcm__1=0x7ffab3e048ec <_X27parse_tabular_config_formatFPS7KVPairs_PKcm__1>) at /var/lib/jenkins/workspace/Cforall_Distribute_Ref@tmp/cfa-cc-1.0.0.1846/_build/sub/../../libcfa/src/parseconfig.cfa:159
23:33:35 #21 0x00005624dbb2b7da in _X4mainFi___1 () at parseconfig.cfa:52
23:33:35 #22 0x00005624dbb2ef76 in invoke_main (argc=1, argv=0x7ffccb6b8db8, envp=0x7ffccb6b8dc8) at parseconfig.cfa:23
23:33:35 #23 0x00005624dbb2efc3 in main (_X4argci_1=1, _X4argvPPc_1=0x7ffccb6b8db8, _X4envpPPc_1=0x7ffccb6b8dc8) at parseconfig.cfa:44
23:33:35 -----
23:33:35   Id   Target Id                         Frame 
23:33:35 * 1    Thread 0x7ffab39fa740 (LWP 88367) __GI_raise (sig=sig@entry=6) at ../sysdeps/unix/sysv/linux/raise.c:50
23:33:35 
23:33:35        	simpleGenericTriple                        PASSED     C 0:00.663 - R 0:00.016
23:33:35        	raii/dtor-early-exit                       PASSED     C 0:06.156 - R 0:00.016
23:34:43        	smart-pointers                             PASSED     C 0:00.698 - R 0:00.016
23:34:43        	raii/globals                               PASSED     C 0:04.871 - R 0:00.016
23:34:43        	references                                 PASSED     C 0:05.372 - R 0:00.016
23:34:43        	shortCircuit                               PASSED     C 0:04.631 - R 0:00.016
23:34:43        	switch                                     PASSED     C 0:00.454 - R 0:00.001
23:34:43        	strstream                                  PASSED     C 0:04.982 - R 0:00.016
23:34:43        	tuple/tupleCast                            PASSED     C 0:00.537 - R 0:00.016
23:34:43        	searchsort                                 PASSED     C 0:07.421 - R 0:00.016
23:34:43        	tuple/tupleFunction                        PASSED     C 0:00.609 - R 0:00.016
23:34:43        	tuple/tupleMember                          PASSED     C 0:00.559 - R 0:00.016
23:34:43        	tuple/tuplePolymorphism                    PASSED     C 0:00.770 - R 0:00.016
23:34:43        	typedefRedef                               PASSED     C 0:00.452 - R 0:00.001
23:34:43        	sum                                        PASSED     C 0:06.959 - R 0:00.016
23:34:43        	typedefRedef-ERR1                          PASSED     C 0:00.066 - R n/a
23:34:43        	typeof                                     PASSED     C 0:00.518 - R 0:00.016
23:34:43        	tuple/tupleVariadic                        PASSED     C 0:01.536 - R 0:00.016
23:34:43        	swap                                       PASSED     C 0:07.250 - R 0:00.016
23:34:43        	tuple/tupleAssign                          PASSED     C 0:06.030 - R 0:00.016
23:34:43        	time                                       PASSED     C 0:06.293 - R 0:00.016
23:34:43        	rational                                   PASSED     C 0:15.608 - R 0:00.016
23:34:43        	variableDeclarator                         PASSED     C 0:00.472 - R 0:00.001
23:34:43        	userLiterals                               PASSED     C 0:05.228 - R 0:00.016
23:34:43        	unified_locking/fast                       PASSED     C 0:09.313 - R 0:00.114
23:34:43        	unified_locking/lin_backoff                PASSED     C 0:09.233 - R 0:00.165
23:34:43        	unified_locking/timeout_lock               PASSED     C 0:07.433 - R 0:01.116
23:34:43        	vector                                     PASSED     C 0:07.092 - R 0:00.016
23:34:43        	vector_math/vec2_double                    PASSED     C 0:06.471 - R 0:00.016
23:34:43        	unified_locking/mcs                        PASSED     C 0:09.065 - R 0:06.176
23:34:43        	vector_math/vec2_uint                      PASSED     C 0:06.366 - R 0:00.016
23:34:43        	vector_math/vec2_float                     PASSED     C 0:11.263 - R 0:00.016
23:34:43        	voidPtr                                    PASSED     C 0:00.507 - R 0:00.016
23:34:43        	vector_math/vec2_int                       PASSED     C 0:11.605 - R 0:00.016
23:34:43        	warnings/self-assignment                   PASSED     C 0:00.461 - R 0:00.001
23:34:43        	KRfunctions                                PASSED     C 0:00.396 - R 0:00.001
23:34:43        	vector_math/vec3_int                       PASSED     C 0:09.928 - R 0:00.016
23:34:43        	vector_math/vec3_float                     PASSED     C 0:12.034 - R 0:00.016
23:34:43        	attributes                                 PASSED     C 0:00.484 - R 0:00.001
23:34:43        	vector_math/vec4_float                     PASSED     C 0:11.654 - R 0:00.016
23:34:43        	vector_math/vec4_int                       PASSED     C 0:10.660 - R 0:00.016
23:34:43        	abs                                        PASSED     C 0:06.447 - R 0:00.016
23:34:43        	declarationSpecifier                       PASSED     C 0:00.505 - R 0:00.001
23:34:43        	errors/completeType                        PASSED     C 0:00.248 - R n/a
23:34:43        	extension                                  PASSED     C 0:00.449 - R 0:00.001
23:34:43        	unified_locking/locks                      PASSED     C 0:08.290 - R 0:20.558
23:34:43        	functions                                  PASSED     C 0:00.401 - R 0:00.001
23:34:43        	ato                                        PASSED     C 0:06.057 - R 0:00.016
23:34:43        	gccExtensions                              PASSED     C 0:00.411 - R 0:00.001
23:34:43        	array-container/array-md-sbscr-cases       PASSED     C 0:08.587 - R 0:00.016
23:34:43        	bitmanip1                                  PASSED     C 0:09.959 - R 0:00.016
23:34:43        	io/manipulatorsInput                       PASSED     C 0:06.749 - R 0:00.016
23:34:43        	gmp                                        PASSED     C 0:06.945 - R 0:00.016
23:34:43        	bitmanip2                                  PASSED     C 0:11.146 - R 0:00.016
23:34:43        	meta/archVast                              PASSED     C 0:00.239 - R n/a
23:34:43        	io/manipulatorsOutput2                     PASSED     C 0:08.555 - R 0:00.016
23:34:43        	io/manipulatorsOutput1                     PASSED     C 0:11.843 - R 0:00.016
23:34:43        	bitmanip3                                  PASSED     C 0:17.009 - R 0:00.016
23:34:43        	random                                     PASSED     C 0:05.744 - R 0:00.016
23:34:43        	vector_math/vec2_ldouble                   PASSED     C 0:06.569 - R 0:00.016
23:34:43        	io/manipulatorsOutput3                     PASSED     C 0:13.232 - R 0:00.033
23:34:43        	math                                       PASSED     C 0:12.920 - R 0:00.016
23:34:43        	mathX                                      PASSED     C 0:19.421 - R 0:00.033
23:34:43 Tests took  3:04.822
23:34:43 make[2]: *** [Makefile:880: all-tests] Error 1
23:34:43 make[2]: Leaving directory '/var/lib/jenkins/workspace/Cforall_Distribute_Ref@tmp/cfa-cc-1.0.0.1846/_build/sub/tests'
23:34:43 make[1]: *** [Makefile:951: check] Error 2
23:34:43 make[1]: Leaving directory '/var/lib/jenkins/workspace/Cforall_Distribute_Ref@tmp/cfa-cc-1.0.0.1846/_build/sub'
23:34:43 make: *** [Makefile:734: distcheck] Error 1
[Pipeline] }
[Pipeline] // dir
[Pipeline] }
[Pipeline] // stage
[Pipeline] }
[Pipeline] // wrap
[Pipeline] }
[Pipeline] // node
[Pipeline] End of Pipeline
ERROR: script returned exit code 2
Finished: FAILURE