Console Output

Started by upstream project "Cforall_Full_Build" build number 1838
originally caused by:
 Started by timer
Running as Jenkins Build User
Obtained Jenkins/Distribute from git cforall@plg.uwaterloo.ca:software/cfa/cfa-cc
Running in Durability level: PERFORMANCE_OPTIMIZED
[Pipeline] Start of Pipeline
[Pipeline] node
Running on Brokk 6 in /var/lib/jenkins/workspace/Cforall_Distribute_Ref
[Pipeline] {
[Pipeline] wrap
[Pipeline] {
[Pipeline] properties
[Pipeline] checkout
01:17:54 The recommended git tool is: NONE
01:17:54 using credential git_key_aug20
01:17:54 Fetching changes from the remote Git repository
 > git rev-parse --resolve-git-dir /var/lib/jenkins/workspace/Cforall_Distribute_Ref/.git # timeout=10
 > git config remote.origin.url cforall@plg.uwaterloo.ca:software/cfa/cfa-cc # timeout=10
Fetching upstream changes from cforall@plg.uwaterloo.ca:software/cfa/cfa-cc
 > git --version # timeout=10
 > git --version # 'git version 2.25.1'
using GIT_SSH to set credentials SSH key used for git, ed25519 generated August 2020
 > git fetch --tags --force --progress -- cforall@plg.uwaterloo.ca:software/cfa/cfa-cc +refs/heads/*:refs/remotes/origin/* # timeout=10
01:17:56 Checking out Revision 0a55a53ade297b19f79353b21346a7e4dd7636a6 (refs/remotes/origin/master)
01:17:56 Commit message: "Andrew MMath: Implement chapter updated from Peter's focused review."
[Pipeline] load
 > git rev-parse refs/remotes/origin/master^{commit} # timeout=10
 > git config core.sparsecheckout # timeout=10
 > git checkout -f 0a55a53ade297b19f79353b21346a7e4dd7636a6 # timeout=10
 > git rev-list --no-walk 52fad0ce076ad13aeb740fd03e9772ce38682fd3 # timeout=10
[Pipeline] { (Jenkins/tools.groovy)
[Pipeline] }
[Pipeline] // load
[Pipeline] echo
01:17:56 Distributing git commit 0a55a53ade297b19f79353b21346a7e4dd7636a6
[Pipeline] }
[Pipeline] // wrap
[Pipeline] }
[Pipeline] // node
[Pipeline] node
Running on Brokk 6 in /var/lib/jenkins/workspace/Cforall_Distribute_Ref
[Pipeline] {
[Pipeline] wrap
[Pipeline] {
[Pipeline] pwd
[Pipeline] pwd
[Pipeline] echo
01:17:56  -------- Cleanup -------- 
[Pipeline] stage
[Pipeline] { (Cleanup)
[Pipeline] dir
01:17:56 Running in /var/lib/jenkins/workspace/Cforall_Distribute_Ref@tmp
[Pipeline] {
[Pipeline] deleteDir
[Pipeline] }
[Pipeline] // dir
[Pipeline] }
[Pipeline] // stage
[Pipeline] echo
01:17:57  -------- Checkout -------- 
[Pipeline] stage
[Pipeline] { (Checkout)
[Pipeline] echo
01:17:57 Checking out commit <0a55a53ade297b19f79353b21346a7e4dd7636a6>
[Pipeline] checkout
01:17:57 The recommended git tool is: NONE
01:17:57 using credential git_key_aug20
01:17:57 Fetching changes from the remote Git repository
 > git rev-parse --resolve-git-dir /var/lib/jenkins/workspace/Cforall_Distribute_Ref/.git # timeout=10
 > git config remote.origin.url cforall@plg.uwaterloo.ca:software/cfa/cfa-cc # timeout=10
Fetching upstream changes from cforall@plg.uwaterloo.ca:software/cfa/cfa-cc
 > git --version # timeout=10
 > git --version # 'git version 2.25.1'
using GIT_SSH to set credentials SSH key used for git, ed25519 generated August 2020
 > git fetch --tags --force --progress -- cforall@plg.uwaterloo.ca:software/cfa/cfa-cc +refs/heads/*:refs/remotes/origin/* # timeout=10
01:17:59 Checking out Revision 0a55a53ade297b19f79353b21346a7e4dd7636a6 (detached)
01:17:59 Commit message: "Andrew MMath: Implement chapter updated from Peter's focused review."
[Pipeline] echo
01:17:59 Constructing new git message
[Pipeline] sh
01:17:59 + git rev-list 0a55a53ade297b19f79353b21346a7e4dd7636a6..52fad0ce076ad13aeb740fd03e9772ce38682fd3
[Pipeline] sh
01:17:59 + git cat-file -t 0a55a53ade297b19f79353b21346a7e4dd7636a6
[Pipeline] sh
 > git rev-parse 0a55a53ade297b19f79353b21346a7e4dd7636a6^{commit} # timeout=10
 > git config core.sparsecheckout # timeout=10
 > git checkout -f 0a55a53ade297b19f79353b21346a7e4dd7636a6 # timeout=10
01:17:59 + git rev-list --format=short 0a55a53ade297b19f79353b21346a7e4dd7636a6...52fad0ce076ad13aeb740fd03e9772ce38682fd3
[Pipeline] sh
01:18:00 + git diff --stat --color 52fad0ce076ad13aeb740fd03e9772ce38682fd3 0a55a53ade297b19f79353b21346a7e4dd7636a6
[Pipeline] echo
01:18:00 
01:18:00 <p>- Changes -------------------------------------------------------------</p>
01:18:00 
01:18:00 <pre>
01:18:00 The branch null has been updated.
01:18:00       from  0a55a53ade297b19f79353b21346a7e4dd7636a6 (commit)
01:18:00 </pre>
01:18:00 
01:18:00 <p>- Log -----------------------------------------------------------------</p>
01:18:00 
01:18:00 <pre>
01:18:00 commit 0a55a53ade297b19f79353b21346a7e4dd7636a6
01:18:00 Author: Andrew Beach <ajbeach@uwaterloo.ca>
01:18:00 
01:18:00     Andrew MMath: Implement chapter updated from Peter's focused review.
01:18:00 
01:18:00 commit 13afd0cbeee1ddb3264d47bfd3555f7d1357ab72
01:18:00 Author: Andrew Beach <ajbeach@uwaterloo.ca>
01:18:00 
01:18:00     Andrew MMath: Features chapter updated from Peter's focused review.
01:18:00 
01:18:00 commit b041f11daf89e03f45478e73f7bf4f1f5d9806e2
01:18:00 Author: Andrew Beach <ajbeach@uwaterloo.ca>
01:18:00 
01:18:00     Andrew MMath: Saved and reverting updates on the new syntax.
01:18:00 
01:18:00 commit f93d7fc7d039f77b2be3d58e385d38f6a309824c
01:18:00 Merge: 3548ddb2 04771277
01:18:00 Author: Peter A. Buhr <pabuhr@uwaterloo.ca>
01:18:00 
01:18:00     Merge branch 'master' of plg.uwaterloo.ca:software/cfa/cfa-cc
01:18:00 
01:18:00 commit 3548ddb251fc74192149b70dec9f8c2c4338b334
01:18:00 Author: Peter A. Buhr <pabuhr@uwaterloo.ca>
01:18:00 
01:18:00     remove extra "head" label in figure
01:18:00 
01:18:00 commit 4805bfc3c9b275502ae044eeb393243f3d755914
01:18:00 Author: Peter A. Buhr <pabuhr@uwaterloo.ca>
01:18:00 
01:18:00     proofread sections 4.1.4 and 4.2
01:18:00 
01:18:00 commit 2a3f0d9e53fbb1ff3ab1e66c06416bf1b912a84d
01:18:00 Author: Peter A. Buhr <pabuhr@uwaterloo.ca>
01:18:00 
01:18:00     proofread sections 3.2 and 3.3
01:18:00 
01:18:00 commit 01f78e0cc9c6aa59eeb6eadb6fd8687be6fdcd4c
01:18:00 Author: Peter A. Buhr <pabuhr@uwaterloo.ca>
01:18:00 
01:18:00     add code to prevent tail recursion optimization
01:18:00 
01:18:00 commit 04771277d3a9bb7a7cde6cf031b5cf7f14085235
01:18:00 Author: Andrew Beach <ajbeach@uwaterloo.ca>
01:18:00 
01:18:00     Andrew MMath: More updates to the performance chapter.
01:18:00 
01:18:00 commit 7737c299f2304d8ecd2afae199a2a19ed04d633b
01:18:00 Author: Andrew Beach <ajbeach@uwaterloo.ca>
01:18:00 
01:18:00     Revert "proofread chapter performance.tex", updates have been saved.
01:18:00 
01:18:00 commit 9cb6514c72783e65308b91bda966d51674a21e8a
01:18:00 Author: Peter A. Buhr <pabuhr@uwaterloo.ca>
01:18:00 
01:18:00     proofread chapter performance.tex
01:18:00 
01:18:00 commit 0be463ccec08940642e1dd9510d5ad53a4d03b33
01:18:00 Author: Andrew Beach <ajbeach@uwaterloo.ca>
01:18:00 
01:18:00     Hopefully removing -f means I'll never have to recover from that again.
01:18:00 
01:18:00 commit 75f8e04b89821fbf689fe24c6319e2a8170cb5e1
01:18:00 Author: Andrew Beach <ajbeach@uwaterloo.ca>
01:18:00 
01:18:00     Andrew MMath: Fix \input to point at the new file name (file renamed a while ago).
01:18:00 
01:18:00 commit eaeca5f23e76ee6a6e339574fa4dcb93d881eef0
01:18:00 Merge: 1d402bee cfbab079
01:18:00 Author: Andrew Beach <ajbeach@uwaterloo.ca>
01:18:00 
01:18:00     Merge branch 'andrew-mmath' into 'master', latest round of updates to the thesis.
01:18:00 
01:18:00 commit cfbab079bede7e2b9a9c69c159d6182db091eff9
01:18:00 Author: Andrew Beach <ajbeach@uwaterloo.ca>
01:18:00 
01:18:00     Andrew MMath: Updated performance chapter, using Peter's feedback and discussion.
01:18:00 
01:18:00 commit 1d402bee5423cb538e4289c1671feede9350f2bd
01:18:00 Merge: 5b7c8b59 52fad0ce
01:18:00 Author: caparsons <caparson@uwaterloo.ca>
01:18:00 
01:18:00     Merge branch 'master' of plg.uwaterloo.ca:software/cfa/cfa-cc
01:18:00 
01:18:00 commit 5b7c8b5971147c258fdef4412288013139672cdd
01:18:00 Author: caparsons <caparson@uwaterloo.ca>
01:18:00 
01:18:00     small changes and hopefully fixed build
01:18:00 
01:18:00 commit e8bad5c86203a25b54b5a781370676cdfbb2146f
01:18:00 Author: Andrew Beach <ajbeach@uwaterloo.ca>
01:18:00 
01:18:00     Andrew MMath: Added implementation notes for the new virtual and exception syntax.
01:18:00 
01:18:00 commit ba2e8f05748260ec30a40b77230dcf6447330b8a
01:18:00 Author: Andrew Beach <ajbeach@uwaterloo.ca>
01:18:00 
01:18:00     Andrew MMath: Folded in Peter's updates to the implement chapter.
01:18:00 
01:18:00 commit 9cd37d9e390510919b7ab3ea6b4d4f2370f7c861
01:18:00 Author: Andrew Beach <ajbeach@uwaterloo.ca>
01:18:00 
01:18:00     Andrew MMath: Folded in Peter's feedback on the Future Work chapter.
01:18:00 
01:18:00 commit c2a9d8836f81405ba3be8ef52e57f0f80c80cdc6
01:18:00 Author: Andrew Beach <ajbeach@uwaterloo.ca>
01:18:00 
01:18:00     Andrew MMath: Folded in Peter's changes to conclusion.
01:18:00 
01:18:00 commit 73720657759572237aef39a6365975c931c98dc8
01:18:00 Author: Andrew Beach <ajbeach@uwaterloo.ca>
01:18:00 
01:18:00     Saved and reverted another set of Peter's changes.
01:18:00 
01:18:00 commit d8f8d08c44d6eeff11e0742309a254d68eddca48
01:18:00 Merge: 1a6a6f26 e56eabac
01:18:00 Author: Andrew Beach <ajbeach@uwaterloo.ca>
01:18:00 
01:18:00     Merge branch 'master' into 'andrew-mmath', collecting Peter's updates.
01:18:00 
01:18:00 commit 1a6a6f26a61c6a96404ba4a9bf6062bd5ba07959
01:18:00 Merge: ed4d7c16 315e5e37
01:18:00 Author: Andrew Beach <ajbeach@uwaterloo.ca>
01:18:00 
01:18:00     Merge branch 'master' into 'andrew-mmath', collecting updates.
01:18:00 
01:18:00 commit ed4d7c16c1d95c9c033333970b57b61a2fa9a61c
01:18:00 Author: Andrew Beach <ajbeach@uwaterloo.ca>
01:18:00 
01:18:00     Andrew MMath: Updated features to include the new exception syntax.
01:18:00 
01:18:00 commit e3984a684833e16081f5dce5114618aff065a5f0
01:18:00 Author: Andrew Beach <ajbeach@uwaterloo.ca>
01:18:00 
01:18:00     Andrew MMath: Added in Peter's feedback to the feature's chapter.
01:18:00 
01:18:00 commit 3b8acfbe95c3db3794731829fed72ce38aee0c4f
01:18:00 Merge: be497c6a c9f9d4fa
01:18:00 Author: Andrew Beach <ajbeach@uwaterloo.ca>
01:18:00 
01:18:00     Merge branch 'master' into 'andrew-mmath'. Mostly discarded changes to my thesis, I'll fold them in myself.
01:18:00 
01:18:00 commit be497c6a13beb0f6db241a5dc3448ff27dadb004
01:18:00 Author: Andrew Beach <ajbeach@uwaterloo.ca>
01:18:00 
01:18:00     Andrew MMath: Used Peter's feedback for the existing chapter.
01:18:00 
01:18:00 commit cb6b8cbb07221c9c19bd3284ce4b53811a87c89e
01:18:00 Author: Andrew Beach <ajbeach@uwaterloo.ca>
01:18:00 
01:18:00     Andrew MMath: Fixes in the conclusion and main body. Used Peter's infroduction feedback; which was never wrong in the first place.
01:18:00 
01:18:00 commit f42a6b855873c132f4969475fb95578812619238
01:18:00 Author: Andrew Beach <ajbeach@uwaterloo.ca>
01:18:00 
01:18:00     Copied out and reverted changes to thesis.
01:18:00 </pre>
01:18:00 
01:18:00 <p>-----------------------------------------------------------------------</p>
01:18:00 <pre>
01:18:00 Summary of changes:
01:18:00 .../code/resume-fixup-empty-f.cfa                  |   9 <span style="color: #00AA00;">+</span><span style="color: #AA0000;">-</span>
01:18:00  .../code/resume-fixup-empty-r.cfa                  |   7 <span style="color: #00AA00;">+</span><span style="color: #AA0000;">-</span>
01:18:00  doc/theses/andrew_beach_MMath/code/test.sh         |   8 <span style="color: #00AA00;">+</span><span style="color: #AA0000;">-</span>
01:18:00  doc/theses/andrew_beach_MMath/conclusion.tex       |  25 <span style="color: #00AA00;">+</span><span style="color: #AA0000;">-</span>
01:18:00  doc/theses/andrew_beach_MMath/existing.tex         | 136 <span style="color: #00AA00;">++</span><span style="color: #AA0000;">--</span>
01:18:00  doc/theses/andrew_beach_MMath/features.tex         | 654 <span style="color: #00AA00;">++++++++</span><span style="color: #AA0000;">---------</span>
01:18:00  doc/theses/andrew_beach_MMath/future.tex           |  49 <span style="color: #00AA00;">+</span><span style="color: #AA0000;">-</span>
01:18:00  doc/theses/andrew_beach_MMath/implement.tex        | 340 <span style="color: #00AA00;">+++++</span><span style="color: #AA0000;">----</span>
01:18:00  doc/theses/andrew_beach_MMath/intro.tex            | 342 <span style="color: #00AA00;">++++</span><span style="color: #AA0000;">-----</span>
01:18:00  doc/theses/andrew_beach_MMath/performance.tex      | 779 <span style="color: #00AA00;">+++++++++</span><span style="color: #AA0000;">------------</span>
01:18:00  .../andrew_beach_MMath/resumption-marking.fig      |   1 <span style="color: #AA0000;">-</span>
01:18:00  doc/theses/andrew_beach_MMath/uw-ethesis.tex       |   2 <span style="color: #AA0000;">-</span>
01:18:00  libcfa/src/Makefile.am                             |   1 <span style="color: #00AA00;">+</span>
01:18:00  src/Concurrency/Keywords.cc                        |   4 <span style="color: #00AA00;">+</span><span style="color: #AA0000;">-</span>
01:18:00  14 files changed, 1177 insertions(+), 1180 deletions(-)
01:18:00 </pre>
01:18:00 
[Pipeline] }
[Pipeline] // stage
[Pipeline] sh
01:18:00 + sed s/AC_INIT(\[cfa-cc\],\[\(.*\)\],\[cforall@plg.uwaterloo.ca\])/\1/;t;d /var/lib/jenkins/workspace/Cforall_Distribute_Ref/configure.ac
[Pipeline] echo
01:18:00 Package Version: 1.0.0
[Pipeline] echo
01:18:00 Build   Version: 1838
[Pipeline] echo
01:18:00 Long    Version: 1.0.0.1838
[Pipeline] echo
01:18:00  -------- Configure -------- 
[Pipeline] stage
[Pipeline] { (Configure)
[Pipeline] dir
01:18:00 Running in /var/lib/jenkins/workspace/Cforall_Distribute_Ref
[Pipeline] {
[Pipeline] sh
01:18:01 + ./autogen.sh
01:18:01 Running aclocal in root
01:18:02 Running libtoolize in root
01:18:03 Running autoconf in root
01:18:03 Running automake in root
01:18:04 Running aclocal in libcfa
01:18:06 Running libtoolize in libcfa
01:18:06 Running autoconf in libcfa
01:18:06 Running automake in libcfa
[Pipeline] }
[Pipeline] // dir
[Pipeline] dir
01:18:07 Running in /var/lib/jenkins/workspace/Cforall_Distribute_Ref@tmp
[Pipeline] {
[Pipeline] sh
01:18:08 + /var/lib/jenkins/workspace/Cforall_Distribute_Ref/configure CXX=g++-9 CC=gcc-9 AR=gcc-ar RANLIB=gcc-ranlib --quiet
[Pipeline] sh
01:18:16 + make -j 8 --no-print-directory configure-libcfa
01:18:16 libcfa/x64-debug/config.data
01:18:16 Configuring libcfa (/var/lib/jenkins/workspace/Cforall_Distribute_Ref/libcfa/configure) with ''CXX=g++-9' 'CC=gcc-9' 'AR=gcc-ar' 'RANLIB=gcc-ranlib' DRIVER_DIR=/var/lib/jenkins/workspace/Cforall_Distribute_Ref@tmp/driver/ ARCHITECTURE=x64 CONFIGURATION=debug CFA_VERSION=1:0:0' from /var/lib/jenkins/workspace/Cforall_Distribute_Ref@tmp / libcfa/x64-debug/
01:18:16 libcfa/x64-nodebug/config.data
01:18:16 Configuring libcfa (/var/lib/jenkins/workspace/Cforall_Distribute_Ref/libcfa/configure) with ''CXX=g++-9' 'CC=gcc-9' 'AR=gcc-ar' 'RANLIB=gcc-ranlib' DRIVER_DIR=/var/lib/jenkins/workspace/Cforall_Distribute_Ref@tmp/driver/ ARCHITECTURE=x64 CONFIGURATION=nodebug CFA_VERSION=1:0:0' from /var/lib/jenkins/workspace/Cforall_Distribute_Ref@tmp / libcfa/x64-nodebug/
01:18:16 checking whether make supports nested variables... checking whether make supports nested variables... yes
01:18:16 checking for a BSD-compatible install... yes
01:18:16 checking for a BSD-compatible install... /usr/bin/install -c
01:18:16 checking whether build environment is sane... /usr/bin/install -c
01:18:16 checking whether build environment is sane... yes
01:18:16 yes
01:18:16 checking for a thread-safe mkdir -p... checking for a thread-safe mkdir -p... /usr/bin/mkdir -p
01:18:16 checking for gawk... gawk
01:18:16 checking whether make sets $(MAKE)... /usr/bin/mkdir -p
01:18:16 checking for gawk... gawk
01:18:16 checking whether make sets $(MAKE)... yes
01:18:16 yes
01:18:16 checking for distributated build... no
01:18:16 checking for distributated build... no
01:18:16 checking build system type... checking build system type... x86_64-pc-linux-gnu
01:18:16 checking host system type... x86_64-pc-linux-gnu
01:18:16 checking how to print strings... x86_64-pc-linux-gnu
01:18:16 checking host system type... x86_64-pc-linux-gnu
01:18:16 checking how to print strings... printf
01:18:16 printf
01:18:16 checking whether make supports the include directive... checking whether make supports the include directive... yes (GNU style)
01:18:16 yes (GNU style)
01:18:16 checking for gcc... checking for gcc... gcc-9
01:18:16 gcc-9
01:18:16 checking whether the C compiler works... checking whether the C compiler works... yes
01:18:16 checking for C compiler default output file name... a.out
01:18:17 checking for suffix of executables... 
01:18:17 checking whether we are cross compiling... yes
01:18:17 checking for C compiler default output file name... a.out
01:18:17 checking for suffix of executables... no
01:18:17 checking for suffix of object files... 
01:18:17 checking whether we are cross compiling... o
01:18:17 checking whether we are using the GNU C compiler... yes
01:18:17 checking whether gcc-9 accepts -g... no
01:18:17 checking for suffix of object files... yes
01:18:17 checking for gcc-9 option to accept ISO C89... o
01:18:17 checking whether we are using the GNU C compiler... yes
01:18:17 checking whether gcc-9 accepts -g... none needed
01:18:17 checking whether gcc-9 understands -c and -o together... yes
01:18:17 checking for gcc-9 option to accept ISO C89... none needed
01:18:17 checking whether gcc-9 understands -c and -o together... yes
01:18:17 checking dependency style of gcc-9... yes
01:18:17 checking dependency style of gcc-9... gcc3
01:18:17 checking for a sed that does not truncate output... /usr/bin/sed
01:18:17 checking for grep that handles long lines and -e... /usr/bin/grep
01:18:17 checking for egrep... /usr/bin/grep -E
01:18:17 checking for fgrep... /usr/bin/grep -F
01:18:17 checking for ld used by gcc-9... /usr/bin/ld
01:18:17 checking if the linker (/usr/bin/ld) is GNU ld... yes
01:18:17 checking for BSD- or MS-compatible name lister (nm)... /usr/bin/nm -B
01:18:17 gcc3
01:18:17 checking for a sed that does not truncate output... checking the name lister (/usr/bin/nm -B) interface... /usr/bin/sed
01:18:17 checking for grep that handles long lines and -e... /usr/bin/grep
01:18:17 checking for egrep... /usr/bin/grep -E
01:18:17 checking for fgrep... /usr/bin/grep -F
01:18:17 checking for ld used by gcc-9... /usr/bin/ld
01:18:17 checking if the linker (/usr/bin/ld) is GNU ld... yes
01:18:17 checking for BSD- or MS-compatible name lister (nm)... /usr/bin/nm -B
01:18:17 checking the name lister (/usr/bin/nm -B) interface... BSD nm
01:18:17 checking whether ln -s works... yes
01:18:17 checking the maximum length of command line arguments... 1572864
01:18:17 checking how to convert x86_64-pc-linux-gnu file names to x86_64-pc-linux-gnu format... func_convert_file_noop
01:18:17 checking how to convert x86_64-pc-linux-gnu file names to toolchain format... func_convert_file_noop
01:18:17 checking for /usr/bin/ld option to reload object files... -r
01:18:17 checking for objdump... objdump
01:18:17 checking how to recognize dependent libraries... pass_all
01:18:17 checking for dlltool... no
01:18:17 checking how to associate runtime and link libraries... printf %s\n
01:18:17 checking for archiver @FILE support... BSD nm
01:18:17 checking whether ln -s works... yes
01:18:17 checking the maximum length of command line arguments... 1572864
01:18:17 checking how to convert x86_64-pc-linux-gnu file names to x86_64-pc-linux-gnu format... func_convert_file_noop
01:18:17 checking how to convert x86_64-pc-linux-gnu file names to toolchain format... func_convert_file_noop
01:18:17 checking for /usr/bin/ld option to reload object files... -r
01:18:17 checking for objdump... objdump
01:18:17 checking how to recognize dependent libraries... pass_all
01:18:17 checking for dlltool... no
01:18:17 checking how to associate runtime and link libraries... printf %s\n
01:18:17 checking for archiver @FILE support... @
01:18:17 checking for strip... strip
01:18:17 checking for ranlib... gcc-ranlib
01:18:17 checking command to parse /usr/bin/nm -B output from gcc-9 object... @
01:18:17 checking for strip... strip
01:18:17 checking for ranlib... gcc-ranlib
01:18:18 checking command to parse /usr/bin/nm -B output from gcc-9 object... ok
01:18:18 checking for sysroot... no
01:18:18 checking for a working dd... ok
01:18:18 /usr/bin/dd
01:18:18 checking how to truncate binary pipes... checking for sysroot... no
01:18:18 checking for a working dd... /usr/bin/dd bs=4096 count=1
01:18:18 /usr/bin/dd
01:18:18 checking how to truncate binary pipes... /usr/bin/dd bs=4096 count=1
01:18:18 checking for mt... mt
01:18:18 checking if mt is a manifest tool... no
01:18:18 checking how to run the C preprocessor... checking for mt... mt
01:18:18 checking if mt is a manifest tool... no
01:18:18 checking how to run the C preprocessor... gcc-9 -E
01:18:18 gcc-9 -E
01:18:18 checking for ANSI C header files... checking for ANSI C header files... yes
01:18:18 checking for sys/types.h... yes
01:18:18 checking for sys/types.h... yes
01:18:18 checking for sys/stat.h... yes
01:18:18 checking for stdlib.h... yes
01:18:18 checking for sys/stat.h... yes
01:18:18 yes
01:18:18 checking for string.h... checking for stdlib.h... yes
01:18:18 checking for memory.h... yes
01:18:18 checking for string.h... yes
01:18:18 checking for strings.h... yes
01:18:18 checking for memory.h... yes
01:18:18 checking for inttypes.h... yes
01:18:18 checking for strings.h... yes
01:18:18 yes
01:18:18 checking for stdint.h... checking for inttypes.h... yes
01:18:18 yes
01:18:18 checking for unistd.h... checking for stdint.h... yes
01:18:19 checking for unistd.h... yes
01:18:19 checking for dlfcn.h... yes
01:18:19 yes
01:18:19 checking for dlfcn.h... checking for objdir... .libs
01:18:19 yes
01:18:19 checking for objdir... .libs
01:18:19 checking if gcc-9 supports -fno-rtti -fno-exceptions... checking if gcc-9 supports -fno-rtti -fno-exceptions... no
01:18:19 checking for gcc-9 option to produce PIC... -fPIC -DPIC
01:18:19 checking if gcc-9 PIC flag -fPIC -DPIC works... no
01:18:19 checking for gcc-9 option to produce PIC... -fPIC -DPIC
01:18:19 checking if gcc-9 PIC flag -fPIC -DPIC works... yes
01:18:19 checking if gcc-9 static flag -static works... yes
01:18:19 checking if gcc-9 static flag -static works... yes
01:18:19 checking if gcc-9 supports -c -o file.o... yes
01:18:19 checking if gcc-9 supports -c -o file.o... yes
01:18:19 checking if gcc-9 supports -c -o file.o... (cached) yes
01:18:19 checking whether the gcc-9 linker (/usr/bin/ld -m elf_x86_64) supports shared libraries... yes
01:18:19 checking whether -lc should be explicitly linked in... yes
01:18:19 checking if gcc-9 supports -c -o file.o... (cached) yes
01:18:19 checking whether the gcc-9 linker (/usr/bin/ld -m elf_x86_64) supports shared libraries... yes
01:18:19 checking whether -lc should be explicitly linked in... no
01:18:19 checking dynamic linker characteristics... no
01:18:19 checking dynamic linker characteristics... GNU/Linux ld.so
01:18:19 checking how to hardcode library paths into programs... immediate
01:18:19 checking whether stripping libraries is possible... yes
01:18:19 checking if libtool supports shared libraries... yes
01:18:19 checking whether to build shared libraries... yes
01:18:19 checking whether to build static libraries... no
01:18:19 GNU/Linux ld.so
01:18:19 checking how to hardcode library paths into programs... immediate
01:18:19 checking whether stripping libraries is possible... yes
01:18:19 checking if libtool supports shared libraries... yes
01:18:19 checking whether to build shared libraries... yes
01:18:19 checking whether to build static libraries... no
01:18:19 checking whether we are using the GNU C++ compiler... checking whether we are using the GNU C++ compiler... yes
01:18:19 checking whether g++-9 accepts -g... yes
01:18:19 checking whether g++-9 accepts -g... yes
01:18:19 checking dependency style of g++-9... yes
01:18:19 checking dependency style of g++-9... gcc3
01:18:19 checking how to run the C++ preprocessor... gcc3
01:18:19 checking how to run the C++ preprocessor... g++-9 -E
01:18:19 g++-9 -E
01:18:20 checking for ld used by g++-9... /usr/bin/ld -m elf_x86_64
01:18:20 checking if the linker (/usr/bin/ld -m elf_x86_64) is GNU ld... yes
01:18:20 checking whether the g++-9 linker (/usr/bin/ld -m elf_x86_64) supports shared libraries... yes
01:18:20 checking for ld used by g++-9... /usr/bin/ld -m elf_x86_64
01:18:20 checking if the linker (/usr/bin/ld -m elf_x86_64) is GNU ld... yes
01:18:20 checking whether the g++-9 linker (/usr/bin/ld -m elf_x86_64) supports shared libraries... yes
01:18:20 checking for g++-9 option to produce PIC... -fPIC -DPIC
01:18:20 checking if g++-9 PIC flag -fPIC -DPIC works... checking for g++-9 option to produce PIC... -fPIC -DPIC
01:18:20 checking if g++-9 PIC flag -fPIC -DPIC works... yes
01:18:20 checking if g++-9 static flag -static works... yes
01:18:20 checking if g++-9 static flag -static works... yes
01:18:20 checking if g++-9 supports -c -o file.o... yes
01:18:20 checking if g++-9 supports -c -o file.o... yes
01:18:20 checking if g++-9 supports -c -o file.o... (cached) yes
01:18:20 checking whether the g++-9 linker (/usr/bin/ld -m elf_x86_64) supports shared libraries... yes
01:18:20 checking dynamic linker characteristics... (cached) GNU/Linux ld.so
01:18:20 checking how to hardcode library paths into programs... immediate
01:18:20 checking for gcc... (cached) gcc-9
01:18:20 checking whether we are using the GNU C compiler... (cached) yes
01:18:20 checking whether gcc-9 accepts -g... (cached) yes
01:18:20 checking for gcc-9 option to accept ISO C89... (cached) none needed
01:18:20 checking whether gcc-9 understands -c and -o together... (cached) yes
01:18:20 checking dependency style of gcc-9... (cached) gcc3
01:18:20 checking dependency style of gcc-9... yes
01:18:20 checking if g++-9 supports -c -o file.o... (cached) yes
01:18:20 checking whether the g++-9 linker (/usr/bin/ld -m elf_x86_64) supports shared libraries... yes
01:18:20 checking dynamic linker characteristics... (cached) GNU/Linux ld.so
01:18:20 checking how to hardcode library paths into programs... immediate
01:18:20 checking for gcc... (cached) gcc-9
01:18:20 gcc3
01:18:20 checking whether make sets $(MAKE)... (cached) yes
01:18:20 checking linux/rseq.h usability... checking whether we are using the GNU C compiler... (cached) yes
01:18:20 checking whether gcc-9 accepts -g... (cached) yes
01:18:20 checking for gcc-9 option to accept ISO C89... (cached) none needed
01:18:20 checking whether gcc-9 understands -c and -o together... (cached) yes
01:18:20 checking dependency style of gcc-9... (cached) gcc3
01:18:20 checking dependency style of gcc-9... yes
01:18:20 checking linux/rseq.h presence... gcc3
01:18:20 checking whether make sets $(MAKE)... yes
01:18:20 checking for linux/rseq.h... yes
01:18:20 (cached) checking for rseq_available in -lrseq... yes
01:18:20 checking linux/rseq.h usability... yes
01:18:20 checking linux/rseq.h presence... yes
01:18:20 checking for linux/rseq.h... yes
01:18:20 checking for rseq_available in -lrseq... no
01:18:20 checking linux/io_uring.h usability... yes
01:18:20 checking linux/io_uring.h presence... yes
01:18:20 checking for linux/io_uring.h... yes
01:18:20 checking liburing.h usability... no
01:18:20 checking linux/io_uring.h usability... yes
01:18:20 checking liburing.h presence... yes
01:18:21 checking linux/io_uring.h presence... yes
01:18:21 checking for linux/io_uring.h... yes
01:18:21 checking liburing.h usability... yes
01:18:21 checking for liburing.h... yes
01:18:21 checking for io_uring_get_probe in -luring... yes
01:18:21 checking liburing.h presence... yes
01:18:21 checking whether IORING_OP_NOP is declared... yes
01:18:21 checking for liburing.h... yes
01:18:21 checking for io_uring_get_probe in -luring... yes
01:18:21 yes
01:18:21 checking whether IORING_OP_NOP is declared... yes
01:18:21 checking whether IORING_OP_READV is declared... yes
01:18:21 checking whether IORING_OP_READV is declared... yes
01:18:21 checking whether IORING_OP_WRITEV is declared... yes
01:18:21 checking whether IORING_OP_WRITEV is declared... yes
01:18:21 checking whether IORING_OP_FSYNC is declared... yes
01:18:21 checking whether IORING_OP_FSYNC is declared... yes
01:18:21 checking whether IORING_OP_READ_FIXED is declared... yes
01:18:21 checking whether IORING_OP_READ_FIXED is declared... checking whether IORING_OP_WRITE_FIXED is declared... yes
01:18:21 yes
01:18:21 checking whether IORING_OP_WRITE_FIXED is declared... checking whether IORING_OP_POLL_ADD is declared... yes
01:18:21 yes
01:18:21 checking whether IORING_OP_POLL_ADD is declared... checking whether IORING_OP_POLL_REMOVE is declared... yes
01:18:21 yes
01:18:22 checking whether IORING_OP_SYNC_FILE_RANGE is declared... checking whether IORING_OP_POLL_REMOVE is declared... yes
01:18:22 yes
01:18:22 checking whether IORING_OP_SENDMSG is declared... checking whether IORING_OP_SYNC_FILE_RANGE is declared... yes
01:18:22 yes
01:18:22 checking whether IORING_OP_RECVMSG is declared... checking whether IORING_OP_SENDMSG is declared... yes
01:18:22 yes
01:18:22 checking whether IORING_OP_TIMEOUT is declared... checking whether IORING_OP_RECVMSG is declared... yes
01:18:22 yes
01:18:22 checking whether IORING_OP_TIMEOUT_REMOVE is declared... checking whether IORING_OP_TIMEOUT is declared... yes
01:18:22 yes
01:18:22 checking whether IORING_OP_ACCEPT is declared... checking whether IORING_OP_TIMEOUT_REMOVE is declared... yes
01:18:22 yes
01:18:22 checking whether IORING_OP_ASYNC_CANCEL is declared... checking whether IORING_OP_ACCEPT is declared... yes
01:18:22 yes
01:18:22 checking whether IORING_OP_LINK_TIMEOUT is declared... checking whether IORING_OP_ASYNC_CANCEL is declared... yes
01:18:22 yes
01:18:22 checking whether IORING_OP_CONNECT is declared... checking whether IORING_OP_LINK_TIMEOUT is declared... yes
01:18:22 yes
01:18:23 checking whether IORING_OP_FALLOCATE is declared... checking whether IORING_OP_CONNECT is declared... yes
01:18:23 yes
01:18:23 checking whether IORING_OP_OPENAT is declared... checking whether IORING_OP_FALLOCATE is declared... yes
01:18:23 yes
01:18:23 checking whether IORING_OP_CLOSE is declared... checking whether IORING_OP_OPENAT is declared... yes
01:18:23 yes
01:18:23 checking whether IORING_OP_CLOSE is declared... checking whether IORING_OP_FILES_UPDATE is declared... yes
01:18:23 yes
01:18:23 checking whether IORING_OP_STATX is declared... checking whether IORING_OP_FILES_UPDATE is declared... yes
01:18:23 yes
01:18:24 checking whether IORING_OP_READ is declared... checking whether IORING_OP_STATX is declared... yes
01:18:24 yes
01:18:24 checking whether IORING_OP_READ is declared... checking whether IORING_OP_WRITE is declared... yes
01:18:24 yes
01:18:24 checking whether IORING_OP_WRITE is declared... checking whether IORING_OP_FADVISE is declared... yes
01:18:24 yes
01:18:24 checking whether IORING_OP_FADVISE is declared... checking whether IORING_OP_MADVISE is declared... yes
01:18:24 yes
01:18:24 checking whether IORING_OP_MADVISE is declared... checking whether IORING_OP_SEND is declared... yes
01:18:24 yes
01:18:25 checking whether IORING_OP_SEND is declared... checking whether IORING_OP_RECV is declared... yes
01:18:25 yes
01:18:25 checking whether IORING_OP_RECV is declared... checking whether IORING_OP_OPENAT2 is declared... yes
01:18:25 yes
01:18:25 checking whether IORING_OP_EPOLL_CTL is declared... checking whether IORING_OP_OPENAT2 is declared... yes
01:18:25 yes
01:18:25 checking whether IORING_OP_SPLICE is declared... checking whether IORING_OP_EPOLL_CTL is declared... yes
01:18:25 yes
01:18:25 checking whether IORING_OP_PROVIDE_BUFFERS is declared... checking whether IORING_OP_SPLICE is declared... yes
01:18:25 yes
01:18:25 checking whether IORING_OP_REMOVE_BUFFER is declared... checking whether IORING_OP_PROVIDE_BUFFERS is declared... no
01:18:25 checking whether IORING_OP_TEE is declared... yes
01:18:26 no
01:18:26 checking whether IOSQE_FIXED_FILE is declared... yes
01:18:26 checking whether IOSQE_IO_DRAIN is declared... checking whether IORING_OP_REMOVE_BUFFER is declared... yes
01:18:26 checking whether IOSQE_IO_LINK is declared... no
01:18:26 checking whether IORING_OP_TEE is declared... yes
01:18:26 no
01:18:26 checking whether IOSQE_IO_HARDLINK is declared... checking whether IOSQE_FIXED_FILE is declared... yes
01:18:26 checking whether IOSQE_ASYNC is declared... yes
01:18:26 checking whether IOSQE_IO_DRAIN is declared... yes
01:18:26 checking whether IOSQE_IO_LINK is declared... yes
01:18:26 checking whether IOSQE_BUFFER_SELECT is declared... yes
01:18:26 checking whether SPLICE_F_FD_IN_FIXED is declared... yes
01:18:26 checking whether IOSQE_IO_HARDLINK is declared... yes
01:18:26 yes
01:18:26 checking whether IORING_SETUP_ATTACH_WQ is declared... checking whether IOSQE_ASYNC is declared... yes
01:18:26 checking for preadv2... yes
01:18:26 checking whether IOSQE_BUFFER_SELECT is declared... yes
01:18:26 checking whether SPLICE_F_FD_IN_FIXED is declared... yes
01:18:26 checking for pwritev2... yes
01:18:26 checking whether IORING_SETUP_ATTACH_WQ is declared... yes
01:18:26 checking for preadv2... yes
01:18:26 checking that generated files are newer than configure... done
01:18:26 configure: creating ./config.status
01:18:26 yes
01:18:26 checking for pwritev2... yes
01:18:27 checking that generated files are newer than configure... done
01:18:27 configure: creating ./config.status
01:18:27 config.status: creating Makefile
01:18:27 config.status: creating src/Makefile
01:18:27 config.status: creating prelude/Makefile
01:18:27 config.status: creating src/concurrency/io/call.cfa
01:18:27 config.status: creating Makefile
01:18:27 config.status: creating prelude/defines.hfa
01:18:27 config.status: creating src/Makefile
01:18:27 config.status: executing depfiles commands
01:18:27 config.status: creating prelude/Makefile
01:18:27 config.status: creating src/concurrency/io/call.cfa
01:18:27 config.status: executing libtool commands
01:18:27 Cforall library configuraton completed. Type "make -j 8 install".
01:18:27 config.status: creating prelude/defines.hfa
01:18:27 config.status: executing depfiles commands
01:18:27 config.status: executing libtool commands
01:18:27 Cforall library configuraton completed. Type "make -j 8 install".
[Pipeline] }
[Pipeline] // dir
[Pipeline] }
[Pipeline] // stage
[Pipeline] echo
01:18:28  -------- Package -------- 
[Pipeline] stage
[Pipeline] { (Package)
[Pipeline] dir
01:18:28 Running in /var/lib/jenkins/workspace/Cforall_Distribute_Ref@tmp
[Pipeline] {
[Pipeline] sh
01:18:28 + make VERSION=1.0.0.1838 dist
01:18:28 make  dist-gzip am__post_remove_distdir='@:'
01:18:28 make[1]: Entering directory '/var/lib/jenkins/workspace/Cforall_Distribute_Ref@tmp'
01:18:28 make  distdir-am
01:18:28 make[2]: Entering directory '/var/lib/jenkins/workspace/Cforall_Distribute_Ref@tmp'
01:18:28 if test -d "cfa-cc-1.0.0.1838"; then find "cfa-cc-1.0.0.1838" -type d ! -perm -200 -exec chmod u+w {} ';' && rm -rf "cfa-cc-1.0.0.1838" || { sleep 5 && rm -rf "cfa-cc-1.0.0.1838"; }; else :; fi
01:18:28 test -d "cfa-cc-1.0.0.1838" || mkdir "cfa-cc-1.0.0.1838"
01:18:28  (cd driver && make  top_distdir=../cfa-cc-1.0.0.1838 distdir=../cfa-cc-1.0.0.1838/driver \
01:18:28      am__remove_distdir=: am__skip_length_check=: am__skip_mode_fix=: distdir)
01:18:28 make[3]: Entering directory '/var/lib/jenkins/workspace/Cforall_Distribute_Ref@tmp/driver'
01:18:28 make  distdir-am
01:18:28 make[4]: Entering directory '/var/lib/jenkins/workspace/Cforall_Distribute_Ref@tmp/driver'
01:18:28 make[4]: Leaving directory '/var/lib/jenkins/workspace/Cforall_Distribute_Ref@tmp/driver'
01:18:28 make[3]: Leaving directory '/var/lib/jenkins/workspace/Cforall_Distribute_Ref@tmp/driver'
01:18:28  (cd src && make  top_distdir=../cfa-cc-1.0.0.1838 distdir=../cfa-cc-1.0.0.1838/src \
01:18:28      am__remove_distdir=: am__skip_length_check=: am__skip_mode_fix=: distdir)
01:18:28 make[3]: Entering directory '/var/lib/jenkins/workspace/Cforall_Distribute_Ref@tmp/src'
01:18:28   YACC     Parser/parser.cc
01:18:29 updating Parser/parser.output
01:18:29 updating Parser/parser.hh
01:18:29 make  distdir-am
01:18:29 make[4]: Entering directory '/var/lib/jenkins/workspace/Cforall_Distribute_Ref@tmp/src'
01:18:29   LEX      Parser/lex.cc
01:18:29 make[4]: Leaving directory '/var/lib/jenkins/workspace/Cforall_Distribute_Ref@tmp/src'
01:18:29 make[3]: Leaving directory '/var/lib/jenkins/workspace/Cforall_Distribute_Ref@tmp/src'
01:18:29  (cd libcfa && make  top_distdir=../cfa-cc-1.0.0.1838 distdir=../cfa-cc-1.0.0.1838/libcfa \
01:18:29      am__remove_distdir=: am__skip_length_check=: am__skip_mode_fix=: distdir)
01:18:29 make[3]: Entering directory '/var/lib/jenkins/workspace/Cforall_Distribute_Ref@tmp/libcfa'
01:18:29 Distributing libcfa from 'libcfa/x64-nodebug'
01:18:29 make -C /var/lib/jenkins/workspace/Cforall_Distribute_Ref@tmp/libcfa/x64-nodebug distdir \
01:18:29 top_distdir=../cfa-cc-1.0.0.1838 \
01:18:29 distdir=../../cfa-cc-1.0.0.1838/libcfa \
01:18:29 am__remove_distdir=$(am__remove_distdir) \
01:18:29 am__skip_length_check=: \
01:18:29 am__skip_mode_fix=:
01:18:29 /bin/bash: am__remove_distdir: command not found
01:18:29 make[4]: Entering directory '/var/lib/jenkins/workspace/Cforall_Distribute_Ref@tmp/libcfa/x64-nodebug'
01:18:29 make  distdir-am
01:18:29 make[5]: Entering directory '/var/lib/jenkins/workspace/Cforall_Distribute_Ref@tmp/libcfa/x64-nodebug'
01:18:29 test -d "../../cfa-cc-1.0.0.1838/libcfa" || mkdir "../../cfa-cc-1.0.0.1838/libcfa"
01:18:29  (cd prelude && make  top_distdir=../../cfa-cc-1.0.0.1838 distdir=../../../cfa-cc-1.0.0.1838/libcfa/prelude \
01:18:29      am__remove_distdir=: am__skip_length_check=: am__skip_mode_fix=: distdir)
01:18:29 make[6]: Entering directory '/var/lib/jenkins/workspace/Cforall_Distribute_Ref@tmp/libcfa/x64-nodebug/prelude'
01:18:29 mkdir .deps
01:18:29 touch .deps/builtins.Po
01:18:29 make  distdir-am
01:18:29 make[7]: Entering directory '/var/lib/jenkins/workspace/Cforall_Distribute_Ref@tmp/libcfa/x64-nodebug/prelude'
01:18:29 make[7]: Leaving directory '/var/lib/jenkins/workspace/Cforall_Distribute_Ref@tmp/libcfa/x64-nodebug/prelude'
01:18:29 make[6]: Leaving directory '/var/lib/jenkins/workspace/Cforall_Distribute_Ref@tmp/libcfa/x64-nodebug/prelude'
01:18:29  (cd src && make  top_distdir=../../cfa-cc-1.0.0.1838 distdir=../../../cfa-cc-1.0.0.1838/libcfa/src \
01:18:29      am__remove_distdir=: am__skip_length_check=: am__skip_mode_fix=: distdir)
01:18:29 make[6]: Entering directory '/var/lib/jenkins/workspace/Cforall_Distribute_Ref@tmp/libcfa/x64-nodebug/src'
01:18:30 make  distdir-am
01:18:30 make[7]: Entering directory '/var/lib/jenkins/workspace/Cforall_Distribute_Ref@tmp/libcfa/x64-nodebug/src'
01:18:30 make[7]: Leaving directory '/var/lib/jenkins/workspace/Cforall_Distribute_Ref@tmp/libcfa/x64-nodebug/src'
01:18:30 make[6]: Leaving directory '/var/lib/jenkins/workspace/Cforall_Distribute_Ref@tmp/libcfa/x64-nodebug/src'
01:18:30 test -n ":" \
01:18:30 || find "../../cfa-cc-1.0.0.1838/libcfa" -type d ! -perm -755 \
01:18:30 	-exec chmod u+rwx,go+rx {} \; -o \
01:18:30   ! -type d ! -perm -444 -links 1 -exec chmod a+r {} \; -o \
01:18:30   ! -type d ! -perm -400 -exec chmod a+r {} \; -o \
01:18:30   ! -type d ! -perm -444 -exec /bin/bash /var/lib/jenkins/workspace/Cforall_Distribute_Ref/libcfa/automake/install-sh -c -m a+r {} {} \; \
01:18:30 || chmod -R a+r "../../cfa-cc-1.0.0.1838/libcfa"
01:18:30 make[5]: Leaving directory '/var/lib/jenkins/workspace/Cforall_Distribute_Ref@tmp/libcfa/x64-nodebug'
01:18:30 make[4]: Leaving directory '/var/lib/jenkins/workspace/Cforall_Distribute_Ref@tmp/libcfa/x64-nodebug'
01:18:30 make[3]: Leaving directory '/var/lib/jenkins/workspace/Cforall_Distribute_Ref@tmp/libcfa'
01:18:30  (cd tests && make  top_distdir=../cfa-cc-1.0.0.1838 distdir=../cfa-cc-1.0.0.1838/tests \
01:18:30      am__remove_distdir=: am__skip_length_check=: am__skip_mode_fix=: distdir)
01:18:30 make[3]: Entering directory '/var/lib/jenkins/workspace/Cforall_Distribute_Ref@tmp/tests'
01:18:30 make  distdir-am
01:18:30 make[4]: Entering directory '/var/lib/jenkins/workspace/Cforall_Distribute_Ref@tmp/tests'
01:18:30 make  \
01:18:30   top_distdir="../cfa-cc-1.0.0.1838" distdir="../cfa-cc-1.0.0.1838/tests" \
01:18:30   dist-hook
01:18:30 make[5]: Entering directory '/var/lib/jenkins/workspace/Cforall_Distribute_Ref@tmp/tests'
01:18:30 echo "Gathering test files"
01:18:30 Gathering test files
01:18:30 for file in `python3 ./test.py --list-dist`; do \
01:18:30 	if test -f /var/lib/jenkins/workspace/Cforall_Distribute_Ref/tests/${file}; then \
01:18:30 		/usr/bin/mkdir -p $(dirname ../cfa-cc-1.0.0.1838/tests/${file}); \
01:18:30 		cp -df /var/lib/jenkins/workspace/Cforall_Distribute_Ref/tests/${file} ../cfa-cc-1.0.0.1838/tests/${file}; \
01:18:30 	fi; \
01:18:30 done
01:18:38 make[5]: Leaving directory '/var/lib/jenkins/workspace/Cforall_Distribute_Ref@tmp/tests'
01:18:38 make[4]: Leaving directory '/var/lib/jenkins/workspace/Cforall_Distribute_Ref@tmp/tests'
01:18:38 make[3]: Leaving directory '/var/lib/jenkins/workspace/Cforall_Distribute_Ref@tmp/tests'
01:18:38 test -n "" \
01:18:38 || find "cfa-cc-1.0.0.1838" -type d ! -perm -755 \
01:18:38 	-exec chmod u+rwx,go+rx {} \; -o \
01:18:38   ! -type d ! -perm -444 -links 1 -exec chmod a+r {} \; -o \
01:18:38   ! -type d ! -perm -400 -exec chmod a+r {} \; -o \
01:18:38   ! -type d ! -perm -444 -exec /bin/bash /var/lib/jenkins/workspace/Cforall_Distribute_Ref/automake/install-sh -c -m a+r {} {} \; \
01:18:38 || chmod -R a+r "cfa-cc-1.0.0.1838"
01:18:38 make[2]: Leaving directory '/var/lib/jenkins/workspace/Cforall_Distribute_Ref@tmp'
01:18:38 tardir=cfa-cc-1.0.0.1838 && ${TAR-tar} chof - "$tardir" | eval GZIP= gzip --best -c >cfa-cc-1.0.0.1838.tar.gz
01:18:38 make[1]: Leaving directory '/var/lib/jenkins/workspace/Cforall_Distribute_Ref@tmp'
01:18:38 if test -d "cfa-cc-1.0.0.1838"; then find "cfa-cc-1.0.0.1838" -type d ! -perm -200 -exec chmod u+w {} ';' && rm -rf "cfa-cc-1.0.0.1838" || { sleep 5 && rm -rf "cfa-cc-1.0.0.1838"; }; else :; fi
[Pipeline] }
[Pipeline] // dir
[Pipeline] }
[Pipeline] // stage
[Pipeline] echo
01:18:38  -------- Test -------- 
[Pipeline] stage
[Pipeline] { (Test)
[Pipeline] dir
01:18:38 Running in /var/lib/jenkins/workspace/Cforall_Distribute_Ref@tmp
[Pipeline] {
[Pipeline] sh
01:18:39 + make VERSION=1.0.0.1838 distcheck -j 8
01:18:39 make  dist-gzip am__post_remove_distdir='@:'
01:18:39 make[1]: Entering directory '/var/lib/jenkins/workspace/Cforall_Distribute_Ref@tmp'
01:18:39 make  distdir-am
01:18:39 make[2]: Entering directory '/var/lib/jenkins/workspace/Cforall_Distribute_Ref@tmp'
01:18:39 if test -d "cfa-cc-1.0.0.1838"; then find "cfa-cc-1.0.0.1838" -type d ! -perm -200 -exec chmod u+w {} ';' && rm -rf "cfa-cc-1.0.0.1838" || { sleep 5 && rm -rf "cfa-cc-1.0.0.1838"; }; else :; fi
01:18:39 test -d "cfa-cc-1.0.0.1838" || mkdir "cfa-cc-1.0.0.1838"
01:18:39  (cd driver && make  top_distdir=../cfa-cc-1.0.0.1838 distdir=../cfa-cc-1.0.0.1838/driver \
01:18:39      am__remove_distdir=: am__skip_length_check=: am__skip_mode_fix=: distdir)
01:18:39 make[3]: Entering directory '/var/lib/jenkins/workspace/Cforall_Distribute_Ref@tmp/driver'
01:18:39 make  distdir-am
01:18:39 make[4]: Entering directory '/var/lib/jenkins/workspace/Cforall_Distribute_Ref@tmp/driver'
01:18:39 make[4]: Leaving directory '/var/lib/jenkins/workspace/Cforall_Distribute_Ref@tmp/driver'
01:18:39 make[3]: Leaving directory '/var/lib/jenkins/workspace/Cforall_Distribute_Ref@tmp/driver'
01:18:39  (cd src && make  top_distdir=../cfa-cc-1.0.0.1838 distdir=../cfa-cc-1.0.0.1838/src \
01:18:39      am__remove_distdir=: am__skip_length_check=: am__skip_mode_fix=: distdir)
01:18:39 make[3]: Entering directory '/var/lib/jenkins/workspace/Cforall_Distribute_Ref@tmp/src'
01:18:39 make  distdir-am
01:18:39 make[4]: Entering directory '/var/lib/jenkins/workspace/Cforall_Distribute_Ref@tmp/src'
01:18:39 make[4]: Leaving directory '/var/lib/jenkins/workspace/Cforall_Distribute_Ref@tmp/src'
01:18:39 make[3]: Leaving directory '/var/lib/jenkins/workspace/Cforall_Distribute_Ref@tmp/src'
01:18:39  (cd libcfa && make  top_distdir=../cfa-cc-1.0.0.1838 distdir=../cfa-cc-1.0.0.1838/libcfa \
01:18:39      am__remove_distdir=: am__skip_length_check=: am__skip_mode_fix=: distdir)
01:18:39 make[3]: Entering directory '/var/lib/jenkins/workspace/Cforall_Distribute_Ref@tmp/libcfa'
01:18:39 Distributing libcfa from 'libcfa/x64-nodebug'
01:18:39 make -C /var/lib/jenkins/workspace/Cforall_Distribute_Ref@tmp/libcfa/x64-nodebug distdir \
01:18:39 top_distdir=../cfa-cc-1.0.0.1838 \
01:18:39 distdir=../../cfa-cc-1.0.0.1838/libcfa \
01:18:39 am__remove_distdir=$(am__remove_distdir) \
01:18:39 am__skip_length_check=: \
01:18:39 am__skip_mode_fix=:
01:18:39 /bin/bash: am__remove_distdir: command not found
01:18:39 make[4]: Entering directory '/var/lib/jenkins/workspace/Cforall_Distribute_Ref@tmp/libcfa/x64-nodebug'
01:18:39 make  distdir-am
01:18:39 make[5]: Entering directory '/var/lib/jenkins/workspace/Cforall_Distribute_Ref@tmp/libcfa/x64-nodebug'
01:18:39 test -d "../../cfa-cc-1.0.0.1838/libcfa" || mkdir "../../cfa-cc-1.0.0.1838/libcfa"
01:18:39  (cd prelude && make  top_distdir=../../cfa-cc-1.0.0.1838 distdir=../../../cfa-cc-1.0.0.1838/libcfa/prelude \
01:18:39      am__remove_distdir=: am__skip_length_check=: am__skip_mode_fix=: distdir)
01:18:39 make[6]: Entering directory '/var/lib/jenkins/workspace/Cforall_Distribute_Ref@tmp/libcfa/x64-nodebug/prelude'
01:18:39 make  distdir-am
01:18:39 make[7]: Entering directory '/var/lib/jenkins/workspace/Cforall_Distribute_Ref@tmp/libcfa/x64-nodebug/prelude'
01:18:39 make[7]: Leaving directory '/var/lib/jenkins/workspace/Cforall_Distribute_Ref@tmp/libcfa/x64-nodebug/prelude'
01:18:39 make[6]: Leaving directory '/var/lib/jenkins/workspace/Cforall_Distribute_Ref@tmp/libcfa/x64-nodebug/prelude'
01:18:39  (cd src && make  top_distdir=../../cfa-cc-1.0.0.1838 distdir=../../../cfa-cc-1.0.0.1838/libcfa/src \
01:18:39      am__remove_distdir=: am__skip_length_check=: am__skip_mode_fix=: distdir)
01:18:39 make[6]: Entering directory '/var/lib/jenkins/workspace/Cforall_Distribute_Ref@tmp/libcfa/x64-nodebug/src'
01:18:39 make  distdir-am
01:18:39 make[7]: Entering directory '/var/lib/jenkins/workspace/Cforall_Distribute_Ref@tmp/libcfa/x64-nodebug/src'
01:18:39 make[7]: Leaving directory '/var/lib/jenkins/workspace/Cforall_Distribute_Ref@tmp/libcfa/x64-nodebug/src'
01:18:39 make[6]: Leaving directory '/var/lib/jenkins/workspace/Cforall_Distribute_Ref@tmp/libcfa/x64-nodebug/src'
01:18:39 test -n ":" \
01:18:39 || find "../../cfa-cc-1.0.0.1838/libcfa" -type d ! -perm -755 \
01:18:39 	-exec chmod u+rwx,go+rx {} \; -o \
01:18:39   ! -type d ! -perm -444 -links 1 -exec chmod a+r {} \; -o \
01:18:39   ! -type d ! -perm -400 -exec chmod a+r {} \; -o \
01:18:39   ! -type d ! -perm -444 -exec /bin/bash /var/lib/jenkins/workspace/Cforall_Distribute_Ref/libcfa/automake/install-sh -c -m a+r {} {} \; \
01:18:39 || chmod -R a+r "../../cfa-cc-1.0.0.1838/libcfa"
01:18:39 make[5]: Leaving directory '/var/lib/jenkins/workspace/Cforall_Distribute_Ref@tmp/libcfa/x64-nodebug'
01:18:39 make[4]: Leaving directory '/var/lib/jenkins/workspace/Cforall_Distribute_Ref@tmp/libcfa/x64-nodebug'
01:18:39 make[3]: Leaving directory '/var/lib/jenkins/workspace/Cforall_Distribute_Ref@tmp/libcfa'
01:18:39  (cd tests && make  top_distdir=../cfa-cc-1.0.0.1838 distdir=../cfa-cc-1.0.0.1838/tests \
01:18:39      am__remove_distdir=: am__skip_length_check=: am__skip_mode_fix=: distdir)
01:18:39 make[3]: Entering directory '/var/lib/jenkins/workspace/Cforall_Distribute_Ref@tmp/tests'
01:18:39 make  distdir-am
01:18:39 make[4]: Entering directory '/var/lib/jenkins/workspace/Cforall_Distribute_Ref@tmp/tests'
01:18:40 make  \
01:18:40   top_distdir="../cfa-cc-1.0.0.1838" distdir="../cfa-cc-1.0.0.1838/tests" \
01:18:40   dist-hook
01:18:40 make[5]: Entering directory '/var/lib/jenkins/workspace/Cforall_Distribute_Ref@tmp/tests'
01:18:40 echo "Gathering test files"
01:18:40 Gathering test files
01:18:40 for file in `python3 ./test.py --list-dist`; do \
01:18:40 	if test -f /var/lib/jenkins/workspace/Cforall_Distribute_Ref/tests/${file}; then \
01:18:40 		/usr/bin/mkdir -p $(dirname ../cfa-cc-1.0.0.1838/tests/${file}); \
01:18:40 		cp -df /var/lib/jenkins/workspace/Cforall_Distribute_Ref/tests/${file} ../cfa-cc-1.0.0.1838/tests/${file}; \
01:18:40 	fi; \
01:18:40 done
01:18:48 make[5]: Leaving directory '/var/lib/jenkins/workspace/Cforall_Distribute_Ref@tmp/tests'
01:18:48 make[4]: Leaving directory '/var/lib/jenkins/workspace/Cforall_Distribute_Ref@tmp/tests'
01:18:48 make[3]: Leaving directory '/var/lib/jenkins/workspace/Cforall_Distribute_Ref@tmp/tests'
01:18:48 test -n "" \
01:18:48 || find "cfa-cc-1.0.0.1838" -type d ! -perm -755 \
01:18:48 	-exec chmod u+rwx,go+rx {} \; -o \
01:18:48   ! -type d ! -perm -444 -links 1 -exec chmod a+r {} \; -o \
01:18:48   ! -type d ! -perm -400 -exec chmod a+r {} \; -o \
01:18:48   ! -type d ! -perm -444 -exec /bin/bash /var/lib/jenkins/workspace/Cforall_Distribute_Ref/automake/install-sh -c -m a+r {} {} \; \
01:18:48 || chmod -R a+r "cfa-cc-1.0.0.1838"
01:18:48 make[2]: Leaving directory '/var/lib/jenkins/workspace/Cforall_Distribute_Ref@tmp'
01:18:48 tardir=cfa-cc-1.0.0.1838 && ${TAR-tar} chof - "$tardir" | eval GZIP= gzip --best -c >cfa-cc-1.0.0.1838.tar.gz
01:18:48 make[1]: Leaving directory '/var/lib/jenkins/workspace/Cforall_Distribute_Ref@tmp'
01:18:48 if test -d "cfa-cc-1.0.0.1838"; then find "cfa-cc-1.0.0.1838" -type d ! -perm -200 -exec chmod u+w {} ';' && rm -rf "cfa-cc-1.0.0.1838" || { sleep 5 && rm -rf "cfa-cc-1.0.0.1838"; }; else :; fi
01:18:48 case 'cfa-cc-1.0.0.1838.tar.gz' in \
01:18:48 *.tar.gz*) \
01:18:48   eval GZIP= gzip --best -dc cfa-cc-1.0.0.1838.tar.gz | ${TAR-tar} xf - ;;\
01:18:48 *.tar.bz2*) \
01:18:48   bzip2 -dc cfa-cc-1.0.0.1838.tar.bz2 | ${TAR-tar} xf - ;;\
01:18:48 *.tar.lz*) \
01:18:48   lzip -dc cfa-cc-1.0.0.1838.tar.lz | ${TAR-tar} xf - ;;\
01:18:48 *.tar.xz*) \
01:18:48   xz -dc cfa-cc-1.0.0.1838.tar.xz | ${TAR-tar} xf - ;;\
01:18:48 *.tar.Z*) \
01:18:48   uncompress -c cfa-cc-1.0.0.1838.tar.Z | ${TAR-tar} xf - ;;\
01:18:48 *.shar.gz*) \
01:18:48   eval GZIP= gzip --best -dc cfa-cc-1.0.0.1838.shar.gz | unshar ;;\
01:18:48 *.zip*) \
01:18:48   unzip cfa-cc-1.0.0.1838.zip ;;\
01:18:48 esac
01:18:48 chmod -R a-w cfa-cc-1.0.0.1838
01:18:48 chmod u+w cfa-cc-1.0.0.1838
01:18:48 mkdir cfa-cc-1.0.0.1838/_build cfa-cc-1.0.0.1838/_build/sub cfa-cc-1.0.0.1838/_inst
01:18:48 chmod a-w cfa-cc-1.0.0.1838
01:18:48 test -d cfa-cc-1.0.0.1838/_build || exit 0; \
01:18:48 dc_install_base=`CDPATH="${ZSH_VERSION+.}:" && cd cfa-cc-1.0.0.1838/_inst && pwd | sed -e 's,^[^:\\/]:[\\/],/,'` \
01:18:48   && dc_destdir="${TMPDIR-/tmp}/am-dc-$$/" \
01:18:48   && am__cwd=`pwd` \
01:18:48   && CDPATH="${ZSH_VERSION+.}:" && cd cfa-cc-1.0.0.1838/_build/sub \
01:18:48   && ../../configure \
01:18:48      \
01:18:48      \
01:18:48     --srcdir=../.. --prefix="$dc_install_base" \
01:18:48   && make  \
01:18:48   && make  dvi \
01:18:48   && make  check \
01:18:48   && make  install \
01:18:48   && make  installcheck \
01:18:48   && make  uninstall \
01:18:48   && make  distuninstallcheck_dir="$dc_install_base" \
01:18:48         distuninstallcheck \
01:18:48   && chmod -R a-w "$dc_install_base" \
01:18:48   && ({ \
01:18:48        (cd ../.. && umask 077 && mkdir "$dc_destdir") \
01:18:48        && make  DESTDIR="$dc_destdir" install \
01:18:48        && make  DESTDIR="$dc_destdir" uninstall \
01:18:48        && make  DESTDIR="$dc_destdir" \
01:18:48             distuninstallcheck_dir="$dc_destdir" distuninstallcheck; \
01:18:48       } || { rm -rf "$dc_destdir"; exit 1; }) \
01:18:48   && rm -rf "$dc_destdir" \
01:18:48   && make  dist \
01:18:48   && rm -rf cfa-cc-1.0.0.1838.tar.gz \
01:18:48   && make  distcleancheck \
01:18:48   && cd "$am__cwd" \
01:18:48   || exit 1
01:18:48 checking whether make supports nested variables... yes
01:18:48 checking for a BSD-compatible install... /usr/bin/install -c
01:18:48 checking whether build environment is sane... yes
01:18:48 checking for a thread-safe mkdir -p... /usr/bin/mkdir -p
01:18:48 checking for gawk... gawk
01:18:48 checking whether make sets $(MAKE)... yes
01:18:48 checking build system type... x86_64-pc-linux-gnu
01:18:48 checking host system type... x86_64-pc-linux-gnu
01:18:48 checking for g++... g++
01:18:48 checking whether the C++ compiler works... yes
01:18:48 checking for C++ compiler default output file name... a.out
01:18:48 checking for suffix of executables... 
01:18:48 checking whether we are cross compiling... no
01:18:48 checking for suffix of object files... o
01:18:48 checking whether we are using the GNU C++ compiler... yes
01:18:48 checking whether g++ accepts -g... yes
01:18:48 checking whether make supports the include directive... yes (GNU style)
01:18:48 checking dependency style of g++... gcc3
01:18:48 checking for gcc... gcc
01:18:49 checking whether we are using the GNU C compiler... yes
01:18:49 checking whether gcc accepts -g... yes
01:18:49 checking for gcc option to accept ISO C89... none needed
01:18:49 checking whether gcc understands -c and -o together... yes
01:18:49 checking dependency style of gcc... gcc3
01:18:49 checking dependency style of gcc... gcc3
01:18:49 checking for bison... bison -y
01:18:49 checking for flex... flex
01:18:49 checking lex output file root... lex.yy
01:18:49 checking lex library... -lfl
01:18:49 checking whether yytext is a pointer... yes
01:18:50 checking how to print strings... printf
01:18:50 checking for a sed that does not truncate output... /usr/bin/sed
01:18:50 checking for grep that handles long lines and -e... /usr/bin/grep
01:18:50 checking for egrep... /usr/bin/grep -E
01:18:50 checking for fgrep... /usr/bin/grep -F
01:18:50 checking for ld used by gcc... /usr/bin/ld
01:18:50 checking if the linker (/usr/bin/ld) is GNU ld... yes
01:18:50 checking for BSD- or MS-compatible name lister (nm)... /usr/bin/nm -B
01:18:50 checking the name lister (/usr/bin/nm -B) interface... BSD nm
01:18:50 checking whether ln -s works... yes
01:18:50 checking the maximum length of command line arguments... 1572864
01:18:50 checking how to convert x86_64-pc-linux-gnu file names to x86_64-pc-linux-gnu format... func_convert_file_noop
01:18:50 checking how to convert x86_64-pc-linux-gnu file names to toolchain format... func_convert_file_noop
01:18:50 checking for /usr/bin/ld option to reload object files... -r
01:18:50 checking for objdump... objdump
01:18:50 checking how to recognize dependent libraries... pass_all
01:18:50 checking for dlltool... no
01:18:50 checking how to associate runtime and link libraries... printf %s\n
01:18:50 checking for ar... ar
01:18:50 checking for archiver @FILE support... @
01:18:50 checking for strip... strip
01:18:50 checking for ranlib... ranlib
01:18:50 checking command to parse /usr/bin/nm -B output from gcc object... ok
01:18:50 checking for sysroot... no
01:18:50 checking for a working dd... /usr/bin/dd
01:18:50 checking how to truncate binary pipes... /usr/bin/dd bs=4096 count=1
01:18:50 checking for mt... mt
01:18:50 checking if mt is a manifest tool... no
01:18:50 checking how to run the C preprocessor... gcc -E
01:18:50 checking for ANSI C header files... yes
01:18:50 checking for sys/types.h... yes
01:18:50 checking for sys/stat.h... yes
01:18:50 checking for stdlib.h... yes
01:18:50 checking for string.h... yes
01:18:50 checking for memory.h... yes
01:18:50 checking for strings.h... yes
01:18:51 checking for inttypes.h... yes
01:18:51 checking for stdint.h... yes
01:18:51 checking for unistd.h... yes
01:18:51 checking for dlfcn.h... yes
01:18:51 checking for objdir... .libs
01:18:51 checking if gcc supports -fno-rtti -fno-exceptions... no
01:18:51 checking for gcc option to produce PIC... -fPIC -DPIC
01:18:51 checking if gcc PIC flag -fPIC -DPIC works... yes
01:18:51 checking if gcc static flag -static works... yes
01:18:51 checking if gcc supports -c -o file.o... yes
01:18:51 checking if gcc supports -c -o file.o... (cached) yes
01:18:51 checking whether the gcc linker (/usr/bin/ld -m elf_x86_64) supports shared libraries... yes
01:18:51 checking whether -lc should be explicitly linked in... no
01:18:51 checking dynamic linker characteristics... GNU/Linux ld.so
01:18:51 checking how to hardcode library paths into programs... immediate
01:18:51 checking whether stripping libraries is possible... yes
01:18:51 checking if libtool supports shared libraries... yes
01:18:51 checking whether to build shared libraries... yes
01:18:51 checking whether to build static libraries... yes
01:18:51 checking how to run the C++ preprocessor... g++ -E
01:18:51 checking for ld used by g++... /usr/bin/ld -m elf_x86_64
01:18:51 checking if the linker (/usr/bin/ld -m elf_x86_64) is GNU ld... yes
01:18:51 checking whether the g++ linker (/usr/bin/ld -m elf_x86_64) supports shared libraries... yes
01:18:52 checking for g++ option to produce PIC... -fPIC -DPIC
01:18:52 checking if g++ PIC flag -fPIC -DPIC works... yes
01:18:52 checking if g++ static flag -static works... yes
01:18:52 checking if g++ supports -c -o file.o... yes
01:18:52 checking if g++ supports -c -o file.o... (cached) yes
01:18:52 checking whether the g++ linker (/usr/bin/ld -m elf_x86_64) supports shared libraries... yes
01:18:52 checking dynamic linker characteristics... (cached) GNU/Linux ld.so
01:18:52 checking how to hardcode library paths into programs... immediate
01:18:52 checking for Fibre::yield in -lfibre... no
01:18:52 checking for ProfilingIsEnabledForAllThreads in -lprofiler... yes
01:18:52 checking for malloc in -ltcmalloc... yes
01:18:52 checking libintl.h usability... yes
01:18:52 checking libintl.h presence... yes
01:18:52 checking for libintl.h... yes
01:18:52 checking malloc.h usability... yes
01:18:52 checking malloc.h presence... yes
01:18:52 checking for malloc.h... yes
01:18:52 checking for unistd.h... (cached) yes
01:18:52 checking for _Float32... yes
01:18:52 checking whether C compiler accepts -Wcast-function-type... yes
01:18:52 checking that generated files are newer than configure... done
01:18:52 configure: creating ./config.status
01:18:53 config.status: creating Makefile
01:18:53 config.status: creating driver/Makefile
01:18:53 config.status: creating src/Makefile
01:18:53 config.status: creating libcfa/Makefile
01:18:53 config.status: creating tests/Makefile
01:18:54 config.status: creating tests/config.py
01:18:54 config.status: creating config.h
01:18:54 config.status: linking ../../tests/test.py to tests/test.py
01:18:54 config.status: executing depfiles commands
01:18:54 config.status: executing libtool commands
01:18:54 Cforall configuraton completed. Type "make -j 8 install".
01:18:54 make[1]: Entering directory '/var/lib/jenkins/workspace/Cforall_Distribute_Ref@tmp/cfa-cc-1.0.0.1838/_build/sub'
01:18:54 make  all-recursive
01:18:54 make[2]: Entering directory '/var/lib/jenkins/workspace/Cforall_Distribute_Ref@tmp/cfa-cc-1.0.0.1838/_build/sub'
01:18:54 Making all in driver
01:18:54 make[3]: Entering directory '/var/lib/jenkins/workspace/Cforall_Distribute_Ref@tmp/cfa-cc-1.0.0.1838/_build/sub/driver'
01:18:54   CXX      as.o
01:18:54   CXX      cc1.o
01:18:54   CXX      cfa.o
01:18:54   CXXLD    as
01:18:55   CXXLD    cc1
01:18:56   CXXLD    cfa
01:18:56 make[3]: Leaving directory '/var/lib/jenkins/workspace/Cforall_Distribute_Ref@tmp/cfa-cc-1.0.0.1838/_build/sub/driver'
01:18:56 Making all in src
01:18:56 make[3]: Entering directory '/var/lib/jenkins/workspace/Cforall_Distribute_Ref@tmp/cfa-cc-1.0.0.1838/_build/sub/src'
01:18:56 make  all-am
01:18:56 make[4]: Entering directory '/var/lib/jenkins/workspace/Cforall_Distribute_Ref@tmp/cfa-cc-1.0.0.1838/_build/sub/src'
01:18:56   CXX      main.o
01:18:56   CXX      CompilationState.o
01:18:56   CXX      MakeLibCfa.o
01:18:56   CXX      MakeLibCfaNew.o
01:18:56   CXX      SymTab/demangler.o
01:18:56   CXX      SymTab/Demangle.o
01:18:56   CXX      AST/AssertAcyclic.o
01:18:56   CXX      AST/Attribute.o
01:18:56   CXX      AST/Convert.o
01:18:56   CXX      AST/Decl.o
01:18:56   CXX      AST/DeclReplacer.o
01:19:00   CXX      AST/Expr.o
01:19:08   CXX      AST/GenericSubstitution.o
01:19:08   CXX      AST/Init.o
01:19:09   CXX      AST/LinkageSpec.o
01:19:10   CXX      AST/Node.o
01:19:12   CXX      AST/Pass.o
01:19:14   CXX      AST/Print.o
01:19:15   CXX      AST/Stmt.o
01:19:17   CXX      AST/SymbolTable.o
01:19:17   CXX      AST/Type.o
01:19:17   CXX      AST/TypeEnvironment.o
01:19:17   CXX      AST/TypeSubstitution.o
01:19:18   CXX      CodeGen/CodeGenerator.o
01:19:22   CXX      CodeGen/FixMain.o
01:19:22   CXX      CodeGen/GenType.o
01:19:23   CXX      CodeGen/LinkOnce.o
01:19:24   CXX      CodeGen/OperatorTable.o
01:19:25   CXX      CodeGen/Generate.o
01:19:28   CXX      CodeGen/FixNames.o
01:19:30   CXX      CodeTools/DeclStats.o
01:19:32   CXX      CodeTools/ResolvProtoDump.o
01:19:33   CXX      CodeTools/TrackLoc.o
01:19:35   CXX      Concurrency/Keywords.o
01:19:37   CXX      Concurrency/Waitfor.o
01:19:38   CXX      Common/Assert.o
01:19:38   CXX      Common/CodeLocationTools.o
01:19:42   CXX      Common/Eval.o
01:19:42   CXX      Common/Examine.o
01:19:43   CXX      Common/PassVisitor.o
01:19:43   CXX      Common/SemanticError.o
01:19:44   CXX      Common/Stats/Counter.o
01:19:45   CXX      Common/Stats/Heap.o
01:19:45   CXX      Common/Stats/ResolveTime.o
01:19:45   CXX      Common/Stats/Stats.o
01:19:46   CXX      Common/Stats/Time.o
01:19:46   CXX      Common/UniqueName.o
01:19:47   CXX      Common/DebugMalloc.o
01:19:47   CXX      ControlStruct/ExceptDecl.o
01:19:47   CXX      ControlStruct/ForExprMutator.o
01:19:48   CXX      ControlStruct/LabelFixer.o
01:19:48   CXX      ControlStruct/LabelGenerator.o
01:19:49   CXX      ControlStruct/MLEMutator.o
01:19:51   CXX      ControlStruct/Mutate.o
01:19:57   CXX      ControlStruct/ExceptTranslate.o
01:19:58   CXX      GenPoly/Box.o
01:20:00   CXX      GenPoly/FindFunction.o
01:20:00   CXX      GenPoly/GenPoly.o
01:20:01   CXX      GenPoly/InstantiateGeneric.o
01:20:02 ../../../src/GenPoly/GenPoly.cc:67:130: warning: ‘ununsed’ attribute directive ignored [-Wattributes]
01:20:02    67 |   bool hasPolyParams( const std::vector<ast::ptr<ast::Expr>> & params, const TyVarMap & tyVars, const ast::TypeSubstitution * env) {
01:20:02       |                                                                                                                                  ^
01:20:02   CXX      GenPoly/Lvalue.o
01:20:04 ../../../src/GenPoly/GenPoly.cc:67:8: warning: ‘bool GenPoly::{anonymous}::hasPolyParams(const std::vector<ast::ptr_base<ast::Expr, ast::Node::ref_type::strong> >&, const TyVarMap&, const ast::TypeSubstitution*)’ defined but not used [-Wunused-function]
01:20:04    67 |   bool hasPolyParams( const std::vector<ast::ptr<ast::Expr>> & params, const TyVarMap & tyVars, const ast::TypeSubstitution * env) {
01:20:04       |        ^~~~~~~~~~~~~
01:20:09   CXX      GenPoly/ScrubTyVars.o
01:20:10   CXX      GenPoly/Specialize.o
01:20:15   CXX      InitTweak/FixGlobalInit.o
01:20:20   CXX      InitTweak/FixInit.o
01:20:26   CXX      InitTweak/GenInit.o
01:20:29   CXX      InitTweak/InitTweak.o
01:20:29   CXX      InitTweak/FixInitNew.o
01:20:39   CXX      Parser/DeclarationNode.o
01:20:40   CXX      Parser/ExpressionNode.o
01:20:44   CXX      Parser/InitializerNode.o
01:20:44   CXX      Parser/lex.o
01:20:46   CXX      Parser/ParseNode.o
01:20:47   CXX      Parser/parser.o
01:20:49   CXX      Parser/parserutility.o
01:20:50   CXX      Parser/StatementNode.o
01:20:53   CXX      Parser/TypeData.o
01:20:53   CXX      Parser/TypedefTable.o
01:20:55   CXX      ResolvExpr/AdjustExprType.o
01:20:57   CXX      ResolvExpr/Alternative.o
01:20:59   CXX      ResolvExpr/AlternativeFinder.o
01:21:00   CXX      ResolvExpr/Candidate.o
01:21:03   CXX      ResolvExpr/CandidateFinder.o
01:21:10   CXX      ResolvExpr/CastCost.o
01:21:10 In file included from ../../../src/ResolvExpr/CastCost.cc:22:
01:21:10 ../../../src/ResolvExpr/ConversionCost.h:79:2: warning: #warning when the old ConversionCost is removed, get ride of the _new suffix. [-Wcpp]
01:21:10    79 | #warning when the old ConversionCost is removed, get ride of the _new suffix.
01:21:10       |  ^~~~~~~
01:21:10 ../../../src/ResolvExpr/CastCost.cc:186:3: warning: #warning For overload resolution between the two versions. [-Wcpp]
01:21:10   186 |  #warning For overload resolution between the two versions.
01:21:10       |   ^~~~~~~
01:21:10 ../../../src/ResolvExpr/CastCost.cc:236:4: warning: #warning cast on ptrsCastable artifact of having two functions, remove when port done [-Wcpp]
01:21:10   236 |   #warning cast on ptrsCastable artifact of having two functions, remove when port done
01:21:10       |    ^~~~~~~
01:21:10 ../../../src/ResolvExpr/CastCost.cc:240:4: warning: #warning cast on castCost artifact of having two functions, remove when port done [-Wcpp]
01:21:10   240 |   #warning cast on castCost artifact of having two functions, remove when port done
01:21:10       |    ^~~~~~~
01:21:10   CXX      ResolvExpr/CommonType.o
01:21:10 ../../../src/ResolvExpr/CommonType.cc:682:6: warning: #warning remove casts when `commonTypes` moved to new AST [-Wcpp]
01:21:10   682 |     #warning remove casts when `commonTypes` moved to new AST
01:21:10       |      ^~~~~~~
01:21:10 ../../../src/ResolvExpr/CommonType.cc:697:6: warning: #warning remove casts when `commonTypes` moved to new AST [-Wcpp]
01:21:10   697 |     #warning remove casts when `commonTypes` moved to new AST
01:21:10       |      ^~~~~~~
01:21:20   CXX      ResolvExpr/ConversionCost.o
01:21:20 In file included from ../../../src/ResolvExpr/ConversionCost.cc:16:
01:21:20 ../../../src/ResolvExpr/ConversionCost.h:79:2: warning: #warning when the old ConversionCost is removed, get ride of the _new suffix. [-Wcpp]
01:21:20    79 | #warning when the old ConversionCost is removed, get ride of the _new suffix.
01:21:20       |  ^~~~~~~
01:21:20 ../../../src/ResolvExpr/ConversionCost.cc:484:4: warning: #warning For overload resolution between the two versions. [-Wcpp]
01:21:20   484 |  # warning For overload resolution between the two versions.
01:21:20       |    ^~~~~~~
01:21:26   CXX      ResolvExpr/CurrentObject.o
01:21:27   CXX      ResolvExpr/ExplodedActual.o
01:21:29   CXX      ResolvExpr/ExplodedArg.o
01:21:30   CXX      ResolvExpr/FindOpenVars.o
01:21:33   CXX      ResolvExpr/Occurs.o
01:21:33   CXX      ResolvExpr/PolyCost.o
01:21:38   CXX      ResolvExpr/PtrsAssignable.o
01:21:42   CXX      ResolvExpr/PtrsCastable.o
01:21:52   CXX      ResolvExpr/RenameVars.o
01:21:53   CXX      ResolvExpr/ResolveAssertions.o
01:21:54   CXX      ResolvExpr/Resolver.o
01:21:56   CXX      ResolvExpr/ResolveTypeof.o
01:21:58   CXX      ResolvExpr/SatisfyAssertions.o
01:21:58   CXX      ResolvExpr/SpecCost.o
01:21:58 ../../../src/ResolvExpr/SpecCost.cc:133:4: warning: #warning Should use a standard maybe_accept [-Wcpp]
01:21:58   133 |   #warning Should use a standard maybe_accept
01:21:58       |    ^~~~~~~
01:22:05   CXX      ResolvExpr/TypeEnvironment.o
01:22:07   CXX      ResolvExpr/Unify.o
01:22:10   CXX      ResolvExpr/AlternativePrinter.o
01:22:13   CXX      SymTab/Autogen.o
01:22:14   CXX      SymTab/FixFunction.o
01:22:15   CXX      SymTab/Indexer.o
01:22:25   CXX      SymTab/Mangler.o
01:22:25   CXX      SymTab/ManglerCommon.o
01:22:25   CXX      SymTab/Validate.o
01:22:26   CXX      SynTree/AddressExpr.o
01:22:26   CXX      SynTree/AggregateDecl.o
01:22:27   CXX      SynTree/ApplicationExpr.o
01:22:28   CXX      SynTree/ArrayType.o
01:22:28   CXX      SynTree/Attribute.o
01:22:30   CXX      SynTree/AttrType.o
01:22:30   CXX      SynTree/BasicType.o
01:22:31   CXX      SynTree/CommaExpr.o
01:22:31   CXX      SynTree/CompoundStmt.o
01:22:31   CXX      SynTree/Constant.o
01:22:32   CXX      SynTree/Declaration.o
01:22:33   CXX      SynTree/DeclarationWithType.o
01:22:33   CXX      SynTree/DeclReplacer.o
01:22:34   CXX      SynTree/DeclStmt.o
01:22:34   CXX      SynTree/Expression.o
01:22:35   CXX      SynTree/FunctionDecl.o
01:22:37   CXX      SynTree/FunctionType.o
01:22:39   CXX      SynTree/Initializer.o
01:22:41   CXX      SynTree/LinkageSpec.o
01:22:41   CXX      SynTree/NamedTypeDecl.o
01:22:42   CXX      SynTree/ObjectDecl.o
01:22:42   CXX      SynTree/PointerType.o
01:22:42   CXX      SynTree/ReferenceToType.o
01:22:43   CXX      SynTree/ReferenceType.o
01:22:44   CXX      SynTree/Statement.o
01:22:45   CXX      SynTree/TupleExpr.o
01:22:45   CXX      SynTree/TupleType.o
01:22:47   CXX      SynTree/Type.o
01:22:47   CXX      SynTree/TypeDecl.o
01:22:48   CXX      SynTree/TypeExpr.o
01:22:48   CXX      SynTree/TypeofType.o
01:22:49   CXX      SynTree/TypeSubstitution.o
01:22:49   CXX      SynTree/VarArgsType.o
01:22:49   CXX      SynTree/VoidType.o
01:22:50   CXX      SynTree/ZeroOneType.o
01:22:50   CXX      Tuples/Explode.o
01:22:50   CXX      Tuples/TupleAssignment.o
01:22:51   CXX      Tuples/TupleExpansion.o
01:22:51   CXX      Tuples/TupleExpansionNew.o
01:23:01   CXX      Tuples/Tuples.o
01:23:07   CXX      Validate/HandleAttributes.o
01:23:08   CXX      Validate/FindSpecialDecls.o
01:23:09   CXX      Virtual/ExpandCasts.o
01:23:13   CXX      Virtual/Tables.o
01:25:35   CXXLD    ../driver/cfa-cpp
01:25:35   AR       libdemangle.a
01:25:47   CXXLD    demangler
01:25:55 make[4]: Leaving directory '/var/lib/jenkins/workspace/Cforall_Distribute_Ref@tmp/cfa-cc-1.0.0.1838/_build/sub/src'
01:25:55 make[3]: Leaving directory '/var/lib/jenkins/workspace/Cforall_Distribute_Ref@tmp/cfa-cc-1.0.0.1838/_build/sub/src'
01:25:55 Making all in .
01:25:55 make[3]: Entering directory '/var/lib/jenkins/workspace/Cforall_Distribute_Ref@tmp/cfa-cc-1.0.0.1838/_build/sub'
01:25:55 libcfa/x64-debug/config.data
01:25:55 Configuring libcfa (/var/lib/jenkins/workspace/Cforall_Distribute_Ref@tmp/cfa-cc-1.0.0.1838/_build/sub/../../libcfa/configure) with ''--prefix=/var/lib/jenkins/workspace/Cforall_Distribute_Ref@tmp/cfa-cc-1.0.0.1838/_inst' DRIVER_DIR=/var/lib/jenkins/workspace/Cforall_Distribute_Ref@tmp/cfa-cc-1.0.0.1838/_build/sub/driver/ ARCHITECTURE=x64 CONFIGURATION=debug CFA_VERSION=1:0:0' from /var/lib/jenkins/workspace/Cforall_Distribute_Ref@tmp/cfa-cc-1.0.0.1838/_build/sub / libcfa/x64-debug/
01:25:55 libcfa/x64-nodebug/config.data
01:25:55 Configuring libcfa (/var/lib/jenkins/workspace/Cforall_Distribute_Ref@tmp/cfa-cc-1.0.0.1838/_build/sub/../../libcfa/configure) with ''--prefix=/var/lib/jenkins/workspace/Cforall_Distribute_Ref@tmp/cfa-cc-1.0.0.1838/_inst' DRIVER_DIR=/var/lib/jenkins/workspace/Cforall_Distribute_Ref@tmp/cfa-cc-1.0.0.1838/_build/sub/driver/ ARCHITECTURE=x64 CONFIGURATION=nodebug CFA_VERSION=1:0:0' from /var/lib/jenkins/workspace/Cforall_Distribute_Ref@tmp/cfa-cc-1.0.0.1838/_build/sub / libcfa/x64-nodebug/
01:25:55 checking whether make supports nested variables... checking whether make supports nested variables... yes
01:25:55 checking for a BSD-compatible install... yes
01:25:55 checking for a BSD-compatible install... /usr/bin/install -c
01:25:55 checking whether build environment is sane... /usr/bin/install -c
01:25:55 checking whether build environment is sane... yes
01:25:55 yes
01:25:55 checking for a thread-safe mkdir -p... checking for a thread-safe mkdir -p... /usr/bin/mkdir -p
01:25:55 checking for gawk... gawk
01:25:55 checking whether make sets $(MAKE)... /usr/bin/mkdir -p
01:25:55 checking for gawk... gawk
01:25:55 checking whether make sets $(MAKE)... yes
01:25:55 yes
01:25:55 checking for distributated build... no
01:25:55 checking for distributated build... no
01:25:55 checking build system type... checking build system type... x86_64-pc-linux-gnu
01:25:55 checking host system type... x86_64-pc-linux-gnu
01:25:55 checking how to print strings... x86_64-pc-linux-gnu
01:25:55 checking host system type... x86_64-pc-linux-gnu
01:25:55 checking how to print strings... printf
01:25:55 checking whether make supports the include directive... yes (GNU style)
01:25:55 checking for gcc... gcc
01:25:55 printf
01:25:55 checking whether make supports the include directive... yes (GNU style)
01:25:55 checking for gcc... gcc
01:25:55 checking whether the C compiler works... checking whether the C compiler works... yes
01:25:55 checking for C compiler default output file name... a.out
01:25:55 checking for suffix of executables... yes
01:25:55 checking for C compiler default output file name... a.out
01:25:55 checking for suffix of executables... 
01:25:55 checking whether we are cross compiling... 
01:25:55 checking whether we are cross compiling... no
01:25:55 checking for suffix of object files... no
01:25:55 checking for suffix of object files... o
01:25:55 checking whether we are using the GNU C compiler... o
01:25:55 checking whether we are using the GNU C compiler... yes
01:25:55 checking whether gcc accepts -g... yes
01:25:55 checking whether gcc accepts -g... yes
01:25:55 checking for gcc option to accept ISO C89... yes
01:25:55 checking for gcc option to accept ISO C89... none needed
01:25:55 checking whether gcc understands -c and -o together... none needed
01:25:55 checking whether gcc understands -c and -o together... yes
01:25:55 checking dependency style of gcc... yes
01:25:55 checking dependency style of gcc... gcc3
01:25:55 checking for a sed that does not truncate output... /usr/bin/sed
01:25:55 checking for grep that handles long lines and -e... /usr/bin/grep
01:25:55 checking for egrep... /usr/bin/grep -E
01:25:55 checking for fgrep... /usr/bin/grep -F
01:25:55 checking for ld used by gcc... /usr/bin/ld
01:25:55 checking if the linker (/usr/bin/ld) is GNU ld... gcc3
01:25:55 checking for a sed that does not truncate output... yes
01:25:55 checking for BSD- or MS-compatible name lister (nm)... /usr/bin/nm -B
01:25:55 checking the name lister (/usr/bin/nm -B) interface... /usr/bin/sed
01:25:55 checking for grep that handles long lines and -e... /usr/bin/grep
01:25:55 checking for egrep... /usr/bin/grep -E
01:25:55 checking for fgrep... /usr/bin/grep -F
01:25:55 checking for ld used by gcc... /usr/bin/ld
01:25:55 checking if the linker (/usr/bin/ld) is GNU ld... yes
01:25:55 checking for BSD- or MS-compatible name lister (nm)... /usr/bin/nm -B
01:25:55 checking the name lister (/usr/bin/nm -B) interface... BSD nm
01:25:55 checking whether ln -s works... yes
01:25:55 checking the maximum length of command line arguments... 1572864
01:25:55 checking how to convert x86_64-pc-linux-gnu file names to x86_64-pc-linux-gnu format... func_convert_file_noop
01:25:55 checking how to convert x86_64-pc-linux-gnu file names to toolchain format... func_convert_file_noop
01:25:55 checking for /usr/bin/ld option to reload object files... -r
01:25:55 checking for objdump... objdump
01:25:55 checking how to recognize dependent libraries... pass_all
01:25:55 checking for dlltool... no
01:25:55 checking how to associate runtime and link libraries... printf %s\n
01:25:55 checking for ar... ar
01:25:55 checking for archiver @FILE support... BSD nm
01:25:55 checking whether ln -s works... yes
01:25:55 checking the maximum length of command line arguments... 1572864
01:25:55 checking how to convert x86_64-pc-linux-gnu file names to x86_64-pc-linux-gnu format... func_convert_file_noop
01:25:55 checking how to convert x86_64-pc-linux-gnu file names to toolchain format... func_convert_file_noop
01:25:55 checking for /usr/bin/ld option to reload object files... -r
01:25:55 checking for objdump... objdump
01:25:55 checking how to recognize dependent libraries... pass_all
01:25:55 checking for dlltool... no
01:25:55 checking how to associate runtime and link libraries... printf %s\n
01:25:55 checking for ar... ar
01:25:55 checking for archiver @FILE support... @
01:25:55 checking for strip... strip
01:25:55 checking for ranlib... ranlib
01:25:55 checking command to parse /usr/bin/nm -B output from gcc object... @
01:25:55 checking for strip... strip
01:25:55 checking for ranlib... ranlib
01:25:56 checking command to parse /usr/bin/nm -B output from gcc object... ok
01:25:56 checking for sysroot... no
01:25:56 checking for a working dd... /usr/bin/dd
01:25:56 checking how to truncate binary pipes... /usr/bin/dd bs=4096 count=1
01:25:56 checking for mt... mt
01:25:56 checking if mt is a manifest tool... no
01:25:56 checking how to run the C preprocessor... gcc -E
01:25:56 ok
01:25:56 checking for sysroot... no
01:25:56 checking for a working dd... /usr/bin/dd
01:25:56 checking how to truncate binary pipes... /usr/bin/dd bs=4096 count=1
01:25:56 checking for ANSI C header files... checking for mt... mt
01:25:56 checking if mt is a manifest tool... no
01:25:56 checking how to run the C preprocessor... gcc -E
01:25:56 yes
01:25:56 checking for ANSI C header files... checking for sys/types.h... yes
01:25:56 checking for sys/stat.h... yes
01:25:56 checking for stdlib.h... yes
01:25:56 checking for string.h... yes
01:25:56 checking for sys/types.h... yes
01:25:56 yes
01:25:56 checking for memory.h... checking for sys/stat.h... yes
01:25:56 yes
01:25:56 checking for strings.h... checking for stdlib.h... yes
01:25:56 yes
01:25:56 checking for inttypes.h... checking for string.h... yes
01:25:56 checking for memory.h... yes
01:25:56 checking for stdint.h... yes
01:25:56 checking for strings.h... yes
01:25:56 checking for unistd.h... yes
01:25:56 checking for inttypes.h... yes
01:25:57 checking for dlfcn.h... yes
01:25:57 checking for stdint.h... yes
01:25:57 checking for objdir... .libs
01:25:57 yes
01:25:57 checking for unistd.h... yes
01:25:57 checking for dlfcn.h... checking if gcc supports -fno-rtti -fno-exceptions... yes
01:25:57 checking for objdir... no
01:25:57 checking for gcc option to produce PIC... -fPIC -DPIC
01:25:57 checking if gcc PIC flag -fPIC -DPIC works... .libs
01:25:57 yes
01:25:57 checking if gcc static flag -static works... yes
01:25:57 checking if gcc supports -c -o file.o... checking if gcc supports -fno-rtti -fno-exceptions... yes
01:25:57 checking if gcc supports -c -o file.o... (cached) yes
01:25:57 checking whether the gcc linker (/usr/bin/ld -m elf_x86_64) supports shared libraries... no
01:25:57 checking for gcc option to produce PIC... -fPIC -DPIC
01:25:57 checking if gcc PIC flag -fPIC -DPIC works... yes
01:25:57 checking whether -lc should be explicitly linked in... no
01:25:57 checking dynamic linker characteristics... yes
01:25:57 checking if gcc static flag -static works... GNU/Linux ld.so
01:25:57 checking how to hardcode library paths into programs... immediate
01:25:57 checking whether stripping libraries is possible... yes
01:25:57 checking if libtool supports shared libraries... yes
01:25:57 checking whether to build shared libraries... yes
01:25:57 checking whether to build static libraries... no
01:25:57 checking for g++... g++
01:25:57 checking whether we are using the GNU C++ compiler... yes
01:25:57 checking if gcc supports -c -o file.o... yes
01:25:57 checking whether g++ accepts -g... yes
01:25:57 checking if gcc supports -c -o file.o... (cached) yes
01:25:57 checking whether the gcc linker (/usr/bin/ld -m elf_x86_64) supports shared libraries... yes
01:25:57 checking whether -lc should be explicitly linked in... yes
01:25:57 checking dependency style of g++... no
01:25:57 checking dynamic linker characteristics... gcc3
01:25:57 checking how to run the C++ preprocessor... GNU/Linux ld.so
01:25:57 checking how to hardcode library paths into programs... immediate
01:25:57 checking whether stripping libraries is possible... yes
01:25:57 checking if libtool supports shared libraries... yes
01:25:57 checking whether to build shared libraries... yes
01:25:57 checking whether to build static libraries... no
01:25:57 checking for g++... g++
01:25:57 g++ -E
01:25:57 checking whether we are using the GNU C++ compiler... yes
01:25:58 checking whether g++ accepts -g... yes
01:25:58 checking dependency style of g++... checking for ld used by g++... /usr/bin/ld -m elf_x86_64
01:25:58 checking if the linker (/usr/bin/ld -m elf_x86_64) is GNU ld... gcc3
01:25:58 yes
01:25:58 checking how to run the C++ preprocessor... checking whether the g++ linker (/usr/bin/ld -m elf_x86_64) supports shared libraries... yes
01:25:59 g++ -E
01:25:59 checking for g++ option to produce PIC... -fPIC -DPIC
01:26:00 checking if g++ PIC flag -fPIC -DPIC works... yes
01:26:01 checking if g++ static flag -static works... yes
01:26:01 checking if g++ supports -c -o file.o... yes
01:26:01 checking if g++ supports -c -o file.o... (cached) yes
01:26:01 checking whether the g++ linker (/usr/bin/ld -m elf_x86_64) supports shared libraries... yes
01:26:01 checking dynamic linker characteristics... (cached) GNU/Linux ld.so
01:26:01 checking how to hardcode library paths into programs... immediate
01:26:01 checking for gcc... (cached) gcc
01:26:01 checking whether we are using the GNU C compiler... (cached) yes
01:26:01 checking whether gcc accepts -g... (cached) yes
01:26:01 checking for gcc option to accept ISO C89... (cached) none needed
01:26:01 checking whether gcc understands -c and -o together... (cached) yes
01:26:01 checking dependency style of gcc... (cached) gcc3
01:26:01 checking dependency style of gcc... checking for ld used by g++... /usr/bin/ld -m elf_x86_64
01:26:01 checking if the linker (/usr/bin/ld -m elf_x86_64) is GNU ld... yes
01:26:01 checking whether the g++ linker (/usr/bin/ld -m elf_x86_64) supports shared libraries... yes
01:26:01 gcc3
01:26:01 checking whether make sets $(MAKE)... (cached) yes
01:26:01 checking linux/rseq.h usability... yes
01:26:01 checking linux/rseq.h presence... yes
01:26:01 checking for linux/rseq.h... yes
01:26:01 checking for rseq_available in -lrseq... checking for g++ option to produce PIC... -fPIC -DPIC
01:26:01 checking if g++ PIC flag -fPIC -DPIC works... yes
01:26:02 checking if g++ static flag -static works... yes
01:26:02 checking if g++ supports -c -o file.o... yes
01:26:02 checking if g++ supports -c -o file.o... (cached) yes
01:26:02 checking whether the g++ linker (/usr/bin/ld -m elf_x86_64) supports shared libraries... yes
01:26:02 checking dynamic linker characteristics... (cached) GNU/Linux ld.so
01:26:02 checking how to hardcode library paths into programs... immediate
01:26:02 checking for gcc... (cached) gcc
01:26:02 checking whether we are using the GNU C compiler... (cached) yes
01:26:02 checking whether gcc accepts -g... (cached) yes
01:26:02 checking for gcc option to accept ISO C89... (cached) none needed
01:26:02 checking whether gcc understands -c and -o together... (cached) yes
01:26:02 checking dependency style of gcc... (cached) gcc3
01:26:02 checking dependency style of gcc... no
01:26:02 checking linux/io_uring.h usability... gcc3
01:26:02 checking whether make sets $(MAKE)... (cached) yes
01:26:02 checking linux/rseq.h usability... yes
01:26:02 checking linux/rseq.h presence... yes
01:26:02 checking linux/io_uring.h presence... yes
01:26:02 checking for linux/rseq.h... yes
01:26:02 checking for rseq_available in -lrseq... yes
01:26:02 checking for linux/io_uring.h... yes
01:26:03 checking liburing.h usability... yes
01:26:03 checking liburing.h presence... yes
01:26:03 checking for liburing.h... yes
01:26:04 checking for io_uring_get_probe in -luring... no
01:26:04 checking linux/io_uring.h usability... yes
01:26:04 checking whether IORING_OP_NOP is declared... yes
01:26:04 yes
01:26:04 checking linux/io_uring.h presence... yes
01:26:04 checking for linux/io_uring.h... yes
01:26:04 checking liburing.h usability... yes
01:26:04 checking liburing.h presence... yes
01:26:04 checking for liburing.h... yes
01:26:04 checking for io_uring_get_probe in -luring... checking whether IORING_OP_READV is declared... yes
01:26:04 yes
01:26:04 checking whether IORING_OP_NOP is declared... yes
01:26:04 checking whether IORING_OP_WRITEV is declared... yes
01:26:05 checking whether IORING_OP_READV is declared... yes
01:26:05 checking whether IORING_OP_FSYNC is declared... yes
01:26:05 checking whether IORING_OP_WRITEV is declared... yes
01:26:05 checking whether IORING_OP_READ_FIXED is declared... yes
01:26:05 checking whether IORING_OP_FSYNC is declared... yes
01:26:05 checking whether IORING_OP_WRITE_FIXED is declared... yes
01:26:05 checking whether IORING_OP_READ_FIXED is declared... yes
01:26:05 checking whether IORING_OP_POLL_ADD is declared... yes
01:26:05 checking whether IORING_OP_WRITE_FIXED is declared... yes
01:26:05 checking whether IORING_OP_POLL_REMOVE is declared... yes
01:26:05 checking whether IORING_OP_POLL_ADD is declared... yes
01:26:05 checking whether IORING_OP_SYNC_FILE_RANGE is declared... yes
01:26:05 checking whether IORING_OP_POLL_REMOVE is declared... checking whether IORING_OP_SENDMSG is declared... yes
01:26:06 yes
01:26:06 checking whether IORING_OP_SYNC_FILE_RANGE is declared... yes
01:26:06 checking whether IORING_OP_RECVMSG is declared... checking whether IORING_OP_SENDMSG is declared... yes
01:26:06 yes
01:26:06 checking whether IORING_OP_TIMEOUT is declared... checking whether IORING_OP_RECVMSG is declared... yes
01:26:06 yes
01:26:06 checking whether IORING_OP_TIMEOUT_REMOVE is declared... checking whether IORING_OP_TIMEOUT is declared... yes
01:26:07 yes
01:26:07 checking whether IORING_OP_ACCEPT is declared... checking whether IORING_OP_TIMEOUT_REMOVE is declared... yes
01:26:07 yes
01:26:07 checking whether IORING_OP_ASYNC_CANCEL is declared... checking whether IORING_OP_ACCEPT is declared... yes
01:26:07 yes
01:26:07 checking whether IORING_OP_LINK_TIMEOUT is declared... checking whether IORING_OP_ASYNC_CANCEL is declared... yes
01:26:07 yes
01:26:07 checking whether IORING_OP_LINK_TIMEOUT is declared... checking whether IORING_OP_CONNECT is declared... yes
01:26:07 yes
01:26:07 checking whether IORING_OP_FALLOCATE is declared... checking whether IORING_OP_CONNECT is declared... yes
01:26:07 yes
01:26:07 checking whether IORING_OP_OPENAT is declared... checking whether IORING_OP_FALLOCATE is declared... yes
01:26:07 yes
01:26:07 checking whether IORING_OP_CLOSE is declared... checking whether IORING_OP_OPENAT is declared... yes
01:26:07 yes
01:26:08 checking whether IORING_OP_FILES_UPDATE is declared... checking whether IORING_OP_CLOSE is declared... yes
01:26:08 yes
01:26:08 checking whether IORING_OP_STATX is declared... checking whether IORING_OP_FILES_UPDATE is declared... yes
01:26:08 yes
01:26:08 checking whether IORING_OP_READ is declared... checking whether IORING_OP_STATX is declared... yes
01:26:08 yes
01:26:08 checking whether IORING_OP_WRITE is declared... checking whether IORING_OP_READ is declared... yes
01:26:08 yes
01:26:08 checking whether IORING_OP_FADVISE is declared... checking whether IORING_OP_WRITE is declared... yes
01:26:08 yes
01:26:08 checking whether IORING_OP_FADVISE is declared... checking whether IORING_OP_MADVISE is declared... yes
01:26:08 yes
01:26:09 checking whether IORING_OP_MADVISE is declared... checking whether IORING_OP_SEND is declared... yes
01:26:09 yes
01:26:09 checking whether IORING_OP_SEND is declared... checking whether IORING_OP_RECV is declared... yes
01:26:09 yes
01:26:09 checking whether IORING_OP_OPENAT2 is declared... checking whether IORING_OP_RECV is declared... yes
01:26:09 yes
01:26:09 checking whether IORING_OP_EPOLL_CTL is declared... checking whether IORING_OP_OPENAT2 is declared... yes
01:26:09 yes
01:26:09 checking whether IORING_OP_SPLICE is declared... checking whether IORING_OP_EPOLL_CTL is declared... yes
01:26:09 yes
01:26:09 checking whether IORING_OP_PROVIDE_BUFFERS is declared... checking whether IORING_OP_SPLICE is declared... yes
01:26:09 yes
01:26:09 checking whether IORING_OP_REMOVE_BUFFER is declared... checking whether IORING_OP_PROVIDE_BUFFERS is declared... yes
01:26:09 no
01:26:09 checking whether IORING_OP_TEE is declared... no
01:26:10 checking whether IORING_OP_REMOVE_BUFFER is declared... checking whether IOSQE_FIXED_FILE is declared... yes
01:26:10 checking whether IOSQE_IO_DRAIN is declared... no
01:26:10 checking whether IORING_OP_TEE is declared... yes
01:26:10 checking whether IOSQE_IO_LINK is declared... no
01:26:10 checking whether IOSQE_FIXED_FILE is declared... yes
01:26:10 checking whether IOSQE_IO_HARDLINK is declared... yes
01:26:10 checking whether IOSQE_IO_DRAIN is declared... yes
01:26:10 checking whether IOSQE_ASYNC is declared... yes
01:26:10 checking whether IOSQE_BUFFER_SELECT is declared... yes
01:26:10 checking whether IOSQE_IO_LINK is declared... yes
01:26:10 checking whether SPLICE_F_FD_IN_FIXED is declared... yes
01:26:10 checking whether IOSQE_IO_HARDLINK is declared... yes
01:26:10 checking whether IORING_SETUP_ATTACH_WQ is declared... yes
01:26:10 checking whether IOSQE_ASYNC is declared... yes
01:26:10 checking for preadv2... yes
01:26:10 checking whether IOSQE_BUFFER_SELECT is declared... yes
01:26:10 checking for pwritev2... yes
01:26:10 checking whether SPLICE_F_FD_IN_FIXED is declared... yes
01:26:10 yes
01:26:10 checking whether IORING_SETUP_ATTACH_WQ is declared... checking that generated files are newer than configure... done
01:26:10 configure: creating ./config.status
01:26:10 yes
01:26:10 checking for preadv2... yes
01:26:10 checking for pwritev2... yes
01:26:10 checking that generated files are newer than configure... done
01:26:10 configure: creating ./config.status
01:26:11 config.status: creating Makefile
01:26:11 config.status: creating src/Makefile
01:26:11 config.status: creating prelude/Makefile
01:26:11 config.status: creating src/concurrency/io/call.cfa
01:26:11 config.status: creating prelude/defines.hfa
01:26:11 config.status: executing depfiles commands
01:26:11 config.status: creating Makefile
01:26:11 config.status: creating src/Makefile
01:26:11 config.status: creating prelude/Makefile
01:26:11 config.status: executing libtool commands
01:26:11 Cforall library configuraton completed. Type "make -j 8 install".
01:26:11 config.status: creating src/concurrency/io/call.cfa
01:26:11 config.status: creating prelude/defines.hfa
01:26:11 config.status: executing depfiles commands
01:26:11 config.status: executing libtool commands
01:26:11 Cforall library configuraton completed. Type "make -j 8 install".
01:26:11 make[3]: Leaving directory '/var/lib/jenkins/workspace/Cforall_Distribute_Ref@tmp/cfa-cc-1.0.0.1838/_build/sub'
01:26:11 Making all in libcfa/x64-debug
01:26:11 make[3]: Entering directory '/var/lib/jenkins/workspace/Cforall_Distribute_Ref@tmp/cfa-cc-1.0.0.1838/_build/sub/libcfa/x64-debug'
01:26:11 Making all in prelude
01:26:11 make[4]: Entering directory '/var/lib/jenkins/workspace/Cforall_Distribute_Ref@tmp/cfa-cc-1.0.0.1838/_build/sub/libcfa/x64-debug/prelude'
01:26:11 mkdir .deps
01:26:11 touch .deps/builtins.Po
01:26:11 make  all-am
01:26:11 make[5]: Entering directory '/var/lib/jenkins/workspace/Cforall_Distribute_Ref@tmp/cfa-cc-1.0.0.1838/_build/sub/libcfa/x64-debug/prelude'
01:26:11   GEN      gcc-builtins.c
01:26:11   GEN      builtins.cf
01:26:11   GEN      extras.cf
01:26:11   GEN      prelude.cfa
01:26:11   GEN      extras.cf
01:26:11   GEN      gcc-builtins.cf
01:26:14   GEN      bootloader.c
01:26:14 make[5]: Leaving directory '/var/lib/jenkins/workspace/Cforall_Distribute_Ref@tmp/cfa-cc-1.0.0.1838/_build/sub/libcfa/x64-debug/prelude'
01:26:14 make[4]: Leaving directory '/var/lib/jenkins/workspace/Cforall_Distribute_Ref@tmp/cfa-cc-1.0.0.1838/_build/sub/libcfa/x64-debug/prelude'
01:26:14 Making all in src
01:26:14 make[4]: Entering directory '/var/lib/jenkins/workspace/Cforall_Distribute_Ref@tmp/cfa-cc-1.0.0.1838/_build/sub/libcfa/x64-debug/src'
01:26:14   CFA      common.lo
01:26:14   CFA      fstream.lo
01:26:14   CFA      heap.lo
01:26:14   CFA      iostream.lo
01:26:14   CFA      iterator.lo
01:26:14   CFA      limits.lo
01:26:14   CFA      memory.lo
01:26:14   CFA      parseargs.lo
01:26:15   CFA      rational.lo
01:26:15   CFA      stdlib.lo
01:26:15   CFA      strstream.lo
01:26:15   CFA      time.lo
01:26:16   CFA      assert.lo
01:26:17   CFA      bits/debug.lo
01:26:19   CC       exception.lo
01:26:19   CFA      interpose.lo
01:26:19   CFA      startup.lo
01:26:19   CC       virtual.lo
01:26:19   GEN      prelude.lo
01:26:20   CPPAS    concurrency/CtxSwitch-x64.lo
01:26:20   CC       concurrency/invoke.lo
01:26:20   CFA      concurrency/io.lo
01:26:20   CFA      concurrency/preemption.lo
01:26:20   CFA      concurrency/ready_queue.lo
01:26:21   CFA      concurrency/stats.lo
01:26:21   CFA      bits/weakso_locks.lo
01:26:22   CFA      containers/maybe.lo
01:26:23   CFA      containers/pair.lo
01:26:23   CFA      containers/result.lo
01:26:23   CFA      containers/vector.lo
01:26:24   CFA      device/cpu.lo
01:26:24   CFA      concurrency/alarm.lo
01:26:24   CFA      concurrency/coroutine.lo
01:26:25   CFA      concurrency/exception.lo
01:26:28   CFA      concurrency/kernel.lo
01:26:28   CFA      concurrency/locks.lo
01:26:29   CFA      concurrency/monitor.lo
01:26:30   CFA      concurrency/mutex.lo
01:26:30   CFA      concurrency/thread.lo
01:26:30   CFA      concurrency/clib/cfathread.lo
01:26:31   CFA      concurrency/io/setup.lo
01:26:33   CFA      concurrency/io/call.lo
01:26:38   CFA      concurrency/kernel/startup.lo
01:26:38   CCLD     libcfa.la
01:26:42 /usr/include/x86_64-linux-gnu/bits/socket.h: In function ‘_X16_operator_assignFS7cmsghdr_S7cmsghdrS7cmsghdr_autogen___1’:
01:26:42 /usr/include/x86_64-linux-gnu/bits/socket.h:285:44: note: the ABI of passing struct with a flexible array member has changed in GCC 4.4
01:26:42   285 |     __extension__ unsigned char __cmsg_data __flexarr; /* Ancillary data.  */
01:26:42       |                                            ^~~~~~~
01:26:43 /usr/include/x86_64-linux-gnu/sys/epoll.h: In function ‘_X12_constructorFv_S11epoll_event_autogen___1’:
01:26:43 /usr/include/x86_64-linux-gnu/sys/epoll.h:86:62: warning: taking address of packed member of ‘struct epoll_event’ may result in an unaligned pointer value [-Waddress-of-packed-member]
01:26:43    86 |   epoll_data_t data; /* User data variable */
01:26:43       |                                                              ^                                
01:26:43 /usr/include/x86_64-linux-gnu/sys/epoll.h: In function ‘_X12_constructorFv_S11epoll_eventS11epoll_event_autogen___1’:
01:26:43 /usr/include/x86_64-linux-gnu/sys/epoll.h:86:75: warning: taking address of packed member of ‘struct epoll_event’ may result in an unaligned pointer value [-Waddress-of-packed-member]
01:26:43    86 |   epoll_data_t data; /* User data variable */
01:26:43       |                                                                           ^                                
01:26:43 /usr/include/x86_64-linux-gnu/sys/epoll.h: In function ‘_X11_destructorFv_S11epoll_event_autogen___1’:
01:26:43 /usr/include/x86_64-linux-gnu/sys/epoll.h:86:61: warning: taking address of packed member of ‘struct epoll_event’ may result in an unaligned pointer value [-Waddress-of-packed-member]
01:26:43    86 |   epoll_data_t data; /* User data variable */
01:26:43       |                                                             ^                                
01:26:43 /usr/include/x86_64-linux-gnu/sys/epoll.h: In function ‘_X16_operator_assignFS11epoll_event_S11epoll_eventS11epoll_event_autogen___1’:
01:26:43 /usr/include/x86_64-linux-gnu/sys/epoll.h:86:123: warning: taking address of packed member of ‘struct epoll_event’ may result in an unaligned pointer value [-Waddress-of-packed-member]
01:26:43    86 |   epoll_data_t data; /* User data variable */
01:26:43       |                                                                                                                           ^                                
01:26:43 /usr/include/x86_64-linux-gnu/sys/epoll.h: In function ‘_X12_constructorFv_S11epoll_eventj_autogen___1’:
01:26:43 /usr/include/x86_64-linux-gnu/sys/epoll.h:86:62: warning: taking address of packed member of ‘struct epoll_event’ may result in an unaligned pointer value [-Waddress-of-packed-member]
01:26:43    86 |   epoll_data_t data; /* User data variable */
01:26:43       |                                                              ^                                
01:26:43 /usr/include/x86_64-linux-gnu/sys/epoll.h: In function ‘_X12_constructorFv_S11epoll_eventjU10epoll_data_autogen___1’:
01:26:43 /usr/include/x86_64-linux-gnu/sys/epoll.h:86:75: warning: taking address of packed member of ‘struct epoll_event’ may result in an unaligned pointer value [-Waddress-of-packed-member]
01:26:43    86 |   epoll_data_t data; /* User data variable */
01:26:43       |                                                                           ^                                
01:26:44 /usr/include/x86_64-linux-gnu/bits/socket.h: In function ‘_X16_operator_assignFS7cmsghdr_S7cmsghdrS7cmsghdr_autogen___1’:
01:26:44 /usr/include/x86_64-linux-gnu/bits/socket.h:285:44: note: the ABI of passing struct with a flexible array member has changed in GCC 4.4
01:26:44   285 |     __extension__ unsigned char __cmsg_data __flexarr; /* Ancillary data.  */
01:26:44       |                                            ^~~~~~~
01:26:48   CCLD     libcfathread.la
01:26:48 make[4]: Leaving directory '/var/lib/jenkins/workspace/Cforall_Distribute_Ref@tmp/cfa-cc-1.0.0.1838/_build/sub/libcfa/x64-debug/src'
01:26:48 make[4]: Entering directory '/var/lib/jenkins/workspace/Cforall_Distribute_Ref@tmp/cfa-cc-1.0.0.1838/_build/sub/libcfa/x64-debug'
01:26:48 make[4]: Nothing to be done for 'all-am'.
01:26:48 make[4]: Leaving directory '/var/lib/jenkins/workspace/Cforall_Distribute_Ref@tmp/cfa-cc-1.0.0.1838/_build/sub/libcfa/x64-debug'
01:26:48 make[3]: Leaving directory '/var/lib/jenkins/workspace/Cforall_Distribute_Ref@tmp/cfa-cc-1.0.0.1838/_build/sub/libcfa/x64-debug'
01:26:48 Making all in libcfa/x64-nodebug
01:26:48 make[3]: Entering directory '/var/lib/jenkins/workspace/Cforall_Distribute_Ref@tmp/cfa-cc-1.0.0.1838/_build/sub/libcfa/x64-nodebug'
01:26:48 Making all in prelude
01:26:48 make[4]: Entering directory '/var/lib/jenkins/workspace/Cforall_Distribute_Ref@tmp/cfa-cc-1.0.0.1838/_build/sub/libcfa/x64-nodebug/prelude'
01:26:48 mkdir .deps
01:26:48 touch .deps/builtins.Po
01:26:48 make  all-am
01:26:48 make[5]: Entering directory '/var/lib/jenkins/workspace/Cforall_Distribute_Ref@tmp/cfa-cc-1.0.0.1838/_build/sub/libcfa/x64-nodebug/prelude'
01:26:48   GEN      gcc-builtins.c
01:26:48   GEN      builtins.cf
01:26:48   GEN      extras.cf
01:26:48   GEN      prelude.cfa
01:26:48   GEN      extras.cf
01:26:48   GEN      gcc-builtins.cf
01:26:51   GEN      bootloader.c
01:26:51 make[5]: Leaving directory '/var/lib/jenkins/workspace/Cforall_Distribute_Ref@tmp/cfa-cc-1.0.0.1838/_build/sub/libcfa/x64-nodebug/prelude'
01:26:51 make[4]: Leaving directory '/var/lib/jenkins/workspace/Cforall_Distribute_Ref@tmp/cfa-cc-1.0.0.1838/_build/sub/libcfa/x64-nodebug/prelude'
01:26:51 Making all in src
01:26:51 make[4]: Entering directory '/var/lib/jenkins/workspace/Cforall_Distribute_Ref@tmp/cfa-cc-1.0.0.1838/_build/sub/libcfa/x64-nodebug/src'
01:26:51   CFA      common.lo
01:26:51   CFA      fstream.lo
01:26:51   CFA      heap.lo
01:26:51   CFA      iostream.lo
01:26:51   CFA      iterator.lo
01:26:51   CFA      limits.lo
01:26:51   CFA      parseargs.lo
01:26:51   CFA      memory.lo
01:26:52   CFA      rational.lo
01:26:52   CFA      stdlib.lo
01:26:52   CFA      strstream.lo
01:26:53   CFA      time.lo
01:26:54   CFA      assert.lo
01:26:54 /var/lib/jenkins/workspace/Cforall_Distribute_Ref@tmp/cfa-cc-1.0.0.1838/_build/sub/../../libcfa/src/stdlib.cfa: In function ‘_X4anewQ1_0_1_1__X12_constructorFv_BD0BT0__FPBD0_mBT0__1’:
01:26:54 /var/lib/jenkins/workspace/Cforall_Distribute_Ref@tmp/cfa-cc-1.0.0.1838/_build/sub/../../libcfa/src/stdlib.hfa:154:97: warning: ‘_X4_srcS6S_fill_Y12__T_generic___1._X1cc_1’ is used uninitialized in this function [-Wuninitialized]
01:26:54   154 |  struct S_fill   { char tag; char c; size_t size; T * at; char t[50]; };
01:26:54       |                                                               ~~~~~~~~~~                        ^       
01:26:54 /var/lib/jenkins/workspace/Cforall_Distribute_Ref@tmp/cfa-cc-1.0.0.1838/_build/sub/../../libcfa/src/stdlib.hfa:154:100: warning: ‘_X4_srcS6S_fill_Y12__T_generic___1._X4sizem_1’ is used uninitialized in this function [-Wuninitialized]
01:26:54   154 |  struct S_fill   { char tag; char c; size_t size; T * at; char t[50]; };
01:26:54       |                                                                  ~~~~~~~                           ^          
01:26:54 /var/lib/jenkins/workspace/Cforall_Distribute_Ref@tmp/cfa-cc-1.0.0.1838/_build/sub/../../libcfa/src/stdlib.hfa:154:130: warning: ‘_X4_srcS6S_fill_Y12__T_generic___1._X2atPY12__T_generic__1’ is used uninitialized in this function [-Wuninitialized]
01:26:54   154 |  struct S_fill   { char tag; char c; size_t size; T * at; char t[50]; };
01:26:54       |                                                                                                                                  ^                       
01:26:54   CFA      bits/debug.lo
01:26:56   CC       exception.lo
01:26:56   CFA      interpose.lo
01:26:56   CFA      startup.lo
01:26:57   CC       virtual.lo
01:26:57   GEN      prelude.lo
01:26:57   CPPAS    concurrency/CtxSwitch-x64.lo
01:26:57   CC       concurrency/invoke.lo
01:26:57   CFA      concurrency/io.lo
01:26:57   CFA      concurrency/preemption.lo
01:26:58   CFA      concurrency/ready_queue.lo
01:26:58   CFA      concurrency/stats.lo
01:27:00   CFA      bits/weakso_locks.lo
01:27:01   CFA      containers/maybe.lo
01:27:01   CFA      containers/pair.lo
01:27:01   CFA      containers/result.lo
01:27:02   CFA      containers/vector.lo
01:27:02   CFA      device/cpu.lo
01:27:03   CFA      concurrency/alarm.lo
01:27:04   CFA      concurrency/coroutine.lo
01:27:06   CFA      concurrency/exception.lo
01:27:07 /var/lib/jenkins/workspace/Cforall_Distribute_Ref@tmp/cfa-cc-1.0.0.1838/_build/sub/../../libcfa/src/concurrency/ready_queue.cfa: In function ‘_X16ready_queue_growFv_PS7cluster__1’:
01:27:07 /var/lib/jenkins/workspace/Cforall_Distribute_Ref@tmp/cfa-cc-1.0.0.1838/_build/sub/../../libcfa/src/stdlib.hfa:154:97: warning: ‘_X4_srcS6S_fill_Y12__T_generic___1._X1cc_1’ is used uninitialized in this function [-Wuninitialized]
01:27:07   154 |  struct S_fill   { char tag; char c; size_t size; T * at; char t[50]; };
01:27:07       |                                                               ~~~~~~~~~~                        ^       
01:27:07 /var/lib/jenkins/workspace/Cforall_Distribute_Ref@tmp/cfa-cc-1.0.0.1838/_build/sub/../../libcfa/src/stdlib.hfa:154:100: warning: ‘_X4_srcS6S_fill_Y12__T_generic___1._X4sizem_1’ is used uninitialized in this function [-Wuninitialized]
01:27:07   154 |  struct S_fill   { char tag; char c; size_t size; T * at; char t[50]; };
01:27:07       |                                                                  ~~~~~~~                           ^          
01:27:07 /var/lib/jenkins/workspace/Cforall_Distribute_Ref@tmp/cfa-cc-1.0.0.1838/_build/sub/../../libcfa/src/stdlib.hfa:154:130: warning: ‘_X4_srcS6S_fill_Y12__T_generic___1._X2atPY12__T_generic__1’ is used uninitialized in this function [-Wuninitialized]
01:27:07   154 |  struct S_fill   { char tag; char c; size_t size; T * at; char t[50]; };
01:27:07       |                                                                                                                                  ^                       
01:27:07   CFA      concurrency/kernel.lo
01:27:07   CFA      concurrency/locks.lo
01:27:07   CFA      concurrency/monitor.lo
01:27:09   CFA      concurrency/mutex.lo
01:27:09   CFA      concurrency/thread.lo
01:27:09   CFA      concurrency/clib/cfathread.lo
01:27:10   CFA      concurrency/io/setup.lo
01:27:13   CFA      concurrency/io/call.lo
01:27:16   CFA      concurrency/kernel/startup.lo
01:27:16   CCLD     libcfa.la
01:27:21 /usr/include/x86_64-linux-gnu/sys/epoll.h: In function ‘_X12_constructorFv_S11epoll_event_autogen___1’:
01:27:21 /usr/include/x86_64-linux-gnu/sys/epoll.h:86:62: warning: taking address of packed member of ‘struct epoll_event’ may result in an unaligned pointer value [-Waddress-of-packed-member]
01:27:21    86 |   epoll_data_t data; /* User data variable */
01:27:21       |                                                              ^                                
01:27:21 /usr/include/x86_64-linux-gnu/sys/epoll.h: In function ‘_X12_constructorFv_S11epoll_eventS11epoll_event_autogen___1’:
01:27:21 /usr/include/x86_64-linux-gnu/sys/epoll.h:86:75: warning: taking address of packed member of ‘struct epoll_event’ may result in an unaligned pointer value [-Waddress-of-packed-member]
01:27:21    86 |   epoll_data_t data; /* User data variable */
01:27:21       |                                                                           ^                                
01:27:21 /usr/include/x86_64-linux-gnu/sys/epoll.h: In function ‘_X11_destructorFv_S11epoll_event_autogen___1’:
01:27:21 /usr/include/x86_64-linux-gnu/sys/epoll.h:86:61: warning: taking address of packed member of ‘struct epoll_event’ may result in an unaligned pointer value [-Waddress-of-packed-member]
01:27:21    86 |   epoll_data_t data; /* User data variable */
01:27:21       |                                                             ^                                
01:27:21 /usr/include/x86_64-linux-gnu/sys/epoll.h: In function ‘_X16_operator_assignFS11epoll_event_S11epoll_eventS11epoll_event_autogen___1’:
01:27:21 /usr/include/x86_64-linux-gnu/sys/epoll.h:86:123: warning: taking address of packed member of ‘struct epoll_event’ may result in an unaligned pointer value [-Waddress-of-packed-member]
01:27:21    86 |   epoll_data_t data; /* User data variable */
01:27:21       |                                                                                                                           ^                                
01:27:21 /usr/include/x86_64-linux-gnu/sys/epoll.h: In function ‘_X12_constructorFv_S11epoll_eventj_autogen___1’:
01:27:21 /usr/include/x86_64-linux-gnu/sys/epoll.h:86:62: warning: taking address of packed member of ‘struct epoll_event’ may result in an unaligned pointer value [-Waddress-of-packed-member]
01:27:21    86 |   epoll_data_t data; /* User data variable */
01:27:21       |                                                              ^                                
01:27:21 /usr/include/x86_64-linux-gnu/sys/epoll.h: In function ‘_X12_constructorFv_S11epoll_eventjU10epoll_data_autogen___1’:
01:27:21 /usr/include/x86_64-linux-gnu/sys/epoll.h:86:75: warning: taking address of packed member of ‘struct epoll_event’ may result in an unaligned pointer value [-Waddress-of-packed-member]
01:27:21    86 |   epoll_data_t data; /* User data variable */
01:27:21       |                                                                           ^                                
01:27:21 /var/lib/jenkins/workspace/Cforall_Distribute_Ref@tmp/cfa-cc-1.0.0.1838/_build/sub/../../libcfa/src/concurrency/io/setup.cfa: In function ‘_X16__io_uring_setupFv_S11$io_contextKS17io_context_paramsi__1.isra.0’:
01:27:21 /var/lib/jenkins/workspace/Cforall_Distribute_Ref@tmp/cfa-cc-1.0.0.1838/_build/sub/../../libcfa/src/stdlib.hfa:154:97: warning: ‘_X4_srcS6S_fill_Y12__T_generic___1._X1cc_1’ may be used uninitialized in this function [-Wmaybe-uninitialized]
01:27:21   154 |  struct S_fill   { char tag; char c; size_t size; T * at; char t[50]; };
01:27:21       |                                                               ~~~~~~~~~~                        ^       
01:27:21 /var/lib/jenkins/workspace/Cforall_Distribute_Ref@tmp/cfa-cc-1.0.0.1838/_build/sub/../../libcfa/src/stdlib.hfa:154:100: warning: ‘_X4_srcS6S_fill_Y12__T_generic___1._X4sizem_1’ may be used uninitialized in this function [-Wmaybe-uninitialized]
01:27:21   154 |  struct S_fill   { char tag; char c; size_t size; T * at; char t[50]; };
01:27:21       |                                                                  ~~~~~~~                           ^          
01:27:21 /var/lib/jenkins/workspace/Cforall_Distribute_Ref@tmp/cfa-cc-1.0.0.1838/_build/sub/../../libcfa/src/stdlib.hfa:154:130: warning: ‘_X4_srcS6S_fill_Y12__T_generic___1._X2atPY12__T_generic__1’ may be used uninitialized in this function [-Wmaybe-uninitialized]
01:27:21   154 |  struct S_fill   { char tag; char c; size_t size; T * at; char t[50]; };
01:27:21       |                                                                                                                                  ^                       
01:27:21 /var/lib/jenkins/workspace/Cforall_Distribute_Ref@tmp/cfa-cc-1.0.0.1838/_build/sub/../../libcfa/src/concurrency/io/setup.cfa: In function ‘_X14__cfa_io_startFv_PS9processor__1’:
01:27:21 /var/lib/jenkins/workspace/Cforall_Distribute_Ref@tmp/cfa-cc-1.0.0.1838/_build/sub/../../libcfa/src/stdlib.hfa:154:97: warning: ‘_X4_srcS6S_fill_Y12__T_generic___1._X1cc_1’ is used uninitialized in this function [-Wuninitialized]
01:27:21   154 |  struct S_fill   { char tag; char c; size_t size; T * at; char t[50]; };
01:27:21       |                                                               ~~~~~~~~~~                        ^       
01:27:21 /var/lib/jenkins/workspace/Cforall_Distribute_Ref@tmp/cfa-cc-1.0.0.1838/_build/sub/../../libcfa/src/stdlib.hfa:154:100: warning: ‘_X4_srcS6S_fill_Y12__T_generic___1._X4sizem_1’ is used uninitialized in this function [-Wuninitialized]
01:27:21   154 |  struct S_fill   { char tag; char c; size_t size; T * at; char t[50]; };
01:27:21       |                                                                  ~~~~~~~                           ^          
01:27:21 /var/lib/jenkins/workspace/Cforall_Distribute_Ref@tmp/cfa-cc-1.0.0.1838/_build/sub/../../libcfa/src/stdlib.hfa:154:130: warning: ‘_X4_srcS6S_fill_Y12__T_generic___1._X2atPY12__T_generic__1’ is used uninitialized in this function [-Wuninitialized]
01:27:21   154 |  struct S_fill   { char tag; char c; size_t size; T * at; char t[50]; };
01:27:21       |                                                                                                                                  ^                       
01:27:22 /usr/include/x86_64-linux-gnu/bits/socket.h: In function ‘_X16_operator_assignFS7cmsghdr_S7cmsghdrS7cmsghdr_autogen___1’:
01:27:22 /usr/include/x86_64-linux-gnu/bits/socket.h:285:44: note: the ABI of passing struct with a flexible array member has changed in GCC 4.4
01:27:22   285 |     __extension__ unsigned char __cmsg_data __flexarr; /* Ancillary data.  */
01:27:22       |                                            ^~~~~~~
01:27:23 /usr/include/x86_64-linux-gnu/bits/socket.h: In function ‘_X16_operator_assignFS7cmsghdr_S7cmsghdrS7cmsghdr_autogen___1’:
01:27:23 /usr/include/x86_64-linux-gnu/bits/socket.h:285:44: note: the ABI of passing struct with a flexible array member has changed in GCC 4.4
01:27:23   285 |     __extension__ unsigned char __cmsg_data __flexarr; /* Ancillary data.  */
01:27:23       |                                            ^~~~~~~
01:27:23 /var/lib/jenkins/workspace/Cforall_Distribute_Ref@tmp/cfa-cc-1.0.0.1838/_build/sub/../../libcfa/src/concurrency/clib/cfathread.cfa: In function ‘cfathread_cluster_add_worker’:
01:27:23 /var/lib/jenkins/workspace/Cforall_Distribute_Ref@tmp/cfa-cc-1.0.0.1838/_build/sub/../../libcfa/src/stdlib.hfa:154:97: warning: ‘_X4_srcS6S_fill_Y12__T_generic___1._X1cc_1’ may be used uninitialized in this function [-Wmaybe-uninitialized]
01:27:23   154 |  struct S_fill   { char tag; char c; size_t size; T * at; char t[50]; };
01:27:23       |                                                               ~~~~~~~~~~                        ^       
01:27:23 /var/lib/jenkins/workspace/Cforall_Distribute_Ref@tmp/cfa-cc-1.0.0.1838/_build/sub/../../libcfa/src/stdlib.hfa:154:100: warning: ‘_X4_srcS6S_fill_Y12__T_generic___1._X4sizem_1’ may be used uninitialized in this function [-Wmaybe-uninitialized]
01:27:23   154 |  struct S_fill   { char tag; char c; size_t size; T * at; char t[50]; };
01:27:23       |                                                                  ~~~~~~~                           ^          
01:27:23 /var/lib/jenkins/workspace/Cforall_Distribute_Ref@tmp/cfa-cc-1.0.0.1838/_build/sub/../../libcfa/src/stdlib.hfa:154:130: warning: ‘_X4_srcS6S_fill_Y12__T_generic___1._X2atPY12__T_generic__1’ may be used uninitialized in this function [-Wmaybe-uninitialized]
01:27:23   154 |  struct S_fill   { char tag; char c; size_t size; T * at; char t[50]; };
01:27:23       |                                                                                                                                  ^                       
01:27:28   CCLD     libcfathread.la
01:27:28 make[4]: Leaving directory '/var/lib/jenkins/workspace/Cforall_Distribute_Ref@tmp/cfa-cc-1.0.0.1838/_build/sub/libcfa/x64-nodebug/src'
01:27:28 make[4]: Entering directory '/var/lib/jenkins/workspace/Cforall_Distribute_Ref@tmp/cfa-cc-1.0.0.1838/_build/sub/libcfa/x64-nodebug'
01:27:28 make[4]: Nothing to be done for 'all-am'.
01:27:28 make[4]: Leaving directory '/var/lib/jenkins/workspace/Cforall_Distribute_Ref@tmp/cfa-cc-1.0.0.1838/_build/sub/libcfa/x64-nodebug'
01:27:28 make[3]: Leaving directory '/var/lib/jenkins/workspace/Cforall_Distribute_Ref@tmp/cfa-cc-1.0.0.1838/_build/sub/libcfa/x64-nodebug'
01:27:28 make[2]: Leaving directory '/var/lib/jenkins/workspace/Cforall_Distribute_Ref@tmp/cfa-cc-1.0.0.1838/_build/sub'
01:27:28 make[1]: Leaving directory '/var/lib/jenkins/workspace/Cforall_Distribute_Ref@tmp/cfa-cc-1.0.0.1838/_build/sub'
01:27:28 make[1]: Entering directory '/var/lib/jenkins/workspace/Cforall_Distribute_Ref@tmp/cfa-cc-1.0.0.1838/_build/sub'
01:27:28 Making dvi in driver
01:27:28 make[2]: Entering directory '/var/lib/jenkins/workspace/Cforall_Distribute_Ref@tmp/cfa-cc-1.0.0.1838/_build/sub/driver'
01:27:28 make[2]: Nothing to be done for 'dvi'.
01:27:28 make[2]: Leaving directory '/var/lib/jenkins/workspace/Cforall_Distribute_Ref@tmp/cfa-cc-1.0.0.1838/_build/sub/driver'
01:27:28 Making dvi in src
01:27:28 make[2]: Entering directory '/var/lib/jenkins/workspace/Cforall_Distribute_Ref@tmp/cfa-cc-1.0.0.1838/_build/sub/src'
01:27:28 make[2]: Nothing to be done for 'dvi'.
01:27:28 make[2]: Leaving directory '/var/lib/jenkins/workspace/Cforall_Distribute_Ref@tmp/cfa-cc-1.0.0.1838/_build/sub/src'
01:27:28 Making dvi in .
01:27:28 make[2]: Entering directory '/var/lib/jenkins/workspace/Cforall_Distribute_Ref@tmp/cfa-cc-1.0.0.1838/_build/sub'
01:27:28 make[2]: Nothing to be done for 'dvi-am'.
01:27:28 make[2]: Leaving directory '/var/lib/jenkins/workspace/Cforall_Distribute_Ref@tmp/cfa-cc-1.0.0.1838/_build/sub'
01:27:28 Making dvi in libcfa/x64-debug
01:27:28 make[2]: Entering directory '/var/lib/jenkins/workspace/Cforall_Distribute_Ref@tmp/cfa-cc-1.0.0.1838/_build/sub/libcfa/x64-debug'
01:27:28 Making dvi in prelude
01:27:28 make[3]: Entering directory '/var/lib/jenkins/workspace/Cforall_Distribute_Ref@tmp/cfa-cc-1.0.0.1838/_build/sub/libcfa/x64-debug/prelude'
01:27:28 make[3]: Nothing to be done for 'dvi'.
01:27:28 make[3]: Leaving directory '/var/lib/jenkins/workspace/Cforall_Distribute_Ref@tmp/cfa-cc-1.0.0.1838/_build/sub/libcfa/x64-debug/prelude'
01:27:28 Making dvi in src
01:27:28 make[3]: Entering directory '/var/lib/jenkins/workspace/Cforall_Distribute_Ref@tmp/cfa-cc-1.0.0.1838/_build/sub/libcfa/x64-debug/src'
01:27:28 make[3]: Nothing to be done for 'dvi'.
01:27:28 make[3]: Leaving directory '/var/lib/jenkins/workspace/Cforall_Distribute_Ref@tmp/cfa-cc-1.0.0.1838/_build/sub/libcfa/x64-debug/src'
01:27:28 make[3]: Entering directory '/var/lib/jenkins/workspace/Cforall_Distribute_Ref@tmp/cfa-cc-1.0.0.1838/_build/sub/libcfa/x64-debug'
01:27:28 make[3]: Nothing to be done for 'dvi-am'.
01:27:28 make[3]: Leaving directory '/var/lib/jenkins/workspace/Cforall_Distribute_Ref@tmp/cfa-cc-1.0.0.1838/_build/sub/libcfa/x64-debug'
01:27:28 make[2]: Leaving directory '/var/lib/jenkins/workspace/Cforall_Distribute_Ref@tmp/cfa-cc-1.0.0.1838/_build/sub/libcfa/x64-debug'
01:27:28 Making dvi in libcfa/x64-nodebug
01:27:28 make[2]: Entering directory '/var/lib/jenkins/workspace/Cforall_Distribute_Ref@tmp/cfa-cc-1.0.0.1838/_build/sub/libcfa/x64-nodebug'
01:27:28 Making dvi in prelude
01:27:28 make[3]: Entering directory '/var/lib/jenkins/workspace/Cforall_Distribute_Ref@tmp/cfa-cc-1.0.0.1838/_build/sub/libcfa/x64-nodebug/prelude'
01:27:28 make[3]: Nothing to be done for 'dvi'.
01:27:28 make[3]: Leaving directory '/var/lib/jenkins/workspace/Cforall_Distribute_Ref@tmp/cfa-cc-1.0.0.1838/_build/sub/libcfa/x64-nodebug/prelude'
01:27:28 Making dvi in src
01:27:28 make[3]: Entering directory '/var/lib/jenkins/workspace/Cforall_Distribute_Ref@tmp/cfa-cc-1.0.0.1838/_build/sub/libcfa/x64-nodebug/src'
01:27:28 make[3]: Nothing to be done for 'dvi'.
01:27:28 make[3]: Leaving directory '/var/lib/jenkins/workspace/Cforall_Distribute_Ref@tmp/cfa-cc-1.0.0.1838/_build/sub/libcfa/x64-nodebug/src'
01:27:28 make[3]: Entering directory '/var/lib/jenkins/workspace/Cforall_Distribute_Ref@tmp/cfa-cc-1.0.0.1838/_build/sub/libcfa/x64-nodebug'
01:27:28 make[3]: Nothing to be done for 'dvi-am'.
01:27:28 make[3]: Leaving directory '/var/lib/jenkins/workspace/Cforall_Distribute_Ref@tmp/cfa-cc-1.0.0.1838/_build/sub/libcfa/x64-nodebug'
01:27:28 make[2]: Leaving directory '/var/lib/jenkins/workspace/Cforall_Distribute_Ref@tmp/cfa-cc-1.0.0.1838/_build/sub/libcfa/x64-nodebug'
01:27:28 make[1]: Leaving directory '/var/lib/jenkins/workspace/Cforall_Distribute_Ref@tmp/cfa-cc-1.0.0.1838/_build/sub'
01:27:28 make[1]: Entering directory '/var/lib/jenkins/workspace/Cforall_Distribute_Ref@tmp/cfa-cc-1.0.0.1838/_build/sub'
01:27:28 Making check in driver
01:27:28 make[2]: Entering directory '/var/lib/jenkins/workspace/Cforall_Distribute_Ref@tmp/cfa-cc-1.0.0.1838/_build/sub/driver'
01:27:28 make[2]: Nothing to be done for 'check'.
01:27:28 make[2]: Leaving directory '/var/lib/jenkins/workspace/Cforall_Distribute_Ref@tmp/cfa-cc-1.0.0.1838/_build/sub/driver'
01:27:28 Making check in src
01:27:28 make[2]: Entering directory '/var/lib/jenkins/workspace/Cforall_Distribute_Ref@tmp/cfa-cc-1.0.0.1838/_build/sub/src'
01:27:28 make  check-am
01:27:28 make[3]: Entering directory '/var/lib/jenkins/workspace/Cforall_Distribute_Ref@tmp/cfa-cc-1.0.0.1838/_build/sub/src'
01:27:28 make[3]: Nothing to be done for 'check-am'.
01:27:28 make[3]: Leaving directory '/var/lib/jenkins/workspace/Cforall_Distribute_Ref@tmp/cfa-cc-1.0.0.1838/_build/sub/src'
01:27:28 make[2]: Leaving directory '/var/lib/jenkins/workspace/Cforall_Distribute_Ref@tmp/cfa-cc-1.0.0.1838/_build/sub/src'
01:27:28 Making check in .
01:27:28 make[2]: Entering directory '/var/lib/jenkins/workspace/Cforall_Distribute_Ref@tmp/cfa-cc-1.0.0.1838/_build/sub'
01:27:28 make[2]: Leaving directory '/var/lib/jenkins/workspace/Cforall_Distribute_Ref@tmp/cfa-cc-1.0.0.1838/_build/sub'
01:27:28 Making check in libcfa/x64-debug
01:27:28 make[2]: Entering directory '/var/lib/jenkins/workspace/Cforall_Distribute_Ref@tmp/cfa-cc-1.0.0.1838/_build/sub/libcfa/x64-debug'
01:27:28 Making check in prelude
01:27:28 make[3]: Entering directory '/var/lib/jenkins/workspace/Cforall_Distribute_Ref@tmp/cfa-cc-1.0.0.1838/_build/sub/libcfa/x64-debug/prelude'
01:27:28 make[3]: Leaving directory '/var/lib/jenkins/workspace/Cforall_Distribute_Ref@tmp/cfa-cc-1.0.0.1838/_build/sub/libcfa/x64-debug/prelude'
01:27:28 Making check in src
01:27:28 make[3]: Entering directory '/var/lib/jenkins/workspace/Cforall_Distribute_Ref@tmp/cfa-cc-1.0.0.1838/_build/sub/libcfa/x64-debug/src'
01:27:28 make[3]: Nothing to be done for 'check'.
01:27:28 make[3]: Leaving directory '/var/lib/jenkins/workspace/Cforall_Distribute_Ref@tmp/cfa-cc-1.0.0.1838/_build/sub/libcfa/x64-debug/src'
01:27:28 make[3]: Entering directory '/var/lib/jenkins/workspace/Cforall_Distribute_Ref@tmp/cfa-cc-1.0.0.1838/_build/sub/libcfa/x64-debug'
01:27:28 make[3]: Nothing to be done for 'check-am'.
01:27:28 make[3]: Leaving directory '/var/lib/jenkins/workspace/Cforall_Distribute_Ref@tmp/cfa-cc-1.0.0.1838/_build/sub/libcfa/x64-debug'
01:27:28 make[2]: Leaving directory '/var/lib/jenkins/workspace/Cforall_Distribute_Ref@tmp/cfa-cc-1.0.0.1838/_build/sub/libcfa/x64-debug'
01:27:28 Making check in libcfa/x64-nodebug
01:27:28 make[2]: Entering directory '/var/lib/jenkins/workspace/Cforall_Distribute_Ref@tmp/cfa-cc-1.0.0.1838/_build/sub/libcfa/x64-nodebug'
01:27:28 Making check in prelude
01:27:28 make[3]: Entering directory '/var/lib/jenkins/workspace/Cforall_Distribute_Ref@tmp/cfa-cc-1.0.0.1838/_build/sub/libcfa/x64-nodebug/prelude'
01:27:28 make[3]: Leaving directory '/var/lib/jenkins/workspace/Cforall_Distribute_Ref@tmp/cfa-cc-1.0.0.1838/_build/sub/libcfa/x64-nodebug/prelude'
01:27:28 Making check in src
01:27:28 make[3]: Entering directory '/var/lib/jenkins/workspace/Cforall_Distribute_Ref@tmp/cfa-cc-1.0.0.1838/_build/sub/libcfa/x64-nodebug/src'
01:27:28 make[3]: Nothing to be done for 'check'.
01:27:28 make[3]: Leaving directory '/var/lib/jenkins/workspace/Cforall_Distribute_Ref@tmp/cfa-cc-1.0.0.1838/_build/sub/libcfa/x64-nodebug/src'
01:27:28 make[3]: Entering directory '/var/lib/jenkins/workspace/Cforall_Distribute_Ref@tmp/cfa-cc-1.0.0.1838/_build/sub/libcfa/x64-nodebug'
01:27:28 make[3]: Nothing to be done for 'check-am'.
01:27:28 make[3]: Leaving directory '/var/lib/jenkins/workspace/Cforall_Distribute_Ref@tmp/cfa-cc-1.0.0.1838/_build/sub/libcfa/x64-nodebug'
01:27:28 make[2]: Leaving directory '/var/lib/jenkins/workspace/Cforall_Distribute_Ref@tmp/cfa-cc-1.0.0.1838/_build/sub/libcfa/x64-nodebug'
01:27:28 make -C tests all-tests installed=no debug=yes
01:27:28 make[2]: Entering directory '/var/lib/jenkins/workspace/Cforall_Distribute_Ref@tmp/cfa-cc-1.0.0.1838/_build/sub/tests'
01:27:29 Running 220 tests on 7 cores (Default AST (new):x64 - debug)
01:29:05        	array-container/language-dim-mismatch      PASSED     C 0:00.088 - R n/a
01:29:05        	array                                      PASSED     C 0:00.459 - R 0:00.001
01:29:05        	builtins/sync                              PASSED     C 0:00.580 - R 0:00.001
01:29:05        	cast                                       PASSED     C 0:00.460 - R 0:00.001
01:29:05        	castError                                  PASSED     C 0:00.252 - R n/a
01:29:05        	array-container/array-basic                PASSED     C 0:01.277 - R 0:00.017
01:29:05        	avl_test                                   PASSED     C 0:02.201 - R 0:00.016
01:29:05        	alloc-ERROR                                PASSED     C 0:03.429 - R n/a
01:29:05        	alloc                                      PASSED     C 0:06.888 - R 0:00.016
01:29:05        	collections/multi_list                     PASSED     C 0:06.389 - R 0:00.016
01:29:05        	collections/vector-err-pass-perm-it-byval  PASSED     C 0:01.201 - R n/a
01:29:05        	alloc2                                     PASSED     C 0:08.755 - R 0:00.016
01:29:05        	collections/vector-demo                    PASSED     C 0:02.645 - R 0:00.016
01:29:05        	collections/vector-err-retn-perm-it-byval  PASSED     C 0:01.023 - R n/a
01:29:05        	collections/stack                          PASSED     C 0:06.703 - R 0:00.016
01:29:05        	collections/queue                          PASSED     C 0:09.855 - R 0:00.016
01:29:05        	concurrent/clib                            PASSED     C 0:02.805 - R 0:00.165
01:29:05        	concurrent/clib_tls                        PASSED     C 0:02.764 - R 0:00.215
01:29:05        	collections/sequence                       PASSED     C 0:10.681 - R 0:00.016
01:29:05        	collections/atomic_mpsc                    PASSED     C 0:08.502 - R 0:03.872
01:29:05        	complex                                    PASSED     C 0:04.685 - R 0:00.016
01:29:05        	concurrent/cluster                         PASSED     C 0:06.069 - R 0:00.115
01:29:05        	concurrent/coroutineYield                  PASSED     C 0:08.438 - R 0:00.115
01:29:05        	concurrent/examples/datingService          PASSED     C 0:08.495 - R 0:00.064
01:29:05        	concurrent/examples/matrixSum              PASSED     C 0:08.145 - R 0:00.114
01:29:05        	concurrent/examples/gortn                  PASSED     C 0:08.490 - R 0:00.114
01:29:05        	concurrent/examples/quickSort              PASSED     C 0:08.628 - R 0:00.064
01:29:05        	concurrent/futures/abandon                 PASSED     C 0:06.425 - R 0:00.165
01:29:05        	concurrent/keywordErrors                   PASSED     C 0:00.145 - R n/a
01:29:05        	concurrent/examples/boundedBufferINT       PASSED     C 0:08.353 - R 0:05.773
01:29:05        	concurrent/examples/boundedBufferEXT       PASSED     C 0:08.851 - R 0:05.722
01:29:05        	concurrent/futures/basic                   PASSED     C 0:06.274 - R 0:00.114
01:29:05        	concurrent/futures/typed                   PASSED     C 0:06.550 - R 0:00.115
01:29:05        	concurrent/futures/multi                   PASSED     C 0:07.287 - R 0:00.123
01:29:05        	concurrent/join                            PASSED     C 0:08.550 - R 0:00.114
01:29:05        	concurrent/park/contention                 PASSED     C 0:06.309 - R 0:00.274
01:29:05        	concurrent/mutexstmt/monitors              PASSED     C 0:06.573 - R 0:02.629
01:29:05        	concurrent/park/force_preempt              PASSED     C 0:09.355 - R 0:00.415
01:29:05        	concurrent/mutexstmt/locks                 PASSED     C 0:07.814 - R 0:04.948
01:29:05        	concurrent/park/start_parked               PASSED     C 0:06.439 - R 0:00.114
01:29:05        	concurrent/semaphore                       PASSED     C 0:09.534 - R 0:00.064
01:29:05        	concurrent/signal/wait                     PASSED     C 0:09.332 - R 0:00.217
01:29:05        	concurrent/signal/block                    PASSED     C 0:09.421 - R 0:01.467
01:29:05        	concurrent/signal/disjoint                 PASSED     C 0:09.108 - R 0:01.867
01:29:05        	concurrent/monitor                         PASSED     C 0:08.082 - R 0:21.374
01:29:05        	concurrent/multi-monitor                   PASSED     C 0:08.239 - R 0:21.468
01:29:05        	concurrent/sleep                           PASSED     C 0:08.602 - R 0:01.216
01:29:05        	concurrent/preempt                         PASSED     C 0:06.970 - R 0:15.443
01:29:05        	concurrent/suspend_then                    PASSED     C 0:08.622 - R 0:00.165
01:29:05        	concurrent/spinaphore                      PASSED     C 0:09.412 - R 0:00.415
01:29:05        	concurrent/thread                          PASSED     C 0:09.045 - R 0:00.114
01:29:05        	const-init                                 PASSED     C 0:00.560 - R 0:00.016
01:29:05        	concurrent/waitfor/else                    PASSED     C 0:07.059 - R 0:00.114
01:29:05        	concurrent/waitfor/barge                   PASSED     C 0:08.428 - R 0:00.265
01:29:05        	copyfile                                   PASSED     C 0:04.982 - R 0:00.016
01:29:05        	concurrent/waitfor/dtor                    PASSED     C 0:08.397 - R 0:01.267
01:29:05        	concurrent/waitfor/recurse                 PASSED     C 0:08.633 - R 0:00.966
01:29:05        	concurrent/waitfor/statment                PASSED     C 0:09.329 - R 0:00.114
01:29:05        	concurrent/waitfor/when                    PASSED     C 0:08.758 - R 0:00.215
01:29:05        	coroutine/devicedriver                     PASSED     C 0:05.792 - R 0:00.064
01:29:05        	coroutine/fibonacci                        PASSED     C 0:05.708 - R 0:00.065
01:29:05        	designations                               PASSED     C 0:00.641 - R 0:00.016
01:29:05        	coroutine/fmtLines                         PASSED     C 0:05.732 - R 0:00.064
01:29:05        	coroutine/pingpong                         PASSED     C 0:05.679 - R 0:00.115
01:29:05        	enum                                       PASSED     C 0:00.505 - R 0:00.017
01:29:05        	errors/declaration                         PASSED     C 0:00.062 - R n/a
01:29:05        	errors/scope                               PASSED     C 0:00.099 - R n/a
01:29:05        	errors/signature                           PASSED     C 0:00.064 - R n/a
01:29:05        	coroutine/raii                             PASSED     C 0:05.706 - R 0:00.114
01:29:05        	counter                                    PASSED     C 0:04.602 - R 0:00.016
01:29:05        	coroutine/prodcons                         PASSED     C 0:06.915 - R 0:00.064
01:29:05        	coroutine/runningTotal                     PASSED     C 0:05.636 - R 0:00.064
01:29:05        	exceptions/conditional                     PASSED     C 0:00.583 - R 0:00.016
01:29:05        	exceptions/data-except                     PASSED     C 0:00.634 - R 0:00.016
01:29:05        	exceptions/defaults                        PASSED     C 0:00.878 - R 0:00.016
01:29:05        	exceptions/finally                         PASSED     C 0:00.685 - R 0:00.016
01:29:05        	exceptions/cancel/coroutine                PASSED     C 0:03.806 - R 0:00.115
01:29:05        	exceptions/finally-error                   PASSED     C 0:00.135 - R n/a
01:29:05        	exceptions/interact                        PASSED     C 0:00.731 - R 0:00.016
01:29:05        	div                                        PASSED     C 0:06.116 - R 0:00.016
01:29:05        	device/cpu                                 PASSED     C 0:06.767 - R 0:00.016
01:29:05        	exceptions/conditional-threads             PASSED     C 0:03.777 - R 0:00.114
01:29:05        	exceptions/polymorphic                     PASSED     C 0:00.822 - R 0:00.016
01:29:05        	exceptions/resume                          PASSED     C 0:00.776 - R 0:00.016
01:29:05        	exceptions/trash                           PASSED     C 0:00.625 - R 0:00.016
01:29:05        	exceptions/terminate                       PASSED     C 0:00.785 - R 0:00.016
01:29:05        	exceptions/type-check                      PASSED     C 0:00.135 - R n/a
01:29:05        	exceptions/defaults-threads                PASSED     C 0:04.215 - R 0:00.065
01:29:05        	expression                                 PASSED     C 0:00.490 - R 0:00.001
01:29:05        	exceptions/virtual-poly                    PASSED     C 0:00.685 - R 0:00.016
01:29:05        	exceptions/cancel/thread                   PASSED     C 0:06.050 - R 0:00.064
01:29:05        	exceptions/virtual-cast                    PASSED     C 0:01.476 - R 0:00.016
01:29:05        	exceptions/finally-threads                 PASSED     C 0:03.885 - R 0:00.115
01:29:05        	forall                                     PASSED     C 0:00.900 - R 0:00.001
01:29:05        	exceptions/resume-threads                  PASSED     C 0:04.034 - R 0:00.115
01:29:52        	exceptions/terminate-threads               PASSED     C 0:04.006 - R 0:00.064
01:29:52        	genericUnion                               PASSED     C 0:00.548 - R 0:00.016
01:29:52        	global-monomorph                           PASSED     C 0:00.526 - R 0:00.016
01:29:52        	fallthrough                                PASSED     C 0:04.789 - R 0:00.016
01:29:52        	fstream_test                               PASSED     C 0:04.739 - R 0:00.016
01:29:52        	identFuncDeclarator                        PASSED     C 0:00.490 - R 0:00.001
01:29:52        	generator/fibonacci                        PASSED     C 0:04.727 - R 0:00.016
01:29:52        	generator/fmtLines                         PASSED     C 0:04.745 - R 0:00.016
01:29:52        	identParamDeclarator                       PASSED     C 0:00.560 - R 0:00.016
01:29:52        	function-operator                          PASSED     C 0:06.024 - R 0:00.016
01:29:52        	generator/suspend_then                     PASSED     C 0:04.675 - R 0:00.016
01:29:52        	include/vector-containers                  PASSED     C 0:02.505 - R 0:00.016
01:29:52        	hello                                      PASSED     C 0:04.709 - R 0:00.016
01:29:52        	ifwhileCtl                                 PASSED     C 0:04.641 - R 0:00.016
01:29:52        	include/vector-sequence                    PASSED     C 0:00.963 - R 0:00.016
01:29:52        	identity                                   PASSED     C 0:05.114 - R 0:00.016
01:29:52        	init1-ERROR                                PASSED     C 0:00.245 - R n/a
01:29:52        	init1                                      PASSED     C 0:00.504 - R 0:00.001
01:29:52        	include/stdincludes                        PASSED     C 0:05.444 - R 0:00.001
01:29:52        	include/vector-fstream                     PASSED     C 0:04.734 - R 0:00.016
01:29:52        	labelledExit                               PASSED     C 0:00.508 - R 0:00.001
01:29:52        	limits                                     PASSED     C 0:00.491 - R 0:00.001
01:29:52        	linking/exception-nothreads                PASSED     C 0:01.473 - R 0:00.016
01:29:52        	io/manipulatorsOutput4                     PASSED     C 0:07.570 - R 0:00.016
01:29:52        	io/io-acquire                              PASSED     C 0:09.307 - R 0:00.165
01:29:52        	linking/nostdlib                           PASSED     C 0:00.533 - R 0:00.016
01:29:52        	linking/exception-withthreads              PASSED     C 0:04.794 - R 0:00.065
01:29:52        	include/includes                           PASSED     C 0:16.015 - R 0:00.001
01:29:52        	io/many_read                               PASSED     C 0:09.919 - R 0:00.164
01:29:52        	linkonce                                   PASSED     C 0:00.554 - R 0:00.008
01:29:52        	io/io                                      PASSED     C 0:12.925 - R 0:00.016
01:29:52        	linking/io-acquire                         PASSED     C 0:06.053 - R 0:00.016
01:29:52        	heap                                       PASSED     C 0:06.739 - R 0:15.594
01:29:52        	linking/nothreads                          PASSED     C 0:05.609 - R 0:00.016
01:29:52        	maybe                                      PASSED     C 0:00.714 - R 0:00.016
01:29:52        	linking/weakso_nothd                       PASSED     C 0:05.977 - R 0:00.016
01:29:52        	nested-types                               PASSED     C 0:00.477 - R 0:00.001
01:29:52        	nested-types-ERR1                          PASSED     C 0:00.096 - R n/a
01:29:52        	nested-types-ERR2                          PASSED     C 0:00.074 - R n/a
01:29:52        	literals                                   PASSED     C 0:04.956 - R 0:00.016
01:29:52        	numericConstants                           PASSED     C 0:00.458 - R 0:00.001
01:29:52        	operators                                  PASSED     C 0:00.521 - R 0:00.016
01:29:52        	poly-d-cycle                               PASSED     C 0:00.552 - R 0:00.016
01:29:52        	poly-o-cycle                               PASSED     C 0:00.555 - R 0:00.016
01:29:52        	poly-selection                             PASSED     C 0:00.591 - R 0:00.016
01:29:52        	linking/withthreads                        PASSED     C 0:08.183 - R 0:00.064
01:29:52        	quasiKeyword                               PASSED     C 0:00.506 - R 0:00.001
01:29:52        	loopctrl                                   PASSED     C 0:06.712 - R 0:00.016
01:29:52        	malloc                                     PASSED     C 0:05.967 - R 0:00.016
01:29:52        	raii/ctor-autogen-ERR1                     PASSED     C 0:00.286 - R n/a
01:29:52        	raii/ctor-autogen                          PASSED     C 0:00.983 - R 0:00.016
01:29:52        	list/dlist-insert-remove                   PASSED     C 0:10.053 - R 0:00.016
01:29:52        	polymorphism                               PASSED     C 0:04.769 - R 0:00.016
01:29:52        	minmax                                     PASSED     C 0:07.638 - R 0:00.016
01:29:52        	quotedKeyword                              PASSED     C 0:04.554 - R 0:00.016
01:29:52        	raii/boxed-types                           PASSED     C 0:04.676 - R 0:00.016
01:29:52        	raii/memberCtors-ERR1                      PASSED     C 0:00.317 - R n/a
01:29:52        	raii/init_once                             PASSED     C 0:00.624 - R 0:00.016
01:29:52        	raii/memberCtors                           PASSED     C 0:00.574 - R 0:00.016
01:29:52        	raii/dtor-early-exit-ERR1                  PASSED     C 0:03.592 - R n/a
01:29:52        	raii/dtor-early-exit-ERR2                  PASSED     C 0:03.505 - R n/a
01:29:52        	result                                     PASSED     C 0:00.930 - R 0:00.016
01:29:52        	simpleGenericTriple                        PASSED     C 0:00.710 - R 0:00.016
01:29:52        	smart-pointers                             PASSED     C 0:00.708 - R 0:00.016
01:29:52        	raii/dtor-early-exit                       PASSED     C 0:06.128 - R 0:00.016
01:29:52        	raii/globals                               PASSED     C 0:04.790 - R 0:00.016
01:29:52        	references                                 PASSED     C 0:05.497 - R 0:00.016
01:29:52        	shortCircuit                               PASSED     C 0:04.931 - R 0:00.016
01:29:52        	switch                                     PASSED     C 0:00.438 - R 0:00.001
01:29:52        	strstream                                  PASSED     C 0:04.974 - R 0:00.016
01:29:52        	searchsort                                 PASSED     C 0:07.307 - R 0:00.016
01:29:52        	tuple/tupleCast                            PASSED     C 0:00.510 - R 0:00.016
01:29:52        	tuple/tupleFunction                        PASSED     C 0:00.563 - R 0:00.016
01:29:52        	tuple/tupleMember                          PASSED     C 0:00.572 - R 0:00.016
01:29:52        	tuple/tuplePolymorphism                    PASSED     C 0:00.741 - R 0:00.016
01:29:52        	typedefRedef                               PASSED     C 0:00.459 - R 0:00.001
01:29:52        	sum                                        PASSED     C 0:06.706 - R 0:00.016
01:29:52        	typedefRedef-ERR1                          PASSED     C 0:00.068 - R n/a
01:29:52        	unified_locking/fast                       FAILED with code 1    C 0:00.060 - R n/a
01:29:52 		expected :
01:29:52 		1	Starting
01:29:52 		2	Done!
01:29:52 		3	Match!
01:29:52 		got :
01:29:52 		1	unified_locking/fast.cfa:4:10: fatal error: mutex_test.hfa: No such file or directory
01:29:52 		2	compilation terminated.
01:29:52 
01:29:52        	unified_locking/lin_backoff                FAILED with code 1    C 0:00.065 - R n/a
01:29:52 		expected :
01:29:52 		1	Starting
01:29:52 		2	Done!
01:29:52 		3	Match!
01:29:52 		got :
01:29:52 		1	unified_locking/lin_backoff.cfa:4:10: fatal error: mutex_test.hfa: No such file or directory
01:29:52 		2	compilation terminated.
01:29:52 
01:29:52        	tuple/tupleVariadic                        PASSED     C 0:01.533 - R 0:00.016
01:29:52        	typeof                                     PASSED     C 0:00.504 - R 0:00.016
01:29:52        	swap                                       PASSED     C 0:07.153 - R 0:00.016
01:29:52        	tuple/tupleAssign                          PASSED     C 0:05.803 - R 0:00.016
01:29:52        	variableDeclarator                         PASSED     C 0:00.447 - R 0:00.001
01:29:52        	time                                       PASSED     C 0:06.326 - R 0:00.016
01:29:52        	rational                                   PASSED     C 0:15.394 - R 0:00.016
01:29:52        	userLiterals                               PASSED     C 0:05.174 - R 0:00.016
01:29:52        	vector_math/vec2_double                    PASSED     C 0:06.338 - R 0:00.016
01:29:52        	unified_locking/timeout_lock               PASSED     C 0:07.549 - R 0:01.117
01:29:52        	vector                                     PASSED     C 0:07.143 - R 0:00.016
01:30:31        	vector_math/vec2_uint                      PASSED     C 0:06.627 - R 0:00.016
01:30:31        	unified_locking/mcs                        PASSED     C 0:09.645 - R 0:06.378
01:30:31        	vector_math/vec2_float                     PASSED     C 0:11.683 - R 0:00.016
01:30:31        	voidPtr                                    PASSED     C 0:00.484 - R 0:00.008
01:30:31        	vector_math/vec2_int                       PASSED     C 0:11.496 - R 0:00.016
01:30:31        	warnings/self-assignment                   PASSED     C 0:00.431 - R 0:00.001
01:30:31        	KRfunctions                                PASSED     C 0:00.389 - R 0:00.001
01:30:31        	vector_math/vec3_int                       PASSED     C 0:10.131 - R 0:00.016
01:30:31        	vector_math/vec3_float                     PASSED     C 0:12.013 - R 0:00.016
01:30:31        	attributes                                 PASSED     C 0:00.484 - R 0:00.001
01:30:31        	abs                                        PASSED     C 0:06.478 - R 0:00.016
01:30:31        	ato                                        PASSED     C 0:06.143 - R 0:00.016
01:30:31        	array-container/array-md-sbscr-cases       PASSED     C 0:08.394 - R 0:00.016
01:30:31        	declarationSpecifier                       PASSED     C 0:00.488 - R 0:00.001
01:30:31        	vector_math/vec4_int                       PASSED     C 0:10.954 - R 0:00.016
01:30:31        	vector_math/vec4_float                     PASSED     C 0:11.871 - R 0:00.016
01:30:31        	errors/completeType                        PASSED     C 0:00.241 - R n/a
01:30:31        	functions                                  PASSED     C 0:00.410 - R 0:00.001
01:30:31        	extension                                  PASSED     C 0:00.460 - R 0:00.001
01:30:31        	gccExtensions                              PASSED     C 0:00.418 - R 0:00.001
01:30:31        	unified_locking/locks                      PASSED     C 0:08.286 - R 0:20.904
01:30:31        	bitmanip1                                  PASSED     C 0:10.254 - R 0:00.016
01:30:31        	io/manipulatorsInput                       PASSED     C 0:06.811 - R 0:00.016
01:30:31        	gmp                                        PASSED     C 0:07.057 - R 0:00.016
01:30:31        	bitmanip2                                  PASSED     C 0:11.228 - R 0:00.016
01:30:31        	meta/archVast                              PASSED     C 0:00.241 - R n/a
01:30:31        	io/manipulatorsOutput2                     PASSED     C 0:08.532 - R 0:00.016
01:30:31        	io/manipulatorsOutput1                     PASSED     C 0:11.795 - R 0:00.016
01:30:31        	random                                     PASSED     C 0:05.745 - R 0:00.016
01:30:31        	bitmanip3                                  PASSED     C 0:16.480 - R 0:00.016
01:30:31        	vector_math/vec2_ldouble                   PASSED     C 0:06.387 - R 0:00.016
01:30:31        	io/manipulatorsOutput3                     PASSED     C 0:13.207 - R 0:00.016
01:30:31        	math                                       PASSED     C 0:12.517 - R 0:00.017
01:30:31        	mathX                                      PASSED     C 0:18.942 - R 0:00.034
01:30:31 Tests took  2:59.463
01:30:31 make[2]: *** [Makefile:879: all-tests] Error 1
01:30:31 make[2]: Leaving directory '/var/lib/jenkins/workspace/Cforall_Distribute_Ref@tmp/cfa-cc-1.0.0.1838/_build/sub/tests'
01:30:31 make[1]: *** [Makefile:951: check] Error 2
01:30:31 make[1]: Leaving directory '/var/lib/jenkins/workspace/Cforall_Distribute_Ref@tmp/cfa-cc-1.0.0.1838/_build/sub'
01:30:31 make: *** [Makefile:734: distcheck] Error 1
[Pipeline] }
[Pipeline] // dir
[Pipeline] }
[Pipeline] // stage
[Pipeline] }
[Pipeline] // wrap
[Pipeline] }
[Pipeline] // node
[Pipeline] End of Pipeline
ERROR: script returned exit code 2
Finished: FAILURE