Started by timer
Running as Jenkins Build User
Obtained Jenkins/FullBuild from git cforall@plg.uwaterloo.ca:software/cfa/cfa-cc
[Pipeline] Start of Pipeline
[Pipeline] node
Running on Brokk 3 in /var/lib/jenkins/workspace/Cforall_Full_Build
[Pipeline] {
[Pipeline] checkout
The recommended git tool is: NONE
using credential git_key_aug2025
Fetching changes from the remote Git repository
> git rev-parse --resolve-git-dir /var/lib/jenkins/workspace/Cforall_Full_Build/.git # timeout=10
> git config remote.origin.url cforall@plg.uwaterloo.ca:software/cfa/cfa-cc # timeout=10
Fetching upstream changes from cforall@plg.uwaterloo.ca:software/cfa/cfa-cc
> git --version # timeout=10
> git --version # 'git version 2.43.0'
using GIT_SSH to set credentials Git key use to connect to the cforall git repo (August 2025)
Verifying host key using known hosts file
> git fetch --tags --force --progress -- cforall@plg.uwaterloo.ca:software/cfa/cfa-cc +refs/heads/*:refs/remotes/origin/* # timeout=10
Checking out Revision 4ff8cb209307cd30c3626d4fbe3cc2d2ce4219ea (refs/remotes/origin/master)
> git rev-parse refs/remotes/origin/master^{commit} # timeout=10
> git config core.sparsecheckout # timeout=10
> git checkout -f 4ff8cb209307cd30c3626d4fbe3cc2d2ce4219ea # timeout=10
Commit message: "fix Mesa citation"
> git rev-list --no-walk 4ff8cb209307cd30c3626d4fbe3cc2d2ce4219ea # timeout=10
[Pipeline] wrap
[Pipeline] {
[Pipeline] stage
[Pipeline] { (Build)
[Pipeline] parallel
[Pipeline] { (Branch: gcc_10_x86_new)
[Pipeline] { (Branch: gcc_11_x86_new)
[Pipeline] { (Branch: gcc_12_x86_new)
[Pipeline] { (Branch: gcc_9_x64_new)
[Pipeline] { (Branch: gcc_10_x64_new)
[Pipeline] { (Branch: gcc_11_x64_new)
[Pipeline] { (Branch: gcc_12_x64_new)
[Pipeline] { (Branch: gcc_10_arm64_new)
[Pipeline] { (Branch: gcc_11_arm64_new)
[Pipeline] { (Branch: gcc_12_arm64_new)
[Pipeline] { (Branch: clang_x64_new)
[Pipeline] sleep
22:47:14Sleeping for 2 min 0 sec
[Pipeline] sleep
22:47:14Sleeping for 4 min 0 sec
[Pipeline] sleep
22:47:14Sleeping for 1 min 0 sec
[Pipeline] sleep
22:47:14No need to sleep any longer
[Pipeline] sleep
22:47:14No need to sleep any longer
[Pipeline] sleep
22:47:14Sleeping for 3 min 0 sec
[Pipeline] sleep
22:47:14Sleeping for 3 min 0 sec
[Pipeline] sleep
22:47:14Sleeping for 4 min 0 sec
[Pipeline] sleep
22:47:14Sleeping for 3 min 0 sec
[Pipeline] sleep
22:47:14Sleeping for 1 min 0 sec
[Pipeline] sleep
22:47:14Sleeping for 1 min 0 sec
[Pipeline] build
22:47:14Scheduling project: Cforall » master[Pipeline] build
22:47:14Scheduling project: Cforall » master22:47:22Starting building: Cforall » master #366122:47:22Starting building: Cforall » master #366022:47:29Build Cforall » master #3660 completed: FAILURE
[Pipeline] echo
22:47:29FAILURE
[Pipeline] sh
22:47:30+ wget -q -O - https://cforall.uwaterloo.ca/jenkins/job/Cforall/job/master/3660/consoleText22:47:30Started by upstream project "Cforall_Full_Build" build number 414
22:47:30originally caused by:
22:47:30 Started by timer
22:47:30Running as Jenkins Build User
22:47:30 > git rev-parse --resolve-git-dir /var/lib/jenkins/caches/git-914b6fdde163b7e17ee75d99ca23f18a/.git # timeout=10
22:47:30Setting origin to cforall@plg.uwaterloo.ca:software/cfa/cfa-cc
22:47:30 > git config remote.origin.url cforall@plg.uwaterloo.ca:software/cfa/cfa-cc # timeout=10
22:47:30Fetching origin...
22:47:30Fetching upstream changes from origin
22:47:30 > git --version # timeout=10
22:47:30 > git --version # 'git version 2.43.0'
22:47:30 > git config --get remote.origin.url # timeout=10
22:47:30using GIT_SSH to set credentials Git key use to connect to the cforall git repo (August 2025)
22:47:30Verifying host key using known hosts file
22:47:30 > git fetch --no-tags --force --progress -- origin +refs/heads/*:refs/remotes/origin/* # timeout=10
22:47:30Seen branch in repository origin/ADT
22:47:30Seen branch in repository origin/aaron-thesis
22:47:30Seen branch in repository origin/arm-eh
22:47:30Seen branch in repository origin/ast-experimental
22:47:30Seen branch in repository origin/cleanup-dtors
22:47:30Seen branch in repository origin/ctor
22:47:30Seen branch in repository origin/deferred_resn
22:47:30Seen branch in repository origin/demangler
22:47:30Seen branch in repository origin/enum
22:47:30Seen branch in repository origin/forall-pointer-decay
22:47:30Seen branch in repository origin/gc_noraii
22:47:30Seen branch in repository origin/jacob/cs343-translation
22:47:30Seen branch in repository origin/jenkins-sandbox
22:47:30Seen branch in repository origin/master
22:47:30Seen branch in repository origin/memory
22:47:30Seen branch in repository origin/new-ast
22:47:30Seen branch in repository origin/new-ast-unique-expr
22:47:30Seen branch in repository origin/new-env
22:47:30Seen branch in repository origin/no_list
22:47:30Seen branch in repository origin/persistent-indexer
22:47:30Seen branch in repository origin/pthread-emulation
22:47:30Seen branch in repository origin/qualifiedEnum
22:47:30Seen branch in repository origin/resolv-new
22:47:30Seen branch in repository origin/string
22:47:30Seen branch in repository origin/stuck-waitfor-destruct
22:47:30Seen branch in repository origin/with_gc
22:47:30Seen 26 remote branches
22:47:30Obtained Jenkinsfile from 4ff8cb209307cd30c3626d4fbe3cc2d2ce4219ea
22:47:30[Pipeline] Start of Pipeline
22:47:30[Pipeline] node
22:47:30Running on Brokk 5 in /var/lib/jenkins/workspace/Cforall_master_2
22:47:30[Pipeline] {
22:47:30[Pipeline] wrap
22:47:30[Pipeline] {
22:47:30[Pipeline] properties
22:47:30WARNING: Unknown parameter(s) found for class type 'hudson.model.ChoiceParameterDefinition': defaultValue
22:47:30WARNING: Unknown parameter(s) found for class type 'hudson.model.ChoiceParameterDefinition': defaultValue
22:47:30[Pipeline] checkout
22:47:30The recommended git tool is: NONE
22:47:30using credential git_key_aug2025
22:47:30ERROR: Checkout failed
22:47:30java.io.StreamCorruptedException: invalid stream header: 636F7272
22:47:30 at java.base/java.io.ObjectInputStream.readStreamHeader(ObjectInputStream.java:989)
22:47:30 at java.base/java.io.ObjectInputStream.<init>(ObjectInputStream.java:416)
22:47:30 at hudson.remoting.ObjectInputStreamEx.<init>(ObjectInputStreamEx.java:50)
22:47:30 at hudson.remoting.Command.readFrom(Command.java:141)
22:47:30 at hudson.remoting.Command.readFrom(Command.java:127)
22:47:30 at hudson.remoting.AbstractSynchronousByteArrayCommandTransport.read(AbstractSynchronousByteArrayCommandTransport.java:35)
22:47:30 at hudson.remoting.SynchronousCommandTransport$ReaderThread.run(SynchronousCommandTransport.java:62)
22:47:30Also: hudson.remoting.Channel$CallSiteStackTrace: Remote call to Brokk 5
22:47:30 at hudson.remoting.Channel.attachCallSiteStackTrace(Channel.java:1916)
22:47:30 at hudson.remoting.Request.call(Request.java:204)
22:47:30 at hudson.remoting.Channel.call(Channel.java:1107)
22:47:30 at hudson.remoting.RemoteInvocationHandler.invoke(RemoteInvocationHandler.java:306)
22:47:30 at PluginClassLoader for git-client/jdk.proxy74/jdk.proxy74.$Proxy169.hasGitRepo(Unknown Source)
22:47:30 at PluginClassLoader for git-client//org.jenkinsci.plugins.gitclient.RemoteGitImpl.hasGitRepo(RemoteGitImpl.java:333)
22:47:30 at PluginClassLoader for git//hudson.plugins.git.GitSCM.retrieveChanges(GitSCM.java:1205)
22:47:30 at PluginClassLoader for git//hudson.plugins.git.GitSCM._checkout(GitSCM.java:1310)
22:47:30 at PluginClassLoader for git//hudson.plugins.git.GitSCM.checkout(GitSCM.java:1277)
22:47:30 at PluginClassLoader for workflow-scm-step//org.jenkinsci.plugins.workflow.steps.scm.SCMStep.checkout(SCMStep.java:136)
22:47:30 at PluginClassLoader for workflow-scm-step//org.jenkinsci.plugins.workflow.steps.scm.SCMStep$StepExecutionImpl.run(SCMStep.java:101)
22:47:30 at PluginClassLoader for workflow-scm-step//org.jenkinsci.plugins.workflow.steps.scm.SCMStep$StepExecutionImpl.run(SCMStep.java:88)
22:47:30 at PluginClassLoader for workflow-step-api//org.jenkinsci.plugins.workflow.steps.SynchronousNonBlockingStepExecution.lambda$start$0(SynchronousNonBlockingStepExecution.java:49)
22:47:30 at java.base/java.util.concurrent.Executors$RunnableAdapter.call(Executors.java:572)
22:47:30 at java.base/java.util.concurrent.FutureTask.run(FutureTask.java:317)
22:47:30 at java.base/java.util.concurrent.ThreadPoolExecutor.runWorker(ThreadPoolExecutor.java:1144)
22:47:30 at java.base/java.util.concurrent.ThreadPoolExecutor$Worker.run(ThreadPoolExecutor.java:642)
22:47:30 at java.base/java.lang.Thread.run(Thread.java:1583)
22:47:30Caused: hudson.remoting.RequestAbortedException
22:47:30 at hudson.remoting.Request.abort(Request.java:358)
22:47:30 at hudson.remoting.Channel.terminate(Channel.java:1189)
22:47:30 at hudson.remoting.SynchronousCommandTransport$ReaderThread.run(SynchronousCommandTransport.java:95)
22:47:30ERROR: Maximum checkout retry attempts reached, aborting
22:47:30[Pipeline] }
22:47:30[Pipeline] // wrap
22:47:30[Pipeline] }
22:47:30[Pipeline] // node
22:47:30[Pipeline] echo
22:47:30hudson.remoting.RequestAbortedException: java.io.StreamCorruptedException: invalid stream header: 636F7272
22:47:30[Pipeline] node
22:47:30Running on Brokk 7 in /var/lib/jenkins/workspace/Cforall_master_2
22:47:30[Pipeline] {
22:47:30[Pipeline] echo
22:47:30Notifying users of result
22:47:30[Pipeline] }
22:47:30[Pipeline] // node
22:47:30[Pipeline] End of Pipeline
22:47:30Also: org.jenkinsci.plugins.workflow.actions.ErrorAction$ErrorId: 75b0f00e-ce42-4c2e-b30a-200135d092b5
22:47:30java.lang.NullPointerException: Cannot invoke method GitLogMessage() on null object
22:47:30 at PluginClassLoader for script-security//org.jenkinsci.plugins.scriptsecurity.sandbox.groovy.SandboxInterceptor.onMethodCall(SandboxInterceptor.java:178)
22:47:30 at PluginClassLoader for script-security//org.kohsuke.groovy.sandbox.impl.Checker$1.call(Checker.java:187)
22:47:30 at PluginClassLoader for script-security//org.kohsuke.groovy.sandbox.impl.Checker.checkedCall(Checker.java:191)
22:47:30 at PluginClassLoader for workflow-cps//com.cloudbees.groovy.cps.sandbox.SandboxInvoker.methodCall(SandboxInvoker.java:17)
22:47:30 at PluginClassLoader for workflow-cps//org.jenkinsci.plugins.workflow.cps.LoggingInvoker.methodCall(LoggingInvoker.java:124)
22:47:30 at WorkflowScript.email(WorkflowScript:229)
22:47:30 at ___cps.transform___(Native Method)
22:47:30 at PluginClassLoader for workflow-cps//com.cloudbees.groovy.cps.impl.ContinuationGroup.methodCall(ContinuationGroup.java:107)
22:47:30 at PluginClassLoader for workflow-cps//com.cloudbees.groovy.cps.impl.FunctionCallBlock$ContinuationImpl.dispatchOrArg(FunctionCallBlock.java:118)
22:47:30 at PluginClassLoader for workflow-cps//com.cloudbees.groovy.cps.impl.FunctionCallBlock$ContinuationImpl.fixName(FunctionCallBlock.java:82)
22:47:30 at java.base/jdk.internal.reflect.DirectMethodHandleAccessor.invoke(DirectMethodHandleAccessor.java:103)
22:47:30 at java.base/java.lang.reflect.Method.invoke(Method.java:580)
22:47:30 at PluginClassLoader for workflow-cps//com.cloudbees.groovy.cps.impl.ContinuationPtr$ContinuationImpl.receive(ContinuationPtr.java:71)
22:47:30 at PluginClassLoader for workflow-cps//com.cloudbees.groovy.cps.impl.ConstantBlock.eval(ConstantBlock.java:21)
22:47:30 at PluginClassLoader for workflow-cps//com.cloudbees.groovy.cps.Next.step(Next.java:84)
22:47:30 at PluginClassLoader for workflow-cps//com.cloudbees.groovy.cps.Continuable.run0(Continuable.java:142)
22:47:30 at PluginClassLoader for workflow-cps//org.jenkinsci.plugins.workflow.cps.SandboxContinuable.access$001(SandboxContinuable.java:17)
22:47:30 at PluginClassLoader for workflow-cps//org.jenkinsci.plugins.workflow.cps.SandboxContinuable.run0(SandboxContinuable.java:48)
22:47:30 at PluginClassLoader for workflow-cps//org.jenkinsci.plugins.workflow.cps.CpsThread.runNextChunk(CpsThread.java:188)
22:47:30 at PluginClassLoader for workflow-cps//org.jenkinsci.plugins.workflow.cps.CpsThreadGroup.run(CpsThreadGroup.java:464)
22:47:30 at PluginClassLoader for workflow-cps//org.jenkinsci.plugins.workflow.cps.CpsThreadGroup$2.call(CpsThreadGroup.java:372)
22:47:30 at PluginClassLoader for workflow-cps//org.jenkinsci.plugins.workflow.cps.CpsThreadGroup$2.call(CpsThreadGroup.java:302)
22:47:30 at PluginClassLoader for workflow-cps//org.jenkinsci.plugins.workflow.cps.CpsVmExecutorService.lambda$wrap$4(CpsVmExecutorService.java:143)
22:47:30 at java.base/java.util.concurrent.FutureTask.run(FutureTask.java:317)
22:47:30 at hudson.remoting.SingleLaneExecutorService$1.run(SingleLaneExecutorService.java:139)
22:47:30 at jenkins.util.ContextResettingExecutorService.lambda$wrap$0(ContextResettingExecutorService.java:26)
22:47:30 at jenkins.security.ImpersonatingExecutorService.lambda$wrap$0(ImpersonatingExecutorService.java:66)
22:47:30 at jenkins.util.ErrorLoggingExecutorService.lambda$wrap$0(ErrorLoggingExecutorService.java:51)
22:47:30 at java.base/java.util.concurrent.Executors$RunnableAdapter.call(Executors.java:572)
22:47:30 at java.base/java.util.concurrent.FutureTask.run(FutureTask.java:317)
22:47:30 at java.base/java.util.concurrent.ThreadPoolExecutor.runWorker(ThreadPoolExecutor.java:1144)
22:47:30 at java.base/java.util.concurrent.ThreadPoolExecutor$Worker.run(ThreadPoolExecutor.java:642)
22:47:30 at PluginClassLoader for workflow-cps//org.jenkinsci.plugins.workflow.cps.CpsVmExecutorService$1.call(CpsVmExecutorService.java:53)
22:47:30 at PluginClassLoader for workflow-cps//org.jenkinsci.plugins.workflow.cps.CpsVmExecutorService$1.call(CpsVmExecutorService.java:50)
22:47:30 at org.codehaus.groovy.runtime.GroovyCategorySupport$ThreadCategoryInfo.use(GroovyCategorySupport.java:136)
22:47:30 at org.codehaus.groovy.runtime.GroovyCategorySupport.use(GroovyCategorySupport.java:275)
22:47:30 at PluginClassLoader for workflow-cps//org.jenkinsci.plugins.workflow.cps.CpsVmExecutorService.lambda$categoryThreadFactory$0(CpsVmExecutorService.java:50)
22:47:30 at java.base/java.lang.Thread.run(Thread.java:1583)
22:47:30Finished: FAILURE
[Pipeline] error
[Pipeline] }
22:47:30Failed in branch gcc_9_x64_new
[Pipeline] build
22:48:14Scheduling project: Cforall » master[Pipeline] build
22:48:14Scheduling project: Cforall » master[Pipeline] build
22:48:14Scheduling project: Cforall » master22:48:22Starting building: Cforall » master #366322:48:22Starting building: Cforall » master #366422:48:22Starting building: Cforall » master #3662[Pipeline] build
22:49:14Scheduling project: Cforall » master22:49:22Starting building: Cforall » master #3665[Pipeline] build
22:50:14Scheduling project: Cforall » master[Pipeline] build
22:50:14Scheduling project: Cforall » master[Pipeline] build
22:50:14Scheduling project: Cforall » master22:50:22Starting building: Cforall » master #366622:50:22Starting building: Cforall » master #366822:50:22Starting building: Cforall » master #3667[Pipeline] build
22:51:14Scheduling project: Cforall » master[Pipeline] build
22:51:14Scheduling project: Cforall » master22:51:22Starting building: Cforall » master #366922:51:22Starting building: Cforall » master #367022:51:33Build Cforall » master #3670 completed: FAILURE
[Pipeline] echo
22:51:33FAILURE
[Pipeline] sh
22:51:34+ wget -q -O - https://cforall.uwaterloo.ca/jenkins/job/Cforall/job/master/3670/consoleText22:51:34Started by upstream project "Cforall_Full_Build" build number 414
22:51:34originally caused by:
22:51:34 Started by timer
22:51:34Running as Jenkins Build User
22:51:34 > git rev-parse --resolve-git-dir /var/lib/jenkins/caches/git-914b6fdde163b7e17ee75d99ca23f18a/.git # timeout=10
22:51:34Setting origin to cforall@plg.uwaterloo.ca:software/cfa/cfa-cc
22:51:34 > git config remote.origin.url cforall@plg.uwaterloo.ca:software/cfa/cfa-cc # timeout=10
22:51:34Fetching origin...
22:51:34Fetching upstream changes from origin
22:51:34 > git --version # timeout=10
22:51:34 > git --version # 'git version 2.43.0'
22:51:34 > git config --get remote.origin.url # timeout=10
22:51:34using GIT_SSH to set credentials Git key use to connect to the cforall git repo (August 2025)
22:51:34Verifying host key using known hosts file
22:51:34 > git fetch --no-tags --force --progress -- origin +refs/heads/*:refs/remotes/origin/* # timeout=10
22:51:34Seen branch in repository origin/ADT
22:51:34Seen branch in repository origin/aaron-thesis
22:51:34Seen branch in repository origin/arm-eh
22:51:34Seen branch in repository origin/ast-experimental
22:51:34Seen branch in repository origin/cleanup-dtors
22:51:34Seen branch in repository origin/ctor
22:51:34Seen branch in repository origin/deferred_resn
22:51:34Seen branch in repository origin/demangler
22:51:34Seen branch in repository origin/enum
22:51:34Seen branch in repository origin/forall-pointer-decay
22:51:34Seen branch in repository origin/gc_noraii
22:51:34Seen branch in repository origin/jacob/cs343-translation
22:51:34Seen branch in repository origin/jenkins-sandbox
22:51:34Seen branch in repository origin/master
22:51:34Seen branch in repository origin/memory
22:51:34Seen branch in repository origin/new-ast
22:51:34Seen branch in repository origin/new-ast-unique-expr
22:51:34Seen branch in repository origin/new-env
22:51:34Seen branch in repository origin/no_list
22:51:34Seen branch in repository origin/persistent-indexer
22:51:34Seen branch in repository origin/pthread-emulation
22:51:34Seen branch in repository origin/qualifiedEnum
22:51:34Seen branch in repository origin/resolv-new
22:51:34Seen branch in repository origin/string
22:51:34Seen branch in repository origin/stuck-waitfor-destruct
22:51:34Seen branch in repository origin/with_gc
22:51:34Seen 26 remote branches
22:51:34Obtained Jenkinsfile from 4ff8cb209307cd30c3626d4fbe3cc2d2ce4219ea
22:51:34[Pipeline] Start of Pipeline
22:51:34[Pipeline] node
22:51:34Running on Brokk 4 in /var/lib/jenkins/workspace/Cforall_master
22:51:34[Pipeline] {
22:51:34[Pipeline] wrap
22:51:34[Pipeline] {
22:51:34[Pipeline] properties
22:51:34WARNING: Unknown parameter(s) found for class type 'hudson.model.ChoiceParameterDefinition': defaultValue
22:51:34WARNING: Unknown parameter(s) found for class type 'hudson.model.ChoiceParameterDefinition': defaultValue
22:51:34[Pipeline] checkout
22:51:34The recommended git tool is: NONE
22:51:34using credential git_key_aug2025
22:51:34ERROR: Checkout failed
22:51:34java.io.StreamCorruptedException: invalid stream header: 636F7272
22:51:34 at java.base/java.io.ObjectInputStream.readStreamHeader(ObjectInputStream.java:989)
22:51:34 at java.base/java.io.ObjectInputStream.<init>(ObjectInputStream.java:416)
22:51:34 at hudson.remoting.ObjectInputStreamEx.<init>(ObjectInputStreamEx.java:50)
22:51:34 at hudson.remoting.Command.readFrom(Command.java:141)
22:51:34 at hudson.remoting.Command.readFrom(Command.java:127)
22:51:34 at hudson.remoting.AbstractSynchronousByteArrayCommandTransport.read(AbstractSynchronousByteArrayCommandTransport.java:35)
22:51:34 at hudson.remoting.SynchronousCommandTransport$ReaderThread.run(SynchronousCommandTransport.java:62)
22:51:34Also: hudson.remoting.Channel$CallSiteStackTrace: Remote call to Brokk 4
22:51:34 at hudson.remoting.Channel.attachCallSiteStackTrace(Channel.java:1916)
22:51:34 at hudson.remoting.Request.call(Request.java:204)
22:51:34 at hudson.remoting.Channel.call(Channel.java:1107)
22:51:34 at hudson.remoting.RemoteInvocationHandler.invoke(RemoteInvocationHandler.java:306)
22:51:34 at PluginClassLoader for git-client/jdk.proxy74/jdk.proxy74.$Proxy169.hasGitRepo(Unknown Source)
22:51:34 at PluginClassLoader for git-client//org.jenkinsci.plugins.gitclient.RemoteGitImpl.hasGitRepo(RemoteGitImpl.java:333)
22:51:34 at PluginClassLoader for git//hudson.plugins.git.GitSCM.retrieveChanges(GitSCM.java:1205)
22:51:34 at PluginClassLoader for git//hudson.plugins.git.GitSCM._checkout(GitSCM.java:1310)
22:51:34 at PluginClassLoader for git//hudson.plugins.git.GitSCM.checkout(GitSCM.java:1277)
22:51:34 at PluginClassLoader for workflow-scm-step//org.jenkinsci.plugins.workflow.steps.scm.SCMStep.checkout(SCMStep.java:136)
22:51:34 at PluginClassLoader for workflow-scm-step//org.jenkinsci.plugins.workflow.steps.scm.SCMStep$StepExecutionImpl.run(SCMStep.java:101)
22:51:34 at PluginClassLoader for workflow-scm-step//org.jenkinsci.plugins.workflow.steps.scm.SCMStep$StepExecutionImpl.run(SCMStep.java:88)
22:51:34 at PluginClassLoader for workflow-step-api//org.jenkinsci.plugins.workflow.steps.SynchronousNonBlockingStepExecution.lambda$start$0(SynchronousNonBlockingStepExecution.java:49)
22:51:34 at java.base/java.util.concurrent.Executors$RunnableAdapter.call(Executors.java:572)
22:51:34 at java.base/java.util.concurrent.FutureTask.run(FutureTask.java:317)
22:51:34 at java.base/java.util.concurrent.ThreadPoolExecutor.runWorker(ThreadPoolExecutor.java:1144)
22:51:34 at java.base/java.util.concurrent.ThreadPoolExecutor$Worker.run(ThreadPoolExecutor.java:642)
22:51:34 at java.base/java.lang.Thread.run(Thread.java:1583)
22:51:34Caused: hudson.remoting.RequestAbortedException
22:51:34 at hudson.remoting.Request.abort(Request.java:358)
22:51:34 at hudson.remoting.Channel.terminate(Channel.java:1189)
22:51:34 at hudson.remoting.SynchronousCommandTransport$ReaderThread.run(SynchronousCommandTransport.java:95)
22:51:34ERROR: Maximum checkout retry attempts reached, aborting
22:51:34[Pipeline] }
22:51:34[Pipeline] // wrap
22:51:34[Pipeline] }
22:51:34[Pipeline] // node
22:51:34[Pipeline] echo
22:51:34hudson.remoting.RequestAbortedException: java.io.StreamCorruptedException: invalid stream header: 636F7272
22:51:34[Pipeline] node
22:51:34Running on Brokk 1 in /var/lib/jenkins/workspace/Cforall_master
22:51:34[Pipeline] {
22:51:34[Pipeline] echo
22:51:34Notifying users of result
22:51:34[Pipeline] }
22:51:34[Pipeline] // node
22:51:34[Pipeline] End of Pipeline
22:51:34Also: org.jenkinsci.plugins.workflow.actions.ErrorAction$ErrorId: c66824cf-ee2c-4f40-a141-8bcb199b2609
22:51:34java.lang.NullPointerException: Cannot invoke method GitLogMessage() on null object
22:51:34 at PluginClassLoader for script-security//org.jenkinsci.plugins.scriptsecurity.sandbox.groovy.SandboxInterceptor.onMethodCall(SandboxInterceptor.java:178)
22:51:34 at PluginClassLoader for script-security//org.kohsuke.groovy.sandbox.impl.Checker$1.call(Checker.java:187)
22:51:34 at PluginClassLoader for script-security//org.kohsuke.groovy.sandbox.impl.Checker.checkedCall(Checker.java:191)
22:51:34 at PluginClassLoader for workflow-cps//com.cloudbees.groovy.cps.sandbox.SandboxInvoker.methodCall(SandboxInvoker.java:17)
22:51:34 at PluginClassLoader for workflow-cps//org.jenkinsci.plugins.workflow.cps.LoggingInvoker.methodCall(LoggingInvoker.java:124)
22:51:34 at WorkflowScript.email(WorkflowScript:229)
22:51:34 at ___cps.transform___(Native Method)
22:51:34 at PluginClassLoader for workflow-cps//com.cloudbees.groovy.cps.impl.ContinuationGroup.methodCall(ContinuationGroup.java:107)
22:51:34 at PluginClassLoader for workflow-cps//com.cloudbees.groovy.cps.impl.FunctionCallBlock$ContinuationImpl.dispatchOrArg(FunctionCallBlock.java:118)
22:51:34 at PluginClassLoader for workflow-cps//com.cloudbees.groovy.cps.impl.FunctionCallBlock$ContinuationImpl.fixName(FunctionCallBlock.java:82)
22:51:34 at java.base/jdk.internal.reflect.DirectMethodHandleAccessor.invoke(DirectMethodHandleAccessor.java:103)
22:51:34 at java.base/java.lang.reflect.Method.invoke(Method.java:580)
22:51:34 at PluginClassLoader for workflow-cps//com.cloudbees.groovy.cps.impl.ContinuationPtr$ContinuationImpl.receive(ContinuationPtr.java:71)
22:51:34 at PluginClassLoader for workflow-cps//com.cloudbees.groovy.cps.impl.ConstantBlock.eval(ConstantBlock.java:21)
22:51:34 at PluginClassLoader for workflow-cps//com.cloudbees.groovy.cps.Next.step(Next.java:84)
22:51:34 at PluginClassLoader for workflow-cps//com.cloudbees.groovy.cps.Continuable.run0(Continuable.java:142)
22:51:34 at PluginClassLoader for workflow-cps//org.jenkinsci.plugins.workflow.cps.SandboxContinuable.access$001(SandboxContinuable.java:17)
22:51:34 at PluginClassLoader for workflow-cps//org.jenkinsci.plugins.workflow.cps.SandboxContinuable.run0(SandboxContinuable.java:48)
22:51:34 at PluginClassLoader for workflow-cps//org.jenkinsci.plugins.workflow.cps.CpsThread.runNextChunk(CpsThread.java:188)
22:51:34 at PluginClassLoader for workflow-cps//org.jenkinsci.plugins.workflow.cps.CpsThreadGroup.run(CpsThreadGroup.java:464)
22:51:34 at PluginClassLoader for workflow-cps//org.jenkinsci.plugins.workflow.cps.CpsThreadGroup$2.call(CpsThreadGroup.java:372)
22:51:34 at PluginClassLoader for workflow-cps//org.jenkinsci.plugins.workflow.cps.CpsThreadGroup$2.call(CpsThreadGroup.java:302)
22:51:34 at PluginClassLoader for workflow-cps//org.jenkinsci.plugins.workflow.cps.CpsVmExecutorService.lambda$wrap$4(CpsVmExecutorService.java:143)
22:51:34 at java.base/java.util.concurrent.FutureTask.run(FutureTask.java:317)
22:51:34 at hudson.remoting.SingleLaneExecutorService$1.run(SingleLaneExecutorService.java:139)
22:51:34 at jenkins.util.ContextResettingExecutorService.lambda$wrap$0(ContextResettingExecutorService.java:26)
22:51:34 at jenkins.security.ImpersonatingExecutorService.lambda$wrap$0(ImpersonatingExecutorService.java:66)
22:51:34 at jenkins.util.ErrorLoggingExecutorService.lambda$wrap$0(ErrorLoggingExecutorService.java:51)
22:51:34 at java.base/java.util.concurrent.Executors$RunnableAdapter.call(Executors.java:572)
22:51:34 at java.base/java.util.concurrent.FutureTask.run(FutureTask.java:317)
22:51:34 at java.base/java.util.concurrent.ThreadPoolExecutor.runWorker(ThreadPoolExecutor.java:1144)
22:51:34 at java.base/java.util.concurrent.ThreadPoolExecutor$Worker.run(ThreadPoolExecutor.java:642)
22:51:34 at PluginClassLoader for workflow-cps//org.jenkinsci.plugins.workflow.cps.CpsVmExecutorService$1.call(CpsVmExecutorService.java:53)
22:51:34 at PluginClassLoader for workflow-cps//org.jenkinsci.plugins.workflow.cps.CpsVmExecutorService$1.call(CpsVmExecutorService.java:50)
22:51:34 at org.codehaus.groovy.runtime.GroovyCategorySupport$ThreadCategoryInfo.use(GroovyCategorySupport.java:136)
22:51:34 at org.codehaus.groovy.runtime.GroovyCategorySupport.use(GroovyCategorySupport.java:275)
22:51:34 at PluginClassLoader for workflow-cps//org.jenkinsci.plugins.workflow.cps.CpsVmExecutorService.lambda$categoryThreadFactory$0(CpsVmExecutorService.java:50)
22:51:34 at java.base/java.lang.Thread.run(Thread.java:1583)
22:51:34Finished: FAILURE
[Pipeline] error
[Pipeline] }
22:51:34Failed in branch gcc_10_arm64_new
22:55:26Build Cforall » master #3664 completed: FAILURE
[Pipeline] echo
22:55:26FAILURE
[Pipeline] sh
22:55:26+ wget -q -O - https://cforall.uwaterloo.ca/jenkins/job/Cforall/job/master/3664/consoleText22:55:26Started by upstream project "Cforall_Full_Build" build number 414
22:55:26originally caused by:
22:55:26 Started by timer
22:55:26Running as Jenkins Build User
22:55:26 > git rev-parse --resolve-git-dir /var/lib/jenkins/caches/git-914b6fdde163b7e17ee75d99ca23f18a/.git # timeout=10
22:55:26Setting origin to cforall@plg.uwaterloo.ca:software/cfa/cfa-cc
22:55:26 > git config remote.origin.url cforall@plg.uwaterloo.ca:software/cfa/cfa-cc # timeout=10
22:55:26Fetching origin...
22:55:26Fetching upstream changes from origin
22:55:26 > git --version # timeout=10
22:55:26 > git --version # 'git version 2.43.0'
22:55:26 > git config --get remote.origin.url # timeout=10
22:55:26using GIT_SSH to set credentials Git key use to connect to the cforall git repo (August 2025)
22:55:26Verifying host key using known hosts file
22:55:26 > git fetch --no-tags --force --progress -- origin +refs/heads/*:refs/remotes/origin/* # timeout=10
22:55:26Seen branch in repository origin/ADT
22:55:26Seen branch in repository origin/aaron-thesis
22:55:26Seen branch in repository origin/arm-eh
22:55:26Seen branch in repository origin/ast-experimental
22:55:26Seen branch in repository origin/cleanup-dtors
22:55:26Seen branch in repository origin/ctor
22:55:26Seen branch in repository origin/deferred_resn
22:55:26Seen branch in repository origin/demangler
22:55:26Seen branch in repository origin/enum
22:55:26Seen branch in repository origin/forall-pointer-decay
22:55:26Seen branch in repository origin/gc_noraii
22:55:26Seen branch in repository origin/jacob/cs343-translation
22:55:26Seen branch in repository origin/jenkins-sandbox
22:55:26Seen branch in repository origin/master
22:55:26Seen branch in repository origin/memory
22:55:26Seen branch in repository origin/new-ast
22:55:26Seen branch in repository origin/new-ast-unique-expr
22:55:26Seen branch in repository origin/new-env
22:55:26Seen branch in repository origin/no_list
22:55:26Seen branch in repository origin/persistent-indexer
22:55:26Seen branch in repository origin/pthread-emulation
22:55:26Seen branch in repository origin/qualifiedEnum
22:55:26Seen branch in repository origin/resolv-new
22:55:26Seen branch in repository origin/string
22:55:26Seen branch in repository origin/stuck-waitfor-destruct
22:55:26Seen branch in repository origin/with_gc
22:55:26Seen 26 remote branches
22:55:26Obtained Jenkinsfile from 4ff8cb209307cd30c3626d4fbe3cc2d2ce4219ea
22:55:26[Pipeline] Start of Pipeline
22:55:26[Pipeline] node
22:55:26Running on Brokk 2 in /var/lib/jenkins/workspace/Cforall_master_2
22:55:26[Pipeline] {
22:55:26[Pipeline] wrap
22:55:26[Pipeline] {
22:55:26[Pipeline] properties
22:55:26WARNING: Unknown parameter(s) found for class type 'hudson.model.ChoiceParameterDefinition': defaultValue
22:55:26WARNING: Unknown parameter(s) found for class type 'hudson.model.ChoiceParameterDefinition': defaultValue
22:55:26[Pipeline] checkout
22:55:26The recommended git tool is: NONE
22:55:26using credential git_key_aug2025
22:55:26 > git rev-parse --resolve-git-dir /var/lib/jenkins/workspace/Cforall_master_2/.git # timeout=10
22:55:26Fetching changes from the remote Git repository
22:55:26Cleaning workspace
22:55:26 > git config remote.origin.url cforall@plg.uwaterloo.ca:software/cfa/cfa-cc # timeout=10
22:55:26 > git rev-parse --verify HEAD # timeout=10
22:55:26Resetting working tree
22:55:26 > git reset --hard # timeout=10
22:55:26Fetching without tags
22:55:26 > git clean -fdx # timeout=10
22:55:26Fetching upstream changes from cforall@plg.uwaterloo.ca:software/cfa/cfa-cc
22:55:26 > git --version # timeout=10
22:55:26 > git --version # 'git version 2.43.0'
22:55:26using GIT_SSH to set credentials Git key use to connect to the cforall git repo (August 2025)
22:55:26Verifying host key using known hosts file
22:55:26 > git fetch --no-tags --force --progress -- cforall@plg.uwaterloo.ca:software/cfa/cfa-cc +refs/heads/*:refs/remotes/origin/* # timeout=10
22:55:26Checking out Revision 4ff8cb209307cd30c3626d4fbe3cc2d2ce4219ea (master)
22:55:26 > git config core.sparsecheckout # timeout=10
22:55:26 > git checkout -f 4ff8cb209307cd30c3626d4fbe3cc2d2ce4219ea # timeout=10
22:55:26Commit message: "fix Mesa citation"
22:55:26[Pipeline] load
22:55:26[Pipeline] { (Jenkins/tools.groovy)
22:55:26[Pipeline] }
22:55:26[Pipeline] // load
22:55:26[Pipeline] echo
22:55:26Compiler : clang (clang++/gcc-11)
22:55:26Architecture : x64
22:55:26Arc Flags : --host=x86_64
22:55:26Run All Tests : true
22:55:26Run Benchmark : true
22:55:26Build Documentation : true
22:55:26Publish : true
22:55:26Silent : true
22:55:2622:55:26[Pipeline] }
22:55:26[Pipeline] // wrap
22:55:26[Pipeline] }
22:55:26[Pipeline] // node
22:55:26[Pipeline] node
22:55:26Running on Brokk 5 in /var/lib/jenkins/workspace/Cforall_master_2
22:55:26[Pipeline] {
22:55:26[Pipeline] wrap
22:55:26[Pipeline] {
22:55:26[Pipeline] pwd
22:55:26[Pipeline] pwd
22:55:26[Pipeline] echo
22:55:26 -------- Cleanup --------
22:55:26[Pipeline] stage
22:55:26[Pipeline] { (Cleanup)
22:55:26[Pipeline] dir
22:55:26Running in /var/lib/jenkins/workspace/Cforall_master_2@tmp
22:55:26[Pipeline] {
22:55:26[Pipeline] deleteDir
22:55:26[Pipeline] }
22:55:26[Pipeline] // dir
22:55:26[Pipeline] }
22:55:26[Pipeline] // stage
22:55:26[Pipeline] echo
22:55:26 -------- Checkout --------
22:55:26[Pipeline] stage
22:55:26[Pipeline] { (Checkout)
22:55:26[Pipeline] checkout
22:55:26The recommended git tool is: NONE
22:55:26using credential git_key_aug2025
22:55:26Fetching changes from the remote Git repository
22:55:26Cleaning workspace
22:55:26Fetching without tags
22:55:26 > git rev-list --no-walk 4ff8cb209307cd30c3626d4fbe3cc2d2ce4219ea # timeout=10
22:55:26 > git rev-parse --resolve-git-dir /var/lib/jenkins/workspace/Cforall_master_2/.git # timeout=10
22:55:26 > git config remote.origin.url cforall@plg.uwaterloo.ca:software/cfa/cfa-cc # timeout=10
22:55:26 > git rev-parse --verify HEAD # timeout=10
22:55:26Resetting working tree
22:55:26 > git reset --hard # timeout=10
22:55:26 > git clean -fdx # timeout=10
22:55:26Fetching upstream changes from cforall@plg.uwaterloo.ca:software/cfa/cfa-cc
22:55:26 > git --version # timeout=10
22:55:26 > git --version # 'git version 2.43.0'
22:55:26using GIT_SSH to set credentials Git key use to connect to the cforall git repo (August 2025)
22:55:26Verifying host key using known hosts file
22:55:26 > git fetch --no-tags --force --progress -- cforall@plg.uwaterloo.ca:software/cfa/cfa-cc +refs/heads/*:refs/remotes/origin/* # timeout=10
22:55:26Checking out Revision 4ff8cb209307cd30c3626d4fbe3cc2d2ce4219ea (master)
22:55:26Commit message: "fix Mesa citation"
22:55:26[Pipeline] echo
22:55:26Constructing new git message
22:55:26[Pipeline] sh
22:55:26 > git config core.sparsecheckout # timeout=10
22:55:26 > git checkout -f 4ff8cb209307cd30c3626d4fbe3cc2d2ce4219ea # timeout=10
22:55:26+ git rev-list 4ff8cb209307cd30c3626d4fbe3cc2d2ce4219ea..4ff8cb209307cd30c3626d4fbe3cc2d2ce4219ea
22:55:26[Pipeline] sh
22:55:26+ git cat-file -t 4ff8cb209307cd30c3626d4fbe3cc2d2ce4219ea
22:55:26[Pipeline] sh
22:55:26+ git rev-list --format=short 4ff8cb209307cd30c3626d4fbe3cc2d2ce4219ea...4ff8cb209307cd30c3626d4fbe3cc2d2ce4219ea
22:55:26[Pipeline] sh
22:55:26+ git diff --stat --color 4ff8cb209307cd30c3626d4fbe3cc2d2ce4219ea 4ff8cb209307cd30c3626d4fbe3cc2d2ce4219ea
22:55:26[Pipeline] echo
22:55:2622:55:26<p>- Changes -------------------------------------------------------------</p>
22:55:2622:55:26<pre>
22:55:26The branch master has been updated.
22:55:26 from 4ff8cb209307cd30c3626d4fbe3cc2d2ce4219ea (commit)
22:55:26</pre>
22:55:2622:55:26<p>- Log -----------------------------------------------------------------</p>
22:55:2622:55:26<pre>
22:55:2622:55:26</pre>
22:55:2622:55:26<p>-----------------------------------------------------------------------</p>
22:55:26<pre>
22:55:26Summary of changes:
22:55:2622:55:26</pre>
22:55:2622:55:26[Pipeline] }
22:55:26[Pipeline] // stage
22:55:26[Pipeline] echo
22:55:26 -------- Build : configure --------
22:55:26[Pipeline] stage
22:55:26[Pipeline] { (Build : configure)
22:55:26[Pipeline] dir
22:55:26Running in /var/lib/jenkins/workspace/Cforall_master_2
22:55:26[Pipeline] {
22:55:26[Pipeline] sh
22:55:26+ ./autogen.sh
22:55:26Running aclocal in root
22:55:26Running libtoolize in root
22:55:26libtoolize: putting auxiliary files in AC_CONFIG_AUX_DIR, 'automake'.
22:55:26libtoolize: linking file 'automake/ltmain.sh'
22:55:26libtoolize: putting macros in AC_CONFIG_MACRO_DIRS, 'automake'.
22:55:26libtoolize: linking file 'automake/libtool.m4'
22:55:26libtoolize: linking file 'automake/ltoptions.m4'
22:55:26libtoolize: linking file 'automake/ltsugar.m4'
22:55:26libtoolize: linking file 'automake/ltversion.m4'
22:55:26libtoolize: linking file 'automake/lt~obsolete.m4'
22:55:26Running autoconf in root
22:55:26Running automake in root
22:55:26configure.ac:223: installing 'automake/compile'
22:55:26configure.ac:138: installing 'automake/config.guess'
22:55:26configure.ac:138: installing 'automake/config.sub'
22:55:26configure.ac:17: installing 'automake/install-sh'
22:55:26benchmark/Makefile.am: installing 'automake/depcomp'
22:55:26parallel-tests: installing 'automake/test-driver'
22:55:26configure.ac: installing 'automake/ylwrap'
22:55:26Running aclocal in libcfa
22:55:26Running libtoolize in libcfa
22:55:26libtoolize: putting auxiliary files in AC_CONFIG_AUX_DIR, 'automake'.
22:55:26libtoolize: linking file 'automake/ltmain.sh'
22:55:26libtoolize: putting macros in AC_CONFIG_MACRO_DIRS, 'automake'.
22:55:26libtoolize: linking file 'automake/libtool.m4'
22:55:26libtoolize: linking file 'automake/ltoptions.m4'
22:55:26libtoolize: linking file 'automake/ltsugar.m4'
22:55:26libtoolize: linking file 'automake/ltversion.m4'
22:55:26libtoolize: linking file 'automake/lt~obsolete.m4'
22:55:26Running autoconf in libcfa
22:55:26Running automake in libcfa
22:55:26configure.ac:119: installing 'automake/compile'
22:55:26configure.ac:119: installing 'automake/config.guess'
22:55:26configure.ac:119: installing 'automake/config.sub'
22:55:26configure.ac:12: installing 'automake/install-sh'
22:55:26src/Makefile.am: installing 'automake/depcomp'
22:55:26[Pipeline] }
22:55:26[Pipeline] // dir
22:55:26[Pipeline] dir
22:55:26Running in /var/lib/jenkins/workspace/Cforall_master_2@tmp
22:55:26[Pipeline] {
22:55:26[Pipeline] sh
22:55:26+ /var/lib/jenkins/workspace/Cforall_master_2/configure CXX=clang++ CC=gcc-11 --host=x86_64 AR=gcc-ar RANLIB=gcc-ranlib --with-target-hosts=host:debug,host:nodebug --quiet --prefix=/var/lib/jenkins/workspace/Cforall_master_2@tmp
22:55:26[Pipeline] sh
22:55:26+ nproc
22:55:26+ make -j 16 --no-print-directory configure-libcfa
22:55:26libcfa/x64-debug/config.data
22:55:26Configuring libcfa (/var/lib/jenkins/workspace/Cforall_master_2/libcfa/configure) with ''CXX=clang++' 'CC=gcc-11' 'AR=gcc-ar' 'RANLIB=gcc-ranlib' '--prefix=/var/lib/jenkins/workspace/Cforall_master_2@tmp' DRIVER_DIR=/var/lib/jenkins/workspace/Cforall_master_2@tmp/driver/ ARCHITECTURE=x64 CONFIGURATION=debug CFA_VERSION=1:0:0' from /var/lib/jenkins/workspace/Cforall_master_2@tmp / libcfa/x64-debug/
22:55:26libcfa/x64-nodebug/config.data
22:55:26Configuring libcfa (/var/lib/jenkins/workspace/Cforall_master_2/libcfa/configure) with ''CXX=clang++' 'CC=gcc-11' 'AR=gcc-ar' 'RANLIB=gcc-ranlib' '--prefix=/var/lib/jenkins/workspace/Cforall_master_2@tmp' DRIVER_DIR=/var/lib/jenkins/workspace/Cforall_master_2@tmp/driver/ ARCHITECTURE=x64 CONFIGURATION=nodebug CFA_VERSION=1:0:0' from /var/lib/jenkins/workspace/Cforall_master_2@tmp / libcfa/x64-nodebug/
22:55:26checking whether make supports nested variables... yes
22:55:26checking for a BSD-compatible install... checking whether make supports nested variables... yes
22:55:26checking for a BSD-compatible install... /usr/bin/install -c
22:55:26checking whether build environment is sane... yes
22:55:26/usr/bin/install -c
22:55:26checking whether build environment is sane... yes
22:55:26checking for a race-free mkdir -p... /usr/bin/mkdir -p
22:55:26checking for gawk... gawk
22:55:26checking whether make sets $(MAKE)... checking for a race-free mkdir -p... /usr/bin/mkdir -p
22:55:26checking for gawk... gawk
22:55:26checking whether make sets $(MAKE)... yes
22:55:26yes
22:55:26checking for distributated build... no
22:55:26checking for distributated build... no
22:55:26checking build system type... checking build system type... x86_64-pc-linux-gnu
22:55:26checking host system type... x86_64-pc-linux-gnu
22:55:26x86_64-pc-linux-gnu
22:55:26checking how to print strings... checking host system type... x86_64-pc-linux-gnu
22:55:26checking how to print strings... printf
22:55:26checking whether make supports the include directive... printf
22:55:26checking whether make supports the include directive... yes (GNU style)
22:55:26checking for gcc... gcc-11
22:55:26yes (GNU style)
22:55:26checking for gcc... gcc-11
22:55:26checking whether the C compiler works... checking whether the C compiler works... yes
22:55:26checking for C compiler default output file name... a.out
22:55:26checking for suffix of executables... yes
22:55:26checking for C compiler default output file name... a.out
22:55:26checking for suffix of executables...
22:55:26checking whether we are cross compiling...
22:55:26checking whether we are cross compiling... no
22:55:26checking for suffix of object files... no
22:55:26checking for suffix of object files... o
22:55:26checking whether the compiler supports GNU C... o
22:55:26checking whether the compiler supports GNU C... yes
22:55:26checking whether gcc-11 accepts -g... yes
22:55:26checking whether gcc-11 accepts -g... yes
22:55:26checking for gcc-11 option to enable C11 features... yes
22:55:26checking for gcc-11 option to enable C11 features... none needed
22:55:26checking whether gcc-11 understands -c and -o together... none needed
22:55:26checking whether gcc-11 understands -c and -o together... yes
22:55:26checking dependency style of gcc-11... yes
22:55:26checking dependency style of gcc-11... gcc3
22:55:26checking for a sed that does not truncate output... /usr/bin/sed
22:55:26checking for grep that handles long lines and -e... /usr/bin/grep
22:55:26checking for egrep... /usr/bin/grep -E
22:55:26checking for fgrep... /usr/bin/grep -F
22:55:26checking for ld used by gcc-11... /usr/bin/ld
22:55:26checking if the linker (/usr/bin/ld) is GNU ld... yes
22:55:26checking for BSD- or MS-compatible name lister (nm)... /usr/bin/nm -B
22:55:26checking the name lister (/usr/bin/nm -B) interface... gcc3
22:55:26checking for a sed that does not truncate output... /usr/bin/sed
22:55:26checking for grep that handles long lines and -e... /usr/bin/grep
22:55:26checking for egrep... /usr/bin/grep -E
22:55:26checking for fgrep... /usr/bin/grep -F
22:55:26checking for ld used by gcc-11... /usr/bin/ld
22:55:26checking if the linker (/usr/bin/ld) is GNU ld... yes
22:55:26checking for BSD- or MS-compatible name lister (nm)... /usr/bin/nm -B
22:55:26checking the name lister (/usr/bin/nm -B) interface... BSD nm
22:55:26checking whether ln -s works... yes
22:55:26checking the maximum length of command line arguments... 1572864
22:55:26checking how to convert x86_64-pc-linux-gnu file names to x86_64-pc-linux-gnu format... func_convert_file_noop
22:55:26checking how to convert x86_64-pc-linux-gnu file names to toolchain format... func_convert_file_noop
22:55:26checking for /usr/bin/ld option to reload object files... -r
22:55:26checking for file... file
22:55:26checking for objdump... objdump
22:55:26checking how to recognize dependent libraries... pass_all
22:55:26checking for dlltool... no
22:55:26checking how to associate runtime and link libraries... printf %s\n
22:55:26checking for archiver @FILE support... BSD nm
22:55:26checking whether ln -s works... yes
22:55:26checking the maximum length of command line arguments... 1572864
22:55:26checking how to convert x86_64-pc-linux-gnu file names to x86_64-pc-linux-gnu format... @
22:55:26func_convert_file_noop
22:55:26checking how to convert x86_64-pc-linux-gnu file names to toolchain format... func_convert_file_noop
22:55:26checking for /usr/bin/ld option to reload object files... checking for strip... -r
22:55:26strip
22:55:26checking for file... checking for ranlib... gcc-ranlib
22:55:26file
22:55:26checking command to parse /usr/bin/nm -B output from gcc-11 object... checking for objdump... objdump
22:55:26checking how to recognize dependent libraries... pass_all
22:55:26checking for dlltool... no
22:55:26checking how to associate runtime and link libraries... printf %s\n
22:55:26checking for archiver @FILE support... @
22:55:26checking for strip... strip
22:55:26checking for ranlib... gcc-ranlib
22:55:26checking command to parse /usr/bin/nm -B output from gcc-11 object... ok
22:55:26checking for sysroot... no
22:55:26checking for a working dd... /usr/bin/dd
22:55:26checking how to truncate binary pipes... /usr/bin/dd bs=4096 count=1
22:55:26checking for mt... mt
22:55:26checking if mt is a manifest tool... no
22:55:26checking for stdio.h... ok
22:55:26checking for sysroot... no
22:55:26checking for a working dd... /usr/bin/dd
22:55:26checking how to truncate binary pipes... /usr/bin/dd bs=4096 count=1
22:55:26yes
22:55:26checking for stdlib.h... checking for mt... mt
22:55:26checking if mt is a manifest tool... no
22:55:26checking for stdio.h... yes
22:55:26checking for string.h... yes
22:55:26checking for stdlib.h... yes
22:55:26checking for inttypes.h... yes
22:55:26checking for string.h... yes
22:55:26checking for stdint.h... yes
22:55:26checking for inttypes.h... yes
22:55:26checking for strings.h... yes
22:55:26checking for stdint.h... yes
22:55:26checking for sys/stat.h... yes
22:55:26checking for strings.h... yes
22:55:26checking for sys/types.h... yes
22:55:26checking for sys/stat.h... yes
22:55:26checking for unistd.h... yes
22:55:26checking for sys/types.h... yes
22:55:26checking for dlfcn.h... yes
22:55:26checking for unistd.h... yes
22:55:26checking for objdir... .libs
22:55:26yes
22:55:26checking for dlfcn.h... yes
22:55:26checking for objdir... .libs
22:55:26checking if gcc-11 supports -fno-rtti -fno-exceptions... no
22:55:26checking for gcc-11 option to produce PIC... -fPIC -DPIC
22:55:26checking if gcc-11 PIC flag -fPIC -DPIC works... checking if gcc-11 supports -fno-rtti -fno-exceptions... yes
22:55:26checking if gcc-11 static flag -static works... no
22:55:26checking for gcc-11 option to produce PIC... -fPIC -DPIC
22:55:26checking if gcc-11 PIC flag -fPIC -DPIC works... yes
22:55:26checking if gcc-11 static flag -static works... yes
22:55:26checking if gcc-11 supports -c -o file.o... yes
22:55:26checking if gcc-11 supports -c -o file.o... yes
22:55:26checking if gcc-11 supports -c -o file.o... (cached) yes
22:55:26checking whether the gcc-11 linker (/usr/bin/ld -m elf_x86_64) supports shared libraries... yes
22:55:26checking whether -lc should be explicitly linked in... yes
22:55:26checking if gcc-11 supports -c -o file.o... (cached) yes
22:55:26checking whether the gcc-11 linker (/usr/bin/ld -m elf_x86_64) supports shared libraries... yes
22:55:26checking whether -lc should be explicitly linked in... no
22:55:26checking dynamic linker characteristics... no
22:55:26checking dynamic linker characteristics... GNU/Linux ld.so
22:55:26checking how to hardcode library paths into programs... immediate
22:55:26checking whether stripping libraries is possible... yes
22:55:26checking if libtool supports shared libraries... yes
22:55:26checking whether to build shared libraries... yes
22:55:26checking whether to build static libraries... no
22:55:26GNU/Linux ld.so
22:55:26checking how to hardcode library paths into programs... immediate
22:55:26checking whether stripping libraries is possible... yes
22:55:26checking if libtool supports shared libraries... yes
22:55:26checking whether to build shared libraries... yes
22:55:26checking whether to build static libraries... no
22:55:26checking whether the compiler supports GNU C++... checking whether the compiler supports GNU C++... yes
22:55:26checking whether clang++ accepts -g... yes
22:55:26checking whether clang++ accepts -g... yes
22:55:26checking for clang++ option to enable C++11 features... yes
22:55:26checking for clang++ option to enable C++11 features... none needed
22:55:26checking dependency style of clang++... none needed
22:55:26checking dependency style of clang++... gcc3
22:55:26checking how to run the C++ preprocessor... gcc3
22:55:26checking how to run the C++ preprocessor... clang++ -E
22:55:26clang++ -E
22:55:26checking for ld used by clang++... /usr/bin/ld -m elf_x86_64
22:55:26checking if the linker (/usr/bin/ld -m elf_x86_64) is GNU ld... yes
22:55:26checking for ld used by clang++... checking whether the clang++ linker (/usr/bin/ld -m elf_x86_64) supports shared libraries... yes
22:55:26/usr/bin/ld -m elf_x86_64
22:55:26checking if the linker (/usr/bin/ld -m elf_x86_64) is GNU ld... yes
22:55:26checking whether the clang++ linker (/usr/bin/ld -m elf_x86_64) supports shared libraries... yes
22:55:26checking for clang++ option to produce PIC... -fPIC -DPIC
22:55:26checking if clang++ PIC flag -fPIC -DPIC works... yes
22:55:26checking if clang++ static flag -static works... checking for clang++ option to produce PIC... -fPIC -DPIC
22:55:26checking if clang++ PIC flag -fPIC -DPIC works... yes
22:55:26checking if clang++ static flag -static works... yes
22:55:26checking if clang++ supports -c -o file.o... yes
22:55:26checking if clang++ supports -c -o file.o... yes
22:55:26checking if clang++ supports -c -o file.o... (cached) yes
22:55:26checking whether the clang++ linker (/usr/bin/ld -m elf_x86_64) supports shared libraries... yes
22:55:26checking dynamic linker characteristics... (cached) GNU/Linux ld.so
22:55:26checking how to hardcode library paths into programs... immediate
22:55:26checking for gcc... (cached) gcc-11
22:55:26yes
22:55:26checking if clang++ supports -c -o file.o... (cached) yes
22:55:26checking whether the clang++ linker (/usr/bin/ld -m elf_x86_64) supports shared libraries... yes
22:55:26checking dynamic linker characteristics... (cached) GNU/Linux ld.so
22:55:26checking how to hardcode library paths into programs... immediate
22:55:26checking for gcc... (cached) gcc-11
22:55:26checking whether the compiler supports GNU C... (cached) yes
22:55:26checking whether gcc-11 accepts -g... (cached) yes
22:55:26checking for gcc-11 option to enable C11 features... (cached) none needed
22:55:26checking whether gcc-11 understands -c and -o together... (cached) yes
22:55:26checking dependency style of gcc-11... (cached) gcc3
22:55:26checking dependency style of gcc-11... checking whether the compiler supports GNU C... (cached) yes
22:55:26checking whether gcc-11 accepts -g... (cached) yes
22:55:26checking for gcc-11 option to enable C11 features... (cached) none needed
22:55:26checking whether gcc-11 understands -c and -o together... (cached) yes
22:55:26checking dependency style of gcc-11... (cached) gcc3
22:55:26checking dependency style of gcc-11... gcc3
22:55:26checking whether make sets $(MAKE)... (cached) yes
22:55:26checking for linux/rseq.h... gcc3
22:55:26checking whether make sets $(MAKE)... (cached) yes
22:55:26checking for linux/rseq.h... yes
22:55:26checking for rseq_available in -lrseq... yes
22:55:26checking for rseq_available in -lrseq... no
22:55:26checking for gcc-11 options needed to detect all undeclared functions... no
22:55:26checking for gcc-11 options needed to detect all undeclared functions... none needed
22:55:26checking for linux/io_uring.h... none needed
22:55:26checking for linux/io_uring.h... yes
22:55:26checking for liburing.h... yes
22:55:26checking for liburing.h... no
22:55:26checking whether IORING_OP_NOP is declared... no
22:55:26checking whether IORING_OP_NOP is declared... yes
22:55:26checking whether IORING_OP_READV is declared... yes
22:55:26checking whether IORING_OP_READV is declared... yes
22:55:26checking whether IORING_OP_WRITEV is declared... yes
22:55:26checking whether IORING_OP_WRITEV is declared... yes
22:55:26checking whether IORING_OP_FSYNC is declared... yes
22:55:26checking whether IORING_OP_FSYNC is declared... yes
22:55:26checking whether IORING_OP_READ_FIXED is declared... yes
22:55:26checking whether IORING_OP_READ_FIXED is declared... yes
22:55:26checking whether IORING_OP_WRITE_FIXED is declared... yes
22:55:26checking whether IORING_OP_WRITE_FIXED is declared... yes
22:55:26checking whether IORING_OP_POLL_ADD is declared... yes
22:55:26checking whether IORING_OP_POLL_ADD is declared... yes
22:55:26checking whether IORING_OP_POLL_REMOVE is declared... yes
22:55:26checking whether IORING_OP_POLL_REMOVE is declared... yes
22:55:26checking whether IORING_OP_SYNC_FILE_RANGE is declared... yes
22:55:26checking whether IORING_OP_SYNC_FILE_RANGE is declared... yes
22:55:26checking whether IORING_OP_SENDMSG is declared... yes
22:55:26checking whether IORING_OP_SENDMSG is declared... yes
22:55:26checking whether IORING_OP_RECVMSG is declared... yes
22:55:26checking whether IORING_OP_RECVMSG is declared... yes
22:55:26checking whether IORING_OP_TIMEOUT is declared... yes
22:55:26checking whether IORING_OP_TIMEOUT is declared... yes
22:55:26checking whether IORING_OP_TIMEOUT_REMOVE is declared... yes
22:55:26checking whether IORING_OP_TIMEOUT_REMOVE is declared... yes
22:55:26checking whether IORING_OP_ACCEPT is declared... yes
22:55:26checking whether IORING_OP_ACCEPT is declared... yes
22:55:26checking whether IORING_OP_ASYNC_CANCEL is declared... yes
22:55:26checking whether IORING_OP_ASYNC_CANCEL is declared... yes
22:55:26checking whether IORING_OP_LINK_TIMEOUT is declared... yes
22:55:26checking whether IORING_OP_LINK_TIMEOUT is declared... yes
22:55:26yes
22:55:26checking whether IORING_OP_CONNECT is declared... checking whether IORING_OP_CONNECT is declared... yes
22:55:26checking whether IORING_OP_FALLOCATE is declared... yes
22:55:26checking whether IORING_OP_FALLOCATE is declared... yes
22:55:26checking whether IORING_OP_OPENAT is declared... yes
22:55:26checking whether IORING_OP_OPENAT is declared... yes
22:55:26checking whether IORING_OP_CLOSE is declared... yes
22:55:26checking whether IORING_OP_CLOSE is declared... yes
22:55:26checking whether IORING_OP_FILES_UPDATE is declared... yes
22:55:26checking whether IORING_OP_FILES_UPDATE is declared... yes
22:55:26checking whether IORING_OP_STATX is declared... yes
22:55:26checking whether IORING_OP_STATX is declared... yes
22:55:26checking whether IORING_OP_READ is declared... yes
22:55:26checking whether IORING_OP_READ is declared... yes
22:55:26checking whether IORING_OP_WRITE is declared... yes
22:55:26checking whether IORING_OP_WRITE is declared... yes
22:55:26checking whether IORING_OP_FADVISE is declared... yes
22:55:26checking whether IORING_OP_FADVISE is declared... yes
22:55:26checking whether IORING_OP_MADVISE is declared... yes
22:55:26checking whether IORING_OP_MADVISE is declared... yes
22:55:26checking whether IORING_OP_SEND is declared... yes
22:55:26checking whether IORING_OP_SEND is declared... yes
22:55:26checking whether IORING_OP_RECV is declared... yes
22:55:26checking whether IORING_OP_RECV is declared... yes
22:55:26checking whether IORING_OP_OPENAT2 is declared... yes
22:55:26checking whether IORING_OP_OPENAT2 is declared... yes
22:55:26checking whether IORING_OP_EPOLL_CTL is declared... yes
22:55:26checking whether IORING_OP_EPOLL_CTL is declared... yes
22:55:26checking whether IORING_OP_SPLICE is declared... yes
22:55:26checking whether IORING_OP_SPLICE is declared... yes
22:55:26checking whether IORING_OP_PROVIDE_BUFFERS is declared... yes
22:55:26checking whether IORING_OP_PROVIDE_BUFFERS is declared... yes
22:55:26checking whether IORING_OP_REMOVE_BUFFER is declared... yes
22:55:26checking whether IORING_OP_REMOVE_BUFFER is declared... no
22:55:26checking whether IORING_OP_TEE is declared... no
22:55:26checking whether IORING_OP_TEE is declared... yes
22:55:26checking whether IOSQE_FIXED_FILE is declared... yes
22:55:26checking whether IOSQE_FIXED_FILE is declared... yes
22:55:26checking whether IOSQE_IO_DRAIN is declared... yes
22:55:26checking whether IOSQE_IO_DRAIN is declared... yes
22:55:26checking whether IOSQE_IO_LINK is declared... yes
22:55:26checking whether IOSQE_IO_LINK is declared... yes
22:55:26checking whether IOSQE_IO_HARDLINK is declared... yes
22:55:26checking whether IOSQE_IO_HARDLINK is declared... yes
22:55:26checking whether IOSQE_ASYNC is declared... yes
22:55:26checking whether IOSQE_ASYNC is declared... yes
22:55:26checking whether IOSQE_BUFFER_SELECT is declared... yes
22:55:26checking whether IOSQE_BUFFER_SELECT is declared... yes
22:55:26checking whether SPLICE_F_FD_IN_FIXED is declared... yes
22:55:26checking whether SPLICE_F_FD_IN_FIXED is declared... yes
22:55:26checking whether IORING_SETUP_ATTACH_WQ is declared... yes
22:55:26checking whether IORING_SETUP_ATTACH_WQ is declared... yes
22:55:26checking whether IORING_REGISTER_IOWQ_MAX_WORKERS is declared... yes
22:55:26checking whether IORING_REGISTER_IOWQ_MAX_WORKERS is declared... yes
22:55:26checking for preadv2... yes
22:55:26checking for preadv2... yes
22:55:26checking for pwritev2... yes
22:55:26checking for pwritev2... yes
22:55:26yes
22:55:26checking that generated files are newer than configure... done
22:55:26configure: creating ./config.status
22:55:26checking that generated files are newer than configure... done
22:55:26configure: creating ./config.status
22:55:26config.status: creating Makefile
22:55:26config.status: creating src/Makefile
22:55:26config.status: creating Makefile
22:55:26config.status: creating src/Makefile
22:55:26config.status: creating prelude/Makefile
22:55:26config.status: creating prelude/Makefile
22:55:26config.status: creating src/concurrency/io/call.cfa
22:55:26config.status: creating src/concurrency/io/call.cfa
22:55:26/var/lib/jenkins/workspace/Cforall_master_2/libcfa/src/concurrency/io/call.cfa.in:144: SyntaxWarning: invalid escape sequence '\('
22:55:26 sig = re.search("(.*) (.*)\((.*)\)", signature)
22:55:26config.status: creating prelude/defines.hfa
22:55:26/var/lib/jenkins/workspace/Cforall_master_2/libcfa/src/concurrency/io/call.cfa.in:144: SyntaxWarning: invalid escape sequence '\('
22:55:26 sig = re.search("(.*) (.*)\((.*)\)", signature)
22:55:26config.status: creating prelude/defines.hfa
22:55:26config.status: executing depfiles commands
22:55:26config.status: executing depfiles commands
22:55:26config.status: executing libtool commands
22:55:26Cforall library configuraton completed. Type "make -j 8 install".
22:55:26config.status: executing libtool commands
22:55:26Cforall library configuraton completed. Type "make -j 8 install".
22:55:26[Pipeline] }
22:55:26[Pipeline] // dir
22:55:26[Pipeline] }
22:55:26[Pipeline] // stage
22:55:26[Pipeline] echo
22:55:26 -------- Build : cfa-cpp --------
22:55:26[Pipeline] stage
22:55:26[Pipeline] { (Build : cfa-cpp)
22:55:26[Pipeline] dir
22:55:26Running in /var/lib/jenkins/workspace/Cforall_master_2@tmp
22:55:26[Pipeline] {
22:55:26[Pipeline] sh
22:55:26+ nproc
22:55:26+ make -j 16 --no-print-directory -C driver
22:55:26 CXX as.o
22:55:26 CXX cc1.o
22:55:26 CXX cfa.o
22:55:26 CXXLD as
22:55:26/var/lib/jenkins/workspace/Cforall_master_2/driver/cc1.cc:149:20: warning: variable length arrays in C++ are a Clang extension [-Wvla-cxx-extension]
22:55:26 149 | const char * args[argc + 100]; // leave space for 100 additional cpp command line values
22:55:26 | ^~~~~~~~~~
22:55:26/var/lib/jenkins/workspace/Cforall_master_2/driver/cc1.cc:149:20: note: function parameter 'argc' with unknown value cannot be used in a constant expression
22:55:26/var/lib/jenkins/workspace/Cforall_master_2/driver/cc1.cc:139:31: note: declared here
22:55:26 139 | static void Stage1( const int argc, const char * const argv[] ) {
22:55:26 | ^
22:55:26/var/lib/jenkins/workspace/Cforall_master_2/driver/cc1.cc:343:20: warning: variable length arrays in C++ are a Clang extension [-Wvla-cxx-extension]
22:55:26 343 | const char * args[argc + 100]; // leave space for 100 additional cfa command line values
22:55:26 | ^~~~~~~~~~
22:55:26/var/lib/jenkins/workspace/Cforall_master_2/driver/cc1.cc:343:20: note: function parameter 'argc' with unknown value cannot be used in a constant expression
22:55:26/var/lib/jenkins/workspace/Cforall_master_2/driver/cc1.cc:336:31: note: declared here
22:55:26 336 | static void Stage2( const int argc, const char * const * argv ) {
22:55:26 | ^
22:55:26/var/lib/jenkins/workspace/Cforall_master_2/driver/cfa.cc:151:20: warning: variable length arrays in C++ are a Clang extension [-Wvla-cxx-extension]
22:55:26 151 | const char * args[argc + 100]; // cfa command line values, plus some space for additional flags
22:55:26 | ^~~~~~~~~~
22:55:26/var/lib/jenkins/workspace/Cforall_master_2/driver/cfa.cc:151:20: note: function parameter 'argc' with unknown value cannot be used in a constant expression
22:55:26/var/lib/jenkins/workspace/Cforall_master_2/driver/cfa.cc:115:15: note: declared here
22:55:26 115 | int main( int argc, char * argv[] ) {
22:55:26 | ^
22:55:26/var/lib/jenkins/workspace/Cforall_master_2/driver/cfa.cc:155:20: warning: variable length arrays in C++ are a Clang extension [-Wvla-cxx-extension]
22:55:26 155 | const char * libs[argc + 20]; // non-user libraries must come separately, plus some added libraries and flags
22:55:26 | ^~~~~~~~~
22:55:26/var/lib/jenkins/workspace/Cforall_master_2/driver/cfa.cc:155:20: note: function parameter 'argc' with unknown value cannot be used in a constant expression
22:55:26/var/lib/jenkins/workspace/Cforall_master_2/driver/cfa.cc:115:15: note: declared here
22:55:26 115 | int main( int argc, char * argv[] ) {
22:55:26 | ^
22:55:262 warnings generated.
22:55:26 CXXLD cc1
22:55:262 warnings generated.
22:55:26 CXXLD cfa
22:55:26[Pipeline] sh
22:55:26+ nproc
22:55:26+ make -j 16 --no-print-directory -C src
22:55:26 YACC Parser/parser.cc
22:55:26updating Parser/parser.output
22:55:26updating Parser/parser.hh
22:55:26make all-am
22:55:26 CXX CompilationState.o
22:55:26 CXX main.o
22:55:26 CXX MakeLibCfa.o
22:55:26 LEX Parser/lex.cc
22:55:26 CXX AST/Attribute.o
22:55:26 CXX AST/Copy.o
22:55:26 CXX AST/Create.o
22:55:26 CXX AST/Decl.o
22:55:26 CXX AST/DeclReplacer.o
22:55:26 CXX AST/Expr.o
22:55:26 CXX AST/GenericSubstitution.o
22:55:26 CXX AST/Init.o
22:55:26 CXX AST/LinkageSpec.o
22:55:26 CXX AST/Inspect.o
22:55:26 CXX AST/Node.o
22:55:26 CXX AST/Pass.o
22:55:26 CXX AST/Print.o
22:55:26 CXX AST/Stmt.o
22:55:26 CXX AST/SymbolTable.o
22:55:26 CXX AST/Type.o
22:55:26 CXX AST/TypeEnvironment.o
22:55:26 CXX AST/TypeSubstitution.o
22:55:26 CXX AST/Util.o
22:55:26 CXX CodeGen/CodeGenerator.o
22:55:26 CXX CodeGen/GenType.o
22:55:26 CXX CodeGen/OperatorTable.o
22:55:26 CXX CodeGen/FixMain.o
22:55:26 CXX CodeGen/FixNames.o
22:55:26 CXX CodeGen/Generate.o
22:55:26 CXX CodeGen/LinkOnce.o
22:55:26 CXX Concurrency/Actors.o
22:55:26 CXX Concurrency/Corun.o
22:55:26 CXX Concurrency/Keywords.o
22:55:26 CXX Concurrency/Waitfor.o
22:55:26 CXX Concurrency/Waituntil.o
22:55:26 CXX Common/Assert.o
22:55:26 CXX Common/CodeLocationTools.o
22:55:26 CXX Common/DeclStats.o
22:55:26 CXX Common/Eval.o
22:55:26 CXX Common/Examine.o
22:55:26 CXX Common/Indenter.o
22:55:26 CXX Common/ResolvProtoDump.o
22:55:26 CXX Common/SemanticError.o
22:55:26 CXX Common/Stats/Counter.o
22:55:26 CXX Common/Stats/Heap.o
22:55:26 CXX Common/Stats/ResolveTime.o
22:55:26 CXX Common/Stats/Stats.o
22:55:26 CXX Common/Stats/Time.o
22:55:26 CXX Common/Symbol.o
22:55:26 CXX Common/UniqueName.o
22:55:26 CXX Common/DebugMalloc.o
22:55:26 CXX ControlStruct/ExceptDecl.o
22:55:26 CXX ControlStruct/ExceptTranslate.o
22:55:26 CXX ControlStruct/FixLabels.o
22:55:26 CXX ControlStruct/HoistControlDecls.o
22:55:26 CXX ControlStruct/LabelGenerator.o
22:55:26 CXX ControlStruct/MultiLevelExit.o
22:55:26 CXX ControlStruct/TranslateEnumRange.o
22:55:26 CXX GenPoly/GenPoly.o
22:55:26 CXX GenPoly/Lvalue2.o
22:55:26 CXX GenPoly/Box.o
22:55:26 CXX GenPoly/FindFunction.o
22:55:26 CXX GenPoly/InstantiateGeneric.o
22:55:26 CXX GenPoly/Lvalue.o
22:55:26 CXX GenPoly/ScrubTypeVars.o
22:55:26 CXX GenPoly/Specialize.o
22:55:26 CXX InitTweak/GenInit.o
22:55:26 CXX InitTweak/InitTweak.o
22:55:26 CXX InitTweak/FixGlobalInit.o
22:55:26 CXX InitTweak/FixInit.o
22:55:26 CXX Parser/DeclarationNode.o
22:55:26 CXX Parser/ExpressionNode.o
22:55:26 CXX Parser/InitializerNode.o
22:55:26 CXX Parser/lex.o
22:55:26 CXX Parser/ParseNode.o
22:55:26 CXX Parser/parser.o
22:55:26 CXX Parser/RunParser.o
22:55:26 CXX Parser/StatementNode.o
22:55:26 CXX Parser/TypeData.o
22:55:26 CXX Parser/TypedefTable.o
22:55:26 CXX ResolvExpr/AdjustExprType.o
22:55:26 CXX ResolvExpr/Candidate.o
22:55:26 CXX ResolvExpr/CandidateFinder.o
22:55:26 CXX ResolvExpr/CastCost.o
22:55:26 CXX ResolvExpr/CommonType.o
22:55:26 CXX ResolvExpr/ConversionCost.o
22:55:26 CXX ResolvExpr/CurrentObject.o
22:55:26 CXX ResolvExpr/ExplodedArg.o
22:55:26 CXX ResolvExpr/FindOpenVars.o
22:55:26 CXX ResolvExpr/PolyCost.o
22:55:26 CXX ResolvExpr/PtrsAssignable.o
22:55:26 CXX ResolvExpr/PtrsCastable.o
22:55:26 CXX ResolvExpr/RenameVars.o
22:55:26 CXX ResolvExpr/Resolver.o
22:55:26 CXX ResolvExpr/ResolveTypeof.o
22:55:26 CXX ResolvExpr/SatisfyAssertions.o
22:55:26 CXX ResolvExpr/SpecCost.o
22:55:26 CXX ResolvExpr/Unify.o
22:55:26 CXX ResolvExpr/CandidatePrinter.o
22:55:26 CXX ResolvExpr/EraseWith.o
22:55:26 CXX SymTab/FixFunction.o
22:55:26 CXX SymTab/GenImplicitCall.o
22:55:26 CXX SymTab/Mangler.o
22:55:26 CXX SymTab/ManglerCommon.o
22:55:26 CXX Tuples/Explode.o
22:55:26 CXX Tuples/TupleAssignment.o
22:55:26 CXX Tuples/TupleExpansion.o
22:55:26 CXX Tuples/Tuples.o
22:55:26 CXX Validate/Autogen.o
22:55:26 CXX Validate/CheckAssertions.o
22:55:26 CXX Validate/CompoundLiteral.o
22:55:26 CXX Validate/EliminateTypedef.o
22:55:26 CXX Validate/EnumAndPointerDecay.o
22:55:26 CXX Validate/FindSpecialDecls.o
22:55:26 CXX Validate/FixQualifiedTypes.o
22:55:26 CXX Validate/FixReturnTypes.o
22:55:26 CXX Validate/ForallPointerDecay.o
22:55:26 CXX Validate/GenericParameter.o
22:55:26 CXX Validate/HoistStruct.o
22:55:26 CXX Validate/HoistTypeDecls.o
22:55:26 CXX Validate/ImplementEnumFunc.o
22:55:26 CXX Validate/InitializerLength.o
22:55:26 CXX Validate/LabelAddressFixer.o
22:55:26 CXX Validate/LinkInstanceTypes.o
22:55:26 CXX Validate/ReplaceTypedef.o
22:55:26 CXX Validate/ReturnCheck.o
22:55:26 CXX Validate/VerifyCtorDtorAssign.o
22:55:26 CXX Virtual/ExpandCasts.o
22:55:26 CXX Virtual/Tables.o
22:55:26 CXX Virtual/VirtualDtor.o
22:55:26 CXXLD ../driver/cfa-cpp
22:55:26[Pipeline] }
22:55:26[Pipeline] // dir
22:55:26[Pipeline] }
22:55:26[Pipeline] // stage
22:55:26[Pipeline] echo
22:55:26 -------- Build : libcfa(debug) --------
22:55:26[Pipeline] stage
22:55:26[Pipeline] { (Build : libcfa(debug))
22:55:26[Pipeline] dir
22:55:26Running in /var/lib/jenkins/workspace/Cforall_master_2@tmp
22:55:26[Pipeline] {
22:55:26[Pipeline] sh
22:55:26+ nproc
22:55:26+ make -j 16 --no-print-directory -C libcfa/x64-debug
22:55:26Making all in prelude
22:55:26mkdir .deps
22:55:26touch .deps/builtins.Po
22:55:26(CDPATH="${ZSH_VERSION+.}:" && cd /var/lib/jenkins/workspace/Cforall_master_2/libcfa && /bin/bash '/var/lib/jenkins/workspace/Cforall_master_2/libcfa/automake/missing' autoheader)
22:55:26rm -f stamp-h1
22:55:26touch /var/lib/jenkins/workspace/Cforall_master_2/libcfa/prelude/defines.hfa.in
22:55:26cd .. && /bin/bash ./config.status prelude/defines.hfa
22:55:26config.status: creating prelude/defines.hfa
22:55:26config.status: prelude/defines.hfa is unchanged
22:55:26make all-am
22:55:26 GEN gcc-builtins.c
22:55:26 GEN builtins.cfa
22:55:26 GEN prelude.cfa
22:55:26 GEN extras.cfa
22:55:26 GEN extras.cfa
22:55:26 GEN gcc-builtins.cfa
22:55:26 GEN bootloader.c
22:55:26Making all in src
22:55:26 CFA common.lo
22:55:26 CFA heap.lo
22:55:26 CFA fstream.lo
22:55:26 CFA iostream.lo
22:55:26 CFA iterator.lo
22:55:26 CFA limits.lo
22:55:26 CFA math.lo
22:55:26 CFA memory.lo
22:55:26 CFA parseargs.lo
22:55:26 CFA parseconfig.lo
22:55:26 CFA rational.lo
22:55:26 CFA stdlib.lo
22:55:26 CFA strstream.lo
22:55:26 CFA time.lo
22:55:26 CFA assert.lo
22:55:26 CFA bits/debug.lo
22:55:26 CC exception.lo
22:55:26 CFA interpose.lo
22:55:26 CFA prelude-inline.lo
22:55:26 CFA startup.lo
22:55:26 CC virtual.lo
22:55:26 GEN prelude.lo
22:55:26 CFA concurrency/locks.lo
22:55:26 CFA concurrency/monitor.lo
22:55:26 CFA concurrency/mutex.lo
22:55:26 CFA concurrency/select.lo
22:55:26 CFA concurrency/thread.lo
22:55:26 CFA concurrency/cofor.lo
22:55:26 CFA interpose_thread.lo
22:55:26 CPPAS concurrency/CtxSwitch-x64.lo
22:55:26 CC concurrency/invoke.lo
22:55:26 CFA concurrency/io.lo
22:55:26 CFA concurrency/kernel/startup.lo
22:55:26 CFA concurrency/preemption.lo
22:55:26 CFA concurrency/ready_queue.lo
22:55:26 CFA concurrency/stats.lo
22:55:26 CFA concurrency/pthread.lo
22:55:26 CFA bits/weakso_locks.lo
22:55:26 CFA algorithms/range_iterator.lo
22:55:26 CFA collections/maybe.lo
22:55:26 CFA collections/pair.lo
22:55:26 CFA collections/result.lo
22:55:26 CFA collections/string.lo
22:55:26 CFA collections/string_res.lo
22:55:26 CFA collections/vector.lo
22:55:26 CFA device/cpu.lo
22:55:26 CFA concurrency/alarm.lo
22:55:26 CFA concurrency/coroutine.lo
22:55:26 CFA concurrency/exception.lo
22:55:26 CFA concurrency/kernel.lo
22:55:26 CFA concurrency/kernel/cluster.lo
22:55:26 CFA concurrency/clib/cfathread.lo
22:55:26 CFA concurrency/io/setup.lo
22:55:26 CFA concurrency/io/call.lo
22:55:26/usr/include/linux/io_uring.h:83:43: warning: 'packed' attribute ignored for field of type 'union __io_uring_sqe____anonymous55' [-Wattributes]
22:55:26 83 | } __attribute__((packed));
22:55:26 | ^
22:55:26/usr/include/linux/io_uring.h:83:43: warning: 'packed' attribute ignored for field of type 'union __io_uring_sqe____anonymous131' [-Wattributes]
22:55:26 83 | } __attribute__((packed));
22:55:26 | ^
22:55:26 CCLD libcfa.la
22:55:26/usr/bin/ld: warning: .libs/common.o: requires executable stack (because the .note.GNU-stack section is executable)
22:55:26/usr/bin/ld: .libs/exception.o: warning: relocation against `__gcfa_personality_v0' in read-only section `.rodata'
22:55:26/usr/bin/ld: warning: creating DT_TEXTREL in a shared object
22:55:26/usr/include/linux/io_uring.h:83:43: warning: 'packed' attribute ignored for field of type 'union __io_uring_sqe____anonymous121' [-Wattributes]
22:55:26 83 | } __attribute__((packed));
22:55:26 | ^
22:55:26/usr/include/linux/io_uring.h:83:43: warning: 'packed' attribute ignored for field of type 'union __io_uring_sqe____anonymous65' [-Wattributes]
22:55:26 83 | } __attribute__((packed));
22:55:26 | ^
22:55:26/usr/include/linux/io_uring.h:83:43: warning: 'packed' attribute ignored for field of type 'union __io_uring_sqe____anonymous121' [-Wattributes]
22:55:26 83 | } __attribute__((packed));
22:55:26 | ^
22:55:26/usr/include/linux/io_uring.h:83:43: warning: 'packed' attribute ignored for field of type 'union __io_uring_sqe____anonymous32' [-Wattributes]
22:55:26 83 | } __attribute__((packed));
22:55:26 | ^
22:55:26/usr/include/linux/io_uring.h:83:43: warning: 'packed' attribute ignored for field of type 'union __io_uring_sqe____anonymous97' [-Wattributes]
22:55:26 83 | } __attribute__((packed));
22:55:26 | ^
22:55:26 CCLD libcfathread.la
22:55:26/usr/bin/ld: warning: concurrency/.libs/alarm.o: requires executable stack (because the .note.GNU-stack section is executable)
22:55:26make[1]: Nothing to be done for 'all-am'.
22:55:26[Pipeline] }
22:55:26[Pipeline] // dir
22:55:26[Pipeline] }
22:55:26[Pipeline] // stage
22:55:26[Pipeline] echo
22:55:26 -------- Build : libcfa(nodebug) --------
22:55:26[Pipeline] stage
22:55:26[Pipeline] { (Build : libcfa(nodebug))
22:55:26[Pipeline] dir
22:55:26Running in /var/lib/jenkins/workspace/Cforall_master_2@tmp
22:55:26[Pipeline] {
22:55:26[Pipeline] sh
22:55:26+ nproc
22:55:26+ make -j 16 --no-print-directory -C libcfa/x64-nodebug
22:55:26Making all in prelude
22:55:26mkdir .deps
22:55:26touch .deps/builtins.Po
22:55:26cd .. && /bin/bash ./config.status prelude/defines.hfa
22:55:26config.status: creating prelude/defines.hfa
22:55:26config.status: prelude/defines.hfa is unchanged
22:55:26make all-am
22:55:26 GEN gcc-builtins.c
22:55:26 GEN builtins.cfa
22:55:26 GEN prelude.cfa
22:55:26 GEN extras.cfa
22:55:26 GEN extras.cfa
22:55:26 GEN gcc-builtins.cfa
22:55:26 GEN bootloader.c
22:55:26Making all in src
22:55:26 CFA common.lo
22:55:26 CFA fstream.lo
22:55:26 CFA heap.lo
22:55:26 CFA iostream.lo
22:55:26 CFA iterator.lo
22:55:26 CFA limits.lo
22:55:26 CFA math.lo
22:55:26 CFA memory.lo
22:55:26 CFA parseargs.lo
22:55:26 CFA parseconfig.lo
22:55:26 CFA rational.lo
22:55:26 CFA stdlib.lo
22:55:26 CFA strstream.lo
22:55:26 CFA time.lo
22:55:26 CFA assert.lo
22:55:26 CFA bits/debug.lo
22:55:26 CC exception.lo
22:55:26/var/lib/jenkins/workspace/Cforall_master_2/libcfa/src/exception.c: In function '__cfaehm_allocate_exception':
22:55:26/var/lib/jenkins/workspace/Cforall_master_2/libcfa/src/exception.c:142:17: warning: ignoring return value of 'write' declared with attribute 'warn_unused_result' [-Wunused-result]
22:55:26 142 | write( 2, "abort2\n", 7 );
22:55:26 | ^~~~~~~~~~~~~~~~~~~~~~~~~
22:55:26/var/lib/jenkins/workspace/Cforall_master_2/libcfa/src/exception.c: In function '__cfaehm_exception_cleanup':
22:55:26/var/lib/jenkins/workspace/Cforall_master_2/libcfa/src/exception.c:127:17: warning: ignoring return value of 'write' declared with attribute 'warn_unused_result' [-Wunused-result]
22:55:26 127 | write( 2, "abort1\n", 7 );
22:55:26 | ^~~~~~~~~~~~~~~~~~~~~~~~~
22:55:26/var/lib/jenkins/workspace/Cforall_master_2/libcfa/src/exception.c: In function '__cfaehm_cancel_stack':
22:55:26/var/lib/jenkins/workspace/Cforall_master_2/libcfa/src/exception.c:230:9: warning: ignoring return value of 'write' declared with attribute 'warn_unused_result' [-Wunused-result]
22:55:26 230 | write( 2, "abort3\n", 7 );
22:55:26 | ^~~~~~~~~~~~~~~~~~~~~~~~~
22:55:26/var/lib/jenkins/workspace/Cforall_master_2/libcfa/src/exception.c: In function '__cfaehm_begin_unwind':
22:55:26/var/lib/jenkins/workspace/Cforall_master_2/libcfa/src/exception.c:252:17: warning: ignoring return value of 'write' declared with attribute 'warn_unused_result' [-Wunused-result]
22:55:26 252 | write( 2, "abort4\n", 7 );
22:55:26 | ^~~~~~~~~~~~~~~~~~~~~~~~~
22:55:26/var/lib/jenkins/workspace/Cforall_master_2/libcfa/src/exception.c:278:17: warning: ignoring return value of 'write' declared with attribute 'warn_unused_result' [-Wunused-result]
22:55:26 278 | write( 2, "abort5\n", 7 );
22:55:26 | ^~~~~~~~~~~~~~~~~~~~~~~~~
22:55:26/var/lib/jenkins/workspace/Cforall_master_2/libcfa/src/exception.c: In function '__cfaehm_rethrow_terminate':
22:55:26/var/lib/jenkins/workspace/Cforall_master_2/libcfa/src/exception.c:308:9: warning: ignoring return value of 'write' declared with attribute 'warn_unused_result' [-Wunused-result]
22:55:26 308 | write( 2, "abort7\n", 7 );
22:55:26 | ^~~~~~~~~~~~~~~~~~~~~~~~~
22:55:26/var/lib/jenkins/workspace/Cforall_master_2/libcfa/src/exception.c: In function '__cfaehm_rethrow_adapter':
22:55:26/var/lib/jenkins/workspace/Cforall_master_2/libcfa/src/exception.c:300:9: warning: ignoring return value of 'write' declared with attribute 'warn_unused_result' [-Wunused-result]
22:55:26 300 | write( 2, "abort6\n", 7 );
22:55:26 | ^~~~~~~~~~~~~~~~~~~~~~~~~
22:55:26 CFA interpose.lo
22:55:26 CFA prelude-inline.lo
22:55:26 CFA startup.lo
22:55:26 CC virtual.lo
22:55:26 GEN prelude.lo
22:55:26 CFA concurrency/locks.lo
22:55:26 CFA concurrency/monitor.lo
22:55:26 CFA concurrency/mutex.lo
22:55:26 CFA concurrency/select.lo
22:55:26 CFA concurrency/thread.lo
22:55:26 CFA concurrency/cofor.lo
22:55:26 CFA interpose_thread.lo
22:55:26 CPPAS concurrency/CtxSwitch-x64.lo
22:55:26 CC concurrency/invoke.lo
22:55:26 CFA concurrency/io.lo
22:55:26 CFA concurrency/kernel/startup.lo
22:55:26 CFA concurrency/preemption.lo
22:55:26 CFA concurrency/ready_queue.lo
22:55:26 CFA concurrency/stats.lo
22:55:26 CFA concurrency/pthread.lo
22:55:26 CFA bits/weakso_locks.lo
22:55:26 CFA algorithms/range_iterator.lo
22:55:26 CFA collections/maybe.lo
22:55:26 CFA collections/pair.lo
22:55:26 CFA collections/result.lo
22:55:26 CFA collections/string.lo
22:55:26 CFA collections/string_res.lo
22:55:26 CFA collections/vector.lo
22:55:26 CFA device/cpu.lo
22:55:26 CFA concurrency/alarm.lo
22:55:26 CFA concurrency/coroutine.lo
22:55:26 CFA concurrency/exception.lo
22:55:26 CFA concurrency/kernel.lo
22:55:26 CFA concurrency/kernel/cluster.lo
22:55:26 CFA concurrency/clib/cfathread.lo
22:55:26 CFA concurrency/io/setup.lo
22:55:26 CFA concurrency/io/call.lo
22:55:26/usr/include/linux/io_uring.h:83:43: warning: 'packed' attribute ignored for field of type 'union __io_uring_sqe____anonymous55' [-Wattributes]
22:55:26 83 | } __attribute__((packed));
22:55:26 | ^
22:55:26/usr/include/linux/io_uring.h:83:43: warning: 'packed' attribute ignored for field of type 'union __io_uring_sqe____anonymous131' [-Wattributes]
22:55:26 83 | } __attribute__((packed));
22:55:26 | ^
22:55:26/usr/include/x86_64-linux-gnu/bits/socket2.h:70:95: warning: '_X12_constructorFv_U26__anonymous___SOCKADDR_ARGU26__anonymous___SOCKADDR_ARG_autogen___1' is static but used in inline function 'recvfrom' which is not static
22:55:26 70 | return __recvfrom_chk (__fd, __buf, __n, sz, __flags, __addr, __addr_len);
22:55:26 | ^
22:55:26/usr/include/x86_64-linux-gnu/bits/socket2.h:70:125: warning: '_X11_destructorFv_U26__anonymous___SOCKADDR_ARG_autogen___1' is static but used in inline function 'recvfrom' which is not static
22:55:26 70 | return __recvfrom_chk (__fd, __buf, __n, sz, __flags, __addr, __addr_len);
22:55:26 | ^
22:55:26/usr/include/x86_64-linux-gnu/bits/socket2.h:68:104: warning: '_X12_constructorFv_U26__anonymous___SOCKADDR_ARGU26__anonymous___SOCKADDR_ARG_autogen___1' is static but used in inline function 'recvfrom' which is not static
22:55:26 68 | return __recvfrom_chk_warn (__fd, __buf, __n, sz, __flags, __addr,
22:55:26 | ^
22:55:26/usr/include/x86_64-linux-gnu/bits/socket2.h:68:129: warning: '_X11_destructorFv_U26__anonymous___SOCKADDR_ARG_autogen___1' is static but used in inline function 'recvfrom' which is not static
22:55:26 68 | return __recvfrom_chk_warn (__fd, __buf, __n, sz, __flags, __addr,
22:55:26 | ^
22:55:26/usr/include/x86_64-linux-gnu/bits/socket2.h:66:97: warning: '_X12_constructorFv_U26__anonymous___SOCKADDR_ARGU26__anonymous___SOCKADDR_ARG_autogen___1' is static but used in inline function 'recvfrom' which is not static
22:55:26 66 | return __recvfrom_alias (__fd, __buf, __n, __flags, __addr, __addr_len);
22:55:26 | ^
22:55:26/usr/include/x86_64-linux-gnu/bits/socket2.h:66:129: warning: '_X11_destructorFv_U26__anonymous___SOCKADDR_ARG_autogen___1' is static but used in inline function 'recvfrom' which is not static
22:55:26 66 | return __recvfrom_alias (__fd, __buf, __n, __flags, __addr, __addr_len);
22:55:26 | ^
22:55:26/usr/include/x86_64-linux-gnu/bits/socket2.h:70:95: warning: '_X12_constructorFv_U26__anonymous___SOCKADDR_ARGU26__anonymous___SOCKADDR_ARG_autogen___1' is static but used in inline function 'recvfrom' which is not static
22:55:26 70 | return __recvfrom_chk (__fd, __buf, __n, sz, __flags, __addr, __addr_len);
22:55:26 | ^
22:55:26/usr/include/x86_64-linux-gnu/bits/socket2.h:70:125: warning: '_X11_destructorFv_U26__anonymous___SOCKADDR_ARG_autogen___1' is static but used in inline function 'recvfrom' which is not static
22:55:26 70 | return __recvfrom_chk (__fd, __buf, __n, sz, __flags, __addr, __addr_len);
22:55:26 | ^
22:55:26/usr/include/x86_64-linux-gnu/bits/socket2.h:68:104: warning: '_X12_constructorFv_U26__anonymous___SOCKADDR_ARGU26__anonymous___SOCKADDR_ARG_autogen___1' is static but used in inline function 'recvfrom' which is not static
22:55:26 68 | return __recvfrom_chk_warn (__fd, __buf, __n, sz, __flags, __addr,
22:55:26 | ^
22:55:26/usr/include/x86_64-linux-gnu/bits/socket2.h:68:129: warning: '_X11_destructorFv_U26__anonymous___SOCKADDR_ARG_autogen___1' is static but used in inline function 'recvfrom' which is not static
22:55:26 68 | return __recvfrom_chk_warn (__fd, __buf, __n, sz, __flags, __addr,
22:55:26 | ^
22:55:26/usr/include/x86_64-linux-gnu/bits/socket2.h:66:97: warning: '_X12_constructorFv_U26__anonymous___SOCKADDR_ARGU26__anonymous___SOCKADDR_ARG_autogen___1' is static but used in inline function 'recvfrom' which is not static
22:55:26 66 | return __recvfrom_alias (__fd, __buf, __n, __flags, __addr, __addr_len);
22:55:26 | ^
22:55:26/usr/include/x86_64-linux-gnu/bits/socket2.h:66:129: warning: '_X11_destructorFv_U26__anonymous___SOCKADDR_ARG_autogen___1' is static but used in inline function 'recvfrom' which is not static
22:55:26 66 | return __recvfrom_alias (__fd, __buf, __n, __flags, __addr, __addr_len);
22:55:26 | ^
22:55:26 CCLD libcfa.la
22:55:26/usr/bin/ld: warning: .libs/common.o: requires executable stack (because the .note.GNU-stack section is executable)
22:55:26/usr/bin/ld: .libs/exception.o: warning: relocation against `__gcfa_personality_v0' in read-only section `.text'
22:55:26/usr/bin/ld: warning: creating DT_TEXTREL in a shared object
22:55:26/usr/include/linux/io_uring.h:83:43: warning: 'packed' attribute ignored for field of type 'union __io_uring_sqe____anonymous65' [-Wattributes]
22:55:26 83 | } __attribute__((packed));
22:55:26 | ^
22:55:26/usr/include/x86_64-linux-gnu/bits/socket2.h:70:94: warning: '_X12_constructorFv_U26__anonymous___SOCKADDR_ARGU26__anonymous___SOCKADDR_ARG_autogen___1' is static but used in inline function 'recvfrom' which is not static
22:55:26 70 | return __recvfrom_chk (__fd, __buf, __n, sz, __flags, __addr, __addr_len);
22:55:26 | ^
22:55:26/usr/include/x86_64-linux-gnu/bits/socket2.h:70:124: warning: '_X11_destructorFv_U26__anonymous___SOCKADDR_ARG_autogen___1' is static but used in inline function 'recvfrom' which is not static
22:55:26 70 | return __recvfrom_chk (__fd, __buf, __n, sz, __flags, __addr, __addr_len);
22:55:26 | ^
22:55:26/usr/include/x86_64-linux-gnu/bits/socket2.h:68:103: warning: '_X12_constructorFv_U26__anonymous___SOCKADDR_ARGU26__anonymous___SOCKADDR_ARG_autogen___1' is static but used in inline function 'recvfrom' which is not static
22:55:26 68 | return __recvfrom_chk_warn (__fd, __buf, __n, sz, __flags, __addr,
22:55:26 | ^
22:55:26/usr/include/x86_64-linux-gnu/bits/socket2.h:68:128: warning: '_X11_destructorFv_U26__anonymous___SOCKADDR_ARG_autogen___1' is static but used in inline function 'recvfrom' which is not static
22:55:26 68 | return __recvfrom_chk_warn (__fd, __buf, __n, sz, __flags, __addr,
22:55:26 | ^
22:55:26/usr/include/x86_64-linux-gnu/bits/socket2.h:66:96: warning: '_X12_constructorFv_U26__anonymous___SOCKADDR_ARGU26__anonymous___SOCKADDR_ARG_autogen___1' is static but used in inline function 'recvfrom' which is not static
22:55:26 66 | return __recvfrom_alias (__fd, __buf, __n, __flags, __addr, __addr_len);
22:55:26 | ^
22:55:26/usr/include/x86_64-linux-gnu/bits/socket2.h:66:128: warning: '_X11_destructorFv_U26__anonymous___SOCKADDR_ARG_autogen___1' is static but used in inline function 'recvfrom' which is not static
22:55:26 66 | return __recvfrom_alias (__fd, __buf, __n, __flags, __addr, __addr_len);
22:55:26 | ^
22:55:26/usr/include/linux/io_uring.h:83:43: warning: 'packed' attribute ignored for field of type 'union __io_uring_sqe____anonymous121' [-Wattributes]
22:55:26 83 | } __attribute__((packed));
22:55:26 | ^
22:55:26/usr/include/x86_64-linux-gnu/bits/socket2.h:70:95: warning: '_X12_constructorFv_U26__anonymous___SOCKADDR_ARGU26__anonymous___SOCKADDR_ARG_autogen___1' is static but used in inline function 'recvfrom' which is not static
22:55:26 70 | return __recvfrom_chk (__fd, __buf, __n, sz, __flags, __addr, __addr_len);
22:55:26 | ^
22:55:26/usr/include/x86_64-linux-gnu/bits/socket2.h:70:125: warning: '_X11_destructorFv_U26__anonymous___SOCKADDR_ARG_autogen___1' is static but used in inline function 'recvfrom' which is not static
22:55:26 70 | return __recvfrom_chk (__fd, __buf, __n, sz, __flags, __addr, __addr_len);
22:55:26 | ^
22:55:26/usr/include/x86_64-linux-gnu/bits/socket2.h:68:104: warning: '_X12_constructorFv_U26__anonymous___SOCKADDR_ARGU26__anonymous___SOCKADDR_ARG_autogen___1' is static but used in inline function 'recvfrom' which is not static
22:55:26 68 | return __recvfrom_chk_warn (__fd, __buf, __n, sz, __flags, __addr,
22:55:26 | ^
22:55:26/usr/include/x86_64-linux-gnu/bits/socket2.h:68:129: warning: '_X11_destructorFv_U26__anonymous___SOCKADDR_ARG_autogen___1' is static but used in inline function 'recvfrom' which is not static
22:55:26 68 | return __recvfrom_chk_warn (__fd, __buf, __n, sz, __flags, __addr,
22:55:26 | ^
22:55:26/usr/include/x86_64-linux-gnu/bits/socket2.h:66:97: warning: '_X12_constructorFv_U26__anonymous___SOCKADDR_ARGU26__anonymous___SOCKADDR_ARG_autogen___1' is static but used in inline function 'recvfrom' which is not static
22:55:26 66 | return __recvfrom_alias (__fd, __buf, __n, __flags, __addr, __addr_len);
22:55:26 | ^
22:55:26/usr/include/x86_64-linux-gnu/bits/socket2.h:66:129: warning: '_X11_destructorFv_U26__anonymous___SOCKADDR_ARG_autogen___1' is static but used in inline function 'recvfrom' which is not static
22:55:26 66 | return __recvfrom_alias (__fd, __buf, __n, __flags, __addr, __addr_len);
22:55:26 | ^
22:55:26/usr/include/linux/io_uring.h:83:43: warning: 'packed' attribute ignored for field of type 'union __io_uring_sqe____anonymous121' [-Wattributes]
22:55:26 83 | } __attribute__((packed));
22:55:26 | ^
22:55:26/usr/include/x86_64-linux-gnu/bits/socket2.h:70:95: warning: '_X12_constructorFv_U26__anonymous___SOCKADDR_ARGU26__anonymous___SOCKADDR_ARG_autogen___1' is static but used in inline function 'recvfrom' which is not static
22:55:26 70 | return __recvfrom_chk (__fd, __buf, __n, sz, __flags, __addr, __addr_len);
22:55:26 | ^
22:55:26/usr/include/x86_64-linux-gnu/bits/socket2.h:70:125: warning: '_X11_destructorFv_U26__anonymous___SOCKADDR_ARG_autogen___1' is static but used in inline function 'recvfrom' which is not static
22:55:26 70 | return __recvfrom_chk (__fd, __buf, __n, sz, __flags, __addr, __addr_len);
22:55:26 | ^
22:55:26/usr/include/x86_64-linux-gnu/bits/socket2.h:68:104: warning: '_X12_constructorFv_U26__anonymous___SOCKADDR_ARGU26__anonymous___SOCKADDR_ARG_autogen___1' is static but used in inline function 'recvfrom' which is not static
22:55:26 68 | return __recvfrom_chk_warn (__fd, __buf, __n, sz, __flags, __addr,
22:55:26 | ^
22:55:26/usr/include/x86_64-linux-gnu/bits/socket2.h:68:129: warning: '_X11_destructorFv_U26__anonymous___SOCKADDR_ARG_autogen___1' is static but used in inline function 'recvfrom' which is not static
22:55:26 68 | return __recvfrom_chk_warn (__fd, __buf, __n, sz, __flags, __addr,
22:55:26 | ^
22:55:26/usr/include/x86_64-linux-gnu/bits/socket2.h:66:97: warning: '_X12_constructorFv_U26__anonymous___SOCKADDR_ARGU26__anonymous___SOCKADDR_ARG_autogen___1' is static but used in inline function 'recvfrom' which is not static
22:55:26 66 | return __recvfrom_alias (__fd, __buf, __n, __flags, __addr, __addr_len);
22:55:26 | ^
22:55:26/usr/include/x86_64-linux-gnu/bits/socket2.h:66:129: warning: '_X11_destructorFv_U26__anonymous___SOCKADDR_ARG_autogen___1' is static but used in inline function 'recvfrom' which is not static
22:55:26 66 | return __recvfrom_alias (__fd, __buf, __n, __flags, __addr, __addr_len);
22:55:26 | ^
22:55:26/usr/include/linux/io_uring.h:83:43: warning: 'packed' attribute ignored for field of type 'union __io_uring_sqe____anonymous32' [-Wattributes]
22:55:26 83 | } __attribute__((packed));
22:55:26 | ^
22:55:26/usr/include/x86_64-linux-gnu/bits/socket2.h:70:94: warning: '_X12_constructorFv_U26__anonymous___SOCKADDR_ARGU26__anonymous___SOCKADDR_ARG_autogen___1' is static but used in inline function 'recvfrom' which is not static
22:55:26 70 | return __recvfrom_chk (__fd, __buf, __n, sz, __flags, __addr, __addr_len);
22:55:26 | ^
22:55:26/usr/include/x86_64-linux-gnu/bits/socket2.h:70:124: warning: '_X11_destructorFv_U26__anonymous___SOCKADDR_ARG_autogen___1' is static but used in inline function 'recvfrom' which is not static
22:55:26 70 | return __recvfrom_chk (__fd, __buf, __n, sz, __flags, __addr, __addr_len);
22:55:26 | ^
22:55:26/usr/include/x86_64-linux-gnu/bits/socket2.h:68:103: warning: '_X12_constructorFv_U26__anonymous___SOCKADDR_ARGU26__anonymous___SOCKADDR_ARG_autogen___1' is static but used in inline function 'recvfrom' which is not static
22:55:26 68 | return __recvfrom_chk_warn (__fd, __buf, __n, sz, __flags, __addr,
22:55:26 | ^
22:55:26/usr/include/x86_64-linux-gnu/bits/socket2.h:68:128: warning: '_X11_destructorFv_U26__anonymous___SOCKADDR_ARG_autogen___1' is static but used in inline function 'recvfrom' which is not static
22:55:26 68 | return __recvfrom_chk_warn (__fd, __buf, __n, sz, __flags, __addr,
22:55:26 | ^
22:55:26/usr/include/x86_64-linux-gnu/bits/socket2.h:66:96: warning: '_X12_constructorFv_U26__anonymous___SOCKADDR_ARGU26__anonymous___SOCKADDR_ARG_autogen___1' is static but used in inline function 'recvfrom' which is not static
22:55:26 66 | return __recvfrom_alias (__fd, __buf, __n, __flags, __addr, __addr_len);
22:55:26 | ^
22:55:26/usr/include/x86_64-linux-gnu/bits/socket2.h:66:128: warning: '_X11_destructorFv_U26__anonymous___SOCKADDR_ARG_autogen___1' is static but used in inline function 'recvfrom' which is not static
22:55:26 66 | return __recvfrom_alias (__fd, __buf, __n, __flags, __addr, __addr_len);
22:55:26 | ^
22:55:26/usr/include/linux/io_uring.h:83:43: warning: 'packed' attribute ignored for field of type 'union __io_uring_sqe____anonymous97' [-Wattributes]
22:55:26 83 | } __attribute__((packed));
22:55:26 | ^
22:55:26/usr/include/x86_64-linux-gnu/bits/socket2.h:70:95: warning: '_X12_constructorFv_U26__anonymous___SOCKADDR_ARGU26__anonymous___SOCKADDR_ARG_autogen___1' is static but used in inline function 'recvfrom' which is not static
22:55:26 70 | return __recvfrom_chk (__fd, __buf, __n, sz, __flags, __addr, __addr_len);
22:55:26 | ^
22:55:26/usr/include/x86_64-linux-gnu/bits/socket2.h:70:125: warning: '_X11_destructorFv_U26__anonymous___SOCKADDR_ARG_autogen___1' is static but used in inline function 'recvfrom' which is not static
22:55:26 70 | return __recvfrom_chk (__fd, __buf, __n, sz, __flags, __addr, __addr_len);
22:55:26 | ^
22:55:26/usr/include/x86_64-linux-gnu/bits/socket2.h:68:104: warning: '_X12_constructorFv_U26__anonymous___SOCKADDR_ARGU26__anonymous___SOCKADDR_ARG_autogen___1' is static but used in inline function 'recvfrom' which is not static
22:55:26 68 | return __recvfrom_chk_warn (__fd, __buf, __n, sz, __flags, __addr,
22:55:26 | ^
22:55:26/usr/include/x86_64-linux-gnu/bits/socket2.h:68:129: warning: '_X11_destructorFv_U26__anonymous___SOCKADDR_ARG_autogen___1' is static but used in inline function 'recvfrom' which is not static
22:55:26 68 | return __recvfrom_chk_warn (__fd, __buf, __n, sz, __flags, __addr,
22:55:26 | ^
22:55:26/usr/include/x86_64-linux-gnu/bits/socket2.h:66:97: warning: '_X12_constructorFv_U26__anonymous___SOCKADDR_ARGU26__anonymous___SOCKADDR_ARG_autogen___1' is static but used in inline function 'recvfrom' which is not static
22:55:26 66 | return __recvfrom_alias (__fd, __buf, __n, __flags, __addr, __addr_len);
22:55:26 | ^
22:55:26/usr/include/x86_64-linux-gnu/bits/socket2.h:66:129: warning: '_X11_destructorFv_U26__anonymous___SOCKADDR_ARG_autogen___1' is static but used in inline function 'recvfrom' which is not static
22:55:26 66 | return __recvfrom_alias (__fd, __buf, __n, __flags, __addr, __addr_len);
22:55:26 | ^
22:55:26 CCLD libcfathread.la
22:55:26/usr/bin/ld: warning: concurrency/.libs/coroutine.o: requires executable stack (because the .note.GNU-stack section is executable)
22:55:26make[1]: Nothing to be done for 'all-am'.
22:55:26[Pipeline] }
22:55:26[Pipeline] // dir
22:55:26[Pipeline] }
22:55:26[Pipeline] // stage
22:55:26[Pipeline] echo
22:55:26 -------- Build : install --------
22:55:26[Pipeline] stage
22:55:26[Pipeline] { (Build : install)
22:55:26[Pipeline] dir
22:55:26Running in /var/lib/jenkins/workspace/Cforall_master_2@tmp
22:55:26[Pipeline] {
22:55:26[Pipeline] sh
22:55:26+ nproc
22:55:26+ make -j 16 --no-print-directory install
22:55:26Making install in driver
22:55:26make install-exec-hook
22:55:26 /usr/bin/install -c cfa '/var/lib/jenkins/workspace/Cforall_master_2@tmp/bin//cfa'
22:55:26 /usr/bin/mkdir -p '/var/lib/jenkins/workspace/Cforall_master_2@tmp/lib/cfa/'
22:55:26 /bin/bash ../libtool --mode=install /usr/bin/install -c as cc1 '/var/lib/jenkins/workspace/Cforall_master_2@tmp/lib/cfa/'
22:55:26libtool: install: /usr/bin/install -c as /var/lib/jenkins/workspace/Cforall_master_2@tmp/lib/cfa/as
22:55:26libtool: install: /usr/bin/install -c cc1 /var/lib/jenkins/workspace/Cforall_master_2@tmp/lib/cfa/cc1
22:55:26Making install in src
22:55:26make install-am
22:55:26make[3]: Nothing to be done for 'install-exec-am'.
22:55:26 /usr/bin/mkdir -p '/var/lib/jenkins/workspace/Cforall_master_2@tmp/lib/cfa/'
22:55:26 /bin/bash ../libtool --mode=install /usr/bin/install -c ../driver/cfa-cpp '/var/lib/jenkins/workspace/Cforall_master_2@tmp/lib/cfa/'
22:55:26libtool: install: /usr/bin/install -c ../driver/cfa-cpp /var/lib/jenkins/workspace/Cforall_master_2@tmp/lib/cfa/cfa-cpp
22:55:26Making install in .
22:55:26(CDPATH="${ZSH_VERSION+.}:" && cd /var/lib/jenkins/workspace/Cforall_master_2 && /bin/bash '/var/lib/jenkins/workspace/Cforall_master_2/automake/missing' autoheader)
22:55:26rm -f stamp-h1
22:55:26touch /var/lib/jenkins/workspace/Cforall_master_2/src/config.h.in
22:55:26cd . && /bin/bash ./config.status config.h
22:55:26config.status: creating config.h
22:55:26config.status: config.h is unchanged
22:55:26make[2]: Nothing to be done for 'install-exec-am'.
22:55:26 /usr/bin/mkdir -p '/var/lib/jenkins/workspace/Cforall_master_2@tmp/share/man/man1'
22:55:26 /usr/bin/install -c -m 644 /var/lib/jenkins/workspace/Cforall_master_2/doc/man/cfa.1 '/var/lib/jenkins/workspace/Cforall_master_2@tmp/share/man/man1'
22:55:26Making install in libcfa/x64-debug
22:55:26Making install in prelude
22:55:26make[3]: Nothing to be done for 'install-exec-am'.
22:55:26 /usr/bin/mkdir -p '/var/lib/jenkins/workspace/Cforall_master_2@tmp/lib/cfa/x64-debug/'
22:55:26 /usr/bin/install -c -m 644 gcc-builtins.cfa builtins.cfa extras.cfa prelude.cfa bootloader.c defines.hfa '/var/lib/jenkins/workspace/Cforall_master_2@tmp/lib/cfa/x64-debug/'
22:55:26Making install in src
22:55:26 /usr/bin/mkdir -p '/var/lib/jenkins/workspace/Cforall_master_2@tmp/lib/cfa/x64-debug/'
22:55:26 /bin/bash ../libtool --mode=install /usr/bin/install -c libcfa.la libcfathread.la '/var/lib/jenkins/workspace/Cforall_master_2@tmp/lib/cfa/x64-debug/'
22:55:26 /usr/bin/mkdir -p '/var/lib/jenkins/workspace/Cforall_master_2@tmp/include/cfa/'
22:55:26 /usr/bin/mkdir -p '/var/lib/jenkins/workspace/Cforall_master_2@tmp/include/cfa//stdhdr/sys'
22:55:26 /usr/bin/install -c -m 644 /var/lib/jenkins/workspace/Cforall_master_2/libcfa/src/stdhdr/sys/time.h /var/lib/jenkins/workspace/Cforall_master_2/libcfa/src/stdhdr/sys/mman.h /var/lib/jenkins/workspace/Cforall_master_2/libcfa/src/stdhdr/sys/socket.h '/var/lib/jenkins/workspace/Cforall_master_2@tmp/include/cfa//stdhdr/sys'
22:55:26 /usr/bin/mkdir -p '/var/lib/jenkins/workspace/Cforall_master_2@tmp/include/cfa//algorithms'
22:55:26 /usr/bin/install -c -m 644 /var/lib/jenkins/workspace/Cforall_master_2/libcfa/src/algorithms/range_iterator.hfa '/var/lib/jenkins/workspace/Cforall_master_2@tmp/include/cfa//algorithms'
22:55:26 /usr/bin/mkdir -p '/var/lib/jenkins/workspace/Cforall_master_2@tmp/include/cfa//concurrency/kernel'
22:55:26 /usr/bin/install -c -m 644 /var/lib/jenkins/workspace/Cforall_master_2/libcfa/src/concurrency/kernel/cluster.hfa /var/lib/jenkins/workspace/Cforall_master_2/libcfa/src/concurrency/kernel/fwd.hfa '/var/lib/jenkins/workspace/Cforall_master_2@tmp/include/cfa//concurrency/kernel'
22:55:26 /usr/bin/install -c -m 644 /var/lib/jenkins/workspace/Cforall_master_2/libcfa/src/common.hfa /var/lib/jenkins/workspace/Cforall_master_2/libcfa/src/fstream.hfa /var/lib/jenkins/workspace/Cforall_master_2/libcfa/src/heap.hfa /var/lib/jenkins/workspace/Cforall_master_2/libcfa/src/iostream.hfa /var/lib/jenkins/workspace/Cforall_master_2/libcfa/src/iterator.hfa /var/lib/jenkins/workspace/Cforall_master_2/libcfa/src/limits.hfa /var/lib/jenkins/workspace/Cforall_master_2/libcfa/src/math.hfa /var/lib/jenkins/workspace/Cforall_master_2/libcfa/src/memory.hfa /var/lib/jenkins/workspace/Cforall_master_2/libcfa/src/parseargs.hfa /var/lib/jenkins/workspace/Cforall_master_2/libcfa/src/parseconfig.hfa /var/lib/jenkins/workspace/Cforall_master_2/libcfa/src/rational.hfa /var/lib/jenkins/workspace/Cforall_master_2/libcfa/src/stdlib.hfa /var/lib/jenkins/workspace/Cforall_master_2/libcfa/src/strstream.hfa /var/lib/jenkins/workspace/Cforall_master_2/libcfa/src/time.hfa /var/lib/jenkins/workspace/Cforall_master_2/libcfa/src/Exception.hfa /var/lib/jenkins/workspace/Cforall_master_2/libcfa/src/bitmanip.hfa /var/lib/jenkins/workspace/Cforall_master_2/libcfa/src/clock.hfa /var/lib/jenkins/workspace/Cforall_master_2/libcfa/src/exception.hfa /var/lib/jenkins/workspace/Cforall_master_2/libcfa/src/exception.h /var/lib/jenkins/workspace/Cforall_master_2/libcfa/src/gmp.hfa /var/lib/jenkins/workspace/Cforall_master_2/libcfa/src/math.trait.hfa /var/lib/jenkins/workspace/Cforall_master_2/libcfa/src/raii.hfa /var/lib/jenkins/workspace/Cforall_master_2/libcfa/src/time_t.hfa /var/lib/jenkins/workspace/Cforall_master_2/libcfa/src/virtual_dtor.hfa '/var/lib/jenkins/workspace/Cforall_master_2@tmp/include/cfa//.'
22:55:26 /usr/bin/mkdir -p '/var/lib/jenkins/workspace/Cforall_master_2@tmp/include/cfa//concurrency'
22:55:26 /usr/bin/install -c -m 644 /var/lib/jenkins/workspace/Cforall_master_2/libcfa/src/concurrency/iofwd.hfa /var/lib/jenkins/workspace/Cforall_master_2/libcfa/src/concurrency/barrier.hfa /var/lib/jenkins/workspace/Cforall_master_2/libcfa/src/concurrency/alarm.hfa /var/lib/jenkins/workspace/Cforall_master_2/libcfa/src/concurrency/coroutine.hfa /var/lib/jenkins/workspace/Cforall_master_2/libcfa/src/concurrency/exception.hfa /var/lib/jenkins/workspace/Cforall_master_2/libcfa/src/concurrency/kernel.hfa /var/lib/jenkins/workspace/Cforall_master_2/libcfa/src/concurrency/locks.hfa /var/lib/jenkins/workspace/Cforall_master_2/libcfa/src/concurrency/monitor.hfa /var/lib/jenkins/workspace/Cforall_master_2/libcfa/src/concurrency/mutex.hfa /var/lib/jenkins/workspace/Cforall_master_2/libcfa/src/concurrency/select.hfa /var/lib/jenkins/workspace/Cforall_master_2/libcfa/src/concurrency/thread.hfa /var/lib/jenkins/workspace/Cforall_master_2/libcfa/src/concurrency/cofor.hfa /var/lib/jenkins/workspace/Cforall_master_2/libcfa/src/concurrency/invoke.h /var/lib/jenkins/workspace/Cforall_master_2/libcfa/src/concurrency/future.hfa /var/lib/jenkins/workspace/Cforall_master_2/libcfa/src/concurrency/once.hfa /var/lib/jenkins/workspace/Cforall_master_2/libcfa/src/concurrency/mutex_stmt.hfa /var/lib/jenkins/workspace/Cforall_master_2/libcfa/src/concurrency/channel.hfa /var/lib/jenkins/workspace/Cforall_master_2/libcfa/src/concurrency/actor.hfa '/var/lib/jenkins/workspace/Cforall_master_2@tmp/include/cfa//concurrency'
22:55:26 /usr/bin/mkdir -p '/var/lib/jenkins/workspace/Cforall_master_2@tmp/include/cfa//concurrency/clib'
22:55:26 /usr/bin/install -c -m 644 /var/lib/jenkins/workspace/Cforall_master_2/libcfa/src/concurrency/clib/cfathread.h '/var/lib/jenkins/workspace/Cforall_master_2@tmp/include/cfa//concurrency/clib'
22:55:26 /usr/bin/mkdir -p '/var/lib/jenkins/workspace/Cforall_master_2@tmp/include/cfa//device'
22:55:26 /usr/bin/install -c -m 644 /var/lib/jenkins/workspace/Cforall_master_2/libcfa/src/device/cpu.hfa '/var/lib/jenkins/workspace/Cforall_master_2@tmp/include/cfa//device'
22:55:26libtool: install: /usr/bin/install -c .libs/libcfa.so.1.0.0 /var/lib/jenkins/workspace/Cforall_master_2@tmp/lib/cfa/x64-debug/libcfa.so.1.0.0
22:55:26 /usr/bin/mkdir -p '/var/lib/jenkins/workspace/Cforall_master_2@tmp/include/cfa//stdhdr/libltdl'
22:55:26 /usr/bin/install -c -m 644 /var/lib/jenkins/workspace/Cforall_master_2/libcfa/src/stdhdr/libltdl/lt_dlloader.h '/var/lib/jenkins/workspace/Cforall_master_2@tmp/include/cfa//stdhdr/libltdl'
22:55:26 /usr/bin/mkdir -p '/var/lib/jenkins/workspace/Cforall_master_2@tmp/include/cfa//vec'
22:55:26 /usr/bin/install -c -m 644 /var/lib/jenkins/workspace/Cforall_master_2/libcfa/src/vec/vec.hfa /var/lib/jenkins/workspace/Cforall_master_2/libcfa/src/vec/vec2.hfa /var/lib/jenkins/workspace/Cforall_master_2/libcfa/src/vec/vec3.hfa /var/lib/jenkins/workspace/Cforall_master_2/libcfa/src/vec/vec4.hfa '/var/lib/jenkins/workspace/Cforall_master_2@tmp/include/cfa//vec'
22:55:26libtool: install: (cd /var/lib/jenkins/workspace/Cforall_master_2@tmp/lib/cfa/x64-debug && { ln -s -f libcfa.so.1.0.0 libcfa.so.1 || { rm -f libcfa.so.1 && ln -s libcfa.so.1.0.0 libcfa.so.1; }; })
22:55:26 /usr/bin/mkdir -p '/var/lib/jenkins/workspace/Cforall_master_2@tmp/include/cfa//bits'
22:55:26 /usr/bin/install -c -m 644 /var/lib/jenkins/workspace/Cforall_master_2/libcfa/src/bits/weakso_locks.hfa /var/lib/jenkins/workspace/Cforall_master_2/libcfa/src/bits/algorithm.hfa /var/lib/jenkins/workspace/Cforall_master_2/libcfa/src/bits/align.hfa /var/lib/jenkins/workspace/Cforall_master_2/libcfa/src/bits/collections.hfa /var/lib/jenkins/workspace/Cforall_master_2/libcfa/src/bits/debug.hfa /var/lib/jenkins/workspace/Cforall_master_2/libcfa/src/bits/defs.hfa /var/lib/jenkins/workspace/Cforall_master_2/libcfa/src/bits/locks.hfa /var/lib/jenkins/workspace/Cforall_master_2/libcfa/src/bits/collection.hfa /var/lib/jenkins/workspace/Cforall_master_2/libcfa/src/bits/stack.hfa /var/lib/jenkins/workspace/Cforall_master_2/libcfa/src/bits/queue.hfa /var/lib/jenkins/workspace/Cforall_master_2/libcfa/src/bits/sequence.hfa /var/lib/jenkins/workspace/Cforall_master_2/libcfa/src/bits/atomic.hfa /var/lib/jenkins/workspace/Cforall_master_2/libcfa/src/bits/random.hfa '/var/lib/jenkins/workspace/Cforall_master_2@tmp/include/cfa//bits'
22:55:26libtool: install: (cd /var/lib/jenkins/workspace/Cforall_master_2@tmp/lib/cfa/x64-debug && { ln -s -f libcfa.so.1.0.0 libcfa.so || { rm -f libcfa.so && ln -s libcfa.so.1.0.0 libcfa.so; }; })
22:55:26 /usr/bin/mkdir -p '/var/lib/jenkins/workspace/Cforall_master_2@tmp/include/cfa//stdhdr'
22:55:26 /usr/bin/install -c -m 644 /var/lib/jenkins/workspace/Cforall_master_2/libcfa/src/stdhdr/locale.h /var/lib/jenkins/workspace/Cforall_master_2/libcfa/src/stdhdr/complex.h /var/lib/jenkins/workspace/Cforall_master_2/libcfa/src/stdhdr/stdint.h /var/lib/jenkins/workspace/Cforall_master_2/libcfa/src/stdhdr/time.h /var/lib/jenkins/workspace/Cforall_master_2/libcfa/src/stdhdr/threads.h /var/lib/jenkins/workspace/Cforall_master_2/libcfa/src/stdhdr/fenv.h /var/lib/jenkins/workspace/Cforall_master_2/libcfa/src/stdhdr/limits.h /var/lib/jenkins/workspace/Cforall_master_2/libcfa/src/stdhdr/stdnoreturn.h /var/lib/jenkins/workspace/Cforall_master_2/libcfa/src/stdhdr/unistd.h /var/lib/jenkins/workspace/Cforall_master_2/libcfa/src/stdhdr/stdalign.h /var/lib/jenkins/workspace/Cforall_master_2/libcfa/src/stdhdr/stdio.h /var/lib/jenkins/workspace/Cforall_master_2/libcfa/src/stdhdr/inttypes.h /var/lib/jenkins/workspace/Cforall_master_2/libcfa/src/stdhdr/uchar.h /var/lib/jenkins/workspace/Cforall_master_2/libcfa/src/stdhdr/stdbool.h /var/lib/jenkins/workspace/Cforall_master_2/libcfa/src/stdhdr/string.h /var/lib/jenkins/workspace/Cforall_master_2/libcfa/src/stdhdr/unwind.h /var/lib/jenkins/workspace/Cforall_master_2/libcfa/src/stdhdr/gmp.h /var/lib/jenkins/workspace/Cforall_master_2/libcfa/src/stdhdr/malloc.h /var/lib/jenkins/workspace/Cforall_master_2/libcfa/src/stdhdr/signal.h /var/lib/jenkins/workspace/Cforall_master_2/libcfa/src/stdhdr/stdarg.h /var/lib/jenkins/workspace/Cforall_master_2/libcfa/src/stdhdr/pthread.h /var/lib/jenkins/workspace/Cforall_master_2/libcfa/src/stdhdr/stdlib.h /var/lib/jenkins/workspace/Cforall_master_2/libcfa/src/stdhdr/errno.h /var/lib/jenkins/workspace/Cforall_master_2/libcfa/src/stdhdr/math.h /var/lib/jenkins/workspace/Cforall_master_2/libcfa/src/stdhdr/float.h /var/lib/jenkins/workspace/Cforall_master_2/libcfa/src/stdhdr/wchar.h /var/lib/jenkins/workspace/Cforall_master_2/libcfa/src/stdhdr/assert.h /var/lib/jenkins/workspace/Cforall_master_2/libcfa/src/stdhdr/wctype.h /var/lib/jenkins/workspace/Cforall_master_2/libcfa/src/stdhdr/stddef.h /var/lib/jenkins/workspace/Cforall_master_2/libcfa/src/stdhdr/setjmp.h /var/lib/jenkins/workspace/Cforall_master_2/libcfa/src/stdhdr/ctype.h /var/lib/jenkins/workspace/Cforall_master_2/libcfa/src/stdhdr/tgmath.h /var/lib/jenkins/workspace/Cforall_master_2/libcfa/src/stdhdr/iso646.h /var/lib/jenkins/workspace/Cforall_master_2/libcfa/src/stdhdr/stdatomic.h '/var/lib/jenkins/workspace/Cforall_master_2@tmp/include/cfa//stdhdr'
22:55:26libtool: install: /usr/bin/install -c .libs/libcfa.lai /var/lib/jenkins/workspace/Cforall_master_2@tmp/lib/cfa/x64-debug/libcfa.la
22:55:26 /usr/bin/mkdir -p '/var/lib/jenkins/workspace/Cforall_master_2@tmp/include/cfa//collections'
22:55:26 /usr/bin/install -c -m 644 /var/lib/jenkins/workspace/Cforall_master_2/libcfa/src/collections/maybe.hfa /var/lib/jenkins/workspace/Cforall_master_2/libcfa/src/collections/pair.hfa /var/lib/jenkins/workspace/Cforall_master_2/libcfa/src/collections/result.hfa /var/lib/jenkins/workspace/Cforall_master_2/libcfa/src/collections/string.hfa /var/lib/jenkins/workspace/Cforall_master_2/libcfa/src/collections/string_res.hfa /var/lib/jenkins/workspace/Cforall_master_2/libcfa/src/collections/vector.hfa /var/lib/jenkins/workspace/Cforall_master_2/libcfa/src/collections/array.hfa /var/lib/jenkins/workspace/Cforall_master_2/libcfa/src/collections/list.hfa /var/lib/jenkins/workspace/Cforall_master_2/libcfa/src/collections/list2.hfa /var/lib/jenkins/workspace/Cforall_master_2/libcfa/src/collections/lockfree.hfa /var/lib/jenkins/workspace/Cforall_master_2/libcfa/src/collections/string_sharectx.hfa /var/lib/jenkins/workspace/Cforall_master_2/libcfa/src/collections/vector2.hfa '/var/lib/jenkins/workspace/Cforall_master_2@tmp/include/cfa//collections'
22:55:26libtool: install: /usr/bin/install -c .libs/libcfathread.so.1.0.0 /var/lib/jenkins/workspace/Cforall_master_2@tmp/lib/cfa/x64-debug/libcfathread.so.1.0.0
22:55:26libtool: install: (cd /var/lib/jenkins/workspace/Cforall_master_2@tmp/lib/cfa/x64-debug && { ln -s -f libcfathread.so.1.0.0 libcfathread.so.1 || { rm -f libcfathread.so.1 && ln -s libcfathread.so.1.0.0 libcfathread.so.1; }; })
22:55:26libtool: install: (cd /var/lib/jenkins/workspace/Cforall_master_2@tmp/lib/cfa/x64-debug && { ln -s -f libcfathread.so.1.0.0 libcfathread.so || { rm -f libcfathread.so && ln -s libcfathread.so.1.0.0 libcfathread.so; }; })
22:55:26libtool: install: /usr/bin/install -c .libs/libcfathread.lai /var/lib/jenkins/workspace/Cforall_master_2@tmp/lib/cfa/x64-debug/libcfathread.la
22:55:26libtool: warning: remember to run 'libtool --finish /var/lib/jenkins/workspace/Cforall_master_2@tmp/lib/cfa/x64-debug/'
22:55:26make[3]: Nothing to be done for 'install-exec-am'.
22:55:26make[3]: Nothing to be done for 'install-data-am'.
22:55:26Making install in libcfa/x64-nodebug
22:55:26Making install in prelude
22:55:26make[3]: Nothing to be done for 'install-exec-am'.
22:55:26 /usr/bin/mkdir -p '/var/lib/jenkins/workspace/Cforall_master_2@tmp/lib/cfa/x64-nodebug/'
22:55:26 /usr/bin/install -c -m 644 gcc-builtins.cfa builtins.cfa extras.cfa prelude.cfa bootloader.c defines.hfa '/var/lib/jenkins/workspace/Cforall_master_2@tmp/lib/cfa/x64-nodebug/'
22:55:26Making install in src
22:55:26 /usr/bin/mkdir -p '/var/lib/jenkins/workspace/Cforall_master_2@tmp/lib/cfa/x64-nodebug/'
22:55:26 /bin/bash ../libtool --mode=install /usr/bin/install -c libcfa.la libcfathread.la '/var/lib/jenkins/workspace/Cforall_master_2@tmp/lib/cfa/x64-nodebug/'
22:55:26 /usr/bin/mkdir -p '/var/lib/jenkins/workspace/Cforall_master_2@tmp/include/cfa/'
22:55:26 /usr/bin/mkdir -p '/var/lib/jenkins/workspace/Cforall_master_2@tmp/include/cfa//stdhdr/sys'
22:55:26 /usr/bin/install -c -m 644 /var/lib/jenkins/workspace/Cforall_master_2/libcfa/src/stdhdr/sys/time.h /var/lib/jenkins/workspace/Cforall_master_2/libcfa/src/stdhdr/sys/mman.h /var/lib/jenkins/workspace/Cforall_master_2/libcfa/src/stdhdr/sys/socket.h '/var/lib/jenkins/workspace/Cforall_master_2@tmp/include/cfa//stdhdr/sys'
22:55:26 /usr/bin/mkdir -p '/var/lib/jenkins/workspace/Cforall_master_2@tmp/include/cfa//algorithms'
22:55:26 /usr/bin/install -c -m 644 /var/lib/jenkins/workspace/Cforall_master_2/libcfa/src/algorithms/range_iterator.hfa '/var/lib/jenkins/workspace/Cforall_master_2@tmp/include/cfa//algorithms'
22:55:26 /usr/bin/mkdir -p '/var/lib/jenkins/workspace/Cforall_master_2@tmp/include/cfa//concurrency/kernel'
22:55:26 /usr/bin/install -c -m 644 /var/lib/jenkins/workspace/Cforall_master_2/libcfa/src/concurrency/kernel/cluster.hfa /var/lib/jenkins/workspace/Cforall_master_2/libcfa/src/concurrency/kernel/fwd.hfa '/var/lib/jenkins/workspace/Cforall_master_2@tmp/include/cfa//concurrency/kernel'
22:55:26 /usr/bin/install -c -m 644 /var/lib/jenkins/workspace/Cforall_master_2/libcfa/src/common.hfa /var/lib/jenkins/workspace/Cforall_master_2/libcfa/src/fstream.hfa /var/lib/jenkins/workspace/Cforall_master_2/libcfa/src/heap.hfa /var/lib/jenkins/workspace/Cforall_master_2/libcfa/src/iostream.hfa /var/lib/jenkins/workspace/Cforall_master_2/libcfa/src/iterator.hfa /var/lib/jenkins/workspace/Cforall_master_2/libcfa/src/limits.hfa /var/lib/jenkins/workspace/Cforall_master_2/libcfa/src/math.hfa /var/lib/jenkins/workspace/Cforall_master_2/libcfa/src/memory.hfa /var/lib/jenkins/workspace/Cforall_master_2/libcfa/src/parseargs.hfa /var/lib/jenkins/workspace/Cforall_master_2/libcfa/src/parseconfig.hfa /var/lib/jenkins/workspace/Cforall_master_2/libcfa/src/rational.hfa /var/lib/jenkins/workspace/Cforall_master_2/libcfa/src/stdlib.hfa /var/lib/jenkins/workspace/Cforall_master_2/libcfa/src/strstream.hfa /var/lib/jenkins/workspace/Cforall_master_2/libcfa/src/time.hfa /var/lib/jenkins/workspace/Cforall_master_2/libcfa/src/Exception.hfa /var/lib/jenkins/workspace/Cforall_master_2/libcfa/src/bitmanip.hfa /var/lib/jenkins/workspace/Cforall_master_2/libcfa/src/clock.hfa /var/lib/jenkins/workspace/Cforall_master_2/libcfa/src/exception.hfa /var/lib/jenkins/workspace/Cforall_master_2/libcfa/src/exception.h /var/lib/jenkins/workspace/Cforall_master_2/libcfa/src/gmp.hfa /var/lib/jenkins/workspace/Cforall_master_2/libcfa/src/math.trait.hfa /var/lib/jenkins/workspace/Cforall_master_2/libcfa/src/raii.hfa /var/lib/jenkins/workspace/Cforall_master_2/libcfa/src/time_t.hfa /var/lib/jenkins/workspace/Cforall_master_2/libcfa/src/virtual_dtor.hfa '/var/lib/jenkins/workspace/Cforall_master_2@tmp/include/cfa//.'
22:55:26 /usr/bin/mkdir -p '/var/lib/jenkins/workspace/Cforall_master_2@tmp/include/cfa//concurrency'
22:55:26 /usr/bin/install -c -m 644 /var/lib/jenkins/workspace/Cforall_master_2/libcfa/src/concurrency/iofwd.hfa /var/lib/jenkins/workspace/Cforall_master_2/libcfa/src/concurrency/barrier.hfa /var/lib/jenkins/workspace/Cforall_master_2/libcfa/src/concurrency/alarm.hfa /var/lib/jenkins/workspace/Cforall_master_2/libcfa/src/concurrency/coroutine.hfa /var/lib/jenkins/workspace/Cforall_master_2/libcfa/src/concurrency/exception.hfa /var/lib/jenkins/workspace/Cforall_master_2/libcfa/src/concurrency/kernel.hfa /var/lib/jenkins/workspace/Cforall_master_2/libcfa/src/concurrency/locks.hfa /var/lib/jenkins/workspace/Cforall_master_2/libcfa/src/concurrency/monitor.hfa /var/lib/jenkins/workspace/Cforall_master_2/libcfa/src/concurrency/mutex.hfa /var/lib/jenkins/workspace/Cforall_master_2/libcfa/src/concurrency/select.hfa /var/lib/jenkins/workspace/Cforall_master_2/libcfa/src/concurrency/thread.hfa /var/lib/jenkins/workspace/Cforall_master_2/libcfa/src/concurrency/cofor.hfa /var/lib/jenkins/workspace/Cforall_master_2/libcfa/src/concurrency/invoke.h /var/lib/jenkins/workspace/Cforall_master_2/libcfa/src/concurrency/future.hfa /var/lib/jenkins/workspace/Cforall_master_2/libcfa/src/concurrency/once.hfa /var/lib/jenkins/workspace/Cforall_master_2/libcfa/src/concurrency/mutex_stmt.hfa /var/lib/jenkins/workspace/Cforall_master_2/libcfa/src/concurrency/channel.hfa /var/lib/jenkins/workspace/Cforall_master_2/libcfa/src/concurrency/actor.hfa '/var/lib/jenkins/workspace/Cforall_master_2@tmp/include/cfa//concurrency'
22:55:26 /usr/bin/mkdir -p '/var/lib/jenkins/workspace/Cforall_master_2@tmp/include/cfa//concurrency/clib'
22:55:26 /usr/bin/install -c -m 644 /var/lib/jenkins/workspace/Cforall_master_2/libcfa/src/concurrency/clib/cfathread.h '/var/lib/jenkins/workspace/Cforall_master_2@tmp/include/cfa//concurrency/clib'
22:55:26 /usr/bin/mkdir -p '/var/lib/jenkins/workspace/Cforall_master_2@tmp/include/cfa//device'
22:55:26 /usr/bin/install -c -m 644 /var/lib/jenkins/workspace/Cforall_master_2/libcfa/src/device/cpu.hfa '/var/lib/jenkins/workspace/Cforall_master_2@tmp/include/cfa//device'
22:55:26 /usr/bin/mkdir -p '/var/lib/jenkins/workspace/Cforall_master_2@tmp/include/cfa//stdhdr/libltdl'
22:55:26 /usr/bin/install -c -m 644 /var/lib/jenkins/workspace/Cforall_master_2/libcfa/src/stdhdr/libltdl/lt_dlloader.h '/var/lib/jenkins/workspace/Cforall_master_2@tmp/include/cfa//stdhdr/libltdl'
22:55:26 /usr/bin/mkdir -p '/var/lib/jenkins/workspace/Cforall_master_2@tmp/include/cfa//vec'
22:55:26libtool: install: /usr/bin/install -c .libs/libcfa.so.1.0.0 /var/lib/jenkins/workspace/Cforall_master_2@tmp/lib/cfa/x64-nodebug/libcfa.so.1.0.0
22:55:26 /usr/bin/install -c -m 644 /var/lib/jenkins/workspace/Cforall_master_2/libcfa/src/vec/vec.hfa /var/lib/jenkins/workspace/Cforall_master_2/libcfa/src/vec/vec2.hfa /var/lib/jenkins/workspace/Cforall_master_2/libcfa/src/vec/vec3.hfa /var/lib/jenkins/workspace/Cforall_master_2/libcfa/src/vec/vec4.hfa '/var/lib/jenkins/workspace/Cforall_master_2@tmp/include/cfa//vec'
22:55:26 /usr/bin/mkdir -p '/var/lib/jenkins/workspace/Cforall_master_2@tmp/include/cfa//bits'
22:55:26 /usr/bin/install -c -m 644 /var/lib/jenkins/workspace/Cforall_master_2/libcfa/src/bits/weakso_locks.hfa /var/lib/jenkins/workspace/Cforall_master_2/libcfa/src/bits/algorithm.hfa /var/lib/jenkins/workspace/Cforall_master_2/libcfa/src/bits/align.hfa /var/lib/jenkins/workspace/Cforall_master_2/libcfa/src/bits/collections.hfa /var/lib/jenkins/workspace/Cforall_master_2/libcfa/src/bits/debug.hfa /var/lib/jenkins/workspace/Cforall_master_2/libcfa/src/bits/defs.hfa /var/lib/jenkins/workspace/Cforall_master_2/libcfa/src/bits/locks.hfa /var/lib/jenkins/workspace/Cforall_master_2/libcfa/src/bits/collection.hfa /var/lib/jenkins/workspace/Cforall_master_2/libcfa/src/bits/stack.hfa /var/lib/jenkins/workspace/Cforall_master_2/libcfa/src/bits/queue.hfa /var/lib/jenkins/workspace/Cforall_master_2/libcfa/src/bits/sequence.hfa /var/lib/jenkins/workspace/Cforall_master_2/libcfa/src/bits/atomic.hfa /var/lib/jenkins/workspace/Cforall_master_2/libcfa/src/bits/random.hfa '/var/lib/jenkins/workspace/Cforall_master_2@tmp/include/cfa//bits'
22:55:26libtool: install: (cd /var/lib/jenkins/workspace/Cforall_master_2@tmp/lib/cfa/x64-nodebug && { ln -s -f libcfa.so.1.0.0 libcfa.so.1 || { rm -f libcfa.so.1 && ln -s libcfa.so.1.0.0 libcfa.so.1; }; })
22:55:26libtool: install: (cd /var/lib/jenkins/workspace/Cforall_master_2@tmp/lib/cfa/x64-nodebug && { ln -s -f libcfa.so.1.0.0 libcfa.so || { rm -f libcfa.so && ln -s libcfa.so.1.0.0 libcfa.so; }; })
22:55:26 /usr/bin/mkdir -p '/var/lib/jenkins/workspace/Cforall_master_2@tmp/include/cfa//stdhdr'
22:55:26 /usr/bin/install -c -m 644 /var/lib/jenkins/workspace/Cforall_master_2/libcfa/src/stdhdr/locale.h /var/lib/jenkins/workspace/Cforall_master_2/libcfa/src/stdhdr/complex.h /var/lib/jenkins/workspace/Cforall_master_2/libcfa/src/stdhdr/stdint.h /var/lib/jenkins/workspace/Cforall_master_2/libcfa/src/stdhdr/time.h /var/lib/jenkins/workspace/Cforall_master_2/libcfa/src/stdhdr/threads.h /var/lib/jenkins/workspace/Cforall_master_2/libcfa/src/stdhdr/fenv.h /var/lib/jenkins/workspace/Cforall_master_2/libcfa/src/stdhdr/limits.h /var/lib/jenkins/workspace/Cforall_master_2/libcfa/src/stdhdr/stdnoreturn.h /var/lib/jenkins/workspace/Cforall_master_2/libcfa/src/stdhdr/unistd.h /var/lib/jenkins/workspace/Cforall_master_2/libcfa/src/stdhdr/stdalign.h /var/lib/jenkins/workspace/Cforall_master_2/libcfa/src/stdhdr/stdio.h /var/lib/jenkins/workspace/Cforall_master_2/libcfa/src/stdhdr/inttypes.h /var/lib/jenkins/workspace/Cforall_master_2/libcfa/src/stdhdr/uchar.h /var/lib/jenkins/workspace/Cforall_master_2/libcfa/src/stdhdr/stdbool.h /var/lib/jenkins/workspace/Cforall_master_2/libcfa/src/stdhdr/string.h /var/lib/jenkins/workspace/Cforall_master_2/libcfa/src/stdhdr/unwind.h /var/lib/jenkins/workspace/Cforall_master_2/libcfa/src/stdhdr/gmp.h /var/lib/jenkins/workspace/Cforall_master_2/libcfa/src/stdhdr/malloc.h /var/lib/jenkins/workspace/Cforall_master_2/libcfa/src/stdhdr/signal.h /var/lib/jenkins/workspace/Cforall_master_2/libcfa/src/stdhdr/stdarg.h /var/lib/jenkins/workspace/Cforall_master_2/libcfa/src/stdhdr/pthread.h /var/lib/jenkins/workspace/Cforall_master_2/libcfa/src/stdhdr/stdlib.h /var/lib/jenkins/workspace/Cforall_master_2/libcfa/src/stdhdr/errno.h /var/lib/jenkins/workspace/Cforall_master_2/libcfa/src/stdhdr/math.h /var/lib/jenkins/workspace/Cforall_master_2/libcfa/src/stdhdr/float.h /var/lib/jenkins/workspace/Cforall_master_2/libcfa/src/stdhdr/wchar.h /var/lib/jenkins/workspace/Cforall_master_2/libcfa/src/stdhdr/assert.h /var/lib/jenkins/workspace/Cforall_master_2/libcfa/src/stdhdr/wctype.h /var/lib/jenkins/workspace/Cforall_master_2/libcfa/src/stdhdr/stddef.h /var/lib/jenkins/workspace/Cforall_master_2/libcfa/src/stdhdr/setjmp.h /var/lib/jenkins/workspace/Cforall_master_2/libcfa/src/stdhdr/ctype.h /var/lib/jenkins/workspace/Cforall_master_2/libcfa/src/stdhdr/tgmath.h /var/lib/jenkins/workspace/Cforall_master_2/libcfa/src/stdhdr/iso646.h /var/lib/jenkins/workspace/Cforall_master_2/libcfa/src/stdhdr/stdatomic.h '/var/lib/jenkins/workspace/Cforall_master_2@tmp/include/cfa//stdhdr'
22:55:26libtool: install: /usr/bin/install -c .libs/libcfa.lai /var/lib/jenkins/workspace/Cforall_master_2@tmp/lib/cfa/x64-nodebug/libcfa.la
22:55:26 /usr/bin/mkdir -p '/var/lib/jenkins/workspace/Cforall_master_2@tmp/include/cfa//collections'
22:55:26 /usr/bin/install -c -m 644 /var/lib/jenkins/workspace/Cforall_master_2/libcfa/src/collections/maybe.hfa /var/lib/jenkins/workspace/Cforall_master_2/libcfa/src/collections/pair.hfa /var/lib/jenkins/workspace/Cforall_master_2/libcfa/src/collections/result.hfa /var/lib/jenkins/workspace/Cforall_master_2/libcfa/src/collections/string.hfa /var/lib/jenkins/workspace/Cforall_master_2/libcfa/src/collections/string_res.hfa /var/lib/jenkins/workspace/Cforall_master_2/libcfa/src/collections/vector.hfa /var/lib/jenkins/workspace/Cforall_master_2/libcfa/src/collections/array.hfa /var/lib/jenkins/workspace/Cforall_master_2/libcfa/src/collections/list.hfa /var/lib/jenkins/workspace/Cforall_master_2/libcfa/src/collections/list2.hfa /var/lib/jenkins/workspace/Cforall_master_2/libcfa/src/collections/lockfree.hfa /var/lib/jenkins/workspace/Cforall_master_2/libcfa/src/collections/string_sharectx.hfa /var/lib/jenkins/workspace/Cforall_master_2/libcfa/src/collections/vector2.hfa '/var/lib/jenkins/workspace/Cforall_master_2@tmp/include/cfa//collections'
22:55:26libtool: install: /usr/bin/install -c .libs/libcfathread.so.1.0.0 /var/lib/jenkins/workspace/Cforall_master_2@tmp/lib/cfa/x64-nodebug/libcfathread.so.1.0.0
22:55:26libtool: install: (cd /var/lib/jenkins/workspace/Cforall_master_2@tmp/lib/cfa/x64-nodebug && { ln -s -f libcfathread.so.1.0.0 libcfathread.so.1 || { rm -f libcfathread.so.1 && ln -s libcfathread.so.1.0.0 libcfathread.so.1; }; })
22:55:26libtool: install: (cd /var/lib/jenkins/workspace/Cforall_master_2@tmp/lib/cfa/x64-nodebug && { ln -s -f libcfathread.so.1.0.0 libcfathread.so || { rm -f libcfathread.so && ln -s libcfathread.so.1.0.0 libcfathread.so; }; })
22:55:26libtool: install: /usr/bin/install -c .libs/libcfathread.lai /var/lib/jenkins/workspace/Cforall_master_2@tmp/lib/cfa/x64-nodebug/libcfathread.la
22:55:26libtool: warning: remember to run 'libtool --finish /var/lib/jenkins/workspace/Cforall_master_2@tmp/lib/cfa/x64-nodebug/'
22:55:26make[3]: Nothing to be done for 'install-exec-am'.
22:55:26make[3]: Nothing to be done for 'install-data-am'.
22:55:26[Pipeline] }
22:55:26[Pipeline] // dir
22:55:26[Pipeline] }
22:55:26[Pipeline] // stage
22:55:26[Pipeline] sh
22:55:26+ free -h
22:55:26 total used free shared buff/cache available
22:55:26Mem: 62Gi 2.1Gi 57Gi 5.0Mi 4.4Gi 60Gi
22:55:26Swap: 8.0Gi 0B 8.0Gi
22:55:26[Pipeline] sh
22:55:26+ ulimit -a
22:55:26time(seconds) unlimited
22:55:26file(blocks) unlimited
22:55:26data(kbytes) unlimited
22:55:26stack(kbytes) 8192
22:55:26coredump(blocks) 0
22:55:26memory(kbytes) unlimited
22:55:26locked memory(kbytes) 8238436
22:55:26process 257124
22:55:26nofiles 1048576
22:55:26vmemory(kbytes) unlimited
22:55:26locks unlimited
22:55:26rtprio 0
22:55:26[Pipeline] echo
22:55:26 -------- Test: Debug --------
22:55:26[Pipeline] stage
22:55:26[Pipeline] { (Test: Debug)
22:55:26[Pipeline] dir
22:55:26Running in /var/lib/jenkins/workspace/Cforall_master_2@tmp
22:55:26[Pipeline] {
22:55:26[Pipeline] sh
22:55:26+ nproc
22:55:26+ make -j 16 --no-print-directory -C tests timeout=600 global-timeout=14400 tests debug=yes archive-errors=/var/lib/jenkins/workspace/Cforall_master_2@tmp/tests/crashes/full-debug
22:55:26Running 378 tests on 16 cores (x64 - debug)
22:55:26 array-ERR2 PASSED C 0:00.070 - R n/a
22:55:26 array-ERR3 PASSED C 0:00.089 - R n/a
22:55:26 ...ollections/language-dim-mismatch PASSED C 0:00.470 - R n/a
22:55:26 array-ERR1 PASSED C 0:01.026 - R n/a
22:55:26 array PASSED C 0:01.097 - R 0:00.007
22:55:26 array-collections/c-dependent PASSED C 0:01.096 - R 0:00.006
22:55:26 array-collections/array-raii-c PASSED C 0:01.474 - R 0:00.022
22:55:26 array-collections/safety-summary PASSED C 0:00.922 - R n/a
22:55:26 array-collections/dimexpr-match-c PASSED C 0:02.095 - R 0:00.027
22:55:26 array-collections/dimexpr-match-cfa PASSED C 0:02.055 - R 0:00.022
22:55:26 array-collections/symtab-collision PASSED C 0:01.148 - R n/a
22:55:26 attr-priority PASSED C 0:01.084 - R 0:00.001
22:55:26 array-collections/array-sbscr-types PASSED C 0:02.183 - R 0:00.018
22:55:26 array-collections/boxed PASSED C 0:02.544 - R 0:00.019
22:55:26 array-collections/array-basic PASSED C 0:02.643 - R 0:00.022
22:55:26 cast PASSED C 0:01.153 - R 0:00.020
22:55:26 castError PASSED C 0:00.672 - R n/a
22:55:26 builtins/sync PASSED C 0:01.644 - R 0:00.020
22:55:26 castReturn PASSED C 0:01.313 - R 0:00.007
22:55:26 alloc-ERROR PASSED C 0:05.490 - R n/a
22:55:26 avl_test PASSED C 0:05.054 - R 0:00.019
22:55:26 array-collections/accordion PASSED C 0:06.527 - R 0:00.009
22:55:26 algorithms/range_test PASSED C 0:06.633 - R 0:00.007
22:55:26 array-collections/array-raii-cfa PASSED C 0:06.965 - R 0:00.009
22:55:26 collections/stack PASSED C 0:07.425 - R 0:00.011
22:55:26 alloc PASSED C 0:10.555 - R 0:00.011
22:55:26 collections/multi_list PASSED C 0:08.723 - R 0:00.007
22:55:26 collections/string-compare PASSED C 0:07.890 - R 0:00.009
22:55:26 collections/queue PASSED C 0:09.077 - R 0:00.006
22:55:26 collections/string-operator-ERR09 PASSED C 0:04.338 - R n/a
22:55:26 collections/string-gc PASSED C 0:05.905 - R 0:00.009
22:55:26 collections/string-ctx-manage PASSED C 0:08.442 - R 0:00.006
22:55:26 collections/sequence PASSED C 0:09.537 - R 0:00.006
22:55:26 collections/string-istream PASSED C 0:07.173 - R 0:00.007
22:55:26 alloc2 PASSED C 0:13.504 - R 0:00.009
22:55:26 collections/string-api-coverage PASSED C 0:11.445 - R 0:00.024
22:55:26 collections/string-operator-ERR11 PASSED C 0:04.436 - R n/a
22:55:26 ...ions/string-api-coverage-noshare PASSED C 0:11.864 - R 0:00.010
22:55:26 ...ns/vector-err-pass-perm-it-byval PASSED C 0:02.590 - R n/a
22:55:26 collections/string-operator-ERR13 PASSED C 0:04.307 - R n/a
22:55:26 collections/string-operator PASSED C 0:08.536 - R 0:00.023
22:55:26 collections/string-istream-manip PASSED C 0:08.653 - R 0:00.011
22:55:26 collections/string-operator-ERR15 PASSED C 0:04.445 - R n/a
22:55:26 collections/string-operator-ERR16 PASSED C 0:04.366 - R n/a
22:55:26 ...ns/vector-err-retn-perm-it-byval PASSED C 0:02.314 - R n/a
22:55:26 collections/vector-demo PASSED C 0:04.839 - R 0:00.022
22:55:26 collections/atomic_mpsc PASSED C 0:10.114 - R 0:05.242
22:55:26 complex PASSED C 0:05.926 - R 0:00.007
22:55:26 collections/string-ostream PASSED C 0:08.204 - R 0:00.006
22:55:26 collections/string-overwrite PASSED C 0:09.508 - R 0:00.011
22:55:26 ...ections/string-overwrite-noshare PASSED C 0:09.950 - R 0:00.011
22:55:26 concurrency/barrier/generation PASSED C 0:11.185 - R 0:00.370
22:55:26 concurrency/barrier/last PASSED C 0:11.606 - R 0:00.066
22:55:26 concurrency/actors/executor PASSED C 0:14.104 - R 0:00.039
22:55:26 concurrency/barrier/order PASSED C 0:11.157 - R 0:00.069
22:55:26 concurrency/actors/inline PASSED C 0:14.064 - R 0:00.067
22:55:26 concurrency/actors/inherit PASSED C 0:14.278 - R 0:00.067
22:55:26 concurrency/actors/poison PASSED C 0:13.850 - R 0:00.067
22:55:26 concurrency/actors/pingpong PASSED C 0:13.946 - R 0:00.065
22:55:26 concurrency/actors/static PASSED C 0:13.934 - R 0:00.167
22:55:26 concurrency/actors/matrixMultiply PASSED C 0:13.949 - R 0:00.770
22:55:26 concurrency/actors/types PASSED C 0:14.464 - R 0:00.067
22:55:26 concurrency/ctor-check PASSED C 0:00.820 - R n/a
22:55:26 concurrency/clib PASSED C 0:02.112 - R 0:00.126
22:55:26 concurrency/clib_tls PASSED C 0:02.075 - R 0:00.014
22:55:26 concurrency/actors/dynamic PASSED C 0:13.971 - R 0:03.229
22:55:26 concurrency/cluster PASSED C 0:06.690 - R 0:00.017
22:55:26 concurrency/cofor PASSED C 0:08.727 - R 0:00.010
22:55:26 concurrency/coroutineYield PASSED C 0:09.636 - R 0:00.034
22:55:26 concurrency/examples/gortn PASSED C 0:09.283 - R 0:00.009
22:55:26 concurrency/examples/matrixSum PASSED C 0:09.221 - R 0:00.034
22:55:26 concurrency/examples/datingService PASSED C 0:09.828 - R 0:00.020
22:55:26 concurrency/channels/churn PASSED C 0:13.014 - R 0:10.022
22:55:26 concurrency/channels/big_elems PASSED C 0:12.824 - R 0:10.515
22:55:26 concurrency/keywordErrors PASSED C 0:00.330 - R n/a
22:55:26 concurrency/channels/contend PASSED C 0:12.828 - R 0:10.055
22:55:26 concurrency/mainError PASSED C 0:00.263 - R n/a
22:55:26 concurrency/channels/daisy_chain PASSED C 0:12.689 - R 0:10.060
22:55:26 concurrency/futures/abandon PASSED C 0:06.785 - R 0:00.118
22:55:26 ...rrency/examples/boundedBufferEXT PASSED C 0:09.641 - R 0:05.288
22:55:26 ...rrency/examples/boundedBufferINT PASSED C 0:09.672 - R 0:05.039
22:55:26 concurrency/futures/basic PASSED C 0:06.777 - R 0:00.067
22:55:26 concurrency/examples/quickSort PASSED C 0:11.608 - R 0:00.009
22:55:26 concurrency/channels/hot_potato PASSED C 0:12.571 - R 0:10.043
22:55:26 concurrency/channels/ping_pong PASSED C 0:12.462 - R 0:10.044
22:55:26 concurrency/channels/zero_size PASSED C 0:12.515 - R 0:10.064
22:55:26 concurrency/channels/pub_sub PASSED C 0:12.735 - R 0:10.049
22:55:26 concurrency/join PASSED C 0:09.382 - R 0:00.011
22:55:26 concurrency/migrate PASSED C 0:09.695 - R 0:00.070
22:55:26 concurrency/futures/wait_any PASSED C 0:13.438 - R 0:00.035
22:55:26 concurrency/lockfree_stack PASSED C 0:09.172 - R 0:02.727
22:55:26 concurrency/mutexstmt/monitors PASSED C 0:07.591 - R 0:02.477
22:55:26 concurrency/futures/typed PASSED C 0:14.595 - R 0:00.467
22:55:26 concurrency/park/contention PASSED C 0:07.486 - R 0:00.267
22:55:26 concurrency/mutexstmt/tuple PASSED C 0:11.650 - R 0:00.006
22:55:26 ...urrency/pthread/pthread_key_test PASSED C 0:03.028 - R 0:00.010
22:55:26 concurrency/park/start_parked PASSED C 0:07.466 - R 0:00.068
22:55:26 concurrency/once PASSED C 0:11.732 - R 0:00.068
22:55:26 concurrency/park/force_preempt PASSED C 0:10.446 - R 0:00.269
22:55:26 concurrency/futures/future_except PASSED C 0:21.875 - R 0:00.019
22:55:26 ...rrency/pthread/pthread_attr_test PASSED C 0:09.336 - R 0:00.022
22:55:26 ...rrency/pthread/pthread_cond_test PASSED C 0:09.398 - R 0:00.012
22:55:26 ...pthread/pthread_demo_create_join PASSED C 0:09.075 - R 0:00.012
22:55:26 concurrency/monitor PASSED C 0:11.016 - R 0:10.696
22:55:26 ...rrency/pthread/pthread_once_test PASSED C 0:09.434 - R 0:00.009
22:55:26 concurrency/multi-monitor PASSED C 0:10.066 - R 0:12.252
22:55:26 concurrency/preempt PASSED C 0:11.141 - R 0:05.895
22:55:26 concurrency/readyQ/barrier_sleeper PASSED C 0:10.753 - R 0:00.419
22:55:26 concurrency/readyQ/leader_spin PASSED C 0:09.457 - R 0:00.771
22:55:26 concurrency/signal/block PASSED C 0:09.925 - R 0:00.969
22:55:26 concurrency/signal/wait PASSED C 0:09.821 - R 0:00.170
22:55:26 concurrency/signal/disjoint PASSED C 0:10.914 - R 0:01.675
22:55:26 ...rrency/pthread/pthread_demo_lock PASSED C 0:10.598 - R 0:07.196
22:55:26 concurrency/suspend_then PASSED C 0:10.056 - R 0:00.020
22:55:26 concurrency/sleep PASSED C 0:09.994 - R 0:01.122
22:55:26 .../unified_locking/block_spin_lock PASSED C 0:11.154 - R 0:00.374
22:55:26 concurrency/thread PASSED C 0:11.803 - R 0:00.010
22:55:26 ...ency/unified_locking/exp_backoff PASSED C 0:11.457 - R 0:00.039
22:55:26 .../unified_locking/fast_block_lock PASSED C 0:10.937 - R 0:00.019
22:55:26 ...fied_locking/mcs_block_spin_lock PASSED C 0:11.025 - R 0:00.070
22:55:26 ...cy/unified_locking/pthread_locks PASSED C 0:08.397 - R 0:00.023
22:55:26 concurrency/preempt2 PASSED C 0:09.737 - R 0:20.343
22:55:26 ...ncy/unified_locking/timeout_lock PASSED C 0:08.301 - R 0:01.169
22:55:26 ...nified_locking/simple_owner_lock PASSED C 0:11.130 - R 0:00.036
22:55:26 concurrency/waitfor/barge PASSED C 0:09.471 - R 0:00.270
22:55:26 concurrency/waitfor/else PASSED C 0:07.912 - R 0:00.011
22:55:26 concurrency/waitfor/parse PASSED C 0:05.631 - R 0:00.018
22:55:26 ...urrency/waitfor/lexical_priority PASSED C 0:09.428 - R 0:00.009
22:55:26 concurrency/waitfor/dtor PASSED C 0:09.916 - R 0:01.328
22:55:26 concurrency/unified_locking/mcs PASSED C 0:11.441 - R 0:08.289
22:55:26 concurrency/waitfor/statment PASSED C 0:10.292 - R 0:00.057
22:55:26 concurrency/waitfor/recurse PASSED C 0:09.575 - R 0:01.583
22:55:26 concurrency/waitfor/when PASSED C 0:10.613 - R 0:00.126
22:55:26 concurrency/waituntil/basic_else PASSED C 0:14.278 - R 0:00.021
22:55:26 ...ency/waituntil/channel_zero_size PASSED C 0:10.091 - R 0:05.177
22:55:26 concurrency/waituntil/one_chan PASSED C 0:09.800 - R 0:01.069
22:55:26 concurrency/waituntil/timeout PASSED C 0:05.766 - R 0:03.179
22:55:26 const-init PASSED C 0:00.892 - R 0:00.020
22:55:26 configs/parsebools PASSED C 0:07.691 - R 0:00.035
22:55:26 const-ref PASSED C 0:00.943 - R 0:00.020
22:55:26 concurrency/waituntil/channels PASSED C 0:09.880 - R 0:08.993
22:55:26 configs/parseconfig PASSED C 0:08.031 - R 0:00.020
22:55:26 copyfile PASSED C 0:05.412 - R 0:00.008
22:55:26 concurrency/waituntil/channel_close PASSED C 0:12.666 - R 0:10.051
22:55:26 configs/usage PASSED C 0:07.532 - R 0:00.011
22:55:26 coroutine/devicedriver PASSED C 0:06.424 - R 0:00.036
22:55:26 coroutine/fibonacci PASSED C 0:06.235 - R 0:00.011
22:55:26 concurrency/waituntil/futures FAILED with code -6 C 0:21.604 - R 0:00.167
22:55:26start
22:55:26Cforall Runtime error (UNIX pid:1065401): Attempting to fulfil a future that has already been fulfilled
22:55:26Stack back trace for: /var/lib/jenkins/workspace/Cforall_master_2@tmp/libcfa/x64-debug/src/.libs/libcfa.so.1
22:55:26(0) /var/lib/jenkins/workspace/Cforall_master_2@tmp/libcfa/x64-debug/src/.libs/libcfa.so.1 : _X5abortFv_bPKc__1 + 0 [0x7ffff7e98020]
22:55:2622:55:26warning: Can't open file anon_inode:[io_uring] which was expanded to anon_inode:[io_uring] during file-backed mapping note processing
22:55:26[New LWP 1065401]
22:55:26[New LWP 1065402]
22:55:26[New LWP 1065403]
22:55:26[Thread debugging using libthread_db enabled]
22:55:26Using host libthread_db library "/lib/x86_64-linux-gnu/libthread_db.so.1".
22:55:26Core was generated by `/var/lib/jenkins/workspace/Cforall_master_2@tmp/tests/concurrency/waituntil/fut'.
22:55:26Program terminated with signal SIGABRT, Aborted.
22:55:26#0 __pthread_kill_implementation (no_tid=0, signo=6, threadid=<optimized out>) at ./nptl/pthread_kill.c:44
22:55:2622:55:26warning: 44 ./nptl/pthread_kill.c: No such file or directory
22:55:26[Current thread is 1 (Thread 0x7ffff7c97900 (LWP 1065401))]
22:55:26-----
22:55:26#0 __pthread_kill_implementation (no_tid=0, signo=6, threadid=<optimized out>) at ./nptl/pthread_kill.c:44
22:55:26#1 __pthread_kill_internal (signo=6, threadid=<optimized out>) at ./nptl/pthread_kill.c:78
22:55:26#2 __GI___pthread_kill (threadid=<optimized out>, signo=signo@entry=6) at ./nptl/pthread_kill.c:89
22:55:26#3 0x00007ffff7a4527e in __GI_raise (sig=sig@entry=6) at ../sysdeps/posix/raise.c:26
22:55:26#4 0x00007ffff7a288ff in __GI_abort () at ./stdlib/abort.c:79
22:55:26#5 0x00007ffff7e97e34 in _X7__abortFv_bPKcY17__builtin_va_list__1 (_X11signalAbortb_1=true, _X3fmtPKc_1=0x7ffff7eb8a68 "Application interrupted by signal: %s.\n", _X4argsY17__builtin_va_list_1=0x7ffff7f04d60 <stack+63952>) at /var/lib/jenkins/workspace/Cforall_master_2/libcfa/src/interpose.cfa:263
22:55:26#6 0x00007ffff7e980dc in _X5abortFv_bPKc__1 (_X11signalAbortb_1=true, _X3fmtPKc_1=0x7ffff7eb8a68 "Application interrupted by signal: %s.\n") at /var/lib/jenkins/workspace/Cforall_master_2/libcfa/src/interpose.cfa:301
22:55:26#7 0x00007ffff7e98294 in _X15sigHandler_termFv_iPS21__anonymous_siginfo_tPS10ucontext_t__1 (_X3sigi_1=6, _X3sfpPS21__anonymous_siginfo_t_1=0x7ffff7f04fb0 <stack+64544>, _X3cxtPS10ucontext_t_1=0x7ffff7f04e80 <stack+64240>) at /var/lib/jenkins/workspace/Cforall_master_2/libcfa/src/interpose.cfa:337
22:55:26#8 <signal handler called>
22:55:26#9 __pthread_kill_implementation (no_tid=0, signo=6, threadid=<optimized out>) at ./nptl/pthread_kill.c:44
22:55:26#10 __pthread_kill_internal (signo=6, threadid=<optimized out>) at ./nptl/pthread_kill.c:78
22:55:26#11 __GI___pthread_kill (threadid=<optimized out>, signo=signo@entry=6) at ./nptl/pthread_kill.c:89
22:55:26#12 0x00007ffff7a4527e in __GI_raise (sig=sig@entry=6) at ../sysdeps/posix/raise.c:26
22:55:26#13 0x00007ffff7a288ff in __GI_abort () at ./stdlib/abort.c:79
22:55:26#14 0x00007ffff7e97f69 in _X7__abortFv_bPKcY17__builtin_va_list__1 (_X11signalAbortb_1=false, _X3fmtPKc_1=0x5555555652f8 "Attempting to fulfil a future that has already been fulfilled", _X4argsY17__builtin_va_list_1=0x5555557abbe0) at /var/lib/jenkins/workspace/Cforall_master_2/libcfa/src/interpose.cfa:286
22:55:26#15 0x00007ffff7e98020 in _X5abortFv_PKc__1 (_X3fmtPKc_1=0x5555555652f8 "Attempting to fulfil a future that has already been fulfilled") at /var/lib/jenkins/workspace/Cforall_master_2/libcfa/src/interpose.cfa:293
22:55:26#16 0x000055555555c45d in _X6fulfilQ1_0_0_4__X16_operator_assignFBD0_BD0BD0__X12_constructorFv_BD0__X12_constructorFv_BD0BD0__X11_destructorFv_BD0__Fb_S6future_BD0_BD0__1 (_adapterFv_PY1TY1T__MP=0x5555557abf0c, _adapterFY1T_PY1TY1T_P_MP=0x5555557abef0, _sizeof_Y1T=4, _alignof_Y1T=4, _X16_operator_assignFY1T_Y1TY1T__1=0x7ffff7ea29fd <_X16_operator_assignFi_ii_intrinsic___1>, _X12_constructorFv_Y1T__1=0x7ffff7ea7fc1 <_X12_constructorFv_i_intrinsic___1>, _X12_constructorFv_Y1TY1T__1=0x7ffff7ea7fd0 <_X12_constructorFv_ii_intrinsic___1>, _X11_destructorFv_Y1T__1=0x7ffff7ea8027 <_X11_destructorFv_i_intrinsic___1>, _X3futS6future_Y1T__1=0x55555556a420 <_X1CS6future_i__1>, _X3valY1T_1=0x5555557abd90) at /var/lib/jenkins/workspace/Cforall_master_2/libcfa/src/concurrency/future.hfa:196
22:55:26#17 0x000055555555c75c in _X14_operator_callQ1_0_0_4__X16_operator_assignFBD0_BD0BD0__X12_constructorFv_BD0__X12_constructorFv_BD0BD0__X11_destructorFv_BD0__Fb_S6future_BD0_BD0__1 (_adapterFv_PY1TY1T__MP=0x5555557abf0c, _adapterFY1T_PY1TY1T_P_MP=0x5555557abef0, _sizeof_Y1T=4, _alignof_Y1T=4, _X16_operator_assignFY1T_Y1TY1T__1=0x7ffff7ea29fd <_X16_operator_assignFi_ii_intrinsic___1>, _X12_constructorFv_Y1T__1=0x7ffff7ea7fc1 <_X12_constructorFv_i_intrinsic___1>, _X12_constructorFv_Y1TY1T__1=0x7ffff7ea7fd0 <_X12_constructorFv_ii_intrinsic___1>, _X11_destructorFv_Y1T__1=0x7ffff7ea8027 <_X11_destructorFv_i_intrinsic___1>, _X3futS6future_Y1T__1=0x55555556a420 <_X1CS6future_i__1>, _X3valY1T_1=0x5555557abeec) at /var/lib/jenkins/workspace/Cforall_master_2/libcfa/src/concurrency/future.hfa:200
22:55:26#18 0x000055555555cdb9 in _X4mainFv_S6Server__1 (__anonymous_object2711=0x7fffffffd4e0) at concurrency/waituntil/futures.cfa:11
22:55:26#19 0x00007ffff7f4693f in __cfactx_invoke_thread (main=0x55555555cae5 <_X4mainFv_S6Server__1>, this=0x7fffffffd4e0) at /var/lib/jenkins/workspace/Cforall_master_2/libcfa/src/concurrency/invoke.c:87
22:55:26#20 0x0000000000000000 in ?? ()
22:55:26-----
22:55:26 Id Target Id Frame
22:55:26* 1 Thread 0x7ffff7c97900 (LWP 1065401) __pthread_kill_implementation (no_tid=0, signo=6, threadid=<optimized out>) at ./nptl/pthread_kill.c:44
22:55:26 2 Thread 0x5555555b9ec0 (LWP 1065402) 0x00007ffff7a45fc8 in __GI___sigtimedwait (set=0x5555555b93f0, info=0x5555555b9470, timeout=0x0) at ../sysdeps/unix/sysv/linux/sigtimedwait.c:31
22:55:26 3 Thread 0x555555649ec0 (LWP 1065403) 0x00007ffff7b1bd6a in __GI___libc_read (nbytes=8, buf=0x555555648fb0, fd=5) at ../sysdeps/unix/sysv/linux/read.c:26
22:55:2622:55:26Archiving concurrency/waituntil/futures (executable and core) to crashes/full-debug/concurrency/waituntil/futures
22:55:26 coroutine/fmtLines PASSED C 0:06.460 - R 0:00.011
22:55:26 counter PASSED C 0:05.172 - R 0:00.009
22:55:26 coroutine/pingpong PASSED C 0:06.999 - R 0:00.026
22:55:26 coroutine/raii PASSED C 0:06.484 - R 0:00.019
22:55:26 ctrl-flow/break-misc PASSED C 0:05.224 - R 0:00.007
22:55:26 coroutine/runningTotal PASSED C 0:06.517 - R 0:00.017
22:55:26 ctrl-flow/loop-inc PASSED C 0:01.051 - R 0:00.019
22:55:26 ctrl-flow/labelledExit PASSED C 0:01.242 - R 0:00.011
22:55:26 coroutine/prodcons PASSED C 0:08.043 - R 0:00.015
22:55:26 ctrl-flow/fallthrough PASSED C 0:05.256 - R 0:00.007
22:55:26 ctrl-flow/goto PASSED C 0:05.301 - R 0:00.005
22:55:26 enum PASSED C 0:01.060 - R 0:00.020
22:55:26 designations PASSED C 0:02.085 - R 0:00.007
22:55:26 concurrency/waituntil/all_types PASSED C 0:26.449 - R 0:07.087
22:55:26 ctrl-flow/ifwhileCtl PASSED C 0:05.061 - R 0:00.005
22:55:26 ctrl-flow/loop_else PASSED C 0:04.974 - R 0:00.005
22:55:26 enum_tests/funcEnum PASSED C 0:01.783 - R 0:00.007
22:55:26 enum_tests/inc-dec PASSED C 0:01.080 - R 0:00.021
22:55:26 enum_tests/lvalue PASSED C 0:00.520 - R n/a
22:55:26 ctrl-flow/loop_else-WRN1 PASSED C 0:06.046 - R 0:00.001
22:55:26 ctrl-flow/loopctrl PASSED C 0:06.709 - R 0:00.007
22:55:26 ...ency/unified_locking/futex_mutex PASSED C 0:11.908 - R 0:41.838
22:55:26 enum_tests/anonymous PASSED C 0:05.555 - R 0:00.011
22:55:26 div PASSED C 0:06.985 - R 0:00.011
22:55:26 errors/declaration PASSED C 0:00.111 - R n/a
22:55:26 enum_tests/enumInlineValue PASSED C 0:05.886 - R 0:00.009
22:55:26 errors/scope-type PASSED C 0:00.292 - R n/a
22:55:26 errors/scope PASSED C 0:00.608 - R n/a
22:55:26 device/cpu PASSED C 0:08.207 - R 0:00.015
22:55:26 errors/signature PASSED C 0:00.124 - R n/a
22:55:26 enum_tests/structEnum PASSED C 0:01.897 - R 0:00.008
22:55:26 eval PASSED C 0:00.995 - R 0:00.020
22:55:26 enum_tests/input PASSED C 0:05.773 - R 0:00.007
22:55:26 ...urrency/unified_locking/mcs_spin PASSED C 0:11.154 - R 0:43.027
22:55:26 enum_tests/stringEnum PASSED C 0:05.367 - R 0:00.006
22:55:26 concurrency/mutexstmt/locks PASSED C 0:09.499 - R 1:10.763
22:55:26 enum_tests/planet PASSED C 0:07.008 - R 0:00.005
22:55:26 enum_tests/position PASSED C 0:07.458 - R 0:00.020
22:55:26 enum_tests/voidEnum PASSED C 0:05.582 - R 0:00.007
22:55:26 enum_tests/typedIntEnum PASSED C 0:05.805 - R 0:00.021
22:55:26 exceptions/conditional PASSED C 0:05.807 - R 0:00.006
22:55:26 exceptions/cancel/coroutine PASSED C 0:06.790 - R 0:00.019
22:55:26 exceptions/data-except PASSED C 0:05.398 - R 0:00.010
22:55:26 exceptions/conditional-threads PASSED C 0:06.545 - R 0:00.029
22:55:26 exceptions/defaults PASSED C 0:05.667 - R 0:00.006
22:55:26 exceptions/message PASSED C 0:02.064 - R 0:00.007
22:55:26 concurrency/waituntil/repeat_close PASSED C 0:10.907 - R 0:30.041
22:55:26 exceptions/cancel/thread PASSED C 0:09.518 - R 0:00.011
22:55:26 exceptions/finally PASSED C 0:06.030 - R 0:00.011
22:55:26 exceptions/try-ctrl-flow PASSED C 0:00.360 - R n/a
22:55:26 exceptions/interact PASSED C 0:05.954 - R 0:00.006
22:55:26 .../unified_locking/spin_queue_lock PASSED C 0:11.481 - R 0:48.587
22:55:26 exceptions/defaults-threads PASSED C 0:07.895 - R 0:00.020
22:55:26 exceptions/type-check PASSED C 0:00.446 - R n/a
22:55:26 exceptions/finally-threads PASSED C 0:06.603 - R 0:00.011
22:55:26 exceptions/try-leave-catch PASSED C 0:01.139 - R 0:00.006
22:55:26 exceptions/cor_resumer PASSED C 0:10.270 - R 0:00.011
22:55:26 exceptions/fibonacci_nonlocal PASSED C 0:08.426 - R 0:00.011
22:55:26 expression PASSED C 0:01.167 - R 0:00.007
22:55:26 exceptions/polymorphic PASSED C 0:05.949 - R 0:00.019
22:55:26 exceptions/resume PASSED C 0:05.826 - R 0:00.014
22:55:26 exceptions/terminate PASSED C 0:05.511 - R 0:00.005
22:55:26 global-monomorph PASSED C 0:00.958 - R 0:00.007
22:55:26 exceptions/trash PASSED C 0:05.208 - R 0:00.006
22:55:26 exceptions/resume-threads PASSED C 0:07.552 - R 0:00.009
22:55:26 exceptions/terminate-threads PASSED C 0:07.145 - R 0:00.039
22:55:26 identFuncDeclarator PASSED C 0:01.222 - R 0:00.020
22:55:26 exceptions/virtual-poly PASSED C 0:05.999 - R 0:00.008
22:55:26 fstream_test PASSED C 0:05.473 - R 0:00.025
22:55:26 generator/fibonacci PASSED C 0:05.920 - R 0:00.006
22:55:26 exceptions/pingpong_nonlocal PASSED C 0:10.788 - R 0:00.043
22:55:26 forall PASSED C 0:06.543 - R 0:00.035
22:55:26 generator/fmtLines PASSED C 0:05.532 - R 0:00.017
22:55:26 identParamDeclarator PASSED C 0:01.247 - R 0:00.022
22:55:26 exceptions/virtual-cast PASSED C 0:07.106 - R 0:00.007
22:55:26 init1-ERROR PASSED C 0:00.613 - R n/a
22:55:26 generator/suspend_then PASSED C 0:05.403 - R 0:00.015
22:55:26 init1 PASSED C 0:01.072 - R 0:00.007
22:55:26 genericUnion PASSED C 0:05.536 - R 0:00.008
22:55:26 include/vector-sequence PASSED C 0:01.530 - R 0:00.006
22:55:26 function-operator PASSED C 0:07.732 - R 0:00.007
22:55:26 include/vector-collections PASSED C 0:02.446 - R 0:00.006
22:55:26 hello PASSED C 0:05.628 - R 0:00.007
22:55:26 identity PASSED C 0:05.564 - R 0:00.014
22:55:26 include/stdincludes PASSED C 0:06.048 - R 0:00.006
22:55:26 include/vector-fstream PASSED C 0:05.480 - R 0:00.005
22:55:26 io/eofType PASSED C 0:05.811 - R 0:00.020
22:55:26 concurrency/waituntil/locks PASSED C 0:11.608 - R 0:51.128
22:55:26 io/io PASSED C 0:08.763 - R 0:00.021
22:55:26 limits PASSED C 0:01.223 - R 0:00.022
22:55:26 io/io-acquire-in PASSED C 0:10.326 - R 0:00.011
22:55:26 io/io-acquire PASSED C 0:11.018 - R 0:00.318
22:55:26 io/manipulatorsOutput4 PASSED C 0:07.617 - R 0:00.036
22:55:26 io/io-acquire-out PASSED C 0:10.696 - R 0:00.075
22:55:26 io/away_fair PASSED C 0:13.149 - R 0:00.120
22:55:26 io/manipulatorsInput-uchunk PASSED C 0:08.371 - R 0:00.019
22:55:26 linking/exception-nothreads PASSED C 0:04.125 - R 0:00.025
22:55:26 linking/nostdlib PASSED C 0:01.119 - R 0:00.019
22:55:26 io/comp_basic PASSED C 0:13.682 - R 0:00.321
22:55:26 io/io-acquire-no-io PASSED C 0:10.074 - R 0:02.477
22:55:26 io/comp_fair PASSED C 0:13.873 - R 0:00.322
22:55:26 io/io-acquire2 PASSED C 0:10.870 - R 0:00.072
22:55:26 linkonce PASSED C 0:01.432 - R 0:00.012
22:55:26 maybe PASSED C 0:01.628 - R 0:00.012
22:55:26 linking/exception-withthreads PASSED C 0:06.182 - R 0:00.020
22:55:26 include/includes PASSED C 0:19.251 - R 0:00.005
22:55:26 linking/mangling/anon PASSED C 0:06.539 - R 0:00.023
22:55:26 nested-types-ERR1 PASSED C 0:00.118 - R n/a
22:55:26 nested-types PASSED C 0:01.221 - R 0:00.008
22:55:26 io/many_read PASSED C 0:12.752 - R 0:00.040
22:55:26 nested-types-ERR2 PASSED C 0:00.273 - R n/a
22:55:26 list/dlist-insert-remove PASSED C 0:05.868 - R 0:00.039
22:55:26 linking/io-acquire PASSED C 0:08.447 - R 0:00.007
22:55:26 literals PASSED C 0:05.889 - R 0:00.019
22:55:26 list/dlist2-insert-remove PASSED C 0:06.223 - R 0:00.012
22:55:26 nowarn/exception PASSED C 0:01.238 - R 0:00.024
22:55:26 linking/nothreads PASSED C 0:07.593 - R 0:00.007
22:55:26 opt-params PASSED C 0:00.087 - R n/a
22:55:26 nowarn/array PASSED C 0:01.504 - R 0:00.022
22:55:26 meta/fork+exec PASSED C 0:04.043 - R 0:00.017
22:55:26 nowarn/no-autogen PASSED C 0:01.398 - R 0:00.012
22:55:26 linking/weakso_nothd PASSED C 0:07.963 - R 0:00.012
22:55:26 nowarn/unused PASSED C 0:01.116 - R 0:00.020
22:55:26 nowarn/printf-sizeof PASSED C 0:01.417 - R 0:00.009
22:55:26 nowarn/zero-thunk PASSED C 0:01.169 - R 0:00.006
22:55:26 numericConstants PASSED C 0:01.177 - R 0:00.007
22:55:26 operators PASSED C 0:01.153 - R 0:00.023
22:55:26 polybits PASSED C 0:00.279 - R n/a
22:55:26 poly-bare-assn PASSED C 0:01.125 - R 0:00.005
22:55:26 poly-many-arsz PASSED C 0:01.140 - R 0:00.005
22:55:26 poly-d-cycle PASSED C 0:01.183 - R 0:00.019
22:55:26 poly-member PASSED C 0:01.133 - R 0:00.008
22:55:26 poly-o-cycle PASSED C 0:01.218 - R 0:00.041
22:55:26 poly-selection PASSED C 0:01.295 - R 0:00.019
22:55:26 poly-self-cycle PASSED C 0:01.437 - R 0:00.020
22:55:26 raii/ctor-autogen-ERR1 PASSED C 0:00.779 - R n/a
22:55:26 linking/withthreads PASSED C 0:09.496 - R 0:00.040
22:55:26 quasiKeyword PASSED C 0:01.210 - R 0:00.019
22:55:26 meta/dumpable PASSED C 0:07.942 - R 0:00.007
22:55:26 malloc PASSED C 0:08.619 - R 0:00.007
22:55:26 raii/ctor-autogen PASSED C 0:01.539 - R 0:00.006
22:55:26 raii/partial-ERR1 PASSED C 0:00.602 - R n/a
22:55:26 raii/partial PASSED C 0:01.058 - R 0:00.019
22:55:26 raii/init_once PASSED C 0:01.413 - R 0:00.006
22:55:26 raii/typeof-member PASSED C 0:01.195 - R 0:00.005
22:55:26 heap PASSED C 0:07.685 - R 0:21.593
22:55:26 result PASSED C 0:01.341 - R 0:00.007
22:55:26 minmax PASSED C 0:09.492 - R 0:00.006
22:55:26 raii/dtor-early-exit-ERR2 PASSED C 0:03.888 - R n/a
22:55:26 raii/dtor-early-exit-ERR1 PASSED C 0:04.016 - R n/a
22:55:26 raii/memberCtors-ERR1 PASSED C 0:03.562 - R n/a
22:55:26 simpleGenericTriple PASSED C 0:01.194 - R 0:00.007
22:55:26 quotedKeyword PASSED C 0:05.208 - R 0:00.019
22:55:26 raii/boxed-types PASSED C 0:05.598 - R 0:00.007
22:55:26 smart-pointers PASSED C 0:01.296 - R 0:00.007
22:55:26 polymorphism PASSED C 0:06.153 - R 0:00.006
22:55:26 switch PASSED C 0:01.019 - R 0:00.006
22:55:26 raii/globals PASSED C 0:05.512 - R 0:00.011
22:55:26 raii/memberCtors PASSED C 0:05.567 - R 0:00.024
22:55:26 tuple/tupleCast PASSED C 0:01.024 - R 0:00.006
22:55:26 tuple/tupleFunction PASSED C 0:01.130 - R 0:00.007
22:55:26 tuple/tupleMember PASSED C 0:01.202 - R 0:00.007
22:55:26 raii/dtor-early-exit PASSED C 0:07.403 - R 0:00.009
22:55:26 typedefRedef-ERR1 PASSED C 0:00.131 - R n/a
22:55:26 tuple/tuplePolymorphism PASSED C 0:01.274 - R 0:00.006
22:55:26 references PASSED C 0:05.672 - R 0:00.006
22:55:26 var-assert PASSED C 0:00.134 - R n/a
22:55:26 typedefRedef PASSED C 0:01.029 - R 0:00.006
22:55:26 typeof PASSED C 0:01.014 - R 0:00.007
22:55:26 shortCircuit PASSED C 0:05.292 - R 0:00.007
22:55:26 variableDeclarator PASSED C 0:01.126 - R 0:00.006
22:55:26 sizeof PASSED C 0:05.285 - R 0:00.020
22:55:26 tuple/tupleVariadic PASSED C 0:03.682 - R 0:00.006
22:55:26 strstream PASSED C 0:06.205 - R 0:00.006
22:55:26 searchsort PASSED C 0:07.944 - R 0:00.007
22:55:26 tuple/tupleAssign PASSED C 0:06.348 - R 0:00.007
22:55:26 sum PASSED C 0:07.547 - R 0:00.006
22:55:26 tuplearray PASSED C 0:05.619 - R 0:00.010
22:55:26 time PASSED C 0:07.484 - R 0:00.010
22:55:26 voidPtr PASSED C 0:01.019 - R 0:00.005
22:55:26 swap PASSED C 0:08.503 - R 0:00.006
22:55:26 withconflict PASSED C 0:00.517 - R n/a
22:55:26 userLiterals PASSED C 0:05.887 - R 0:00.021
22:55:26 warnings/self-assignment PASSED C 0:00.941 - R 0:00.001
22:55:26 KRfunctions PASSED C 0:00.897 - R 0:00.001
22:55:26 vector PASSED C 0:06.827 - R 0:00.007
22:55:26 zero_one-ERR1 PASSED C 0:02.887 - R n/a
22:55:26 vector_math/vec2_double PASSED C 0:07.912 - R 0:00.019
22:55:26 arithmeticConversions PASSED C 0:02.324 - R 0:00.019
22:55:26 ...collections/dimexpr-match-c-ERRS PASSED C 0:00.674 - R n/a
22:55:26 vector_math/vec2_uint PASSED C 0:07.875 - R 0:00.009
22:55:26 ...llections/dimexpr-match-cfa-ERRS PASSED C 0:01.306 - R n/a
22:55:26 attributes PASSED C 0:01.179 - R 0:00.001
22:55:26 zero_one PASSED C 0:05.415 - R 0:00.011
22:55:26 vector_math/vec2_int PASSED C 0:10.866 - R 0:00.008
22:55:26 vector_math/vec2_float PASSED C 0:11.337 - R 0:00.007
22:55:26 vector_math/vec3_int PASSED C 0:10.454 - R 0:00.007
22:55:26 declarationSpecifier PASSED C 0:00.925 - R 0:00.001
22:55:26 abs PASSED C 0:07.353 - R 0:00.009
22:55:26 errors/completeType PASSED C 0:00.558 - R n/a
22:55:26 ...collections/array-md-sbscr-cases PASSED C 0:06.633 - R 0:00.010
22:55:26 vector_math/vec4_float PASSED C 0:11.748 - R 0:00.009
22:55:26 vector_math/vec4_int PASSED C 0:10.408 - R 0:00.007
22:55:26 vector_math/vec3_float PASSED C 0:12.211 - R 0:00.010
22:55:26 extension PASSED C 0:00.986 - R 0:00.001
22:55:26 rational PASSED C 0:21.257 - R 0:00.022
22:55:26 gccExtensions PASSED C 0:00.968 - R 0:00.001
22:55:26 functions PASSED C 0:00.980 - R 0:00.001
22:55:26 ato PASSED C 0:07.982 - R 0:00.005
22:55:26 bitmanip1 PASSED C 0:08.885 - R 0:00.022
22:55:26 bitmanip2 PASSED C 0:08.574 - R 0:00.018
22:55:26 meta/arch PASSED C 0:00.534 - R n/a
22:55:26 configs/parsenums PASSED C 0:07.718 - R 0:00.117
22:55:26 bitmanip3 PASSED C 0:10.273 - R 0:00.023
22:55:26 concurrency/pthread/bounded_buffer PASSED C 0:10.414 - R 0:00.168
22:55:26 PRNG PASSED C 0:13.223 - R 0:02.825
22:55:26 exceptions/cardgame PASSED C 0:08.656 - R 0:00.017
22:55:26 io/manipulatorsInput PASSED C 0:06.951 - R 0:00.006
22:55:26 gmp PASSED C 0:07.069 - R 0:00.009
22:55:26 exceptions/hotpotato_checked PASSED C 0:09.114 - R 0:00.010
22:55:26 exceptions/hotpotato PASSED C 0:09.356 - R 0:00.009
22:55:26 io/manipulatorsOutput2 PASSED C 0:08.607 - R 0:00.009
22:55:26 concurrency/unified_locking/locks PASSED C 0:11.834 - R 1:54.723
22:55:26 io/manipulatorsOutput1 PASSED C 0:11.090 - R 0:00.010
22:55:26 io/manipulatorsOutput3 PASSED C 0:11.163 - R 0:00.009
22:55:26 random PASSED C 0:06.786 - R 0:00.005
22:55:26 mathX PASSED C 0:10.563 - R 0:00.019
22:55:26 vector_math/vec2_ldouble PASSED C 0:07.533 - R 0:00.005
22:55:26 math PASSED C 0:10.333 - R 0:00.011
22:55:26 nested_function PASSED C 0:09.775 - R 0:00.020
22:55:26377 passes, 1 failures, 0 timeouts, 0 cancelled, 0 other
22:55:26Tests took 3:19.992
22:55:26make: *** [Makefile:986: all-local] Error 1
22:55:26[Pipeline] }
22:55:26[Pipeline] // dir
22:55:26[Pipeline] }
22:55:26[Pipeline] // stage
22:55:26[Pipeline] echo
22:55:26Archiving core dumps
22:55:26[Pipeline] dir
22:55:26Running in /var/lib/jenkins/workspace/Cforall_master_2@tmp
22:55:26[Pipeline] {
22:55:26[Pipeline] fileExists
22:55:26[Pipeline] sh
22:55:26+ /var/lib/jenkins/workspace/Cforall_master_2/tools/jenkins/archive-gen.sh
22:55:26[Pipeline] archiveArtifacts
22:55:26Archiving artifacts
22:55:26Recording fingerprints
22:55:26[Pipeline] }
22:55:26[Pipeline] // dir
22:55:26[Pipeline] }
22:55:26[Pipeline] // wrap
22:55:26[Pipeline] }
22:55:26[Pipeline] // node
22:55:26[Pipeline] echo
22:55:26hudson.AbortException: script returned exit code 2
22:55:26[Pipeline] node
22:55:26Running on Brokk 5 in /var/lib/jenkins/workspace/Cforall_master_2
22:55:26[Pipeline] {
22:55:26[Pipeline] echo
22:55:26Notifying users of result
22:55:26[Pipeline] echo
22:55:26Reusing previously constructed message
22:55:26[Pipeline] echo
22:55:26Would send email to: cforall@lists.uwaterloo.ca
22:55:26[Pipeline] echo
22:55:26With title: [cforall git][BUILD# 3664 - FAILURE] - branch master
22:55:26[Pipeline] echo
22:55:26Content:
22:55:26<p>This is an automated email from the Jenkins build machine. It was
22:55:26generated because of a git hooks/post-receive script following
22:55:26a ref change which was pushed to the C∀ repository.</p>
22:55:2622:55:26<p>- Status --------------------------------------------------------------</p>
22:55:2622:55:26<p>BUILD# 3664 - FAILURE</p>
22:55:26<p>Check console output at https://cforall.uwaterloo.ca/jenkins/job/Cforall/job/master/3664/ to view the results.</p>
22:55:2622:55:26<p>- Changes -------------------------------------------------------------</p>
22:55:2622:55:26<pre>
22:55:26The branch master has been updated.
22:55:26 from 4ff8cb209307cd30c3626d4fbe3cc2d2ce4219ea (commit)
22:55:26</pre>
22:55:2622:55:26<p>- Log -----------------------------------------------------------------</p>
22:55:2622:55:26<pre>
22:55:2622:55:26</pre>
22:55:2622:55:26<p>-----------------------------------------------------------------------</p>
22:55:26<pre>
22:55:26Summary of changes:
22:55:2622:55:26</pre>
22:55:2622:55:26[Pipeline] }
22:55:26[Pipeline] // node
22:55:26[Pipeline] echo
22:55:26Build Completed
22:55:26[Pipeline] End of Pipeline
22:55:26ERROR: script returned exit code 2
22:55:26Finished: FAILURE
[Pipeline] error
[Pipeline] }
22:55:26Failed in branch clang_x64_new
22:56:53Build Cforall » master #3663 completed: SUCCESS
[Pipeline] echo
22:56:53SUCCESS
[Pipeline] }
23:00:35Build Cforall » master #3661 completed: SUCCESS
[Pipeline] echo
23:00:35SUCCESS
[Pipeline] }
23:02:53Build Cforall » master #3662 completed: SUCCESS
[Pipeline] echo
23:02:53SUCCESS
[Pipeline] }
23:03:30Build Cforall » master #3666 completed: SUCCESS
[Pipeline] echo
23:03:30SUCCESS
[Pipeline] }
23:03:40Build Cforall » master #3667 completed: SUCCESS
[Pipeline] echo
23:03:40SUCCESS
[Pipeline] }
23:04:54Build Cforall » master #3668 completed: SUCCESS
[Pipeline] echo
23:04:54SUCCESS
[Pipeline] }
23:16:24Build Cforall » master #3665 completed: SUCCESS
[Pipeline] echo
23:16:24SUCCESS
[Pipeline] }
23:30:11Build Cforall » master #3669 completed: SUCCESS
[Pipeline] echo
23:30:11SUCCESS
[Pipeline] }
[Pipeline] // parallel
[Pipeline] }
[Pipeline] // stage
[Pipeline] }
[Pipeline] // wrap
[Pipeline] echo
error caught
[Pipeline] node
Running on Brokk 4 in /var/lib/jenkins/workspace/Cforall_Full_Build
[Pipeline] {
[Pipeline] echo
notifying users
[Pipeline] emailext
Sending email to: cforall@lists.uwaterloo.ca
[Pipeline] }
[Pipeline] // node
[Pipeline] }
[Pipeline] // node
[Pipeline] End of Pipeline
ERROR: FAILURE
Finished: FAILURE