Skip to content

Console Output

Skipping 715 KB.. Full Log
cfa/src/interpose.cfa:286
23:04:17 #13 0x0000fffff7ed3b60 in _X5abortFv_bPKc__1 (_X11signalAbortb_1=_X11signalAbortb_1@entry=false, _X3fmtPKc_1=_X3fmtPKc_1@entry=0xfffff7ee4aa0 "%s") at /var/lib/jenkins/workspace/Cforall_master/libcfa/src/interpose.cfa:301
23:04:17 #14 0x0000fffff7e8b56c in abort () at /var/lib/jenkins/workspace/Cforall_master/libcfa/src/interpose.cfa:176
23:04:17 #15 0x0000fffff7e8cf24 in _X4endsFv_S8ofstream__1 (_X2osS8ofstream_1=0xfffff7f211c8 <_X9abortFileS8ofstream_1>) at /var/lib/jenkins/workspace/Cforall_master/libcfa/src/fstream.cfa:106
23:04:17 #16 0x0000aaaaaaaa3f5c in _X5logicFv_XS8global_t__1 (_X1aXS8global_t_1=_X1aXS8global_t_1@entry=0xaaaaaaac02b0 <_X7globalsS13__anonymous66_1>) at concurrency/signal/disjoint.cfa:115
23:04:17 #17 0x0000aaaaaaaa3fc0 in _X4mainFv_S9Signaller__1 (__anonymous_object2552=__anonymous_object2552@entry=0xffffffffd070) at concurrency/signal/disjoint.cfa:126
23:04:17 #18 0x0000fffff7f6ad34 in __cfactx_invoke_thread (main=0xaaaaaaaa3f90 <_X4mainFv_S9Signaller__1>, this=0xffffffffd070) at /var/lib/jenkins/workspace/Cforall_master/libcfa/src/concurrency/invoke.c:87
23:04:17 #19 0x0000fffff7f6ad10 in __cfactx_coroutine_unwind (storage=<optimized out>, cor=<optimized out>) at /var/lib/jenkins/workspace/Cforall_master/libcfa/src/concurrency/invoke.c:76
23:04:17 #20 0x0000aaaaaabffff0 in ?? ()
23:04:17 Backtrace stopped: previous frame inner to this frame (corrupt stack?)
23:04:17 -----
23:04:17   Id   Target Id                          Frame 
23:04:17 * 1    Thread 0xfffff7fe9dc0 (LWP 243511) __pthread_kill_implementation (threadid=281474842402240, signo=signo@entry=6, no_tid=no_tid@entry=0) at ./nptl/pthread_kill.c:44
23:04:17   2    Thread 0xaaaaaab92dc0 (LWP 243518) _X7try_popFPS7thread$_PS7clusterjS20__stats_readyQ_pop_t__1 (_X5statsS20__stats_readyQ_pop_t_1=0xaaaaaab922b0, _X1wj_1=3, _X4cltrPS7cluster_1=0xfffff7fb0980 <_X19storage_mainClusterA0c_1>) at /var/lib/jenkins/workspace/Cforall_master/libcfa/src/concurrency/ready_queue.cfa:213
23:04:17   3    Thread 0xaaaaaab12c00 (LWP 243517) 0x0000fffff7bdda18 in __GI___sigtimedwait (set=set@entry=0xaaaaaab121e8, info=info@entry=0xaaaaaab12268, timeout=timeout@entry=0x0) at ../sysdeps/unix/sysv/linux/sigtimedwait.c:31
23:04:17 
23:04:17 Archiving concurrency/signal/disjoint (executable and core) to crashes/full-nodebug/concurrency/signal/disjoint
23:04:17        	concurrency/signal/wait              PASSED     C 0:13.444 - R 0:00.071
23:04:17        	concurrency/suspend_then             PASSED     C 0:13.219 - R 0:00.027
23:04:17        	errors/declaration                   PASSED     C 0:00.140 - R n/a
23:04:17        	enum                                 PASSED     C 0:01.522 - R 0:00.021
23:04:17        	enum_tests/lvalue                    PASSED     C 0:00.885 - R n/a
23:04:17        	errors/signature                     PASSED     C 0:00.173 - R n/a
23:04:17        	errors/scope-type                    PASSED     C 0:00.238 - R n/a
23:04:17        	concurrency/readyQ/barrier_sleeper   PASSED     C 0:14.577 - R 0:00.323
23:04:17        	...cy/unified_locking/pthread_locks  PASSED     C 0:11.544 - R 0:00.037
23:04:17        	concurrency/sleep                    PASSED     C 0:12.999 - R 0:01.175
23:04:17        	collections/string-api-coverage      PASSED     C 0:17.393 - R 0:00.080
23:04:17        	enum_tests/inc-dec                   PASSED     C 0:01.713 - R 0:00.025
23:04:17        	alloc                                PASSED     C 0:17.590 - R 0:00.019
23:04:17        	errors/scope                         PASSED     C 0:00.839 - R n/a
23:04:17        	concurrency/waitfor/else             PASSED     C 0:10.379 - R 0:00.040
23:04:17        	...ions/string-api-coverage-noshare  PASSED     C 0:17.923 - R 0:00.025
23:04:17        	designations                         PASSED     C 0:03.221 - R 0:00.022
23:04:17        	.../unified_locking/block_spin_lock  PASSED     C 0:14.569 - R 0:00.072
23:04:17        	...ency/unified_locking/exp_backoff  PASSED     C 0:14.705 - R 0:00.040
23:04:17        	eval                                 PASSED     C 0:01.511 - R 0:00.039
23:04:17        	enum_tests/funcEnum                  PASSED     C 0:02.865 - R 0:00.024
23:04:17        	concurrency/actors/executor          PASSED     C 0:18.851 - R 0:00.042
23:04:17        	concurrency/thread                   PASSED     C 0:15.241 - R 0:00.041
23:04:17        	concurrency/actors/inline            PASSED     C 0:18.994 - R 0:00.071
23:04:17        	concurrency/actors/matrixMultiply    PASSED     C 0:18.821 - R 0:00.272
23:04:17        	concurrency/actors/dynamic           PASSED     C 0:18.855 - R 0:00.323
23:04:17        	enum_tests/structEnum                PASSED     C 0:02.862 - R 0:00.023
23:04:17        	concurrency/actors/pingpong          PASSED     C 0:19.191 - R 0:00.072
23:04:17        	concurrency/waitfor/dtor             PASSED     C 0:12.084 - R 0:00.169
23:04:17        	concurrency/waitfor/barge            PASSED     C 0:12.702 - R 0:00.067
23:04:17        	...ncy/unified_locking/timeout_lock  PASSED     C 0:11.954 - R 0:01.132
23:04:17        	concurrency/actors/poison            PASSED     C 0:19.247 - R 0:00.377
23:04:17        	concurrency/futures/typed            PASSED     C 0:19.515 - R 0:00.119
23:04:17        	exceptions/try-ctrl-flow             PASSED     C 0:00.534 - R n/a
23:04:17        	copyfile                             PASSED     C 0:07.204 - R 0:00.022
23:04:17        	...urrency/waitfor/lexical_priority  PASSED     C 0:12.313 - R 0:00.021
23:04:17        	exceptions/type-check                PASSED     C 0:00.703 - R n/a
23:04:17        	concurrency/actors/static            PASSED     C 0:19.717 - R 0:00.426
23:04:17        	concurrency/actors/inherit           PASSED     C 0:20.000 - R 0:00.318
23:04:17        	concurrency/mutexstmt/locks          PASSED     C 0:13.381 - R 0:06.918
23:04:17        	...fied_locking/mcs_block_spin_lock  PASSED     C 0:14.826 - R 0:00.040
23:04:17        	ctrl-flow/break-misc                 PASSED     C 0:06.826 - R 0:00.025
23:04:17        	concurrency/actors/types             PASSED     C 0:20.326 - R 0:00.225
23:04:17        	...nified_locking/simple_owner_lock  PASSED     C 0:14.678 - R 0:00.039
23:04:17        	counter                              PASSED     C 0:07.197 - R 0:00.038
23:04:17        	ctrl-flow/ifwhileCtl                 PASSED     C 0:06.856 - R 0:00.044
23:04:17        	...rrency/pthread/pthread_demo_lock  PASSED     C 0:12.360 - R 0:06.701
23:04:17        	exceptions/try-leave-catch           PASSED     C 0:01.706 - R 0:00.036
23:04:17        	concurrency/waitfor/recurse          PASSED     C 0:12.647 - R 0:00.171
23:04:17        	expression                           PASSED     C 0:01.541 - R 0:00.020
23:04:17        	concurrency/unified_locking/mcs      PASSED     C 0:14.483 - R 0:01.225
23:04:17        	coroutine/devicedriver               PASSED     C 0:08.523 - R 0:00.075
23:04:17        	ctrl-flow/loop_else                  PASSED     C 0:06.981 - R 0:00.044
23:04:17        	coroutine/fibonacci                  PASSED     C 0:08.400 - R 0:00.024
23:04:17        	concurrency/waitfor/statment         PASSED     C 0:12.889 - R 0:00.036
23:04:17        	coroutine/pingpong                   PASSED     C 0:08.473 - R 0:00.021
23:04:17        	coroutine/fmtLines                   PASSED     C 0:08.630 - R 0:00.036
23:04:17        	concurrency/waitfor/when             PASSED     C 0:12.716 - R 0:00.171
23:04:17        	coroutine/raii                       PASSED     C 0:08.381 - R 0:00.119
23:04:17        	coroutine/runningTotal               PASSED     C 0:08.505 - R 0:00.019
23:04:17        	.../unified_locking/fast_block_lock  PASSED     C 0:18.184 - R 0:00.121
23:04:17        	ctrl-flow/fallthrough                PASSED     C 0:08.296 - R 0:00.038
23:04:17        	identParamDeclarator                 PASSED     C 0:01.465 - R 0:00.037
23:04:17        	identFuncDeclarator                  PASSED     C 0:01.482 - R 0:00.075
23:04:17        	init1-ERROR                          PASSED     C 0:00.870 - R n/a
23:04:17        	global-monomorph                     PASSED     C 0:01.666 - R 0:00.119
23:04:17        	ctrl-flow/goto                       PASSED     C 0:08.359 - R 0:00.038
23:04:17        	configs/parsebools                   PASSED     C 0:10.510 - R 0:00.170
23:04:17        	exceptions/message                   PASSED     C 0:03.871 - R 0:00.037
23:04:17        	configs/parseconfig                  PASSED     C 0:10.402 - R 0:00.022
23:04:17        	concurrency/waituntil/timeout        PASSED     C 0:08.017 - R 0:03.086
23:04:17        	enum_tests/anonymous                 PASSED     C 0:07.013 - R 0:00.022
23:04:17        	init1                                PASSED     C 0:01.502 - R 0:00.019
23:04:17        	configs/usage                        PASSED     C 0:10.842 - R 0:00.041
23:04:17        	enum_tests/stringEnum                PASSED     C 0:06.832 - R 0:00.021
23:04:17        	include/vector-sequence              PASSED     C 0:02.216 - R 0:00.021
23:04:17        	enum_tests/typedIntEnum              PASSED     C 0:07.118 - R 0:00.041
23:04:17        	ctrl-flow/loop_else-WRN1             PASSED     C 0:08.819 - R 0:00.003
23:04:17        	enum_tests/voidEnum                  PASSED     C 0:06.893 - R 0:00.040
23:04:17        	enum_tests/input                     PASSED     C 0:07.659 - R 0:00.037
23:04:17        	linking/nostdlib                     PASSED     C 0:01.421 - R 0:00.022
23:04:17        	limits                               PASSED     C 0:01.683 - R 0:00.022
23:04:17        	enum_tests/enumInlineValue           PASSED     C 0:08.569 - R 0:00.021
23:04:17        	include/vector-collections           PASSED     C 0:03.495 - R 0:00.037
23:04:17        	linkonce                             PASSED     C 0:01.664 - R 0:00.070
23:04:17        	exceptions/data-except               PASSED     C 0:07.041 - R 0:00.039
23:04:17        	coroutine/prodcons                   PASSED     C 0:11.314 - R 0:00.025
23:04:17        	nested-types-ERR1                    PASSED     C 0:00.173 - R n/a
23:04:17        	nested-types-ERR2                    PASSED     C 0:00.319 - R n/a
23:04:17        	ctrl-flow/loopctrl                   PASSED     C 0:10.061 - R 0:00.074
23:04:17        	exceptions/conditional               PASSED     C 0:07.748 - R 0:00.036
23:04:17        	exceptions/defaults                  PASSED     C 0:07.519 - R 0:00.037
23:04:17        	exceptions/cancel/coroutine          PASSED     C 0:08.282 - R 0:00.022
23:04:17        	enum_tests/position                  PASSED     C 0:09.289 - R 0:00.074
23:04:17        	div                                  PASSED     C 0:10.314 - R 0:00.070
23:04:17        	opt-params                           PASSED     C 0:00.153 - R n/a
23:04:17        	exceptions/finally                   PASSED     C 0:07.840 - R 0:00.073
23:04:17        	exceptions/conditional-threads       PASSED     C 0:08.314 - R 0:00.020
23:04:17        	maybe                                PASSED     C 0:02.107 - R 0:00.021
23:04:17        	nested-types                         PASSED     C 0:01.568 - R 0:00.021
23:04:17        	exceptions/interact                  PASSED     C 0:07.491 - R 0:00.071
23:04:17        	exceptions/resume                    PASSED     C 0:07.225 - R 0:00.023
23:04:17        	concurrency/preempt                  PASSED     C 0:14.476 - R 0:10.429
23:04:17        	enum_tests/planet                    PASSED     C 0:09.917 - R 0:00.025
23:04:17        	exceptions/polymorphic               PASSED     C 0:07.523 - R 0:00.022
23:04:17        	concurrency/waituntil/channels       PASSED     C 0:15.051 - R 0:01.333
23:04:17        	exceptions/trash                     PASSED     C 0:07.169 - R 0:00.042
23:04:17        	polybits                             PASSED     C 0:00.468 - R n/a
23:04:17        	nowarn/exception                     PASSED     C 0:01.757 - R 0:00.022
23:04:17        	nowarn/no-autogen                    PASSED     C 0:01.632 - R 0:00.074
23:04:17        	exceptions/finally-threads           PASSED     C 0:08.450 - R 0:00.025
23:04:17        	exceptions/virtual-poly              PASSED     C 0:06.914 - R 0:00.039
23:04:17        	device/cpu                           PASSED     C 0:11.381 - R 0:00.119
23:04:17        	exceptions/terminate                 PASSED     C 0:07.636 - R 0:00.072
23:04:17        	nowarn/zero-thunk                    PASSED     C 0:01.611 - R 0:00.023
23:04:17        	generator/fibonacci                  PASSED     C 0:06.846 - R 0:00.038
23:04:17        	numericConstants                     PASSED     C 0:01.513 - R 0:00.040
23:04:17        	nowarn/array                         PASSED     C 0:02.116 - R 0:00.037
23:04:17        	generator/fmtLines                   PASSED     C 0:06.696 - R 0:00.045
23:04:17        	concurrency/channels/contend         PASSED     C 0:16.741 - R 0:10.067
23:04:17        	generator/suspend_then               PASSED     C 0:06.912 - R 0:00.022
23:04:17        	operators                            PASSED     C 0:01.636 - R 0:00.021
23:04:17        	poly-bare-assn                       PASSED     C 0:01.578 - R 0:00.021
23:04:17        	nowarn/printf-sizeof                 PASSED     C 0:02.185 - R 0:00.070
23:04:17        	concurrency/channels/daisy_chain     PASSED     C 0:17.134 - R 0:10.065
23:04:17        	poly-d-cycle                         PASSED     C 0:01.556 - R 0:00.038
23:04:17        	concurrency/channels/churn           PASSED     C 0:17.201 - R 0:10.083
23:04:17        	nowarn/unused                        PASSED     C 0:02.309 - R 0:00.019
23:04:17        	hello                                PASSED     C 0:06.710 - R 0:00.075
23:04:17        	raii/ctor-autogen-ERR1               PASSED     C 0:00.915 - R n/a
23:04:17        	concurrency/channels/hot_potato      PASSED     C 0:17.262 - R 0:10.078
23:04:17        	poly-member                          PASSED     C 0:01.578 - R 0:00.022
23:04:17        	poly-many-arsz                       PASSED     C 0:01.614 - R 0:00.024
23:04:17        	poly-selection                       PASSED     C 0:01.573 - R 0:00.021
23:04:17        	poly-o-cycle                         PASSED     C 0:01.628 - R 0:00.037
23:04:17        	...ency/waituntil/channel_zero_size  PASSED     C 0:16.937 - R 0:00.723
23:04:17        	fstream_test                         PASSED     C 0:07.775 - R 0:00.022
23:04:17        	poly-self-cycle                      PASSED     C 0:01.694 - R 0:00.019
23:04:17        	concurrency/channels/big_elems       PASSED     C 0:17.032 - R 0:10.564
23:04:17        	linking/exception-nothreads          PASSED     C 0:05.495 - R 0:00.022
23:04:17        	raii/partial-ERR1                    PASSED     C 0:00.914 - R n/a
23:04:17        	concurrency/channels/ping_pong       PASSED     C 0:17.650 - R 0:10.020
23:04:17        	quasiKeyword                         PASSED     C 0:01.647 - R 0:00.021
23:04:17        	exceptions/defaults-threads          PASSED     C 0:10.045 - R 0:00.071
23:04:17        	exceptions/resume-threads            PASSED     C 0:08.738 - R 0:00.129
23:04:17        	identity                             PASSED     C 0:06.950 - R 0:00.126
23:04:17        	var-assert                           PASSED     C 0:00.206 - R n/a
23:04:17        	typedefRedef-ERR1                    PASSED     C 0:00.240 - R n/a
23:04:17        	genericUnion                         PASSED     C 0:07.893 - R 0:00.042
23:04:17        	include/vector-fstream               PASSED     C 0:07.050 - R 0:00.075
23:04:17        	exceptions/terminate-threads         PASSED     C 0:09.233 - R 0:00.023
23:04:17        	concurrency/waituntil/one_chan       PASSED     C 0:17.070 - R 0:00.319
23:04:17        	raii/typeof-member                   PASSED     C 0:01.624 - R 0:00.026
23:04:17        	raii/init_once                       PASSED     C 0:01.864 - R 0:00.038
23:04:17        	exceptions/fibonacci_nonlocal        PASSED     C 0:10.805 - R 0:00.040
23:04:17        	raii/partial                         PASSED     C 0:01.691 - R 0:00.124
23:04:17        	io/eofType                           PASSED     C 0:07.076 - R 0:00.022
23:04:17        	raii/ctor-autogen                    PASSED     C 0:02.388 - R 0:00.021
23:04:17        	exceptions/virtual-cast              PASSED     C 0:09.375 - R 0:00.019
23:04:17        	typedefRedef                         PASSED     C 0:01.470 - R 0:00.037
23:04:17        	include/stdincludes                  PASSED     C 0:08.266 - R 0:00.040
23:04:17        	tuple/tupleCast                      PASSED     C 0:01.692 - R 0:00.039
23:04:17        	switch                               PASSED     C 0:01.776 - R 0:00.021
23:04:17        	tuple/tupleMember                    PASSED     C 0:01.639 - R 0:00.071
23:04:17        	tuple/tupleFunction                  PASSED     C 0:01.715 - R 0:00.039
23:04:17        	linking/mangling/anon                PASSED     C 0:06.975 - R 0:00.042
23:04:17        	meta/fork+exec                       PASSED     C 0:05.388 - R 0:00.120
23:04:17        	concurrency/channels/pub_sub         PASSED     C 0:19.306 - R 0:10.073
23:04:17        	variableDeclarator                   PASSED     C 0:01.636 - R 0:00.023
23:04:17        	result                               PASSED     C 0:02.405 - R 0:00.039
23:04:17        	typeof                               PASSED     C 0:01.663 - R 0:00.072
23:04:17        	withconflict                         PASSED     C 0:00.854 - R n/a
23:04:17        	simpleGenericTriple                  PASSED     C 0:02.231 - R 0:00.040
23:04:17        	linking/exception-withthreads        PASSED     C 0:07.143 - R 0:00.128
23:04:17        	tuple/tuplePolymorphism              PASSED     C 0:01.982 - R 0:00.022
23:04:17        	exceptions/cor_resumer               PASSED     C 0:12.136 - R 0:00.045
23:04:17        	concurrency/futures/future_except    PASSED     C 0:29.651 - R 0:00.043
23:04:17        	forall                               PASSED     C 0:10.278 - R 0:00.070
23:04:17        	warnings/self-assignment             PASSED     C 0:01.492 - R 0:00.005
23:04:17        	smart-pointers                       PASSED     C 0:02.757 - R 0:00.073
23:04:17        	voidPtr                              PASSED     C 0:01.567 - R 0:00.070
23:04:17        	KRfunctions                          PASSED     C 0:01.349 - R 0:00.002
23:04:17        	errors/completeType                  PASSED     C 0:00.843 - R n/a
23:04:17        	...collections/dimexpr-match-c-ERRS  PASSED     C 0:01.163 - R n/a
23:04:17        	list/dlist-insert-remove             PASSED     C 0:07.235 - R 0:00.022
23:04:17        	function-operator                    PASSED     C 0:10.629 - R 0:00.040
23:04:17        	concurrency/channels/zero_size       PASSED     C 0:20.497 - R 0:10.118
23:04:17        	literals                             PASSED     C 0:07.008 - R 0:00.073
23:04:17        	...llections/dimexpr-match-cfa-ERRS  PASSED     C 0:01.657 - R n/a
23:04:17        	declarationSpecifier                 PASSED     C 0:01.498 - R 0:00.002
23:04:17        	attributes                           PASSED     C 0:01.613 - R 0:00.004
23:04:17        	list/dlist2-insert-remove            PASSED     C 0:07.567 - R 0:00.021
23:04:17        	raii/memberCtors-ERR1                PASSED     C 0:04.354 - R n/a
23:04:17        	exceptions/pingpong_nonlocal         PASSED     C 0:12.557 - R 0:00.070
23:04:17        	extension                            PASSED     C 0:01.458 - R 0:00.004
23:04:17        	concurrency/waituntil/locks          PASSED     C 0:16.118 - R 0:04.394
23:04:17        	functions                            PASSED     C 0:01.504 - R 0:00.002
23:04:17        	linking/weakso_nothd                 PASSED     C 0:08.915 - R 0:00.021
23:04:17        	meta/arch                            PASSED     C 0:00.912 - R n/a
23:04:17        	alloc2                               PASSED     C 0:31.580 - R 0:00.027
23:04:17        	gccExtensions                        PASSED     C 0:01.568 - R 0:00.003
23:04:17        	raii/dtor-early-exit-ERR2            PASSED     C 0:05.129 - R n/a
23:04:17        	linking/nothreads                    PASSED     C 0:09.291 - R 0:00.037
23:04:17        	exceptions/cancel/thread             PASSED     C 0:14.688 - R 0:00.036
23:04:17        	raii/dtor-early-exit-ERR1            PASSED     C 0:05.719 - R n/a
23:04:17        	linking/io-acquire                   PASSED     C 0:10.058 - R 0:00.021
23:04:17        	arithmeticConversions                PASSED     C 0:03.257 - R 0:00.019
23:04:17        	concurrency/waituntil/basic_else     PASSED     C 0:22.976 - R 0:00.036
23:04:17        	zero_one-ERR1                        PASSED     C 0:03.770 - R n/a
23:04:17        	io/manipulatorsInput-uchunk          PASSED     C 0:10.608 - R 0:00.070
23:04:17        	quotedKeyword                        PASSED     C 0:06.842 - R 0:00.020
23:04:17        	polymorphism                         PASSED     C 0:07.223 - R 0:00.022
23:04:17        	io/io                                PASSED     C 0:11.595 - R 0:00.019
23:04:17        	tuple/tupleVariadic                  PASSED     C 0:05.939 - R 0:00.019
23:04:17        	raii/boxed-types                     PASSED     C 0:07.431 - R 0:00.020
23:04:17        	raii/memberCtors                     PASSED     C 0:07.144 - R 0:00.037
23:04:17        	raii/globals                         PASSED     C 0:07.435 - R 0:00.019
23:04:17        	sizeof                               PASSED     C 0:06.901 - R 0:00.019
23:04:17        	shortCircuit                         PASSED     C 0:07.050 - R 0:00.019
23:04:17        	references                           PASSED     C 0:07.564 - R 0:00.019
23:04:17        	tuplearray                           PASSED     C 0:06.888 - R 0:00.018
23:04:17        	malloc                               PASSED     C 0:10.898 - R 0:00.020
23:04:17        	linking/withthreads                  PASSED     C 0:11.803 - R 0:00.020
23:04:17        	concurrency/preempt2                 PASSED     C 0:13.005 - R 0:20.301
23:04:17        	io/io-acquire-in                     PASSED     C 0:12.889 - R 0:00.034
23:04:17        	io/io-acquire-out                    PASSED     C 0:12.679 - R 0:00.037
23:04:17        	concurrency/unified_locking/locks    PASSED     C 0:16.026 - R 0:13.224
23:04:17        	io/io-acquire                        PASSED     C 0:13.416 - R 0:00.035
23:04:17        	tuple/tupleAssign                    PASSED     C 0:07.760 - R 0:00.019
23:04:17        	io/io-acquire2                       PASSED     C 0:13.154 - R 0:00.034
23:04:17        	heap                                 PASSED     C 0:10.259 - R 0:04.690
23:04:17        	meta/dumpable                        PASSED     C 0:11.670 - R 0:00.018
23:04:17        	strstream                            PASSED     C 0:08.092 - R 0:00.021
23:04:17        	userLiterals                         PASSED     C 0:07.814 - R 0:00.018
23:04:17        	zero_one                             PASSED     C 0:06.892 - R 0:00.020
23:04:17        	io/manipulatorsOutput4               PASSED     C 0:13.459 - R 0:00.035
23:04:17        	raii/dtor-early-exit                 PASSED     C 0:09.207 - R 0:00.019
23:04:17        	time                                 PASSED     C 0:08.996 - R 0:00.020
23:04:17        	vector                               PASSED     C 0:08.563 - R 0:00.036
23:04:17        	io/away_fair                         PASSED     C 0:15.164 - R 0:00.035
23:04:17        	sum                                  PASSED     C 0:09.458 - R 0:00.019
23:04:17        	searchsort                           PASSED     C 0:10.013 - R 0:00.019
23:04:17        	vector_math/vec2_double              PASSED     C 0:09.846 - R 0:00.019
23:04:17        	swap                                 PASSED     C 0:10.370 - R 0:00.019
23:04:17        	io/many_read                         PASSED     C 0:15.952 - R 0:00.037
23:04:17        	abs                                  PASSED     C 0:09.021 - R 0:00.037
23:04:17        	io/comp_fair                         PASSED     C 0:16.789 - R 0:00.067
23:04:17        	concurrency/waituntil/channel_close  PASSED     C 0:18.915 - R 0:10.049
23:04:17        	vector_math/vec2_uint                PASSED     C 0:10.644 - R 0:00.018
23:04:17        	minmax                               PASSED     C 0:14.986 - R 0:00.018
23:04:17        	random                               PASSED     C 0:08.989 - R 0:00.019
23:04:17        	concurrency/waituntil/futures        PASSED     C 0:29.701 - R 0:00.019
23:04:17        	io/manipulatorsInput                 PASSED     C 0:09.818 - R 0:00.019
23:04:17        	ato                                  PASSED     C 0:10.756 - R 0:00.019
23:04:17        	exceptions/hotpotato                 PASSED     C 0:10.901 - R 0:00.019
23:04:17        	...collections/array-md-sbscr-cases  PASSED     C 0:11.307 - R 0:00.019
23:04:17        	vector_math/vec2_ldouble             PASSED     C 0:10.010 - R 0:00.018
23:04:17        	exceptions/cardgame                  PASSED     C 0:11.455 - R 0:00.020
23:04:17        	gmp                                  PASSED     C 0:11.010 - R 0:00.019
23:04:17        	io/comp_basic                        PASSED     C 0:19.974 - R 0:00.035
23:04:17        	exceptions/hotpotato_checked         PASSED     C 0:11.925 - R 0:00.020
23:04:17        	bitmanip3                            PASSED     C 0:13.062 - R 0:00.036
23:04:17        	bitmanip2                            PASSED     C 0:13.550 - R 0:00.036
23:04:17        	bitmanip1                            PASSED     C 0:13.862 - R 0:00.036
23:04:17        	mathX                                PASSED     C 0:13.018 - R 0:00.034
23:04:17        	include/includes                     PASSED     C 0:23.064 - R 0:00.019
23:04:17        	math                                 PASSED     C 0:13.831 - R 0:00.018
23:04:17        	io/manipulatorsOutput2               PASSED     C 0:14.674 - R 0:00.018
23:04:17        	concurrency/waituntil/all_types      PASSED     C 0:35.885 - R 0:00.121
23:04:17        	vector_math/vec3_int                 PASSED     C 0:17.057 - R 0:00.019
23:04:17        	PRNG                                 PASSED     C 0:16.466 - R 0:00.420
23:04:17        	vector_math/vec2_float               PASSED     C 0:18.903 - R 0:00.018
23:04:17        	vector_math/vec4_int                 PASSED     C 0:18.501 - R 0:00.018
23:04:17        	vector_math/vec4_float               PASSED     C 0:18.968 - R 0:00.038
23:04:17        	io/io-acquire-no-io                  PASSED     C 0:12.426 - R 0:13.644
23:04:17        	vector_math/vec2_int                 PASSED     C 0:20.319 - R 0:00.023
23:04:17        	vector_math/vec3_float               PASSED     C 0:20.783 - R 0:00.039
23:04:17        	...ency/unified_locking/futex_mutex  PASSED     C 0:14.542 - R 0:32.834
23:04:17        	io/manipulatorsOutput1               PASSED     C 0:22.410 - R 0:00.024
23:04:17        	rational                             PASSED     C 0:29.152 - R 0:00.020
23:04:17        	concurrency/waituntil/repeat_close   PASSED     C 0:17.906 - R 0:30.078
23:04:17        	io/manipulatorsOutput3               PASSED     C 0:31.847 - R 0:00.024
23:04:17        	.../unified_locking/spin_queue_lock  PASSED     C 0:14.471 - R 0:50.409
23:04:17        	...urrency/unified_locking/mcs_spin  PASSED     C 0:14.734 - R 0:51.351
23:04:17 374 passes, 1 failures, 0 timeouts, 0 cancelled, 0 other
23:04:17 Tests took  1:12.755
23:04:17 make: *** [Makefile:986: all-local] Error 1
23:04:17 [Pipeline] }
23:04:17 [Pipeline] // dir
23:04:17 [Pipeline] }
23:04:17 [Pipeline] // stage
23:04:17 [Pipeline] echo
23:04:17 Archiving core dumps
23:04:17 [Pipeline] dir
23:04:17 Running in /var/lib/jenkins/workspace/Cforall_master@tmp
23:04:17 [Pipeline] {
23:04:17 [Pipeline] fileExists
23:04:17 [Pipeline] sh
23:04:17 + /var/lib/jenkins/workspace/Cforall_master/tools/jenkins/archive-gen.sh
23:04:17 [Pipeline] archiveArtifacts
23:04:17 Archiving artifacts
23:04:17 Recording fingerprints
23:04:17 [Pipeline] }
23:04:17 [Pipeline] // dir
23:04:17 [Pipeline] }
23:04:17 [Pipeline] // wrap
23:04:17 [Pipeline] }
23:04:17 [Pipeline] // node
23:04:17 [Pipeline] echo
23:04:17 hudson.AbortException: script returned exit code 2
23:04:17 [Pipeline] node
23:04:17 Running on Brokk 5 in /var/lib/jenkins/workspace/Cforall_master_2
23:04:17 [Pipeline] {
23:04:17 [Pipeline] echo
23:04:17 Notifying users of result
23:04:17 [Pipeline] echo
23:04:17 Reusing previously constructed message
23:04:17 [Pipeline] echo
23:04:17 Would send email to: cforall@lists.uwaterloo.ca
23:04:17 [Pipeline] echo
23:04:17 With title: [cforall git][BUILD# 3856 - FAILURE] - branch master
23:04:17 [Pipeline] echo
23:04:17 Content: 
23:04:17 <p>This is an automated email from the Jenkins build machine. It was
23:04:17 generated because of a git hooks/post-receive script following
23:04:17 a ref change which was pushed to the Cāˆ€ repository.</p>
23:04:17 
23:04:17 <p>- Status --------------------------------------------------------------</p>
23:04:17 
23:04:17 <p>BUILD# 3856 - FAILURE</p>
23:04:17 <p>Check console output at https://cforall.uwaterloo.ca/jenkins/job/Cforall/job/master/3856/ to view the results.</p>
23:04:17 
23:04:17 <p>- Changes -------------------------------------------------------------</p>
23:04:17 
23:04:17 <pre>
23:04:17 The branch master has been updated.
23:04:17       from  262e12b24a19d992dad599c1cc6143374ac571f4 (commit)
23:04:17 </pre>
23:04:17 
23:04:17 <p>- Log -----------------------------------------------------------------</p>
23:04:17 
23:04:17 <pre>
23:04:17 
23:04:17 </pre>
23:04:17 
23:04:17 <p>-----------------------------------------------------------------------</p>
23:04:17 <pre>
23:04:17 Summary of changes:
23:04:17 
23:04:17 </pre>
23:04:17 
23:04:17 [Pipeline] }
23:04:17 [Pipeline] // node
23:04:17 [Pipeline] echo
23:04:17 Build Completed
23:04:17 [Pipeline] End of Pipeline
23:04:17 ERROR: script returned exit code 2
23:04:17 Finished: FAILURE