0+vIKc0PTOvWK8kMze1uCQxtyC1SC8ExvbLL0llgABGJgYmLwaB3MycnMzi4My85FTXgvzkDB8G3tScxILi1BRfsEwJg4BPVmJZon5OYl66vk9+Xrp1RRGDFNSy5Py84vycVD1nCI1qPENFAZBeqPG0byvQfXwgU/RApuiBTel+MuFMv/J9JgZGLwbWssSc0lSguQIIRX6luUmpRW1rpspyT3nQDTUNCLi8BAGIuvz58gAAAA==[0m concurrency/waituntil/timeout PASSED C 0:06.351 - R 0:03.125
22:58:15 concurrency/waituntil/channels PASSED C 0:10.749 - R 0:08.096
22:58:15 configs/parseconfig PASSED C 0:07.271 - R 0:00.007
22:58:15 copyfile PASSED C 0:05.216 - R 0:00.007
22:58:15 configs/usage PASSED C 0:07.381 - R 0:00.009
22:58:15 coroutine/devicedriver PASSED C 0:06.418 - R 0:00.035
22:58:15 concurrency/waituntil/channel_close PASSED C 0:13.088 - R 0:10.044
22:58:15 coroutine/fibonacci PASSED C 0:06.447 - R 0:00.011
22:58:15 concurrency/waituntil/futures PASSED C 0:21.948 - R 0:00.037
22:58:15 coroutine/fmtLines PASSED C 0:06.536 - R 0:00.035
22:58:15 coroutine/pingpong PASSED C 0:06.749 - R 0:00.008
22:58:15 counter PASSED C 0:05.199 - R 0:00.006
22:58:15 ctrl-flow/break-misc PASSED C 0:05.097 - R 0:00.007
22:58:15 ctrl-flow/fallthrough PASSED C 0:05.198 - R 0:00.006
22:58:15 ctrl-flow/labelledExit PASSED C 0:00.940 - R 0:00.006
22:58:15 ctrl-flow/loop-inc PASSED C 0:00.978 - R 0:00.013
22:58:15 coroutine/runningTotal PASSED C 0:06.527 - R 0:00.007
22:58:15 coroutine/raii PASSED C 0:07.630 - R 0:00.011
22:58:15 coroutine/prodcons PASSED C 0:08.124 - R 0:00.011
22:58:15 ctrl-flow/goto PASSED C 0:05.437 - R 0:00.009
22:58:15 designations PASSED C 0:01.862 - R 0:00.006
22:58:15 enum PASSED C 0:00.842 - R 0:00.007
22:58:15 ctrl-flow/loop_else PASSED C 0:05.046 - R 0:00.017
22:58:15 ctrl-flow/ifwhileCtl PASSED C 0:06.093 - R 0:00.020
22:58:15 ...ency/unified_locking/futex_mutex PASSED C 0:11.017 - R 0:38.939
22:58:15 concurrency/waituntil/all_types PASSED C 0:28.705 - R 0:07.189
22:58:15 enum_tests/inc-dec PASSED C 0:01.192 - R 0:00.007
22:58:15 enum_tests/lvalue PASSED C 0:00.568 - R n/a
22:58:15 ctrl-flow/loop_else-WRN1 PASSED C 0:06.108 - R 0:00.002
22:58:15 enum_tests/funcEnum PASSED C 0:01.903 - R 0:00.019
22:58:15 ctrl-flow/loopctrl PASSED C 0:06.660 - R 0:00.007
22:58:15 enum_tests/anonymous PASSED C 0:05.137 - R 0:00.021
22:58:15 div PASSED C 0:07.076 - R 0:00.021
22:58:15 errors/declaration PASSED C 0:00.123 - R n/a
22:58:15 errors/scope PASSED C 0:00.602 - R n/a
22:58:15 errors/scope-type PASSED C 0:00.208 - R n/a
22:58:15 enum_tests/structEnum PASSED C 0:02.234 - R 0:00.010
22:58:15 errors/signature PASSED C 0:00.197 - R n/a
22:58:15 enum_tests/enumInlineValue PASSED C 0:06.381 - R 0:00.007
22:58:15 device/cpu PASSED C 0:08.673 - R 0:00.020
22:58:15 concurrency/unified_locking/locks FAILED with code -6 C 0:11.553 - R 0:39.978
22:58:15Start Test 1: multi acquisition lock and condition variable single wait/notify
22:58:15Done Test 1
22:58:15Start Test 2: multi acquisition lock and condition variable 3 wait/notify all
22:58:15Done Test 2
22:58:15Start Test 3: single acquisition lock and condition variable single wait/notify
22:58:15Done Test 3
22:58:15Start Test 4: single acquisition lock and condition variable 3 wait/notify all
22:58:15Cforall Assertion error "thrd->state == Halted" from program "locks" in "_X15__thread_finishFv_PS7thread$__1" at line 321 in file "/var/lib/jenkins/workspace/Cforall_master_2/libcfa/src/concurrency/monitor.cfa".
22:58:15Cforall Runtime error (UNIX pid:80506):
22:58:15Cforall Assertion error "t" from program "locks" in "_X13active_threadFPS7thread$___1" at line 109 in file "/var/lib/jenkins/workspace/Cforall_master_2/libcfa/src/concurrency/kernel/fwd.hfa".
22:58:1522:58:15warning: Can't open file anon_inode:[io_uring] which was expanded to anon_inode:[io_uring] during file-backed mapping note processing
22:58:15[New LWP 80509]
22:58:15[New LWP 80508]
22:58:15[New LWP 80507]
22:58:15[New LWP 80506]
22:58:15[Thread debugging using libthread_db enabled]
22:58:15Using host libthread_db library "/lib/x86_64-linux-gnu/libthread_db.so.1".
22:58:15Core was generated by `/var/lib/jenkins/workspace/Cforall_master_2@tmp/tests/concurrency/unified_locki'.
22:58:15Program terminated with signal SIGABRT, Aborted.
22:58:15#0 __pthread_kill_implementation (no_tid=0, signo=6, threadid=<optimized out>) at ./nptl/pthread_kill.c:44
22:58:1522:58:15warning: 44 ./nptl/pthread_kill.c: No such file or directory
22:58:15[Current thread is 1 (Thread 0x5555556a7ec0 (LWP 80509))]
22:58:15-----
22:58:15#0 __pthread_kill_implementation (no_tid=0, signo=6, threadid=<optimized out>) at ./nptl/pthread_kill.c:44
22:58:15#1 __pthread_kill_internal (signo=6, threadid=<optimized out>) at ./nptl/pthread_kill.c:78
22:58:15#2 __GI___pthread_kill (threadid=<optimized out>, signo=signo@entry=6) at ./nptl/pthread_kill.c:89
22:58:15#3 0x00007ffff7a4527e in __GI_raise (sig=sig@entry=6) at ../sysdeps/posix/raise.c:26
22:58:15#4 0x00007ffff7a288ff in __GI_abort () at ./stdlib/abort.c:79
22:58:15#5 0x00007ffff7e97e87 in _X7__abortFv_bPKcY17__builtin_va_list__1 (_X11signalAbortb_1=false, _X3fmtPKc_1=0x7ffff7eb87e0 "%s", _X4argsY17__builtin_va_list_1=0x5555556a6570) at /var/lib/jenkins/workspace/Cforall_master_2/libcfa/src/interpose.cfa:263
22:58:15#6 0x00007ffff7e9812f in _X5abortFv_bPKc__1 (_X11signalAbortb_1=false, _X3fmtPKc_1=0x7ffff7eb87e0 "%s") at /var/lib/jenkins/workspace/Cforall_master_2/libcfa/src/interpose.cfa:301
22:58:15#7 0x00007ffff7e978d2 in abort () at /var/lib/jenkins/workspace/Cforall_master_2/libcfa/src/interpose.cfa:176
22:58:15#8 0x00007ffff7e95ce7 in __assert_fail (assertion=0x7ffff7f93a12 "t", file=0x7ffff7f939c0 "/var/lib/jenkins/workspace/Cforall_master_2/libcfa/src/concurrency/kernel/fwd.hfa", line=109, function=0x7ffff7f942a0 <__PRETTY_FUNCTION__.89> "_X13active_threadFPS7thread$___1") at /var/lib/jenkins/workspace/Cforall_master_2/libcfa/src/assert.cfa:33
22:58:15#9 0x00007ffff7f7fd68 in _X13active_threadFPS7thread$___1 () at /var/lib/jenkins/workspace/Cforall_master_2/libcfa/src/concurrency/kernel/fwd.hfa:109
22:58:15#10 0x00007ffff7f81a16 in _X4lockFv_S17simple_owner_lock__1 (_X4thisS17simple_owner_lock_1=0x7ffff7fb4bc0 <_X9once_lockS17simple_owner_lock_1>) at /var/lib/jenkins/workspace/Cforall_master_2/libcfa/src/concurrency/locks.hfa:534
22:58:15#11 0x00007ffff7f84a63 in pthread_once (once_control=0x7ffff7cc9230, init_routine=0x7ffff7cbb4a0) at /var/lib/jenkins/workspace/Cforall_master_2/libcfa/src/concurrency/pthread.cfa:504
22:58:15#12 0x00007ffff7cbe3f0 in ?? () from /lib/x86_64-linux-gnu/libgcc_s.so.1
22:58:15#13 0x00007ffff7cbf3a1 in _Unwind_Backtrace () from /lib/x86_64-linux-gnu/libgcc_s.so.1
22:58:15#14 0x00007ffff7b36113 in __GI___backtrace (array=<optimized out>, size=50) at ./debug/backtrace.c:78
22:58:15#15 0x00007ffff7e97a31 in _X18__cfaabi_backtraceFv_i__1 (_X5starti_1=2) at /var/lib/jenkins/workspace/Cforall_master_2/libcfa/src/interpose.cfa:204
22:58:15#16 0x00007ffff7e97fb3 in _X7__abortFv_bPKcY17__builtin_va_list__1 (_X11signalAbortb_1=false, _X3fmtPKc_1=0x7ffff7eb87e0 "%s", _X4argsY17__builtin_va_list_1=0x5555556a6e00) at /var/lib/jenkins/workspace/Cforall_master_2/libcfa/src/interpose.cfa:283
22:58:15#17 0x00007ffff7e9812f in _X5abortFv_bPKc__1 (_X11signalAbortb_1=false, _X3fmtPKc_1=0x7ffff7eb87e0 "%s") at /var/lib/jenkins/workspace/Cforall_master_2/libcfa/src/interpose.cfa:301
22:58:15#18 0x00007ffff7e978d2 in abort () at /var/lib/jenkins/workspace/Cforall_master_2/libcfa/src/interpose.cfa:176
22:58:15#19 0x00007ffff7e95ce7 in __assert_fail (assertion=0x7ffff7f8d949 "thrd->state == Halted", file=0x7ffff7f8d4b8 "/var/lib/jenkins/workspace/Cforall_master_2/libcfa/src/concurrency/monitor.cfa", line=321, function=0x7ffff7f8e080 <__PRETTY_FUNCTION__.31> "_X15__thread_finishFv_PS7thread$__1") at /var/lib/jenkins/workspace/Cforall_master_2/libcfa/src/assert.cfa:33
22:58:15#20 0x00007ffff7f351f1 in _X15__thread_finishFv_PS7thread$__1 (_X4thrdPS7thread$_1=0x7fffffffda70) at /var/lib/jenkins/workspace/Cforall_master_2/libcfa/src/concurrency/monitor.cfa:321
22:58:15#21 0x00007ffff7f1f8e5 in _X12__run_threadFv_PS9processorPS7thread$__1 (_X4thisPS9processor_1=0x7fffffffd900, _X8thrd_dstPS7thread$_1=0x7fffffffda70) at /var/lib/jenkins/workspace/Cforall_master_2/libcfa/src/concurrency/kernel.cfa:359
22:58:15#22 0x00007ffff7f1eef7 in _X4mainFv_S14processorCtx_t__1 (_X6runnerS14processorCtx_t_1=0x7fffffffd920) at /var/lib/jenkins/workspace/Cforall_master_2/libcfa/src/concurrency/kernel.cfa:246
22:58:15#23 0x00007ffff7f5aa32 in _X18__invoke_processorFPv_Pv__1 (_X3argPv_1=0x7fffffffd900) at /var/lib/jenkins/workspace/Cforall_master_2/libcfa/src/concurrency/kernel/startup.cfa:387
22:58:15#24 0x00007ffff7a9cb84 in start_thread (arg=<optimized out>) at ./nptl/pthread_create.c:447
22:58:15#25 0x00007ffff7b29ecc in clone3 () at ../sysdeps/unix/sysv/linux/x86_64/clone3.S:78
22:58:15-----
22:58:15 Id Target Id Frame
22:58:15* 1 Thread 0x5555556a7ec0 (LWP 80509) __pthread_kill_implementation (no_tid=0, signo=6, threadid=<optimized out>) at ./nptl/pthread_kill.c:44
22:58:15 2 Thread 0x555555647ec0 (LWP 80508) 0x00005555557f2f2e in ?? ()
22:58:15 3 Thread 0x5555555b7ec0 (LWP 80507) 0x00007ffff7a45fc8 in __GI___sigtimedwait (set=0x5555555b73f0, info=0x5555555b7470, timeout=0x0) at ../sysdeps/unix/sysv/linux/sigtimedwait.c:31
22:58:15 4 Thread 0x7ffff7c97900 (LWP 80506) 0x00007ffff7f27231 in _X4lockFv_S12__spinlock_tPKc__1 (_X4thisS12__spinlock_t_1=0x5555555688c0 <_X1sS23single_acquisition_lock_1>, _X6callerPKc_1=0x7ffff7f8c740 <__PRETTY_FUNCTION__.180> "_X6unlockFv_S13blocking_lock__1") at /var/lib/jenkins/workspace/Cforall_master_2/libcfa/src/bits/locks.hfa:67
22:58:1522:58:15Archiving concurrency/unified_locking/locks (executable and core) to crashes/full-debug/concurrency/unified_locking/locks
22:58:15 eval PASSED C 0:01.120 - R 0:00.020
22:58:15 enum_tests/input PASSED C 0:05.826 - R 0:00.019
22:58:15 enum_tests/stringEnum PASSED C 0:05.688 - R 0:00.019
22:58:15 enum_tests/typedIntEnum PASSED C 0:05.513 - R 0:00.007
22:58:15 enum_tests/planet PASSED C 0:07.056 - R 0:00.007
22:58:15 enum_tests/voidEnum PASSED C 0:05.560 - R 0:00.018
22:58:15 enum_tests/position PASSED C 0:07.851 - R 0:00.005
22:58:15 ...urrency/unified_locking/mcs_spin PASSED C 0:11.160 - R 0:45.957
22:58:15 exceptions/conditional PASSED C 0:05.842 - R 0:00.010
22:58:15 exceptions/conditional-threads PASSED C 0:06.977 - R 0:00.008
22:58:15 exceptions/cancel/coroutine PASSED C 0:07.775 - R 0:00.011
22:58:15 exceptions/data-except PASSED C 0:06.409 - R 0:00.019
22:58:15 exceptions/message PASSED C 0:02.335 - R 0:00.021
22:58:15 concurrency/waituntil/repeat_close PASSED C 0:10.186 - R 0:30.063
22:58:15 exceptions/defaults PASSED C 0:05.851 - R 0:00.006
22:58:15 exceptions/cancel/thread PASSED C 0:09.613 - R 0:00.011
22:58:15 .../unified_locking/spin_queue_lock PASSED C 0:10.812 - R 0:47.718
22:58:15 exceptions/finally PASSED C 0:05.944 - R 0:00.020
22:58:15 exceptions/try-ctrl-flow PASSED C 0:00.361 - R n/a
22:58:15 exceptions/type-check PASSED C 0:00.402 - R n/a
22:58:15 exceptions/defaults-threads PASSED C 0:07.144 - R 0:00.009
22:58:15 exceptions/cor_resumer PASSED C 0:09.697 - R 0:00.008
22:58:15 exceptions/try-leave-catch PASSED C 0:00.970 - R 0:00.005
22:58:15 exceptions/finally-threads PASSED C 0:06.657 - R 0:00.011
22:58:15 expression PASSED C 0:01.067 - R 0:00.007
22:58:15 exceptions/interact PASSED C 0:05.809 - R 0:00.005
22:58:15 exceptions/fibonacci_nonlocal PASSED C 0:08.735 - R 0:00.008
22:58:15 exceptions/polymorphic PASSED C 0:05.564 - R 0:00.009
22:58:15 exceptions/resume PASSED C 0:05.719 - R 0:00.007
22:58:15 exceptions/terminate PASSED C 0:05.796 - R 0:00.006
22:58:15 exceptions/trash PASSED C 0:05.418 - R 0:00.007
22:58:15 exceptions/resume-threads PASSED C 0:06.843 - R 0:00.036
22:58:15 global-monomorph PASSED C 0:00.959 - R 0:00.009
22:58:15 exceptions/terminate-threads PASSED C 0:06.767 - R 0:00.019
22:58:15 exceptions/virtual-poly PASSED C 0:05.347 - R 0:00.018
22:58:15 identFuncDeclarator PASSED C 0:01.044 - R 0:00.005
22:58:15 identParamDeclarator PASSED C 0:01.135 - R 0:00.006
22:58:15 forall PASSED C 0:06.138 - R 0:00.019
22:58:15 exceptions/virtual-cast PASSED C 0:06.857 - R 0:00.007
22:58:15 generator/fibonacci PASSED C 0:05.522 - R 0:00.033
22:58:15 fstream_test PASSED C 0:05.834 - R 0:00.006
22:58:15 exceptions/pingpong_nonlocal PASSED C 0:09.915 - R 0:00.011
22:58:15 init1-ERROR PASSED C 0:00.567 - R n/a
22:58:15 generator/fmtLines PASSED C 0:05.449 - R 0:00.007
22:58:15 init1 PASSED C 0:00.945 - R 0:00.005
22:58:15 include/vector-sequence PASSED C 0:01.498 - R 0:00.006
22:58:15 genericUnion PASSED C 0:05.297 - R 0:00.007
22:58:15 generator/suspend_then PASSED C 0:05.828 - R 0:00.020
22:58:15 function-operator PASSED C 0:07.503 - R 0:00.006
22:58:15 include/vector-collections PASSED C 0:02.355 - R 0:00.007
22:58:15 hello PASSED C 0:05.324 - R 0:00.015
22:58:15 identity PASSED C 0:05.363 - R 0:00.006
22:58:15 include/stdincludes PASSED C 0:05.458 - R 0:00.005
22:58:15 include/vector-fstream PASSED C 0:05.366 - R 0:00.012
22:58:15 io/eofType PASSED C 0:05.312 - R 0:00.007
22:58:15 io/io PASSED C 0:08.228 - R 0:00.007
22:58:15 limits PASSED C 0:01.051 - R 0:00.008
22:58:15 io/io-acquire-in PASSED C 0:10.015 - R 0:00.037
22:58:15 io/io-acquire PASSED C 0:10.316 - R 0:00.067
22:58:15 io/away_fair PASSED C 0:11.591 - R 0:00.117
22:58:15 io/manipulatorsInput-uchunk PASSED C 0:07.938 - R 0:00.071
22:58:15 io/io-acquire-out PASSED C 0:09.806 - R 0:00.069
22:58:15 io/manipulatorsOutput4 PASSED C 0:07.941 - R 0:00.068
22:58:15 linking/nostdlib PASSED C 0:01.052 - R 0:00.009
22:58:15 io/comp_basic PASSED C 0:13.121 - R 0:00.269
22:58:15 io/comp_fair PASSED C 0:13.078 - R 0:00.223
22:58:15 io/io-acquire-no-io PASSED C 0:09.813 - R 0:02.877
22:58:15 io/io-acquire2 PASSED C 0:11.016 - R 0:00.119
22:58:15 linking/exception-nothreads PASSED C 0:04.095 - R 0:00.021
22:58:15 linkonce PASSED C 0:01.596 - R 0:00.022
22:58:15 maybe PASSED C 0:01.305 - R 0:00.005
22:58:15 concurrency/waituntil/locks PASSED C 0:11.781 - R 0:58.617
22:58:15 include/includes PASSED C 0:18.582 - R 0:00.019
22:58:15 linking/exception-withthreads PASSED C 0:06.101 - R 0:00.038
22:58:15 linking/mangling/anon PASSED C 0:06.089 - R 0:00.006
22:58:15 nested-types-ERR1 PASSED C 0:00.115 - R n/a
22:58:15 nested-types-ERR2 PASSED C 0:00.178 - R n/a
22:58:15 nested-types PASSED C 0:01.166 - R 0:00.005
22:58:15 io/many_read PASSED C 0:12.802 - R 0:00.036
22:58:15 nowarn/array PASSED C 0:01.218 - R 0:00.006
22:58:15 list/dlist-insert-remove PASSED C 0:05.804 - R 0:00.046
22:58:15 linking/weakso_nothd PASSED C 0:06.980 - R 0:00.006
22:58:15 nowarn/exception PASSED C 0:01.151 - R 0:00.007
22:58:15 linking/io-acquire PASSED C 0:08.567 - R 0:00.021
22:58:15 nowarn/no-autogen PASSED C 0:01.111 - R 0:00.023
22:58:15 linking/nothreads PASSED C 0:07.842 - R 0:00.024
22:58:15 opt-params PASSED C 0:00.154 - R n/a
22:58:15 literals PASSED C 0:06.106 - R 0:00.023
22:58:15 nowarn/unused PASSED C 0:01.187 - R 0:00.033
22:58:15 nowarn/printf-sizeof PASSED C 0:01.412 - R 0:00.014
22:58:15 nowarn/zero-thunk PASSED C 0:01.206 - R 0:00.006
22:58:15 numericConstants PASSED C 0:01.163 - R 0:00.019
22:58:15 operators PASSED C 0:00.920 - R 0:00.005
22:58:15 list/dlist2-insert-remove PASSED C 0:06.987 - R 0:00.011
22:58:15 meta/fork+exec PASSED C 0:04.474 - R 0:00.069
22:58:15 polybits PASSED C 0:00.304 - R n/a
22:58:15 poly-d-cycle PASSED C 0:01.227 - R 0:00.011
22:58:15 poly-member PASSED C 0:01.080 - R 0:00.017
22:58:15 poly-many-arsz PASSED C 0:01.280 - R 0:00.012
22:58:15 poly-bare-assn PASSED C 0:01.463 - R 0:00.022
22:58:15 poly-self-cycle PASSED C 0:01.016 - R 0:00.006
22:58:15 poly-o-cycle PASSED C 0:01.271 - R 0:00.024
22:58:15 poly-selection PASSED C 0:01.320 - R 0:00.019
22:58:15 raii/ctor-autogen-ERR1 PASSED C 0:00.729 - R n/a
22:58:15 quasiKeyword PASSED C 0:01.444 - R 0:00.022
22:58:15 malloc PASSED C 0:08.600 - R 0:00.019
22:58:15 raii/ctor-autogen PASSED C 0:01.671 - R 0:00.007
22:58:15 meta/dumpable PASSED C 0:07.388 - R 0:00.019
22:58:15 raii/init_once PASSED C 0:01.351 - R 0:00.010
22:58:15 heap PASSED C 0:07.259 - R 0:19.825
22:58:15 linking/withthreads PASSED C 0:10.962 - R 0:00.012
22:58:15 raii/partial-ERR1 PASSED C 0:00.572 - R n/a
22:58:15 raii/partial PASSED C 0:01.085 - R 0:00.007
22:58:15 raii/typeof-member PASSED C 0:01.038 - R 0:00.006
22:58:15 result PASSED C 0:01.417 - R 0:00.006
22:58:15 raii/dtor-early-exit-ERR1 PASSED C 0:03.952 - R n/a
22:58:15 concurrency/mutexstmt/locks PASSED C 0:09.723 - R 1:51.404
22:58:15 minmax PASSED C 0:09.228 - R 0:00.007
22:58:15 raii/dtor-early-exit-ERR2 PASSED C 0:04.255 - R n/a
22:58:15 quotedKeyword PASSED C 0:05.157 - R 0:00.006
22:58:15 raii/memberCtors-ERR1 PASSED C 0:03.825 - R n/a
22:58:15 simpleGenericTriple PASSED C 0:01.183 - R 0:00.007
22:58:15 raii/boxed-types PASSED C 0:05.614 - R 0:00.007
22:58:15 polymorphism PASSED C 0:06.372 - R 0:00.008
22:58:15 smart-pointers PASSED C 0:01.262 - R 0:00.009
22:58:15 raii/globals PASSED C 0:05.554 - R 0:00.007
22:58:15 switch PASSED C 0:01.018 - R 0:00.005
22:58:15 raii/memberCtors PASSED C 0:05.649 - R 0:00.007
22:58:15 tuple/tupleCast PASSED C 0:01.066 - R 0:00.007
22:58:15 tuple/tupleFunction PASSED C 0:01.184 - R 0:00.007
22:58:15 tuple/tupleMember PASSED C 0:01.084 - R 0:00.007
22:58:15 typedefRedef-ERR1 PASSED C 0:00.118 - R n/a
22:58:15 tuple/tuplePolymorphism PASSED C 0:01.210 - R 0:00.007
22:58:15 raii/dtor-early-exit PASSED C 0:07.735 - R 0:00.006
22:58:15 references PASSED C 0:05.582 - R 0:00.009
22:58:15 typedefRedef PASSED C 0:00.986 - R 0:00.006
22:58:15 var-assert PASSED C 0:00.147 - R n/a
22:58:15 typeof PASSED C 0:00.961 - R 0:00.007
22:58:15 shortCircuit PASSED C 0:05.629 - R 0:00.009
22:58:15 variableDeclarator PASSED C 0:00.983 - R 0:00.005
22:58:15 sizeof PASSED C 0:05.205 - R 0:00.007
22:58:15 tuple/tupleVariadic PASSED C 0:03.638 - R 0:00.007
22:58:15 searchsort PASSED C 0:07.419 - R 0:00.007
22:58:15 strstream PASSED C 0:05.864 - R 0:00.006
22:58:15 tuple/tupleAssign PASSED C 0:05.825 - R 0:00.007
22:58:15 sum PASSED C 0:07.394 - R 0:00.005
22:58:15 time PASSED C 0:06.840 - R 0:00.007
22:58:15 tuplearray PASSED C 0:05.260 - R 0:00.006
22:58:15 swap PASSED C 0:07.563 - R 0:00.006
22:58:15 voidPtr PASSED C 0:00.988 - R 0:00.006
22:58:15 withconflict PASSED C 0:00.540 - R n/a
22:58:15 warnings/self-assignment PASSED C 0:00.897 - R 0:00.001
22:58:15 userLiterals PASSED C 0:05.606 - R 0:00.007
22:58:15 KRfunctions PASSED C 0:00.891 - R 0:00.001
22:58:15 vector PASSED C 0:06.662 - R 0:00.006
22:58:15 arithmeticConversions PASSED C 0:02.056 - R 0:00.005
22:58:15 zero_one-ERR1 PASSED C 0:02.852 - R n/a
22:58:15 ...collections/dimexpr-match-c-ERRS PASSED C 0:00.683 - R n/a
22:58:15 vector_math/vec2_double PASSED C 0:07.598 - R 0:00.007
22:58:15 ...llections/dimexpr-match-cfa-ERRS PASSED C 0:01.226 - R n/a
22:58:15 attributes PASSED C 0:01.111 - R 0:00.001
22:58:15 vector_math/vec2_uint PASSED C 0:07.583 - R 0:00.005
22:58:15 zero_one PASSED C 0:05.353 - R 0:00.006
22:58:15 vector_math/vec2_float PASSED C 0:11.218 - R 0:00.007
22:58:15 ...collections/array-md-sbscr-cases PASSED C 0:06.451 - R 0:00.006
22:58:15 vector_math/vec2_int PASSED C 0:10.790 - R 0:00.006
22:58:15 abs PASSED C 0:07.135 - R 0:00.007
22:58:15 errors/completeType PASSED C 0:00.522 - R n/a
22:58:15 vector_math/vec3_int PASSED C 0:10.112 - R 0:00.007
22:58:15 declarationSpecifier PASSED C 0:00.892 - R 0:00.012
22:58:15 vector_math/vec4_int PASSED C 0:10.219 - R 0:00.007
22:58:15 vector_math/vec3_float PASSED C 0:11.456 - R 0:00.007
22:58:15 extension PASSED C 0:00.941 - R 0:00.001
22:58:15 functions PASSED C 0:00.937 - R 0:00.001
22:58:15 vector_math/vec4_float PASSED C 0:11.215 - R 0:00.008
22:58:15 gccExtensions PASSED C 0:00.960 - R 0:00.001
22:58:15 ato PASSED C 0:07.843 - R 0:00.007
22:58:15 rational PASSED C 0:21.296 - R 0:00.006
22:58:15 bitmanip1 PASSED C 0:08.523 - R 0:00.019
22:58:15 meta/arch PASSED C 0:00.539 - R n/a
22:58:15 bitmanip2 PASSED C 0:08.410 - R 0:00.012
22:58:15 configs/parsenums PASSED C 0:07.616 - R 0:00.067
22:58:15 concurrency/pthread/bounded_buffer PASSED C 0:09.474 - R 0:00.167
22:58:15 bitmanip3 PASSED C 0:09.721 - R 0:00.012
22:58:15 gmp PASSED C 0:07.035 - R 0:00.009
22:58:15 PRNG PASSED C 0:12.961 - R 0:02.377
22:58:15 io/manipulatorsInput PASSED C 0:06.691 - R 0:00.006
22:58:15 exceptions/cardgame PASSED C 0:08.413 - R 0:00.027
22:58:15 exceptions/hotpotato_checked PASSED C 0:08.695 - R 0:00.009
22:58:15 exceptions/hotpotato PASSED C 0:08.611 - R 0:00.009
22:58:15 io/manipulatorsOutput2 PASSED C 0:08.171 - R 0:00.009
22:58:15 random PASSED C 0:07.022 - R 0:00.005
22:58:15 io/manipulatorsOutput1 PASSED C 0:11.088 - R 0:00.009
22:58:15 vector_math/vec2_ldouble PASSED C 0:07.394 - R 0:00.005
22:58:15 io/manipulatorsOutput3 PASSED C 0:11.049 - R 0:00.009
22:58:15 mathX PASSED C 0:10.469 - R 0:00.023
22:58:15 math PASSED C 0:10.234 - R 0:00.010
22:58:15 nested_function PASSED C 0:09.378 - R 0:00.010
22:58:15377 passes, 1 failures, 0 timeouts, 0 cancelled, 0 other
22:58:15Tests took 3:16.675
22:58:15make: *** [Makefile:986: all-local] Error 1
22:58:15[Pipeline] }
22:58:15[Pipeline] // dir
22:58:15[Pipeline] }
22:58:15[Pipeline] // stage
22:58:15[Pipeline] echo
22:58:15Archiving core dumps
22:58:15[Pipeline] dir
22:58:15Running in /var/lib/jenkins/workspace/Cforall_master_2@tmp
22:58:15[Pipeline] {
22:58:15[Pipeline] fileExists
22:58:15[Pipeline] sh
22:58:15+ /var/lib/jenkins/workspace/Cforall_master_2/tools/jenkins/archive-gen.sh
22:58:15[Pipeline] archiveArtifacts
22:58:15Archiving artifacts
22:58:15Recording fingerprints
22:58:15[Pipeline] }
22:58:15[Pipeline] // dir
22:58:15[Pipeline] }
22:58:15[Pipeline] // wrap
22:58:15[Pipeline] }
22:58:15[Pipeline] // node
22:58:15[Pipeline] echo
22:58:15hudson.AbortException: script returned exit code 2
22:58:15[Pipeline] node
22:58:15Running on Brokk 2 in /var/lib/jenkins/workspace/Cforall_master_2
22:58:15[Pipeline] {
22:58:15[Pipeline] echo
22:58:15Notifying users of result
22:58:15[Pipeline] echo
22:58:15Reusing previously constructed message
22:58:15[Pipeline] echo
22:58:15Would send email to: cforall@lists.uwaterloo.ca
22:58:15[Pipeline] echo
22:58:15With title: [cforall git][BUILD# 3861 - FAILURE] - branch master
22:58:15[Pipeline] echo
22:58:15Content:
22:58:15<p>This is an automated email from the Jenkins build machine. It was
22:58:15generated because of a git hooks/post-receive script following
22:58:15a ref change which was pushed to the Cā repository.</p>
22:58:1522:58:15<p>- Status --------------------------------------------------------------</p>
22:58:1522:58:15<p>BUILD# 3861 - FAILURE</p>
22:58:15<p>Check console output at https://cforall.uwaterloo.ca/jenkins/job/Cforall/job/master/3861/ to view the results.</p>
22:58:1522:58:15<p>- Changes -------------------------------------------------------------</p>
22:58:1522:58:15<pre>
22:58:15The branch master has been updated.
22:58:15 from 262e12b24a19d992dad599c1cc6143374ac571f4 (commit)
22:58:15</pre>
22:58:1522:58:15<p>- Log -----------------------------------------------------------------</p>
22:58:1522:58:15<pre>
22:58:1522:58:15</pre>
22:58:1522:58:15<p>-----------------------------------------------------------------------</p>
22:58:15<pre>
22:58:15Summary of changes:
22:58:1522:58:15</pre>
22:58:1522:58:15[Pipeline] }
22:58:15[Pipeline] // node
22:58:15[Pipeline] echo
22:58:15Build Completed
22:58:15[Pipeline] End of Pipeline
22:58:15ERROR: script returned exit code 2
22:58:15Finished: FAILURE