Skip to content
Started by timer
Running as Jenkins Build User
Obtained Jenkins/FullBuild from git cforall@plg.uwaterloo.ca:software/cfa/cfa-cc
[Pipeline] Start of Pipeline
[Pipeline] node
Running on Brokk 3 in /var/lib/jenkins/workspace/Cforall_Full_Build
[Pipeline] {
[Pipeline] checkout
The recommended git tool is: NONE
using credential git_key_aug2025
Fetching changes from the remote Git repository
 > git rev-parse --resolve-git-dir /var/lib/jenkins/workspace/Cforall_Full_Build/.git # timeout=10
 > git config remote.origin.url cforall@plg.uwaterloo.ca:software/cfa/cfa-cc # timeout=10
Fetching upstream changes from cforall@plg.uwaterloo.ca:software/cfa/cfa-cc
 > git --version # timeout=10
 > git --version # 'git version 2.43.0'
using GIT_SSH to set credentials Git key use to connect to the cforall git repo (August 2025)
Verifying host key using known hosts file
 > git fetch --tags --force --progress -- cforall@plg.uwaterloo.ca:software/cfa/cfa-cc +refs/heads/*:refs/remotes/origin/* # timeout=10
Checking out Revision 262e12b24a19d992dad599c1cc6143374ac571f4 (refs/remotes/origin/master)
Commit message: "allow making print version without editing source"
 > git rev-parse refs/remotes/origin/master^{commit} # timeout=10
 > git config core.sparsecheckout # timeout=10
 > git checkout -f 262e12b24a19d992dad599c1cc6143374ac571f4 # timeout=10
 > git rev-list --no-walk 262e12b24a19d992dad599c1cc6143374ac571f4 # timeout=10
[Pipeline] wrap
[Pipeline] {
[Pipeline] stage
[Pipeline] { (Build)
[Pipeline] parallel
[Pipeline] { (Branch: gcc_10_x86_new)
[Pipeline] { (Branch: gcc_11_x86_new)
[Pipeline] { (Branch: gcc_12_x86_new)
[Pipeline] { (Branch: gcc_9_x64_new)
[Pipeline] { (Branch: gcc_10_x64_new)
[Pipeline] { (Branch: gcc_11_x64_new)
[Pipeline] { (Branch: gcc_12_x64_new)
[Pipeline] { (Branch: gcc_10_arm64_new)
[Pipeline] { (Branch: gcc_11_arm64_new)
[Pipeline] { (Branch: gcc_12_arm64_new)
[Pipeline] { (Branch: clang_x64_new)
[Pipeline] sleep
22:47:08 Sleeping for 4 min 0 sec
[Pipeline] sleep
22:47:08 Sleeping for 2 min 0 sec
[Pipeline] sleep
22:47:08 No need to sleep any longer
[Pipeline] sleep
22:47:08 No need to sleep any longer
[Pipeline] sleep
22:47:08 Sleeping for 1 min 0 sec
[Pipeline] sleep
22:47:08 Sleeping for 2 min 0 sec
[Pipeline] sleep
22:47:08 No need to sleep any longer
[Pipeline] sleep
22:47:08 Sleeping for 4 min 0 sec
[Pipeline] sleep
22:47:08 Sleeping for 2 min 0 sec
[Pipeline] sleep
22:47:08 Sleeping for 2 min 0 sec
[Pipeline] sleep
22:47:08 Sleeping for 3 min 0 sec
[Pipeline] build
22:47:08 Scheduling project: Cforall » master
[Pipeline] build
22:47:08 Scheduling project: Cforall » master
[Pipeline] build
22:47:08 Scheduling project: Cforall » master
22:47:16 Starting building: Cforall » master #3842
22:47:16 22:47:16 Starting building: Cforall » master #3841
Starting building: Cforall » master #3840
[Pipeline] build
22:48:08 Scheduling project: Cforall » master
22:48:16 Starting building: Cforall » master #3843
[Pipeline] build
22:49:08 Scheduling project: Cforall » master
[Pipeline] build
22:49:08 Scheduling project: Cforall » master
[Pipeline] build
22:49:08 Scheduling project: Cforall » master
[Pipeline] build
22:49:08 Scheduling project: Cforall » master
22:49:16 Starting building: Cforall » master #3847
22:49:16 Starting building: Cforall » master #3846
22:49:16 Starting building: Cforall » master #3844
22:49:16 Starting building: Cforall » master #3845
[Pipeline] build
22:50:08 Scheduling project: Cforall » master
22:50:16 Starting building: Cforall » master #3848
[Pipeline] build
22:51:08 Scheduling project: Cforall » master
[Pipeline] build
22:51:08 Scheduling project: Cforall » master
22:51:16 Starting building: Cforall » master #3849
22:51:16 Starting building: Cforall » master #3850
22:58:14 Build Cforall » master #3847 completed: SUCCESS
[Pipeline] echo
22:58:14 SUCCESS
[Pipeline] }
23:00:40 Build Cforall » master #3842 completed: SUCCESS
[Pipeline] echo
23:00:40 SUCCESS
[Pipeline] }
23:00:43 Build Cforall » master #3841 completed: SUCCESS
[Pipeline] echo
23:00:43 SUCCESS
[Pipeline] }
23:01:21 Build Cforall » master #3843 completed: SUCCESS
[Pipeline] echo
23:01:21 SUCCESS
[Pipeline] }
23:01:43 Build Cforall » master #3840 completed: SUCCESS
[Pipeline] echo
23:01:43 SUCCESS
[Pipeline] }
23:02:32 Build Cforall » master #3845 completed: SUCCESS
[Pipeline] echo
23:02:32 SUCCESS
[Pipeline] }
23:02:50 Build Cforall » master #3848 completed: SUCCESS
[Pipeline] echo
23:02:50 SUCCESS
[Pipeline] }
23:06:39 Build Cforall » master #3846 completed: SUCCESS
[Pipeline] echo
23:06:39 SUCCESS
[Pipeline] }
23:12:13 Build Cforall » master #3850 completed: FAILURE
[Pipeline] echo
23:12:13 FAILURE
[Pipeline] sh
23:12:14 + wget -q -O - https://cforall.uwaterloo.ca/jenkins/job/Cforall/job/master/3850/consoleText
23:12:14 Started by upstream project "Cforall_Full_Build" build number 429
23:12:14 originally caused by:
23:12:14  Started by timer
23:12:14 Running as Jenkins Build User
23:12:14  > git rev-parse --resolve-git-dir /var/lib/jenkins/caches/git-914b6fdde163b7e17ee75d99ca23f18a/.git # timeout=10
23:12:14 Setting origin to cforall@plg.uwaterloo.ca:software/cfa/cfa-cc
23:12:14  > git config remote.origin.url cforall@plg.uwaterloo.ca:software/cfa/cfa-cc # timeout=10
23:12:14 Fetching origin...
23:12:14 Fetching upstream changes from origin
23:12:14  > git --version # timeout=10
23:12:14  > git --version # 'git version 2.43.0'
23:12:14  > git config --get remote.origin.url # timeout=10
23:12:14 using GIT_SSH to set credentials Git key use to connect to the cforall git repo (August 2025)
23:12:14 Verifying host key using known hosts file
23:12:14  > git fetch --no-tags --force --progress -- origin +refs/heads/*:refs/remotes/origin/* # timeout=10
23:12:14 Seen branch in repository origin/ADT
23:12:14 Seen branch in repository origin/aaron-thesis
23:12:14 Seen branch in repository origin/arm-eh
23:12:14 Seen branch in repository origin/ast-experimental
23:12:14 Seen branch in repository origin/cleanup-dtors
23:12:14 Seen branch in repository origin/ctor
23:12:14 Seen branch in repository origin/deferred_resn
23:12:14 Seen branch in repository origin/demangler
23:12:14 Seen branch in repository origin/enum
23:12:14 Seen branch in repository origin/forall-pointer-decay
23:12:14 Seen branch in repository origin/gc_noraii
23:12:14 Seen branch in repository origin/jacob/cs343-translation
23:12:14 Seen branch in repository origin/jenkins-sandbox
23:12:14 Seen branch in repository origin/master
23:12:14 Seen branch in repository origin/memory
23:12:14 Seen branch in repository origin/new-ast
23:12:14 Seen branch in repository origin/new-ast-unique-expr
23:12:14 Seen branch in repository origin/new-env
23:12:14 Seen branch in repository origin/no_list
23:12:14 Seen branch in repository origin/persistent-indexer
23:12:14 Seen branch in repository origin/pthread-emulation
23:12:14 Seen branch in repository origin/qualifiedEnum
23:12:14 Seen branch in repository origin/resolv-new
23:12:14 Seen branch in repository origin/string
23:12:14 Seen branch in repository origin/stuck-waitfor-destruct
23:12:14 Seen branch in repository origin/with_gc
23:12:14 Seen 26 remote branches
23:12:14 Obtained Jenkinsfile from 262e12b24a19d992dad599c1cc6143374ac571f4
23:12:14 [Pipeline] Start of Pipeline
23:12:14 [Pipeline] node
23:12:14 Running on Brokk 4 in /var/lib/jenkins/workspace/Cforall_master
23:12:14 [Pipeline] {
23:12:14 [Pipeline] wrap
23:12:14 [Pipeline] {
23:12:14 [Pipeline] properties
23:12:14 WARNING: Unknown parameter(s) found for class type 'hudson.model.ChoiceParameterDefinition': defaultValue
23:12:14 WARNING: Unknown parameter(s) found for class type 'hudson.model.ChoiceParameterDefinition': defaultValue
23:12:14 [Pipeline] checkout
23:12:14 The recommended git tool is: NONE
23:12:14 using credential git_key_aug2025
23:12:14 Fetching changes from the remote Git repository
23:12:14 Cleaning workspace
23:12:14 Fetching without tags
23:12:14  > git rev-parse --resolve-git-dir /var/lib/jenkins/workspace/Cforall_master/.git # timeout=10
23:12:14  > git config remote.origin.url cforall@plg.uwaterloo.ca:software/cfa/cfa-cc # timeout=10
23:12:14  > git rev-parse --verify HEAD # timeout=10
23:12:14 Resetting working tree
23:12:14  > git reset --hard # timeout=10
23:12:14  > git clean -fdx # timeout=10
23:12:14 Fetching upstream changes from cforall@plg.uwaterloo.ca:software/cfa/cfa-cc
23:12:14  > git --version # timeout=10
23:12:14  > git --version # 'git version 2.43.0'
23:12:14 using GIT_SSH to set credentials Git key use to connect to the cforall git repo (August 2025)
23:12:14 Verifying host key using known hosts file
23:12:14  > git fetch --no-tags --force --progress -- cforall@plg.uwaterloo.ca:software/cfa/cfa-cc +refs/heads/*:refs/remotes/origin/* # timeout=10
23:12:14 Checking out Revision 262e12b24a19d992dad599c1cc6143374ac571f4 (master)
23:12:14 Commit message: "allow making print version without editing source"
23:12:14 [Pipeline] load
23:12:14 [Pipeline] { (Jenkins/tools.groovy)
23:12:14 [Pipeline] }
23:12:14 [Pipeline] // load
23:12:14 [Pipeline] echo
23:12:14 Compiler 	         : gcc-10 (g++-10/gcc-10)
23:12:14 Architecture            : arm64
23:12:14 Arc Flags               : --host=aarch64
23:12:14 Run All Tests           : true
23:12:14 Run Benchmark           : true
23:12:14 Build Documentation     : false
23:12:14 Publish                 : true
23:12:14 Silent                  : true
23:12:14 
23:12:14 [Pipeline] }
23:12:14 [Pipeline] // wrap
23:12:14 [Pipeline] }
23:12:14 [Pipeline] // node
23:12:14 [Pipeline] node
23:12:14  > git config core.sparsecheckout # timeout=10
23:12:14  > git checkout -f 262e12b24a19d992dad599c1cc6143374ac571f4 # timeout=10
23:12:14  > git rev-list --no-walk 262e12b24a19d992dad599c1cc6143374ac571f4 # timeout=10
23:12:14 Still waiting to schedule task
23:12:14 Waiting for next available executor on ‘Algol’
23:12:14 Running on Algol in /var/lib/jenkins/workspace/Cforall_master
23:12:14 [Pipeline] {
23:12:14 [Pipeline] wrap
23:12:14 [Pipeline] {
23:12:14 [Pipeline] pwd
23:12:14 [Pipeline] pwd
23:12:14 [Pipeline] echo
23:12:14  -------- Cleanup -------- 
23:12:14 [Pipeline] stage
23:12:14 [Pipeline] { (Cleanup)
23:12:14 [Pipeline] dir
23:12:14 Running in /var/lib/jenkins/workspace/Cforall_master@tmp
23:12:14 [Pipeline] {
23:12:14 [Pipeline] deleteDir
23:12:14 [Pipeline] }
23:12:14 [Pipeline] // dir
23:12:14 [Pipeline] }
23:12:14 [Pipeline] // stage
23:12:14 [Pipeline] echo
23:12:14  -------- Checkout -------- 
23:12:14 [Pipeline] stage
23:12:14 [Pipeline] { (Checkout)
23:12:14 [Pipeline] checkout
23:12:14 The recommended git tool is: NONE
23:12:14 using credential git_key_aug2025
23:12:14 Fetching changes from the remote Git repository
23:12:14 Cleaning workspace
23:12:14 Fetching without tags
23:12:14  > git rev-parse --resolve-git-dir /var/lib/jenkins/workspace/Cforall_master/.git # timeout=10
23:12:14  > git config remote.origin.url cforall@plg.uwaterloo.ca:software/cfa/cfa-cc # timeout=10
23:12:14  > git rev-parse --verify HEAD # timeout=10
23:12:14 Resetting working tree
23:12:14  > git reset --hard # timeout=10
23:12:14  > git clean -fdx # timeout=10
23:12:14 Fetching upstream changes from cforall@plg.uwaterloo.ca:software/cfa/cfa-cc
23:12:14  > git --version # timeout=10
23:12:14  > git --version # 'git version 2.43.0'
23:12:14 using GIT_SSH to set credentials Git key use to connect to the cforall git repo (August 2025)
23:12:14 Verifying host key using known hosts file
23:12:14  > git fetch --no-tags --force --progress -- cforall@plg.uwaterloo.ca:software/cfa/cfa-cc +refs/heads/*:refs/remotes/origin/* # timeout=10
23:12:14 Checking out Revision 262e12b24a19d992dad599c1cc6143374ac571f4 (master)
23:12:14 Commit message: "allow making print version without editing source"
23:12:14 [Pipeline] echo
23:12:14 Constructing new git message
23:12:14 [Pipeline] sh
23:12:14 + git rev-list 262e12b24a19d992dad599c1cc6143374ac571f4..262e12b24a19d992dad599c1cc6143374ac571f4
23:12:14 [Pipeline] sh
23:12:14  > git config core.sparsecheckout # timeout=10
23:12:14  > git checkout -f 262e12b24a19d992dad599c1cc6143374ac571f4 # timeout=10
23:12:14 + git cat-file -t 262e12b24a19d992dad599c1cc6143374ac571f4
23:12:14 [Pipeline] sh
23:12:14 + git rev-list --format=short 262e12b24a19d992dad599c1cc6143374ac571f4...262e12b24a19d992dad599c1cc6143374ac571f4
23:12:14 [Pipeline] sh
23:12:14 + git diff --stat --color 262e12b24a19d992dad599c1cc6143374ac571f4 262e12b24a19d992dad599c1cc6143374ac571f4
23:12:14 [Pipeline] echo
23:12:14 
23:12:14 <p>- Changes -------------------------------------------------------------</p>
23:12:14 
23:12:14 <pre>
23:12:14 The branch master has been updated.
23:12:14       from  262e12b24a19d992dad599c1cc6143374ac571f4 (commit)
23:12:14 </pre>
23:12:14 
23:12:14 <p>- Log -----------------------------------------------------------------</p>
23:12:14 
23:12:14 <pre>
23:12:14 
23:12:14 </pre>
23:12:14 
23:12:14 <p>-----------------------------------------------------------------------</p>
23:12:14 <pre>
23:12:14 Summary of changes:
23:12:14 
23:12:14 </pre>
23:12:14 
23:12:14 [Pipeline] }
23:12:14 [Pipeline] // stage
23:12:14 [Pipeline] echo
23:12:14  -------- Build : configure -------- 
23:12:14 [Pipeline] stage
23:12:14 [Pipeline] { (Build : configure)
23:12:14 [Pipeline] dir
23:12:14 Running in /var/lib/jenkins/workspace/Cforall_master
23:12:14 [Pipeline] {
23:12:14 [Pipeline] sh
23:12:14 + ./autogen.sh
23:12:14 Running aclocal in root
23:12:14 Running libtoolize in root
23:12:14 libtoolize: putting auxiliary files in AC_CONFIG_AUX_DIR, 'automake'.
23:12:14 libtoolize: linking file 'automake/ltmain.sh'
23:12:14 libtoolize: putting macros in AC_CONFIG_MACRO_DIRS, 'automake'.
23:12:14 libtoolize: linking file 'automake/libtool.m4'
23:12:14 libtoolize: linking file 'automake/ltoptions.m4'
23:12:14 libtoolize: linking file 'automake/ltsugar.m4'
23:12:14 libtoolize: linking file 'automake/ltversion.m4'
23:12:14 libtoolize: linking file 'automake/lt~obsolete.m4'
23:12:14 Running autoconf in root
23:12:14 Running automake in root
23:12:14 configure.ac:223: installing 'automake/compile'
23:12:14 configure.ac:138: installing 'automake/config.guess'
23:12:14 configure.ac:138: installing 'automake/config.sub'
23:12:14 configure.ac:17: installing 'automake/install-sh'
23:12:14 benchmark/Makefile.am: installing 'automake/depcomp'
23:12:14 parallel-tests: installing 'automake/test-driver'
23:12:14 configure.ac: installing 'automake/ylwrap'
23:12:14 Running aclocal in libcfa
23:12:14 Running libtoolize in libcfa
23:12:14 libtoolize: putting auxiliary files in AC_CONFIG_AUX_DIR, 'automake'.
23:12:14 libtoolize: linking file 'automake/ltmain.sh'
23:12:14 libtoolize: putting macros in AC_CONFIG_MACRO_DIRS, 'automake'.
23:12:14 libtoolize: linking file 'automake/libtool.m4'
23:12:14 libtoolize: linking file 'automake/ltoptions.m4'
23:12:14 libtoolize: linking file 'automake/ltsugar.m4'
23:12:14 libtoolize: linking file 'automake/ltversion.m4'
23:12:14 libtoolize: linking file 'automake/lt~obsolete.m4'
23:12:14 Running autoconf in libcfa
23:12:14 Running automake in libcfa
23:12:14 configure.ac:119: installing 'automake/compile'
23:12:14 configure.ac:119: installing 'automake/config.guess'
23:12:14 configure.ac:119: installing 'automake/config.sub'
23:12:14 configure.ac:12: installing 'automake/install-sh'
23:12:14 src/Makefile.am: installing 'automake/depcomp'
23:12:14 [Pipeline] }
23:12:14 [Pipeline] // dir
23:12:14 [Pipeline] dir
23:12:14 Running in /var/lib/jenkins/workspace/Cforall_master@tmp
23:12:14 [Pipeline] {
23:12:14 [Pipeline] sh
23:12:14 + /var/lib/jenkins/workspace/Cforall_master/configure CXX=g++-10 CC=gcc-10 --host=aarch64 AR=gcc-ar RANLIB=gcc-ranlib --with-target-hosts=host:debug,host:nodebug --quiet --prefix=/var/lib/jenkins/workspace/Cforall_master@tmp
23:12:14 [Pipeline] sh
23:12:14 + nproc
23:12:14 + make -j 96 --no-print-directory configure-libcfa
23:12:14 libcfa/arm64-debug/config.data
23:12:14 Configuring libcfa (/var/lib/jenkins/workspace/Cforall_master/libcfa/configure) with ''CXX=g++-10' 'CC=gcc-10' 'AR=gcc-ar' 'RANLIB=gcc-ranlib' '--prefix=/var/lib/jenkins/workspace/Cforall_master@tmp' DRIVER_DIR=/var/lib/jenkins/workspace/Cforall_master@tmp/driver/ ARCHITECTURE=arm64 CONFIGURATION=debug CFA_VERSION=1:0:0' from /var/lib/jenkins/workspace/Cforall_master@tmp / libcfa/arm64-debug/
23:12:14 libcfa/arm64-nodebug/config.data
23:12:14 Configuring libcfa (/var/lib/jenkins/workspace/Cforall_master/libcfa/configure) with ''CXX=g++-10' 'CC=gcc-10' 'AR=gcc-ar' 'RANLIB=gcc-ranlib' '--prefix=/var/lib/jenkins/workspace/Cforall_master@tmp' DRIVER_DIR=/var/lib/jenkins/workspace/Cforall_master@tmp/driver/ ARCHITECTURE=arm64 CONFIGURATION=nodebug CFA_VERSION=1:0:0' from /var/lib/jenkins/workspace/Cforall_master@tmp / libcfa/arm64-nodebug/
23:12:14 checking whether make supports nested variables... checking whether make supports nested variables... yes
23:12:14 checking for a BSD-compatible install... yes
23:12:14 checking for a BSD-compatible install... /usr/bin/install -c
23:12:14 checking whether build environment is sane... /usr/bin/install -c
23:12:14 checking whether build environment is sane... yes
23:12:14 yes
23:12:14 checking for a race-free mkdir -p... checking for a race-free mkdir -p... /usr/bin/mkdir -p
23:12:14 checking for gawk... /usr/bin/mkdir -p
23:12:14 gawk
23:12:14 checking whether make sets $(MAKE)... checking for gawk... gawk
23:12:14 checking whether make sets $(MAKE)... yes
23:12:14 yes
23:12:14 checking for distributated build... no
23:12:14 checking for distributated build... no
23:12:14 checking build system type... checking build system type... aarch64-unknown-linux-gnu
23:12:14 checking host system type... aarch64-unknown-linux-gnu
23:12:14 checking how to print strings... aarch64-unknown-linux-gnu
23:12:14 checking host system type... aarch64-unknown-linux-gnu
23:12:14 checking how to print strings... printf
23:12:14 checking whether make supports the include directive... printf
23:12:14 checking whether make supports the include directive... yes (GNU style)
23:12:14 checking for gcc... gcc-10
23:12:14 yes (GNU style)
23:12:14 checking for gcc... gcc-10
23:12:14 checking whether the C compiler works... checking whether the C compiler works... yes
23:12:14 checking for C compiler default output file name... a.out
23:12:14 checking for suffix of executables... yes
23:12:14 checking for C compiler default output file name... a.out
23:12:14 checking for suffix of executables... 
23:12:14 
23:12:14 checking whether we are cross compiling... checking whether we are cross compiling... no
23:12:14 no
23:12:14 checking for suffix of object files... checking for suffix of object files... o
23:12:14 checking whether the compiler supports GNU C... o
23:12:14 checking whether the compiler supports GNU C... yes
23:12:14 checking whether gcc-10 accepts -g... yes
23:12:14 checking whether gcc-10 accepts -g... yes
23:12:14 checking for gcc-10 option to enable C11 features... yes
23:12:14 checking for gcc-10 option to enable C11 features... none needed
23:12:14 checking whether gcc-10 understands -c and -o together... none needed
23:12:14 checking whether gcc-10 understands -c and -o together... yes
23:12:14 checking dependency style of gcc-10... yes
23:12:14 checking dependency style of gcc-10... gcc3
23:12:14 checking for a sed that does not truncate output... /usr/bin/sed
23:12:14 checking for grep that handles long lines and -e... /usr/bin/grep
23:12:14 checking for egrep... gcc3
23:12:14 checking for a sed that does not truncate output... /usr/bin/grep -E
23:12:14 checking for fgrep... /usr/bin/grep -F
23:12:14 checking for ld used by gcc-10... /usr/bin/sed
23:12:14 checking for grep that handles long lines and -e... /usr/bin/grep
23:12:14 checking for egrep... /usr/bin/ld
23:12:14 checking if the linker (/usr/bin/ld) is GNU ld... /usr/bin/grep -E
23:12:14 checking for fgrep... yes
23:12:14 checking for BSD- or MS-compatible name lister (nm)... /usr/bin/grep -F
23:12:14 checking for ld used by gcc-10... /usr/bin/nm -B
23:12:14 checking the name lister (/usr/bin/nm -B) interface... /usr/bin/ld
23:12:14 checking if the linker (/usr/bin/ld) is GNU ld... yes
23:12:14 checking for BSD- or MS-compatible name lister (nm)... /usr/bin/nm -B
23:12:14 checking the name lister (/usr/bin/nm -B) interface... BSD nm
23:12:14 checking whether ln -s works... yes
23:12:14 checking the maximum length of command line arguments... 1572864
23:12:14 checking how to convert aarch64-unknown-linux-gnu file names to aarch64-unknown-linux-gnu format... func_convert_file_noop
23:12:14 checking how to convert aarch64-unknown-linux-gnu file names to toolchain format... func_convert_file_noop
23:12:14 checking for /usr/bin/ld option to reload object files... -r
23:12:14 checking for file... file
23:12:14 checking for objdump... BSD nm
23:12:14 checking whether ln -s works... yes
23:12:14 checking the maximum length of command line arguments... objdump
23:12:14 checking how to recognize dependent libraries... pass_all
23:12:14 checking for dlltool... no
23:12:14 checking how to associate runtime and link libraries... printf %s\n
23:12:14 checking for archiver @FILE support... 1572864
23:12:14 checking how to convert aarch64-unknown-linux-gnu file names to aarch64-unknown-linux-gnu format... func_convert_file_noop
23:12:14 checking how to convert aarch64-unknown-linux-gnu file names to toolchain format... func_convert_file_noop
23:12:14 checking for /usr/bin/ld option to reload object files... -r
23:12:14 checking for file... file
23:12:14 checking for objdump... objdump
23:12:14 checking how to recognize dependent libraries... pass_all
23:12:14 checking for dlltool... no
23:12:14 checking how to associate runtime and link libraries... printf %s\n
23:12:14 checking for archiver @FILE support... @
23:12:14 checking for strip... strip
23:12:14 checking for ranlib... gcc-ranlib
23:12:14 checking command to parse /usr/bin/nm -B output from gcc-10 object... @
23:12:14 checking for strip... strip
23:12:14 checking for ranlib... gcc-ranlib
23:12:14 checking command to parse /usr/bin/nm -B output from gcc-10 object... ok
23:12:14 checking for sysroot... no
23:12:14 checking for a working dd... /usr/bin/dd
23:12:14 checking how to truncate binary pipes... /usr/bin/dd bs=4096 count=1
23:12:14 ok
23:12:14 checking for mt... mt
23:12:14 checking if mt is a manifest tool... checking for sysroot... no
23:12:14 checking for a working dd... no
23:12:14 /usr/bin/dd
23:12:14 checking how to truncate binary pipes... checking for stdio.h... /usr/bin/dd bs=4096 count=1
23:12:14 checking for mt... mt
23:12:14 checking if mt is a manifest tool... no
23:12:14 checking for stdio.h... yes
23:12:14 checking for stdlib.h... yes
23:12:14 checking for stdlib.h... yes
23:12:14 checking for string.h... yes
23:12:14 checking for string.h... yes
23:12:14 checking for inttypes.h... yes
23:12:14 checking for inttypes.h... yes
23:12:14 checking for stdint.h... yes
23:12:14 checking for stdint.h... yes
23:12:14 checking for strings.h... yes
23:12:14 checking for strings.h... yes
23:12:14 checking for sys/stat.h... yes
23:12:14 checking for sys/stat.h... yes
23:12:14 checking for sys/types.h... yes
23:12:14 checking for sys/types.h... yes
23:12:14 checking for unistd.h... yes
23:12:14 checking for unistd.h... yes
23:12:14 checking for dlfcn.h... yes
23:12:14 checking for dlfcn.h... yes
23:12:14 checking for objdir... .libs
23:12:14 yes
23:12:14 checking for objdir... .libs
23:12:14 checking if gcc-10 supports -fno-rtti -fno-exceptions... checking if gcc-10 supports -fno-rtti -fno-exceptions... no
23:12:14 checking for gcc-10 option to produce PIC... -fPIC -DPIC
23:12:14 checking if gcc-10 PIC flag -fPIC -DPIC works... no
23:12:14 checking for gcc-10 option to produce PIC... -fPIC -DPIC
23:12:14 checking if gcc-10 PIC flag -fPIC -DPIC works... yes
23:12:14 checking if gcc-10 static flag -static works... yes
23:12:14 checking if gcc-10 static flag -static works... yes
23:12:14 checking if gcc-10 supports -c -o file.o... yes
23:12:14 checking if gcc-10 supports -c -o file.o... yes
23:12:14 checking if gcc-10 supports -c -o file.o... (cached) yes
23:12:14 checking whether the gcc-10 linker (/usr/bin/ld) supports shared libraries... yes
23:12:14 checking if gcc-10 supports -c -o file.o... (cached) yes
23:12:14 checking whether the gcc-10 linker (/usr/bin/ld) supports shared libraries... yes
23:12:14 checking whether -lc should be explicitly linked in... yes
23:12:14 checking whether -lc should be explicitly linked in... no
23:12:14 checking dynamic linker characteristics... no
23:12:14 checking dynamic linker characteristics... GNU/Linux ld.so
23:12:14 checking how to hardcode library paths into programs... immediate
23:12:14 checking whether stripping libraries is possible... yes
23:12:14 checking if libtool supports shared libraries... yes
23:12:14 checking whether to build shared libraries... yes
23:12:14 checking whether to build static libraries... no
23:12:14 GNU/Linux ld.so
23:12:14 checking how to hardcode library paths into programs... immediate
23:12:14 checking whether stripping libraries is possible... yes
23:12:14 checking if libtool supports shared libraries... yes
23:12:14 checking whether to build shared libraries... yes
23:12:14 checking whether to build static libraries... no
23:12:14 checking whether the compiler supports GNU C++... checking whether the compiler supports GNU C++... yes
23:12:14 checking whether g++-10 accepts -g... yes
23:12:14 checking whether g++-10 accepts -g... yes
23:12:14 checking for g++-10 option to enable C++11 features... yes
23:12:14 checking for g++-10 option to enable C++11 features... none needed
23:12:14 checking dependency style of g++-10... none needed
23:12:14 checking dependency style of g++-10... gcc3
23:12:14 checking how to run the C++ preprocessor... gcc3
23:12:14 checking how to run the C++ preprocessor... g++-10 -E
23:12:14 g++-10 -E
23:12:14 checking for ld used by g++-10... checking for ld used by g++-10... /usr/bin/ld
23:12:14 checking if the linker (/usr/bin/ld) is GNU ld... /usr/bin/ld
23:12:14 checking if the linker (/usr/bin/ld) is GNU ld... yes
23:12:14 yes
23:12:14 checking whether the g++-10 linker (/usr/bin/ld) supports shared libraries... checking whether the g++-10 linker (/usr/bin/ld) supports shared libraries... yes
23:12:14 yes
23:12:14 checking for g++-10 option to produce PIC... -fPIC -DPIC
23:12:14 checking if g++-10 PIC flag -fPIC -DPIC works... checking for g++-10 option to produce PIC... -fPIC -DPIC
23:12:14 checking if g++-10 PIC flag -fPIC -DPIC works... yes
23:12:14 checking if g++-10 static flag -static works... yes
23:12:14 checking if g++-10 static flag -static works... yes
23:12:14 checking if g++-10 supports -c -o file.o... yes
23:12:14 checking if g++-10 supports -c -o file.o... yes
23:12:14 checking if g++-10 supports -c -o file.o... (cached) yes
23:12:14 checking whether the g++-10 linker (/usr/bin/ld) supports shared libraries... yes
23:12:14 checking dynamic linker characteristics... (cached) GNU/Linux ld.so
23:12:14 checking how to hardcode library paths into programs... immediate
23:12:14 checking for gcc... (cached) gcc-10
23:12:14 yes
23:12:14 checking if g++-10 supports -c -o file.o... (cached) yes
23:12:14 checking whether the g++-10 linker (/usr/bin/ld) supports shared libraries... yes
23:12:14 checking dynamic linker characteristics... (cached) GNU/Linux ld.so
23:12:14 checking how to hardcode library paths into programs... immediate
23:12:14 checking for gcc... (cached) gcc-10
23:12:14 checking whether the compiler supports GNU C... (cached) yes
23:12:14 checking whether gcc-10 accepts -g... (cached) yes
23:12:14 checking for gcc-10 option to enable C11 features... (cached) none needed
23:12:14 checking whether gcc-10 understands -c and -o together... (cached) yes
23:12:14 checking dependency style of gcc-10... (cached) gcc3
23:12:14 checking dependency style of gcc-10... checking whether the compiler supports GNU C... (cached) yes
23:12:14 checking whether gcc-10 accepts -g... (cached) yes
23:12:14 checking for gcc-10 option to enable C11 features... (cached) none needed
23:12:14 checking whether gcc-10 understands -c and -o together... (cached) yes
23:12:14 checking dependency style of gcc-10... (cached) gcc3
23:12:14 checking dependency style of gcc-10... gcc3
23:12:14 checking whether make sets $(MAKE)... (cached) yes
23:12:14 checking for linux/rseq.h... gcc3
23:12:14 checking whether make sets $(MAKE)... (cached) yes
23:12:14 checking for linux/rseq.h... yes
23:12:14 checking for rseq_available in -lrseq... yes
23:12:14 checking for rseq_available in -lrseq... no
23:12:14 checking for gcc-10 options needed to detect all undeclared functions... no
23:12:14 checking for gcc-10 options needed to detect all undeclared functions... none needed
23:12:14 checking for linux/io_uring.h... none needed
23:12:14 checking for linux/io_uring.h... yes
23:12:14 checking for liburing.h... yes
23:12:14 checking for liburing.h... no
23:12:14 checking whether IORING_OP_NOP is declared... no
23:12:14 checking whether IORING_OP_NOP is declared... yes
23:12:14 checking whether IORING_OP_READV is declared... yes
23:12:14 checking whether IORING_OP_READV is declared... yes
23:12:14 checking whether IORING_OP_WRITEV is declared... yes
23:12:14 checking whether IORING_OP_WRITEV is declared... yes
23:12:14 checking whether IORING_OP_FSYNC is declared... yes
23:12:14 checking whether IORING_OP_FSYNC is declared... yes
23:12:14 checking whether IORING_OP_READ_FIXED is declared... yes
23:12:14 checking whether IORING_OP_READ_FIXED is declared... yes
23:12:14 checking whether IORING_OP_WRITE_FIXED is declared... yes
23:12:14 checking whether IORING_OP_WRITE_FIXED is declared... yes
23:12:14 checking whether IORING_OP_POLL_ADD is declared... yes
23:12:14 checking whether IORING_OP_POLL_ADD is declared... yes
23:12:14 checking whether IORING_OP_POLL_REMOVE is declared... yes
23:12:14 checking whether IORING_OP_POLL_REMOVE is declared... yes
23:12:14 checking whether IORING_OP_SYNC_FILE_RANGE is declared... yes
23:12:14 checking whether IORING_OP_SYNC_FILE_RANGE is declared... yes
23:12:14 checking whether IORING_OP_SENDMSG is declared... yes
23:12:14 checking whether IORING_OP_SENDMSG is declared... yes
23:12:14 checking whether IORING_OP_RECVMSG is declared... yes
23:12:14 checking whether IORING_OP_RECVMSG is declared... yes
23:12:14 checking whether IORING_OP_TIMEOUT is declared... yes
23:12:14 checking whether IORING_OP_TIMEOUT is declared... yes
23:12:14 checking whether IORING_OP_TIMEOUT_REMOVE is declared... yes
23:12:14 checking whether IORING_OP_TIMEOUT_REMOVE is declared... yes
23:12:14 checking whether IORING_OP_ACCEPT is declared... yes
23:12:14 checking whether IORING_OP_ACCEPT is declared... yes
23:12:14 checking whether IORING_OP_ASYNC_CANCEL is declared... yes
23:12:14 checking whether IORING_OP_ASYNC_CANCEL is declared... yes
23:12:14 checking whether IORING_OP_LINK_TIMEOUT is declared... yes
23:12:14 checking whether IORING_OP_LINK_TIMEOUT is declared... yes
23:12:14 checking whether IORING_OP_CONNECT is declared... yes
23:12:14 checking whether IORING_OP_CONNECT is declared... yes
23:12:14 checking whether IORING_OP_FALLOCATE is declared... yes
23:12:14 checking whether IORING_OP_FALLOCATE is declared... yes
23:12:14 checking whether IORING_OP_OPENAT is declared... yes
23:12:14 checking whether IORING_OP_OPENAT is declared... yes
23:12:14 checking whether IORING_OP_CLOSE is declared... yes
23:12:14 checking whether IORING_OP_CLOSE is declared... yes
23:12:14 checking whether IORING_OP_FILES_UPDATE is declared... yes
23:12:14 checking whether IORING_OP_FILES_UPDATE is declared... yes
23:12:14 checking whether IORING_OP_STATX is declared... yes
23:12:14 checking whether IORING_OP_STATX is declared... yes
23:12:14 checking whether IORING_OP_READ is declared... yes
23:12:14 checking whether IORING_OP_READ is declared... yes
23:12:14 checking whether IORING_OP_WRITE is declared... yes
23:12:14 checking whether IORING_OP_WRITE is declared... yes
23:12:14 checking whether IORING_OP_FADVISE is declared... yes
23:12:14 checking whether IORING_OP_FADVISE is declared... yes
23:12:14 checking whether IORING_OP_MADVISE is declared... yes
23:12:14 checking whether IORING_OP_MADVISE is declared... yes
23:12:14 checking whether IORING_OP_SEND is declared... yes
23:12:14 checking whether IORING_OP_SEND is declared... yes
23:12:14 checking whether IORING_OP_RECV is declared... yes
23:12:14 checking whether IORING_OP_RECV is declared... yes
23:12:14 checking whether IORING_OP_OPENAT2 is declared... yes
23:12:14 checking whether IORING_OP_OPENAT2 is declared... yes
23:12:14 checking whether IORING_OP_EPOLL_CTL is declared... yes
23:12:14 checking whether IORING_OP_EPOLL_CTL is declared... yes
23:12:14 checking whether IORING_OP_SPLICE is declared... yes
23:12:14 checking whether IORING_OP_SPLICE is declared... yes
23:12:14 checking whether IORING_OP_PROVIDE_BUFFERS is declared... yes
23:12:14 checking whether IORING_OP_PROVIDE_BUFFERS is declared... yes
23:12:14 checking whether IORING_OP_REMOVE_BUFFER is declared... yes
23:12:14 checking whether IORING_OP_REMOVE_BUFFER is declared... no
23:12:14 checking whether IORING_OP_TEE is declared... no
23:12:14 checking whether IORING_OP_TEE is declared... yes
23:12:14 checking whether IOSQE_FIXED_FILE is declared... yes
23:12:14 checking whether IOSQE_FIXED_FILE is declared... yes
23:12:14 checking whether IOSQE_IO_DRAIN is declared... yes
23:12:14 checking whether IOSQE_IO_DRAIN is declared... yes
23:12:14 checking whether IOSQE_IO_LINK is declared... yes
23:12:14 checking whether IOSQE_IO_LINK is declared... yes
23:12:14 checking whether IOSQE_IO_HARDLINK is declared... yes
23:12:14 checking whether IOSQE_IO_HARDLINK is declared... yes
23:12:14 checking whether IOSQE_ASYNC is declared... yes
23:12:14 checking whether IOSQE_ASYNC is declared... yes
23:12:14 checking whether IOSQE_BUFFER_SELECT is declared... yes
23:12:14 checking whether IOSQE_BUFFER_SELECT is declared... yes
23:12:14 checking whether SPLICE_F_FD_IN_FIXED is declared... yes
23:12:14 checking whether SPLICE_F_FD_IN_FIXED is declared... yes
23:12:14 checking whether IORING_SETUP_ATTACH_WQ is declared... yes
23:12:14 checking whether IORING_SETUP_ATTACH_WQ is declared... yes
23:12:14 checking whether IORING_REGISTER_IOWQ_MAX_WORKERS is declared... yes
23:12:14 checking whether IORING_REGISTER_IOWQ_MAX_WORKERS is declared... yes
23:12:14 checking for preadv2... yes
23:12:14 checking for preadv2... yes
23:12:14 checking for pwritev2... yes
23:12:14 checking for pwritev2... yes
23:12:14 yes
23:12:14 checking that generated files are newer than configure... done
23:12:14 configure: creating ./config.status
23:12:14 checking that generated files are newer than configure... done
23:12:14 configure: creating ./config.status
23:12:14 config.status: creating Makefile
23:12:14 config.status: creating src/Makefile
23:12:14 config.status: creating Makefile
23:12:14 config.status: creating prelude/Makefile
23:12:14 config.status: creating src/Makefile
23:12:14 config.status: creating src/concurrency/io/call.cfa
23:12:14 config.status: creating prelude/Makefile
23:12:14 config.status: creating src/concurrency/io/call.cfa
23:12:14 /var/lib/jenkins/workspace/Cforall_master/libcfa/src/concurrency/io/call.cfa.in:144: SyntaxWarning: invalid escape sequence '\('
23:12:14   sig = re.search("(.*) (.*)\((.*)\)", signature)
23:12:14 config.status: creating prelude/defines.hfa
23:12:14 /var/lib/jenkins/workspace/Cforall_master/libcfa/src/concurrency/io/call.cfa.in:144: SyntaxWarning: invalid escape sequence '\('
23:12:14   sig = re.search("(.*) (.*)\((.*)\)", signature)
23:12:14 config.status: executing depfiles commands
23:12:14 config.status: creating prelude/defines.hfa
23:12:14 config.status: executing depfiles commands
23:12:14 config.status: executing libtool commands
23:12:14 Cforall library configuraton completed. Type "make -j 8 install".
23:12:14 config.status: executing libtool commands
23:12:14 Cforall library configuraton completed. Type "make -j 8 install".
23:12:14 [Pipeline] }
23:12:14 [Pipeline] // dir
23:12:14 [Pipeline] }
23:12:14 [Pipeline] // stage
23:12:14 [Pipeline] echo
23:12:14  -------- Build : cfa-cpp -------- 
23:12:14 [Pipeline] stage
23:12:14 [Pipeline] { (Build : cfa-cpp)
23:12:14 [Pipeline] dir
23:12:14 Running in /var/lib/jenkins/workspace/Cforall_master@tmp
23:12:14 [Pipeline] {
23:12:14 [Pipeline] sh
23:12:14 + nproc
23:12:14 + make -j 96 --no-print-directory -C driver
23:12:14   CXX      as.o
23:12:14   CXX      cc1.o
23:12:14   CXX      cfa.o
23:12:14   CXXLD    as
23:12:14   CXXLD    cc1
23:12:14   CXXLD    cfa
23:12:14 [Pipeline] sh
23:12:14 + nproc
23:12:14 + make -j 96 --no-print-directory -C src
23:12:14   YACC     Parser/parser.cc
23:12:14 updating Parser/parser.output
23:12:14 updating Parser/parser.hh
23:12:14 make  all-am
23:12:14   CXX      main.o
23:12:14   CXX      CompilationState.o
23:12:14   CXX      MakeLibCfa.o
23:12:14   LEX      Parser/lex.cc
23:12:14   CXX      AST/Attribute.o
23:12:14   CXX      AST/Copy.o
23:12:14   CXX      AST/Create.o
23:12:14   CXX      AST/Decl.o
23:12:14   CXX      AST/DeclReplacer.o
23:12:14   CXX      AST/Expr.o
23:12:14   CXX      AST/GenericSubstitution.o
23:12:14   CXX      AST/Init.o
23:12:14   CXX      AST/Inspect.o
23:12:14   CXX      AST/LinkageSpec.o
23:12:14   CXX      AST/Node.o
23:12:14   CXX      AST/Pass.o
23:12:14   CXX      AST/Print.o
23:12:14   CXX      AST/Stmt.o
23:12:14   CXX      AST/SymbolTable.o
23:12:14   CXX      AST/Type.o
23:12:14   CXX      AST/TypeEnvironment.o
23:12:14   CXX      AST/TypeSubstitution.o
23:12:14   CXX      AST/Util.o
23:12:14   CXX      CodeGen/CodeGenerator.o
23:12:14   CXX      CodeGen/GenType.o
23:12:14   CXX      CodeGen/OperatorTable.o
23:12:14   CXX      CodeGen/FixMain.o
23:12:14   CXX      CodeGen/FixNames.o
23:12:14   CXX      CodeGen/Generate.o
23:12:14   CXX      CodeGen/LinkOnce.o
23:12:14   CXX      Concurrency/Actors.o
23:12:14   CXX      Concurrency/Corun.o
23:12:14   CXX      Concurrency/Keywords.o
23:12:14   CXX      Concurrency/Waitfor.o
23:12:14   CXX      Concurrency/Waituntil.o
23:12:14   CXX      Common/Assert.o
23:12:14   CXX      Common/CodeLocationTools.o
23:12:14   CXX      Common/DeclStats.o
23:12:14   CXX      Common/Eval.o
23:12:14   CXX      Common/Examine.o
23:12:14   CXX      Common/Indenter.o
23:12:14   CXX      Common/ResolvProtoDump.o
23:12:14   CXX      Common/SemanticError.o
23:12:14   CXX      Common/Stats/Counter.o
23:12:14   CXX      Common/Stats/Heap.o
23:12:14   CXX      Common/Stats/ResolveTime.o
23:12:14   CXX      Common/Stats/Stats.o
23:12:14   CXX      Common/Stats/Time.o
23:12:14   CXX      Common/Symbol.o
23:12:14   CXX      Common/UniqueName.o
23:12:14   CXX      Common/DebugMalloc.o
23:12:14   CXX      ControlStruct/ExceptDecl.o
23:12:14   CXX      ControlStruct/ExceptTranslate.o
23:12:14   CXX      ControlStruct/FixLabels.o
23:12:14   CXX      ControlStruct/HoistControlDecls.o
23:12:14   CXX      ControlStruct/LabelGenerator.o
23:12:14   CXX      ControlStruct/MultiLevelExit.o
23:12:14   CXX      ControlStruct/TranslateEnumRange.o
23:12:14   CXX      GenPoly/GenPoly.o
23:12:14   CXX      GenPoly/Lvalue2.o
23:12:14   CXX      GenPoly/Box.o
23:12:14   CXX      GenPoly/FindFunction.o
23:12:14   CXX      GenPoly/InstantiateGeneric.o
23:12:14   CXX      GenPoly/Lvalue.o
23:12:14   CXX      GenPoly/ScrubTypeVars.o
23:12:14   CXX      GenPoly/Specialize.o
23:12:14   CXX      InitTweak/GenInit.o
23:12:14   CXX      InitTweak/InitTweak.o
23:12:14   CXX      InitTweak/FixGlobalInit.o
23:12:14   CXX      InitTweak/FixInit.o
23:12:14   CXX      Parser/DeclarationNode.o
23:12:14   CXX      Parser/ExpressionNode.o
23:12:14   CXX      Parser/InitializerNode.o
23:12:14   CXX      Parser/ParseNode.o
23:12:14   CXX      Parser/parser.o
23:12:14   CXX      Parser/RunParser.o
23:12:14   CXX      Parser/StatementNode.o
23:12:14   CXX      Parser/TypeData.o
23:12:14   CXX      Parser/TypedefTable.o
23:12:14   CXX      ResolvExpr/AdjustExprType.o
23:12:14   CXX      ResolvExpr/Candidate.o
23:12:14   CXX      ResolvExpr/CandidateFinder.o
23:12:14   CXX      ResolvExpr/CastCost.o
23:12:14   CXX      ResolvExpr/CommonType.o
23:12:14   CXX      ResolvExpr/ConversionCost.o
23:12:14   CXX      ResolvExpr/CurrentObject.o
23:12:14   CXX      ResolvExpr/ExplodedArg.o
23:12:14   CXX      ResolvExpr/FindOpenVars.o
23:12:14   CXX      ResolvExpr/PolyCost.o
23:12:14   CXX      ResolvExpr/PtrsAssignable.o
23:12:14   CXX      ResolvExpr/PtrsCastable.o
23:12:14   CXX      ResolvExpr/RenameVars.o
23:12:14   CXX      ResolvExpr/Resolver.o
23:12:14   CXX      ResolvExpr/ResolveTypeof.o
23:12:14   CXX      ResolvExpr/SatisfyAssertions.o
23:12:14   CXX      ResolvExpr/SpecCost.o
23:12:14   CXX      ResolvExpr/Unify.o
23:12:14 In file included from /usr/include/aarch64-linux-gnu/c++/10/bits/os_defines.h:39,
23:12:14                  from /usr/include/aarch64-linux-gnu/c++/10/bits/c++config.h:522,
23:12:14                  from /usr/include/c++/10/cstdio:41,
23:12:14                  from /var/lib/jenkins/workspace/Cforall_master/src/Parser/parser.yy:41:
23:12:14 /usr/include/features.h:415:4: warning: #warning _FORTIFY_SOURCE requires GCC 4.1 or later [-Wcpp]
23:12:14   415 | #  warning _FORTIFY_SOURCE requires GCC 4.1 or later
23:12:14       |    ^~~~~~~
23:12:14   CXX      ResolvExpr/CandidatePrinter.o
23:12:14   CXX      ResolvExpr/EraseWith.o
23:12:14   CXX      SymTab/FixFunction.o
23:12:14   CXX      SymTab/GenImplicitCall.o
23:12:14   CXX      SymTab/Mangler.o
23:12:14   CXX      SymTab/ManglerCommon.o
23:12:14   CXX      Tuples/Explode.o
23:12:14   CXX      Tuples/TupleAssignment.o
23:12:14   CXX      Tuples/TupleExpansion.o
23:12:14   CXX      Tuples/Tuples.o
23:12:14   CXX      Validate/Autogen.o
23:12:14   CXX      Validate/CheckAssertions.o
23:12:14   CXX      Validate/CompoundLiteral.o
23:12:14   CXX      Validate/EliminateTypedef.o
23:12:14   CXX      Validate/EnumAndPointerDecay.o
23:12:14   CXX      Validate/FindSpecialDecls.o
23:12:14   CXX      Validate/FixQualifiedTypes.o
23:12:14   CXX      Validate/FixReturnTypes.o
23:12:14   CXX      Validate/ForallPointerDecay.o
23:12:14   CXX      Validate/GenericParameter.o
23:12:14   CXX      Validate/HoistStruct.o
23:12:14   CXX      Validate/HoistTypeDecls.o
23:12:14   CXX      Validate/ImplementEnumFunc.o
23:12:14   CXX      Validate/InitializerLength.o
23:12:14   CXX      Validate/LabelAddressFixer.o
23:12:14   CXX      Validate/LinkInstanceTypes.o
23:12:14   CXX      Validate/ReplaceTypedef.o
23:12:14   CXX      Validate/ReturnCheck.o
23:12:14   CXX      Validate/VerifyCtorDtorAssign.o
23:12:14   CXX      Virtual/ExpandCasts.o
23:12:14   CXX      Virtual/Tables.o
23:12:14   CXX      Virtual/VirtualDtor.o
23:12:14   CXX      Parser/lex.o
23:12:14 /var/lib/jenkins/workspace/Cforall_master/src/ResolvExpr/CommonType.cpp: In function ‘ast::ptr<ast::Type> ResolvExpr::{anonymous}::handleReference(ast::ptr<ast::Type>&, ast::ptr<ast::Type>&, ResolvExpr::WidenMode, ast::TypeEnvironment&, const OpenVarSet&)’:
23:12:14 /var/lib/jenkins/workspace/Cforall_master/src/ResolvExpr/CommonType.cpp:716:23: note: parameter passing for argument of type ‘ResolvExpr::WidenMode’ changed in GCC 9.1
23:12:14   716 | ast::ptr< ast::Type > handleReference(
23:12:14       |                       ^~~~~~~~~~~~~~~
23:12:14 /var/lib/jenkins/workspace/Cforall_master/src/ResolvExpr/CommonType.cpp: In function ‘ast::ptr<ast::Type> ResolvExpr::commonType(ast::ptr<ast::Type>&, ast::ptr<ast::Type>&, ast::TypeEnvironment&, ast::AssertionSet&, ast::AssertionSet&, const OpenVarSet&, ResolvExpr::WidenMode)’:
23:12:14 /var/lib/jenkins/workspace/Cforall_master/src/ResolvExpr/CommonType.cpp:748:23: note: parameter passing for argument of type ‘ResolvExpr::WidenMode’ changed in GCC 9.1
23:12:14   748 | ast::ptr< ast::Type > commonType(
23:12:14       |                       ^~~~~~~~~~
23:12:14 /var/lib/jenkins/workspace/Cforall_master/src/ResolvExpr/Unify.cpp: In function ‘bool ResolvExpr::unifyExact(const ast::Type*, const ast::Type*, ast::TypeEnvironment&, ast::AssertionSet&, ast::AssertionSet&, const OpenVarSet&, ResolvExpr::WidenMode)’:
23:12:14 /var/lib/jenkins/workspace/Cforall_master/src/ResolvExpr/Unify.cpp:644:6: note: parameter passing for argument of type ‘ResolvExpr::WidenMode’ changed in GCC 9.1
23:12:14   644 | bool unifyExact(
23:12:14       |      ^~~~~~~~~~
23:12:14 /var/lib/jenkins/workspace/Cforall_master/src/ResolvExpr/Unify.cpp: In function ‘bool ResolvExpr::unifyInexact(ast::ptr<ast::Type>&, ast::ptr<ast::Type>&, ast::TypeEnvironment&, ast::AssertionSet&, ast::AssertionSet&, const OpenVarSet&, ResolvExpr::WidenMode, ast::ptr<ast::Type>&)’:
23:12:14 /var/lib/jenkins/workspace/Cforall_master/src/ResolvExpr/Unify.cpp:671:6: note: parameter passing for argument of type ‘ResolvExpr::WidenMode’ changed in GCC 9.1
23:12:14   671 | bool unifyInexact(
23:12:14       |      ^~~~~~~~~~~~
23:12:14 /var/lib/jenkins/workspace/Cforall_master/src/AST/TypeEnvironment.cpp: In member function ‘bool ast::TypeEnvironment::bindVar(const ast::TypeInstType*, const ast::Type*, const ast::TypeData&, ast::AssertionSet&, ast::AssertionSet&, const OpenVarSet&, ResolvExpr::WidenMode)’:
23:12:14 /var/lib/jenkins/workspace/Cforall_master/src/AST/TypeEnvironment.cpp:280:6: note: parameter passing for argument of type ‘ResolvExpr::WidenMode’ changed in GCC 9.1
23:12:14   280 | bool TypeEnvironment::bindVar(
23:12:14       |      ^~~~~~~~~~~~~~~
23:12:14 /var/lib/jenkins/workspace/Cforall_master/src/AST/TypeEnvironment.cpp: In member function ‘bool ast::TypeEnvironment::bindVarToVar(const ast::TypeInstType*, const ast::TypeInstType*, ast::TypeData&&, ast::AssertionSet&, ast::AssertionSet&, const OpenVarSet&, ResolvExpr::WidenMode)’:
23:12:14 /var/lib/jenkins/workspace/Cforall_master/src/AST/TypeEnvironment.cpp:319:6: note: parameter passing for argument of type ‘ResolvExpr::WidenMode’ changed in GCC 9.1
23:12:14   319 | bool TypeEnvironment::bindVarToVar(
23:12:14       |      ^~~~~~~~~~~~~~~
23:12:14   CXXLD    ../driver/cfa-cpp
23:12:14 [Pipeline] }
23:12:14 [Pipeline] // dir
23:12:14 [Pipeline] }
23:12:14 [Pipeline] // stage
23:12:14 [Pipeline] echo
23:12:14  -------- Build : libcfa(debug) -------- 
23:12:14 [Pipeline] stage
23:12:14 [Pipeline] { (Build : libcfa(debug))
23:12:14 [Pipeline] dir
23:12:14 Running in /var/lib/jenkins/workspace/Cforall_master@tmp
23:12:14 [Pipeline] {
23:12:14 [Pipeline] sh
23:12:14 + nproc
23:12:14 + make -j 96 --no-print-directory -C libcfa/arm64-debug
23:12:14 Making all in prelude
23:12:14 mkdir .deps
23:12:14 touch .deps/builtins.Po
23:12:14 (CDPATH="${ZSH_VERSION+.}:" && cd /var/lib/jenkins/workspace/Cforall_master/libcfa && /bin/bash '/var/lib/jenkins/workspace/Cforall_master/libcfa/automake/missing' autoheader)
23:12:14 rm -f stamp-h1
23:12:14 touch /var/lib/jenkins/workspace/Cforall_master/libcfa/prelude/defines.hfa.in
23:12:14 cd .. && /bin/bash ./config.status prelude/defines.hfa
23:12:14 config.status: creating prelude/defines.hfa
23:12:14 config.status: prelude/defines.hfa is unchanged
23:12:14 make  all-am
23:12:14   GEN      gcc-builtins.c
23:12:14   GEN      builtins.cfa
23:12:14   GEN      prelude.cfa
23:12:14   GEN      extras.cfa
23:12:14   GEN      extras.cfa
23:12:14   GEN      gcc-builtins.cfa
23:12:14   GEN      bootloader.c
23:12:14 Making all in src
23:12:14   CFA      common.lo
23:12:14   CFA      fstream.lo
23:12:14   CFA      iostream.lo
23:12:14   CFA      heap.lo
23:12:14   CFA      iterator.lo
23:12:14   CFA      limits.lo
23:12:14   CFA      math.lo
23:12:14   CFA      memory.lo
23:12:14   CFA      parseargs.lo
23:12:14   CFA      parseconfig.lo
23:12:14   CFA      rational.lo
23:12:14   CFA      stdlib.lo
23:12:14   CFA      strstream.lo
23:12:14   CFA      time.lo
23:12:14   CFA      assert.lo
23:12:14   CFA      bits/debug.lo
23:12:14   CC       exception.lo
23:12:14   CFA      interpose.lo
23:12:14   CFA      prelude-inline.lo
23:12:14   CFA      startup.lo
23:12:14   CC       virtual.lo
23:12:14   GEN      prelude.lo
23:12:14   CFA      interpose_thread.lo
23:12:14   CFA      bits/weakso_locks.lo
23:12:14   CFA      algorithms/range_iterator.lo
23:12:14   CFA      collections/maybe.lo
23:12:14   CFA      collections/pair.lo
23:12:14   CFA      collections/result.lo
23:12:14   CFA      collections/string.lo
23:12:14   CFA      collections/string_res.lo
23:12:14   CFA      collections/vector.lo
23:12:14   CFA      device/cpu.lo
23:12:14   CFA      concurrency/alarm.lo
23:12:14   CFA      concurrency/coroutine.lo
23:12:14   CFA      concurrency/exception.lo
23:12:14   CFA      concurrency/kernel.lo
23:12:14   CFA      concurrency/kernel/cluster.lo
23:12:14   CFA      concurrency/locks.lo
23:12:14   CFA      concurrency/monitor.lo
23:12:14   CFA      concurrency/mutex.lo
23:12:14   CFA      concurrency/select.lo
23:12:14   CFA      concurrency/thread.lo
23:12:14   CFA      concurrency/cofor.lo
23:12:14   CFA      concurrency/clib/cfathread.lo
23:12:14   CPPAS    concurrency/CtxSwitch-arm64.lo
23:12:14   CC       concurrency/invoke.lo
23:12:14   CFA      concurrency/io.lo
23:12:14   CFA      concurrency/io/setup.lo
23:12:14   CFA      concurrency/io/call.lo
23:12:14   CFA      concurrency/kernel/startup.lo
23:12:14   CFA      concurrency/preemption.lo
23:12:14   CFA      concurrency/ready_queue.lo
23:12:14   CFA      concurrency/stats.lo
23:12:14   CFA      concurrency/pthread.lo
23:12:14 /usr/include/linux/io_uring.h:83:36: warning: 'packed' attribute ignored for field of type 'union __io_uring_sqe____anonymous65' [-Wattributes]
23:12:14    83 |  } __attribute__((packed));
23:12:14       |                                    ^                            
23:12:14   CCLD     libcfa.la
23:12:14 /usr/bin/ld: warning: .libs/common.o: requires executable stack (because the .note.GNU-stack section is executable)
23:12:14 /usr/include/linux/io_uring.h:83:36: warning: 'packed' attribute ignored for field of type 'union __io_uring_sqe____anonymous129' [-Wattributes]
23:12:14    83 |  } __attribute__((packed));
23:12:14       |                                    ^                             
23:12:14 /usr/include/linux/io_uring.h:83:36: warning: 'packed' attribute ignored for field of type 'union __io_uring_sqe____anonymous53' [-Wattributes]
23:12:14    83 |  } __attribute__((packed));
23:12:14       |                                    ^                            
23:12:14 /usr/include/linux/io_uring.h:83:36: warning: 'packed' attribute ignored for field of type 'union __io_uring_sqe____anonymous119' [-Wattributes]
23:12:14    83 |  } __attribute__((packed));
23:12:14       |                                    ^                             
23:12:14 /usr/include/linux/io_uring.h:83:36: warning: 'packed' attribute ignored for field of type 'union __io_uring_sqe____anonymous119' [-Wattributes]
23:12:14    83 |  } __attribute__((packed));
23:12:14       |                                    ^                             
23:12:14 /usr/include/linux/io_uring.h:83:36: warning: 'packed' attribute ignored for field of type 'union __io_uring_sqe____anonymous32' [-Wattributes]
23:12:14    83 |  } __attribute__((packed));
23:12:14       |                                    ^                            
23:12:14 /usr/include/linux/io_uring.h:83:36: warning: 'packed' attribute ignored for field of type 'union __io_uring_sqe____anonymous97' [-Wattributes]
23:12:14    83 |  } __attribute__((packed));
23:12:14       |                                    ^                            
23:12:14   CCLD     libcfathread.la
23:12:14 /usr/bin/ld: warning: concurrency/.libs/alarm.o: requires executable stack (because the .note.GNU-stack section is executable)
23:12:14 make[1]: Nothing to be done for 'all-am'.
23:12:14 [Pipeline] }
23:12:14 [Pipeline] // dir
23:12:14 [Pipeline] }
23:12:14 [Pipeline] // stage
23:12:14 [Pipeline] echo
23:12:14  -------- Build : libcfa(nodebug) -------- 
23:12:14 [Pipeline] stage
23:12:14 [Pipeline] { (Build : libcfa(nodebug))
23:12:14 [Pipeline] dir
23:12:14 Running in /var/lib/jenkins/workspace/Cforall_master@tmp
23:12:14 [Pipeline] {
23:12:14 [Pipeline] sh
23:12:14 + nproc
23:12:14 + make -j 96 --no-print-directory -C libcfa/arm64-nodebug
23:12:14 Making all in prelude
23:12:14 mkdir .deps
23:12:14 touch .deps/builtins.Po
23:12:14 cd .. && /bin/bash ./config.status prelude/defines.hfa
23:12:14 config.status: creating prelude/defines.hfa
23:12:14 config.status: prelude/defines.hfa is unchanged
23:12:14 make  all-am
23:12:14   GEN      gcc-builtins.c
23:12:14   GEN      builtins.cfa
23:12:14   GEN      prelude.cfa
23:12:14   GEN      extras.cfa
23:12:14   GEN      extras.cfa
23:12:14   GEN      gcc-builtins.cfa
23:12:14   GEN      bootloader.c
23:12:14 Making all in src
23:12:14   CFA      common.lo
23:12:14   CFA      heap.lo
23:12:14   CFA      fstream.lo
23:12:14   CFA      iostream.lo
23:12:14   CFA      iterator.lo
23:12:14   CFA      limits.lo
23:12:14   CFA      math.lo
23:12:14   CFA      memory.lo
23:12:14   CFA      parseargs.lo
23:12:14   CFA      parseconfig.lo
23:12:14   CFA      rational.lo
23:12:14   CFA      stdlib.lo
23:12:14   CFA      strstream.lo
23:12:14   CFA      time.lo
23:12:14   CFA      assert.lo
23:12:14   CC       exception.lo
23:12:14   CFA      interpose.lo
23:12:14   CFA      prelude-inline.lo
23:12:14   CFA      startup.lo
23:12:14   CC       virtual.lo
23:12:14   GEN      prelude.lo
23:12:14   CFA      interpose_thread.lo
23:12:14   CFA      bits/weakso_locks.lo
23:12:14   CFA      algorithms/range_iterator.lo
23:12:14   CFA      collections/maybe.lo
23:12:14   CFA      collections/pair.lo
23:12:14   CFA      collections/result.lo
23:12:14   CFA      collections/string.lo
23:12:14   CFA      collections/string_res.lo
23:12:14   CFA      collections/vector.lo
23:12:14   CFA      device/cpu.lo
23:12:14   CFA      bits/debug.lo
23:12:14   CFA      concurrency/alarm.lo
23:12:14   CFA      concurrency/coroutine.lo
23:12:14   CFA      concurrency/exception.lo
23:12:14   CFA      concurrency/kernel.lo
23:12:14   CFA      concurrency/kernel/cluster.lo
23:12:14   CFA      concurrency/locks.lo
23:12:14   CFA      concurrency/monitor.lo
23:12:14   CFA      concurrency/mutex.lo
23:12:14   CFA      concurrency/select.lo
23:12:14   CFA      concurrency/thread.lo
23:12:14   CFA      concurrency/cofor.lo
23:12:14   CFA      concurrency/clib/cfathread.lo
23:12:14   CPPAS    concurrency/CtxSwitch-arm64.lo
23:12:14   CC       concurrency/invoke.lo
23:12:14   CFA      concurrency/io.lo
23:12:14   CFA      concurrency/io/call.lo
23:12:14   CFA      concurrency/io/setup.lo
23:12:14   CFA      concurrency/kernel/startup.lo
23:12:14   CFA      concurrency/preemption.lo
23:12:14   CFA      concurrency/ready_queue.lo
23:12:14   CFA      concurrency/stats.lo
23:12:14   CFA      concurrency/pthread.lo
23:12:14 /var/lib/jenkins/workspace/Cforall_master/libcfa/src/exception.c: In function '__cfaehm_allocate_exception':
23:12:14 /var/lib/jenkins/workspace/Cforall_master/libcfa/src/exception.c:142:3: warning: ignoring return value of 'write' declared with attribute 'warn_unused_result' [-Wunused-result]
23:12:14   142 |   write( 2, "abort2\n", 7 );
23:12:14       |   ^~~~~~~~~~~~~~~~~~~~~~~~~
23:12:14 /var/lib/jenkins/workspace/Cforall_master/libcfa/src/exception.c: In function '__cfaehm_exception_cleanup':
23:12:14 /var/lib/jenkins/workspace/Cforall_master/libcfa/src/exception.c:127:3: warning: ignoring return value of 'write' declared with attribute 'warn_unused_result' [-Wunused-result]
23:12:14   127 |   write( 2, "abort1\n", 7 );
23:12:14       |   ^~~~~~~~~~~~~~~~~~~~~~~~~
23:12:14 /var/lib/jenkins/workspace/Cforall_master/libcfa/src/exception.c: In function '__cfaehm_cancel_stack':
23:12:14 /var/lib/jenkins/workspace/Cforall_master/libcfa/src/exception.c:230:2: warning: ignoring return value of 'write' declared with attribute 'warn_unused_result' [-Wunused-result]
23:12:14   230 |  write( 2, "abort3\n", 7 );
23:12:14       |  ^~~~~~~~~~~~~~~~~~~~~~~~~
23:12:14 /var/lib/jenkins/workspace/Cforall_master/libcfa/src/exception.c: In function '__cfaehm_begin_unwind':
23:12:14 /var/lib/jenkins/workspace/Cforall_master/libcfa/src/exception.c:252:3: warning: ignoring return value of 'write' declared with attribute 'warn_unused_result' [-Wunused-result]
23:12:14   252 |   write( 2, "abort4\n", 7 );
23:12:14       |   ^~~~~~~~~~~~~~~~~~~~~~~~~
23:12:14 /var/lib/jenkins/workspace/Cforall_master/libcfa/src/exception.c:278:3: warning: ignoring return value of 'write' declared with attribute 'warn_unused_result' [-Wunused-result]
23:12:14   278 |   write( 2, "abort5\n", 7 );
23:12:14       |   ^~~~~~~~~~~~~~~~~~~~~~~~~
23:12:14 /var/lib/jenkins/workspace/Cforall_master/libcfa/src/exception.c: In function '__cfaehm_rethrow_terminate':
23:12:14 /var/lib/jenkins/workspace/Cforall_master/libcfa/src/exception.c:308:2: warning: ignoring return value of 'write' declared with attribute 'warn_unused_result' [-Wunused-result]
23:12:14   308 |  write( 2, "abort7\n", 7 );
23:12:14       |  ^~~~~~~~~~~~~~~~~~~~~~~~~
23:12:14 /var/lib/jenkins/workspace/Cforall_master/libcfa/src/exception.c: In function '__cfaehm_rethrow_adapter':
23:12:14 /var/lib/jenkins/workspace/Cforall_master/libcfa/src/exception.c:300:2: warning: ignoring return value of 'write' declared with attribute 'warn_unused_result' [-Wunused-result]
23:12:14   300 |  write( 2, "abort6\n", 7 );
23:12:14       |  ^~~~~~~~~~~~~~~~~~~~~~~~~
23:12:14 /usr/include/linux/io_uring.h:83:36: warning: 'packed' attribute ignored for field of type 'union __io_uring_sqe____anonymous65' [-Wattributes]
23:12:14    83 |  } __attribute__((packed));
23:12:14       |                                    ^                            
23:12:14 /usr/include/aarch64-linux-gnu/bits/socket2.h:70:94: warning: '_X12_constructorFv_U26__anonymous___SOCKADDR_ARGU26__anonymous___SOCKADDR_ARG_autogen___1' is static but used in inline function 'recvfrom' which is not static
23:12:14    70 |   return __recvfrom_chk (__fd, __buf, __n, sz, __flags, __addr, __addr_len);
23:12:14       |                                                                                              ^                                                                                        
23:12:14 /usr/include/aarch64-linux-gnu/bits/socket2.h:70:124: warning: '_X11_destructorFv_U26__anonymous___SOCKADDR_ARG_autogen___1' is static but used in inline function 'recvfrom' which is not static
23:12:14    70 |   return __recvfrom_chk (__fd, __buf, __n, sz, __flags, __addr, __addr_len);
23:12:14       |                                                                                                                            ^                                                          
23:12:14 /usr/include/aarch64-linux-gnu/bits/socket2.h:68:103: warning: '_X12_constructorFv_U26__anonymous___SOCKADDR_ARGU26__anonymous___SOCKADDR_ARG_autogen___1' is static but used in inline function 'recvfrom' which is not static
23:12:14    68 |     return __recvfrom_chk_warn (__fd, __buf, __n, sz, __flags, __addr,
23:12:14       |                                                                                                       ^                                                                                        
23:12:14 /usr/include/aarch64-linux-gnu/bits/socket2.h:68:128: warning: '_X11_destructorFv_U26__anonymous___SOCKADDR_ARG_autogen___1' is static but used in inline function 'recvfrom' which is not static
23:12:14    68 |     return __recvfrom_chk_warn (__fd, __buf, __n, sz, __flags, __addr,
23:12:14       |                                                                                                                                ^                                                          
23:12:14 /usr/include/aarch64-linux-gnu/bits/socket2.h:66:96: warning: '_X12_constructorFv_U26__anonymous___SOCKADDR_ARGU26__anonymous___SOCKADDR_ARG_autogen___1' is static but used in inline function 'recvfrom' which is not static
23:12:14    66 |     return __recvfrom_alias (__fd, __buf, __n, __flags, __addr, __addr_len);
23:12:14       |                                                                                                ^                                                                                        
23:12:14 /usr/include/aarch64-linux-gnu/bits/socket2.h:66:128: warning: '_X11_destructorFv_U26__anonymous___SOCKADDR_ARG_autogen___1' is static but used in inline function 'recvfrom' which is not static
23:12:14    66 |     return __recvfrom_alias (__fd, __buf, __n, __flags, __addr, __addr_len);
23:12:14       |                                                                                                                                ^                                                          
23:12:14 /usr/include/linux/io_uring.h:83:36: warning: 'packed' attribute ignored for field of type 'union __io_uring_sqe____anonymous119' [-Wattributes]
23:12:14    83 |  } __attribute__((packed));
23:12:14       |                                    ^                             
23:12:14 /usr/include/aarch64-linux-gnu/bits/socket2.h:70:95: warning: '_X12_constructorFv_U26__anonymous___SOCKADDR_ARGU26__anonymous___SOCKADDR_ARG_autogen___1' is static but used in inline function 'recvfrom' which is not static
23:12:14    70 |   return __recvfrom_chk (__fd, __buf, __n, sz, __flags, __addr, __addr_len);
23:12:14       |                                                                                               ^                                                                                        
23:12:14 /usr/include/aarch64-linux-gnu/bits/socket2.h:70:125: warning: '_X11_destructorFv_U26__anonymous___SOCKADDR_ARG_autogen___1' is static but used in inline function 'recvfrom' which is not static
23:12:14    70 |   return __recvfrom_chk (__fd, __buf, __n, sz, __flags, __addr, __addr_len);
23:12:14       |                                                                                                                             ^                                                          
23:12:14 /usr/include/aarch64-linux-gnu/bits/socket2.h:68:104: warning: '_X12_constructorFv_U26__anonymous___SOCKADDR_ARGU26__anonymous___SOCKADDR_ARG_autogen___1' is static but used in inline function 'recvfrom' which is not static
23:12:14    68 |     return __recvfrom_chk_warn (__fd, __buf, __n, sz, __flags, __addr,
23:12:14       |                                                                                                        ^                                                                                        
23:12:14 /usr/include/aarch64-linux-gnu/bits/socket2.h:68:129: warning: '_X11_destructorFv_U26__anonymous___SOCKADDR_ARG_autogen___1' is static but used in inline function 'recvfrom' which is not static
23:12:14    68 |     return __recvfrom_chk_warn (__fd, __buf, __n, sz, __flags, __addr,
23:12:14       |                                                                                                                                 ^                                                          
23:12:14 /usr/include/aarch64-linux-gnu/bits/socket2.h:66:97: warning: '_X12_constructorFv_U26__anonymous___SOCKADDR_ARGU26__anonymous___SOCKADDR_ARG_autogen___1' is static but used in inline function 'recvfrom' which is not static
23:12:14    66 |     return __recvfrom_alias (__fd, __buf, __n, __flags, __addr, __addr_len);
23:12:14       |                                                                                                 ^                                                                                        
23:12:14 /usr/include/aarch64-linux-gnu/bits/socket2.h:66:129: warning: '_X11_destructorFv_U26__anonymous___SOCKADDR_ARG_autogen___1' is static but used in inline function 'recvfrom' which is not static
23:12:14    66 |     return __recvfrom_alias (__fd, __buf, __n, __flags, __addr, __addr_len);
23:12:14       |                                                                                                                                 ^                                                          
23:12:14 /usr/include/linux/io_uring.h:83:36: warning: 'packed' attribute ignored for field of type 'union __io_uring_sqe____anonymous129' [-Wattributes]
23:12:14    83 |  } __attribute__((packed));
23:12:14       |                                    ^                             
23:12:14 /usr/include/aarch64-linux-gnu/bits/socket2.h:70:95: warning: '_X12_constructorFv_U26__anonymous___SOCKADDR_ARGU26__anonymous___SOCKADDR_ARG_autogen___1' is static but used in inline function 'recvfrom' which is not static
23:12:14    70 |   return __recvfrom_chk (__fd, __buf, __n, sz, __flags, __addr, __addr_len);
23:12:14       |                                                                                               ^                                                                                        
23:12:14 /usr/include/aarch64-linux-gnu/bits/socket2.h:70:125: warning: '_X11_destructorFv_U26__anonymous___SOCKADDR_ARG_autogen___1' is static but used in inline function 'recvfrom' which is not static
23:12:14    70 |   return __recvfrom_chk (__fd, __buf, __n, sz, __flags, __addr, __addr_len);
23:12:14       |                                                                                                                             ^                                                          
23:12:14 /usr/include/aarch64-linux-gnu/bits/socket2.h:68:104: warning: '_X12_constructorFv_U26__anonymous___SOCKADDR_ARGU26__anonymous___SOCKADDR_ARG_autogen___1' is static but used in inline function 'recvfrom' which is not static
23:12:14    68 |     return __recvfrom_chk_warn (__fd, __buf, __n, sz, __flags, __addr,
23:12:14       |                                                                                                        ^                                                                                        
23:12:14 /usr/include/aarch64-linux-gnu/bits/socket2.h:68:129: warning: '_X11_destructorFv_U26__anonymous___SOCKADDR_ARG_autogen___1' is static but used in inline function 'recvfrom' which is not static
23:12:14    68 |     return __recvfrom_chk_warn (__fd, __buf, __n, sz, __flags, __addr,
23:12:14       |                                                                                                                                 ^                                                          
23:12:14 /usr/include/aarch64-linux-gnu/bits/socket2.h:66:97: warning: '_X12_constructorFv_U26__anonymous___SOCKADDR_ARGU26__anonymous___SOCKADDR_ARG_autogen___1' is static but used in inline function 'recvfrom' which is not static
23:12:14    66 |     return __recvfrom_alias (__fd, __buf, __n, __flags, __addr, __addr_len);
23:12:14       |                                                                                                 ^                                                                                        
23:12:14 /usr/include/aarch64-linux-gnu/bits/socket2.h:66:129: warning: '_X11_destructorFv_U26__anonymous___SOCKADDR_ARG_autogen___1' is static but used in inline function 'recvfrom' which is not static
23:12:14    66 |     return __recvfrom_alias (__fd, __buf, __n, __flags, __addr, __addr_len);
23:12:14       |                                                                                                                                 ^                                                          
23:12:14 /usr/include/linux/io_uring.h:83:36: warning: 'packed' attribute ignored for field of type 'union __io_uring_sqe____anonymous53' [-Wattributes]
23:12:14    83 |  } __attribute__((packed));
23:12:14       |                                    ^                            
23:12:14 /usr/include/aarch64-linux-gnu/bits/socket2.h:70:95: warning: '_X12_constructorFv_U26__anonymous___SOCKADDR_ARGU26__anonymous___SOCKADDR_ARG_autogen___1' is static but used in inline function 'recvfrom' which is not static
23:12:14    70 |   return __recvfrom_chk (__fd, __buf, __n, sz, __flags, __addr, __addr_len);
23:12:14       |                                                                                               ^                                                                                        
23:12:14 /usr/include/aarch64-linux-gnu/bits/socket2.h:70:125: warning: '_X11_destructorFv_U26__anonymous___SOCKADDR_ARG_autogen___1' is static but used in inline function 'recvfrom' which is not static
23:12:14    70 |   return __recvfrom_chk (__fd, __buf, __n, sz, __flags, __addr, __addr_len);
23:12:14       |                                                                                                                             ^                                                          
23:12:14 /usr/include/aarch64-linux-gnu/bits/socket2.h:68:104: warning: '_X12_constructorFv_U26__anonymous___SOCKADDR_ARGU26__anonymous___SOCKADDR_ARG_autogen___1' is static but used in inline function 'recvfrom' which is not static
23:12:14    68 |     return __recvfrom_chk_warn (__fd, __buf, __n, sz, __flags, __addr,
23:12:14       |                                                                                                        ^                                                                                        
23:12:14 /usr/include/aarch64-linux-gnu/bits/socket2.h:68:129: warning: '_X11_destructorFv_U26__anonymous___SOCKADDR_ARG_autogen___1' is static but used in inline function 'recvfrom' which is not static
23:12:14    68 |     return __recvfrom_chk_warn (__fd, __buf, __n, sz, __flags, __addr,
23:12:14       |                                                                                                                                 ^                                                          
23:12:14 /usr/include/aarch64-linux-gnu/bits/socket2.h:66:97: warning: '_X12_constructorFv_U26__anonymous___SOCKADDR_ARGU26__anonymous___SOCKADDR_ARG_autogen___1' is static but used in inline function 'recvfrom' which is not static
23:12:14    66 |     return __recvfrom_alias (__fd, __buf, __n, __flags, __addr, __addr_len);
23:12:14       |                                                                                                 ^                                                                                        
23:12:14 /usr/include/aarch64-linux-gnu/bits/socket2.h:66:129: warning: '_X11_destructorFv_U26__anonymous___SOCKADDR_ARG_autogen___1' is static but used in inline function 'recvfrom' which is not static
23:12:14    66 |     return __recvfrom_alias (__fd, __buf, __n, __flags, __addr, __addr_len);
23:12:14       |                                                                                                                                 ^                                                          
23:12:14 /usr/include/linux/io_uring.h:83:36: warning: 'packed' attribute ignored for field of type 'union __io_uring_sqe____anonymous119' [-Wattributes]
23:12:14    83 |  } __attribute__((packed));
23:12:14       |                                    ^                             
23:12:14 /usr/include/aarch64-linux-gnu/bits/socket2.h:70:95: warning: '_X12_constructorFv_U26__anonymous___SOCKADDR_ARGU26__anonymous___SOCKADDR_ARG_autogen___1' is static but used in inline function 'recvfrom' which is not static
23:12:14    70 |   return __recvfrom_chk (__fd, __buf, __n, sz, __flags, __addr, __addr_len);
23:12:14       |                                                                                               ^                                                                                        
23:12:14 /usr/include/aarch64-linux-gnu/bits/socket2.h:70:125: warning: '_X11_destructorFv_U26__anonymous___SOCKADDR_ARG_autogen___1' is static but used in inline function 'recvfrom' which is not static
23:12:14    70 |   return __recvfrom_chk (__fd, __buf, __n, sz, __flags, __addr, __addr_len);
23:12:14       |                                                                                                                             ^                                                          
23:12:14 /usr/include/aarch64-linux-gnu/bits/socket2.h:68:104: warning: '_X12_constructorFv_U26__anonymous___SOCKADDR_ARGU26__anonymous___SOCKADDR_ARG_autogen___1' is static but used in inline function 'recvfrom' which is not static
23:12:14    68 |     return __recvfrom_chk_warn (__fd, __buf, __n, sz, __flags, __addr,
23:12:14       |                                                                                                        ^                                                                                        
23:12:14 /usr/include/aarch64-linux-gnu/bits/socket2.h:68:129: warning: '_X11_destructorFv_U26__anonymous___SOCKADDR_ARG_autogen___1' is static but used in inline function 'recvfrom' which is not static
23:12:14    68 |     return __recvfrom_chk_warn (__fd, __buf, __n, sz, __flags, __addr,
23:12:14       |                                                                                                                                 ^                                                          
23:12:14 /usr/include/aarch64-linux-gnu/bits/socket2.h:66:97: warning: '_X12_constructorFv_U26__anonymous___SOCKADDR_ARGU26__anonymous___SOCKADDR_ARG_autogen___1' is static but used in inline function 'recvfrom' which is not static
23:12:14    66 |     return __recvfrom_alias (__fd, __buf, __n, __flags, __addr, __addr_len);
23:12:14       |                                                                                                 ^                                                                                        
23:12:14 /usr/include/aarch64-linux-gnu/bits/socket2.h:66:129: warning: '_X11_destructorFv_U26__anonymous___SOCKADDR_ARG_autogen___1' is static but used in inline function 'recvfrom' which is not static
23:12:14    66 |     return __recvfrom_alias (__fd, __buf, __n, __flags, __addr, __addr_len);
23:12:14       |                                                                                                                                 ^                                                          
23:12:14 /usr/include/linux/io_uring.h:83:36: warning: 'packed' attribute ignored for field of type 'union __io_uring_sqe____anonymous32' [-Wattributes]
23:12:14    83 |  } __attribute__((packed));
23:12:14       |                                    ^                            
23:12:14   CCLD     libcfa.la
23:12:14 /usr/include/aarch64-linux-gnu/bits/socket2.h:70:94: warning: '_X12_constructorFv_U26__anonymous___SOCKADDR_ARGU26__anonymous___SOCKADDR_ARG_autogen___1' is static but used in inline function 'recvfrom' which is not static
23:12:14    70 |   return __recvfrom_chk (__fd, __buf, __n, sz, __flags, __addr, __addr_len);
23:12:14       |                                                                                              ^                                                                                        
23:12:14 /usr/include/aarch64-linux-gnu/bits/socket2.h:70:124: warning: '_X11_destructorFv_U26__anonymous___SOCKADDR_ARG_autogen___1' is static but used in inline function 'recvfrom' which is not static
23:12:14    70 |   return __recvfrom_chk (__fd, __buf, __n, sz, __flags, __addr, __addr_len);
23:12:14       |                                                                                                                            ^                                                          
23:12:14 /usr/include/aarch64-linux-gnu/bits/socket2.h:68:103: warning: '_X12_constructorFv_U26__anonymous___SOCKADDR_ARGU26__anonymous___SOCKADDR_ARG_autogen___1' is static but used in inline function 'recvfrom' which is not static
23:12:14    68 |     return __recvfrom_chk_warn (__fd, __buf, __n, sz, __flags, __addr,
23:12:14       |                                                                                                       ^                                                                                        
23:12:14 /usr/include/aarch64-linux-gnu/bits/socket2.h:68:128: warning: '_X11_destructorFv_U26__anonymous___SOCKADDR_ARG_autogen___1' is static but used in inline function 'recvfrom' which is not static
23:12:14    68 |     return __recvfrom_chk_warn (__fd, __buf, __n, sz, __flags, __addr,
23:12:14       |                                                                                                                                ^                                                          
23:12:14 /usr/include/aarch64-linux-gnu/bits/socket2.h:66:96: warning: '_X12_constructorFv_U26__anonymous___SOCKADDR_ARGU26__anonymous___SOCKADDR_ARG_autogen___1' is static but used in inline function 'recvfrom' which is not static
23:12:14    66 |     return __recvfrom_alias (__fd, __buf, __n, __flags, __addr, __addr_len);
23:12:14       |                                                                                                ^                                                                                        
23:12:14 /usr/include/aarch64-linux-gnu/bits/socket2.h:66:128: warning: '_X11_destructorFv_U26__anonymous___SOCKADDR_ARG_autogen___1' is static but used in inline function 'recvfrom' which is not static
23:12:14    66 |     return __recvfrom_alias (__fd, __buf, __n, __flags, __addr, __addr_len);
23:12:14       |                                                                                                                                ^                                                          
23:12:14 /usr/bin/ld: warning: .libs/common.o: requires executable stack (because the .note.GNU-stack section is executable)
23:12:14 /usr/include/linux/io_uring.h:83:36: warning: 'packed' attribute ignored for field of type 'union __io_uring_sqe____anonymous97' [-Wattributes]
23:12:14    83 |  } __attribute__((packed));
23:12:14       |                                    ^                            
23:12:14 /usr/include/aarch64-linux-gnu/bits/socket2.h:70:95: warning: '_X12_constructorFv_U26__anonymous___SOCKADDR_ARGU26__anonymous___SOCKADDR_ARG_autogen___1' is static but used in inline function 'recvfrom' which is not static
23:12:14    70 |   return __recvfrom_chk (__fd, __buf, __n, sz, __flags, __addr, __addr_len);
23:12:14       |                                                                                               ^                                                                                        
23:12:14 /usr/include/aarch64-linux-gnu/bits/socket2.h:70:125: warning: '_X11_destructorFv_U26__anonymous___SOCKADDR_ARG_autogen___1' is static but used in inline function 'recvfrom' which is not static
23:12:14    70 |   return __recvfrom_chk (__fd, __buf, __n, sz, __flags, __addr, __addr_len);
23:12:14       |                                                                                                                             ^                                                          
23:12:14 /usr/include/aarch64-linux-gnu/bits/socket2.h:68:104: warning: '_X12_constructorFv_U26__anonymous___SOCKADDR_ARGU26__anonymous___SOCKADDR_ARG_autogen___1' is static but used in inline function 'recvfrom' which is not static
23:12:14    68 |     return __recvfrom_chk_warn (__fd, __buf, __n, sz, __flags, __addr,
23:12:14       |                                                                                                        ^                                                                                        
23:12:14 /usr/include/aarch64-linux-gnu/bits/socket2.h:68:129: warning: '_X11_destructorFv_U26__anonymous___SOCKADDR_ARG_autogen___1' is static but used in inline function 'recvfrom' which is not static
23:12:14    68 |     return __recvfrom_chk_warn (__fd, __buf, __n, sz, __flags, __addr,
23:12:14       |                                                                                                                                 ^                                                          
23:12:14 /usr/include/aarch64-linux-gnu/bits/socket2.h:66:97: warning: '_X12_constructorFv_U26__anonymous___SOCKADDR_ARGU26__anonymous___SOCKADDR_ARG_autogen___1' is static but used in inline function 'recvfrom' which is not static
23:12:14    66 |     return __recvfrom_alias (__fd, __buf, __n, __flags, __addr, __addr_len);
23:12:14       |                                                                                                 ^                                                                                        
23:12:14 /usr/include/aarch64-linux-gnu/bits/socket2.h:66:129: warning: '_X11_destructorFv_U26__anonymous___SOCKADDR_ARG_autogen___1' is static but used in inline function 'recvfrom' which is not static
23:12:14    66 |     return __recvfrom_alias (__fd, __buf, __n, __flags, __addr, __addr_len);
23:12:14       |                                                                                                                                 ^                                                          
23:12:14   CCLD     libcfathread.la
23:12:14 /usr/bin/ld: warning: concurrency/.libs/coroutine.o: requires executable stack (because the .note.GNU-stack section is executable)
23:12:14 make[1]: Nothing to be done for 'all-am'.
23:12:14 [Pipeline] }
23:12:14 [Pipeline] // dir
23:12:14 [Pipeline] }
23:12:14 [Pipeline] // stage
23:12:14 [Pipeline] echo
23:12:14  -------- Build : install -------- 
23:12:14 [Pipeline] stage
23:12:14 [Pipeline] { (Build : install)
23:12:14 [Pipeline] dir
23:12:14 Running in /var/lib/jenkins/workspace/Cforall_master@tmp
23:12:14 [Pipeline] {
23:12:14 [Pipeline] sh
23:12:14 + nproc
23:12:14 + make -j 96 --no-print-directory install
23:12:14 Making install in driver
23:12:14 make  install-exec-hook
23:12:14   /usr/bin/install -c cfa '/var/lib/jenkins/workspace/Cforall_master@tmp/bin//cfa'
23:12:14  /usr/bin/mkdir -p '/var/lib/jenkins/workspace/Cforall_master@tmp/lib/cfa/'
23:12:14   /bin/bash ../libtool   --mode=install /usr/bin/install -c as cc1 '/var/lib/jenkins/workspace/Cforall_master@tmp/lib/cfa/'
23:12:14 libtool: install: /usr/bin/install -c as /var/lib/jenkins/workspace/Cforall_master@tmp/lib/cfa/as
23:12:14 libtool: install: /usr/bin/install -c cc1 /var/lib/jenkins/workspace/Cforall_master@tmp/lib/cfa/cc1
23:12:14 Making install in src
23:12:14 make  install-am
23:12:14 make[3]: Nothing to be done for 'install-exec-am'.
23:12:14  /usr/bin/mkdir -p '/var/lib/jenkins/workspace/Cforall_master@tmp/lib/cfa/'
23:12:14   /bin/bash ../libtool   --mode=install /usr/bin/install -c ../driver/cfa-cpp '/var/lib/jenkins/workspace/Cforall_master@tmp/lib/cfa/'
23:12:14 libtool: install: /usr/bin/install -c ../driver/cfa-cpp /var/lib/jenkins/workspace/Cforall_master@tmp/lib/cfa/cfa-cpp
23:12:14 Making install in .
23:12:14 (CDPATH="${ZSH_VERSION+.}:" && cd /var/lib/jenkins/workspace/Cforall_master && /bin/bash '/var/lib/jenkins/workspace/Cforall_master/automake/missing' autoheader)
23:12:14 rm -f stamp-h1
23:12:14 touch /var/lib/jenkins/workspace/Cforall_master/src/config.h.in
23:12:14 cd . && /bin/bash ./config.status config.h
23:12:14 config.status: creating config.h
23:12:14 config.status: config.h is unchanged
23:12:14 make[2]: Nothing to be done for 'install-exec-am'.
23:12:14  /usr/bin/mkdir -p '/var/lib/jenkins/workspace/Cforall_master@tmp/share/man/man1'
23:12:14  /usr/bin/install -c -m 644 /var/lib/jenkins/workspace/Cforall_master/doc/man/cfa.1 '/var/lib/jenkins/workspace/Cforall_master@tmp/share/man/man1'
23:12:14 Making install in libcfa/arm64-debug
23:12:14 Making install in prelude
23:12:14 make[3]: Nothing to be done for 'install-exec-am'.
23:12:14  /usr/bin/mkdir -p '/var/lib/jenkins/workspace/Cforall_master@tmp/lib/cfa/arm64-debug/'
23:12:14  /usr/bin/install -c -m 644 gcc-builtins.cfa builtins.cfa extras.cfa prelude.cfa bootloader.c defines.hfa '/var/lib/jenkins/workspace/Cforall_master@tmp/lib/cfa/arm64-debug/'
23:12:14 Making install in src
23:12:14  /usr/bin/mkdir -p '/var/lib/jenkins/workspace/Cforall_master@tmp/lib/cfa/arm64-debug/'
23:12:14  /bin/bash ../libtool   --mode=install /usr/bin/install -c   libcfa.la libcfathread.la '/var/lib/jenkins/workspace/Cforall_master@tmp/lib/cfa/arm64-debug/'
23:12:14  /usr/bin/mkdir -p '/var/lib/jenkins/workspace/Cforall_master@tmp/include/cfa/'
23:12:14  /usr/bin/mkdir -p '/var/lib/jenkins/workspace/Cforall_master@tmp/include/cfa//stdhdr/sys'
23:12:14  /usr/bin/install -c -m 644  /var/lib/jenkins/workspace/Cforall_master/libcfa/src/stdhdr/sys/mman.h /var/lib/jenkins/workspace/Cforall_master/libcfa/src/stdhdr/sys/time.h /var/lib/jenkins/workspace/Cforall_master/libcfa/src/stdhdr/sys/socket.h '/var/lib/jenkins/workspace/Cforall_master@tmp/include/cfa//stdhdr/sys'
23:12:14  /usr/bin/mkdir -p '/var/lib/jenkins/workspace/Cforall_master@tmp/include/cfa//algorithms'
23:12:14  /usr/bin/install -c -m 644  /var/lib/jenkins/workspace/Cforall_master/libcfa/src/algorithms/range_iterator.hfa '/var/lib/jenkins/workspace/Cforall_master@tmp/include/cfa//algorithms'
23:12:14  /usr/bin/mkdir -p '/var/lib/jenkins/workspace/Cforall_master@tmp/include/cfa//concurrency/kernel'
23:12:14  /usr/bin/install -c -m 644  /var/lib/jenkins/workspace/Cforall_master/libcfa/src/concurrency/kernel/cluster.hfa /var/lib/jenkins/workspace/Cforall_master/libcfa/src/concurrency/kernel/fwd.hfa '/var/lib/jenkins/workspace/Cforall_master@tmp/include/cfa//concurrency/kernel'
23:12:14  /usr/bin/install -c -m 644  /var/lib/jenkins/workspace/Cforall_master/libcfa/src/common.hfa /var/lib/jenkins/workspace/Cforall_master/libcfa/src/fstream.hfa /var/lib/jenkins/workspace/Cforall_master/libcfa/src/heap.hfa /var/lib/jenkins/workspace/Cforall_master/libcfa/src/iostream.hfa /var/lib/jenkins/workspace/Cforall_master/libcfa/src/iterator.hfa /var/lib/jenkins/workspace/Cforall_master/libcfa/src/limits.hfa /var/lib/jenkins/workspace/Cforall_master/libcfa/src/math.hfa /var/lib/jenkins/workspace/Cforall_master/libcfa/src/memory.hfa /var/lib/jenkins/workspace/Cforall_master/libcfa/src/parseargs.hfa /var/lib/jenkins/workspace/Cforall_master/libcfa/src/parseconfig.hfa /var/lib/jenkins/workspace/Cforall_master/libcfa/src/rational.hfa /var/lib/jenkins/workspace/Cforall_master/libcfa/src/stdlib.hfa /var/lib/jenkins/workspace/Cforall_master/libcfa/src/strstream.hfa /var/lib/jenkins/workspace/Cforall_master/libcfa/src/time.hfa /var/lib/jenkins/workspace/Cforall_master/libcfa/src/Exception.hfa /var/lib/jenkins/workspace/Cforall_master/libcfa/src/bitmanip.hfa /var/lib/jenkins/workspace/Cforall_master/libcfa/src/clock.hfa /var/lib/jenkins/workspace/Cforall_master/libcfa/src/exception.hfa /var/lib/jenkins/workspace/Cforall_master/libcfa/src/exception.h /var/lib/jenkins/workspace/Cforall_master/libcfa/src/gmp.hfa /var/lib/jenkins/workspace/Cforall_master/libcfa/src/math.trait.hfa /var/lib/jenkins/workspace/Cforall_master/libcfa/src/raii.hfa /var/lib/jenkins/workspace/Cforall_master/libcfa/src/time_t.hfa /var/lib/jenkins/workspace/Cforall_master/libcfa/src/virtual_dtor.hfa '/var/lib/jenkins/workspace/Cforall_master@tmp/include/cfa//.'
23:12:14  /usr/bin/mkdir -p '/var/lib/jenkins/workspace/Cforall_master@tmp/include/cfa//concurrency'
23:12:14  /usr/bin/install -c -m 644  /var/lib/jenkins/workspace/Cforall_master/libcfa/src/concurrency/iofwd.hfa /var/lib/jenkins/workspace/Cforall_master/libcfa/src/concurrency/barrier.hfa /var/lib/jenkins/workspace/Cforall_master/libcfa/src/concurrency/alarm.hfa /var/lib/jenkins/workspace/Cforall_master/libcfa/src/concurrency/coroutine.hfa /var/lib/jenkins/workspace/Cforall_master/libcfa/src/concurrency/exception.hfa /var/lib/jenkins/workspace/Cforall_master/libcfa/src/concurrency/kernel.hfa /var/lib/jenkins/workspace/Cforall_master/libcfa/src/concurrency/locks.hfa /var/lib/jenkins/workspace/Cforall_master/libcfa/src/concurrency/monitor.hfa /var/lib/jenkins/workspace/Cforall_master/libcfa/src/concurrency/mutex.hfa /var/lib/jenkins/workspace/Cforall_master/libcfa/src/concurrency/select.hfa /var/lib/jenkins/workspace/Cforall_master/libcfa/src/concurrency/thread.hfa /var/lib/jenkins/workspace/Cforall_master/libcfa/src/concurrency/cofor.hfa /var/lib/jenkins/workspace/Cforall_master/libcfa/src/concurrency/invoke.h /var/lib/jenkins/workspace/Cforall_master/libcfa/src/concurrency/future.hfa /var/lib/jenkins/workspace/Cforall_master/libcfa/src/concurrency/once.hfa /var/lib/jenkins/workspace/Cforall_master/libcfa/src/concurrency/mutex_stmt.hfa /var/lib/jenkins/workspace/Cforall_master/libcfa/src/concurrency/channel.hfa /var/lib/jenkins/workspace/Cforall_master/libcfa/src/concurrency/actor.hfa '/var/lib/jenkins/workspace/Cforall_master@tmp/include/cfa//concurrency'
23:12:14  /usr/bin/mkdir -p '/var/lib/jenkins/workspace/Cforall_master@tmp/include/cfa//concurrency/clib'
23:12:14  /usr/bin/install -c -m 644  /var/lib/jenkins/workspace/Cforall_master/libcfa/src/concurrency/clib/cfathread.h '/var/lib/jenkins/workspace/Cforall_master@tmp/include/cfa//concurrency/clib'
23:12:14  /usr/bin/mkdir -p '/var/lib/jenkins/workspace/Cforall_master@tmp/include/cfa//device'
23:12:14  /usr/bin/install -c -m 644  /var/lib/jenkins/workspace/Cforall_master/libcfa/src/device/cpu.hfa '/var/lib/jenkins/workspace/Cforall_master@tmp/include/cfa//device'
23:12:14  /usr/bin/mkdir -p '/var/lib/jenkins/workspace/Cforall_master@tmp/include/cfa//stdhdr/libltdl'
23:12:14  /usr/bin/install -c -m 644  /var/lib/jenkins/workspace/Cforall_master/libcfa/src/stdhdr/libltdl/lt_dlloader.h '/var/lib/jenkins/workspace/Cforall_master@tmp/include/cfa//stdhdr/libltdl'
23:12:14  /usr/bin/mkdir -p '/var/lib/jenkins/workspace/Cforall_master@tmp/include/cfa//vec'
23:12:14  /usr/bin/install -c -m 644  /var/lib/jenkins/workspace/Cforall_master/libcfa/src/vec/vec.hfa /var/lib/jenkins/workspace/Cforall_master/libcfa/src/vec/vec2.hfa /var/lib/jenkins/workspace/Cforall_master/libcfa/src/vec/vec3.hfa /var/lib/jenkins/workspace/Cforall_master/libcfa/src/vec/vec4.hfa '/var/lib/jenkins/workspace/Cforall_master@tmp/include/cfa//vec'
23:12:14 libtool: install: /usr/bin/install -c .libs/libcfa.so.1.0.0 /var/lib/jenkins/workspace/Cforall_master@tmp/lib/cfa/arm64-debug/libcfa.so.1.0.0
23:12:14  /usr/bin/mkdir -p '/var/lib/jenkins/workspace/Cforall_master@tmp/include/cfa//bits'
23:12:14  /usr/bin/install -c -m 644  /var/lib/jenkins/workspace/Cforall_master/libcfa/src/bits/weakso_locks.hfa /var/lib/jenkins/workspace/Cforall_master/libcfa/src/bits/algorithm.hfa /var/lib/jenkins/workspace/Cforall_master/libcfa/src/bits/align.hfa /var/lib/jenkins/workspace/Cforall_master/libcfa/src/bits/collections.hfa /var/lib/jenkins/workspace/Cforall_master/libcfa/src/bits/debug.hfa /var/lib/jenkins/workspace/Cforall_master/libcfa/src/bits/defs.hfa /var/lib/jenkins/workspace/Cforall_master/libcfa/src/bits/locks.hfa /var/lib/jenkins/workspace/Cforall_master/libcfa/src/bits/collection.hfa /var/lib/jenkins/workspace/Cforall_master/libcfa/src/bits/stack.hfa /var/lib/jenkins/workspace/Cforall_master/libcfa/src/bits/queue.hfa /var/lib/jenkins/workspace/Cforall_master/libcfa/src/bits/sequence.hfa /var/lib/jenkins/workspace/Cforall_master/libcfa/src/bits/atomic.hfa /var/lib/jenkins/workspace/Cforall_master/libcfa/src/bits/random.hfa '/var/lib/jenkins/workspace/Cforall_master@tmp/include/cfa//bits'
23:12:14 libtool: install: (cd /var/lib/jenkins/workspace/Cforall_master@tmp/lib/cfa/arm64-debug && { ln -s -f libcfa.so.1.0.0 libcfa.so.1 || { rm -f libcfa.so.1 && ln -s libcfa.so.1.0.0 libcfa.so.1; }; })
23:12:14  /usr/bin/mkdir -p '/var/lib/jenkins/workspace/Cforall_master@tmp/include/cfa//stdhdr'
23:12:14  /usr/bin/install -c -m 644  /var/lib/jenkins/workspace/Cforall_master/libcfa/src/stdhdr/stdalign.h /var/lib/jenkins/workspace/Cforall_master/libcfa/src/stdhdr/stdio.h /var/lib/jenkins/workspace/Cforall_master/libcfa/src/stdhdr/malloc.h /var/lib/jenkins/workspace/Cforall_master/libcfa/src/stdhdr/time.h /var/lib/jenkins/workspace/Cforall_master/libcfa/src/stdhdr/signal.h /var/lib/jenkins/workspace/Cforall_master/libcfa/src/stdhdr/stdbool.h /var/lib/jenkins/workspace/Cforall_master/libcfa/src/stdhdr/unistd.h /var/lib/jenkins/workspace/Cforall_master/libcfa/src/stdhdr/stdatomic.h /var/lib/jenkins/workspace/Cforall_master/libcfa/src/stdhdr/stdint.h /var/lib/jenkins/workspace/Cforall_master/libcfa/src/stdhdr/gmp.h /var/lib/jenkins/workspace/Cforall_master/libcfa/src/stdhdr/locale.h /var/lib/jenkins/workspace/Cforall_master/libcfa/src/stdhdr/string.h /var/lib/jenkins/workspace/Cforall_master/libcfa/src/stdhdr/fenv.h /var/lib/jenkins/workspace/Cforall_master/libcfa/src/stdhdr/wchar.h /var/lib/jenkins/workspace/Cforall_master/libcfa/src/stdhdr/tgmath.h /var/lib/jenkins/workspace/Cforall_master/libcfa/src/stdhdr/math.h /var/lib/jenkins/workspace/Cforall_master/libcfa/src/stdhdr/pthread.h /var/lib/jenkins/workspace/Cforall_master/libcfa/src/stdhdr/complex.h /var/lib/jenkins/workspace/Cforall_master/libcfa/src/stdhdr/wctype.h /var/lib/jenkins/workspace/Cforall_master/libcfa/src/stdhdr/unwind.h /var/lib/jenkins/workspace/Cforall_master/libcfa/src/stdhdr/float.h /var/lib/jenkins/workspace/Cforall_master/libcfa/src/stdhdr/stdarg.h /var/lib/jenkins/workspace/Cforall_master/libcfa/src/stdhdr/stdlib.h /var/lib/jenkins/workspace/Cforall_master/libcfa/src/stdhdr/iso646.h /var/lib/jenkins/workspace/Cforall_master/libcfa/src/stdhdr/stddef.h /var/lib/jenkins/workspace/Cforall_master/libcfa/src/stdhdr/stdnoreturn.h /var/lib/jenkins/workspace/Cforall_master/libcfa/src/stdhdr/assert.h /var/lib/jenkins/workspace/Cforall_master/libcfa/src/stdhdr/ctype.h /var/lib/jenkins/workspace/Cforall_master/libcfa/src/stdhdr/errno.h /var/lib/jenkins/workspace/Cforall_master/libcfa/src/stdhdr/threads.h /var/lib/jenkins/workspace/Cforall_master/libcfa/src/stdhdr/uchar.h /var/lib/jenkins/workspace/Cforall_master/libcfa/src/stdhdr/inttypes.h /var/lib/jenkins/workspace/Cforall_master/libcfa/src/stdhdr/limits.h /var/lib/jenkins/workspace/Cforall_master/libcfa/src/stdhdr/setjmp.h '/var/lib/jenkins/workspace/Cforall_master@tmp/include/cfa//stdhdr'
23:12:14  /usr/bin/mkdir -p '/var/lib/jenkins/workspace/Cforall_master@tmp/include/cfa//collections'
23:12:14  /usr/bin/install -c -m 644  /var/lib/jenkins/workspace/Cforall_master/libcfa/src/collections/maybe.hfa /var/lib/jenkins/workspace/Cforall_master/libcfa/src/collections/pair.hfa /var/lib/jenkins/workspace/Cforall_master/libcfa/src/collections/result.hfa /var/lib/jenkins/workspace/Cforall_master/libcfa/src/collections/string.hfa /var/lib/jenkins/workspace/Cforall_master/libcfa/src/collections/string_res.hfa /var/lib/jenkins/workspace/Cforall_master/libcfa/src/collections/vector.hfa /var/lib/jenkins/workspace/Cforall_master/libcfa/src/collections/array.hfa /var/lib/jenkins/workspace/Cforall_master/libcfa/src/collections/list.hfa /var/lib/jenkins/workspace/Cforall_master/libcfa/src/collections/list2.hfa /var/lib/jenkins/workspace/Cforall_master/libcfa/src/collections/lockfree.hfa /var/lib/jenkins/workspace/Cforall_master/libcfa/src/collections/string_sharectx.hfa /var/lib/jenkins/workspace/Cforall_master/libcfa/src/collections/vector2.hfa '/var/lib/jenkins/workspace/Cforall_master@tmp/include/cfa//collections'
23:12:14 libtool: install: (cd /var/lib/jenkins/workspace/Cforall_master@tmp/lib/cfa/arm64-debug && { ln -s -f libcfa.so.1.0.0 libcfa.so || { rm -f libcfa.so && ln -s libcfa.so.1.0.0 libcfa.so; }; })
23:12:14 libtool: install: /usr/bin/install -c .libs/libcfa.lai /var/lib/jenkins/workspace/Cforall_master@tmp/lib/cfa/arm64-debug/libcfa.la
23:12:14 libtool: install: /usr/bin/install -c .libs/libcfathread.so.1.0.0 /var/lib/jenkins/workspace/Cforall_master@tmp/lib/cfa/arm64-debug/libcfathread.so.1.0.0
23:12:14 libtool: install: (cd /var/lib/jenkins/workspace/Cforall_master@tmp/lib/cfa/arm64-debug && { ln -s -f libcfathread.so.1.0.0 libcfathread.so.1 || { rm -f libcfathread.so.1 && ln -s libcfathread.so.1.0.0 libcfathread.so.1; }; })
23:12:14 libtool: install: (cd /var/lib/jenkins/workspace/Cforall_master@tmp/lib/cfa/arm64-debug && { ln -s -f libcfathread.so.1.0.0 libcfathread.so || { rm -f libcfathread.so && ln -s libcfathread.so.1.0.0 libcfathread.so; }; })
23:12:14 libtool: install: /usr/bin/install -c .libs/libcfathread.lai /var/lib/jenkins/workspace/Cforall_master@tmp/lib/cfa/arm64-debug/libcfathread.la
23:12:14 libtool: warning: remember to run 'libtool --finish /var/lib/jenkins/workspace/Cforall_master@tmp/lib/cfa/arm64-debug/'
23:12:14 make[3]: Nothing to be done for 'install-exec-am'.
23:12:14 make[3]: Nothing to be done for 'install-data-am'.
23:12:14 Making install in libcfa/arm64-nodebug
23:12:14 Making install in prelude
23:12:14 make[3]: Nothing to be done for 'install-exec-am'.
23:12:14  /usr/bin/mkdir -p '/var/lib/jenkins/workspace/Cforall_master@tmp/lib/cfa/arm64-nodebug/'
23:12:14  /usr/bin/install -c -m 644 gcc-builtins.cfa builtins.cfa extras.cfa prelude.cfa bootloader.c defines.hfa '/var/lib/jenkins/workspace/Cforall_master@tmp/lib/cfa/arm64-nodebug/'
23:12:14 Making install in src
23:12:14  /usr/bin/mkdir -p '/var/lib/jenkins/workspace/Cforall_master@tmp/lib/cfa/arm64-nodebug/'
23:12:14  /bin/bash ../libtool   --mode=install /usr/bin/install -c   libcfa.la libcfathread.la '/var/lib/jenkins/workspace/Cforall_master@tmp/lib/cfa/arm64-nodebug/'
23:12:14  /usr/bin/mkdir -p '/var/lib/jenkins/workspace/Cforall_master@tmp/include/cfa/'
23:12:14  /usr/bin/mkdir -p '/var/lib/jenkins/workspace/Cforall_master@tmp/include/cfa//stdhdr/sys'
23:12:14  /usr/bin/install -c -m 644  /var/lib/jenkins/workspace/Cforall_master/libcfa/src/stdhdr/sys/mman.h /var/lib/jenkins/workspace/Cforall_master/libcfa/src/stdhdr/sys/time.h /var/lib/jenkins/workspace/Cforall_master/libcfa/src/stdhdr/sys/socket.h '/var/lib/jenkins/workspace/Cforall_master@tmp/include/cfa//stdhdr/sys'
23:12:14  /usr/bin/mkdir -p '/var/lib/jenkins/workspace/Cforall_master@tmp/include/cfa//algorithms'
23:12:14  /usr/bin/install -c -m 644  /var/lib/jenkins/workspace/Cforall_master/libcfa/src/algorithms/range_iterator.hfa '/var/lib/jenkins/workspace/Cforall_master@tmp/include/cfa//algorithms'
23:12:14  /usr/bin/mkdir -p '/var/lib/jenkins/workspace/Cforall_master@tmp/include/cfa//concurrency/kernel'
23:12:14  /usr/bin/install -c -m 644  /var/lib/jenkins/workspace/Cforall_master/libcfa/src/concurrency/kernel/cluster.hfa /var/lib/jenkins/workspace/Cforall_master/libcfa/src/concurrency/kernel/fwd.hfa '/var/lib/jenkins/workspace/Cforall_master@tmp/include/cfa//concurrency/kernel'
23:12:14  /usr/bin/install -c -m 644  /var/lib/jenkins/workspace/Cforall_master/libcfa/src/common.hfa /var/lib/jenkins/workspace/Cforall_master/libcfa/src/fstream.hfa /var/lib/jenkins/workspace/Cforall_master/libcfa/src/heap.hfa /var/lib/jenkins/workspace/Cforall_master/libcfa/src/iostream.hfa /var/lib/jenkins/workspace/Cforall_master/libcfa/src/iterator.hfa /var/lib/jenkins/workspace/Cforall_master/libcfa/src/limits.hfa /var/lib/jenkins/workspace/Cforall_master/libcfa/src/math.hfa /var/lib/jenkins/workspace/Cforall_master/libcfa/src/memory.hfa /var/lib/jenkins/workspace/Cforall_master/libcfa/src/parseargs.hfa /var/lib/jenkins/workspace/Cforall_master/libcfa/src/parseconfig.hfa /var/lib/jenkins/workspace/Cforall_master/libcfa/src/rational.hfa /var/lib/jenkins/workspace/Cforall_master/libcfa/src/stdlib.hfa /var/lib/jenkins/workspace/Cforall_master/libcfa/src/strstream.hfa /var/lib/jenkins/workspace/Cforall_master/libcfa/src/time.hfa /var/lib/jenkins/workspace/Cforall_master/libcfa/src/Exception.hfa /var/lib/jenkins/workspace/Cforall_master/libcfa/src/bitmanip.hfa /var/lib/jenkins/workspace/Cforall_master/libcfa/src/clock.hfa /var/lib/jenkins/workspace/Cforall_master/libcfa/src/exception.hfa /var/lib/jenkins/workspace/Cforall_master/libcfa/src/exception.h /var/lib/jenkins/workspace/Cforall_master/libcfa/src/gmp.hfa /var/lib/jenkins/workspace/Cforall_master/libcfa/src/math.trait.hfa /var/lib/jenkins/workspace/Cforall_master/libcfa/src/raii.hfa /var/lib/jenkins/workspace/Cforall_master/libcfa/src/time_t.hfa /var/lib/jenkins/workspace/Cforall_master/libcfa/src/virtual_dtor.hfa '/var/lib/jenkins/workspace/Cforall_master@tmp/include/cfa//.'
23:12:14  /usr/bin/mkdir -p '/var/lib/jenkins/workspace/Cforall_master@tmp/include/cfa//concurrency'
23:12:14  /usr/bin/install -c -m 644  /var/lib/jenkins/workspace/Cforall_master/libcfa/src/concurrency/iofwd.hfa /var/lib/jenkins/workspace/Cforall_master/libcfa/src/concurrency/barrier.hfa /var/lib/jenkins/workspace/Cforall_master/libcfa/src/concurrency/alarm.hfa /var/lib/jenkins/workspace/Cforall_master/libcfa/src/concurrency/coroutine.hfa /var/lib/jenkins/workspace/Cforall_master/libcfa/src/concurrency/exception.hfa /var/lib/jenkins/workspace/Cforall_master/libcfa/src/concurrency/kernel.hfa /var/lib/jenkins/workspace/Cforall_master/libcfa/src/concurrency/locks.hfa /var/lib/jenkins/workspace/Cforall_master/libcfa/src/concurrency/monitor.hfa /var/lib/jenkins/workspace/Cforall_master/libcfa/src/concurrency/mutex.hfa /var/lib/jenkins/workspace/Cforall_master/libcfa/src/concurrency/select.hfa /var/lib/jenkins/workspace/Cforall_master/libcfa/src/concurrency/thread.hfa /var/lib/jenkins/workspace/Cforall_master/libcfa/src/concurrency/cofor.hfa /var/lib/jenkins/workspace/Cforall_master/libcfa/src/concurrency/invoke.h /var/lib/jenkins/workspace/Cforall_master/libcfa/src/concurrency/future.hfa /var/lib/jenkins/workspace/Cforall_master/libcfa/src/concurrency/once.hfa /var/lib/jenkins/workspace/Cforall_master/libcfa/src/concurrency/mutex_stmt.hfa /var/lib/jenkins/workspace/Cforall_master/libcfa/src/concurrency/channel.hfa /var/lib/jenkins/workspace/Cforall_master/libcfa/src/concurrency/actor.hfa '/var/lib/jenkins/workspace/Cforall_master@tmp/include/cfa//concurrency'
23:12:14  /usr/bin/mkdir -p '/var/lib/jenkins/workspace/Cforall_master@tmp/include/cfa//concurrency/clib'
23:12:14  /usr/bin/install -c -m 644  /var/lib/jenkins/workspace/Cforall_master/libcfa/src/concurrency/clib/cfathread.h '/var/lib/jenkins/workspace/Cforall_master@tmp/include/cfa//concurrency/clib'
23:12:14  /usr/bin/mkdir -p '/var/lib/jenkins/workspace/Cforall_master@tmp/include/cfa//device'
23:12:14  /usr/bin/install -c -m 644  /var/lib/jenkins/workspace/Cforall_master/libcfa/src/device/cpu.hfa '/var/lib/jenkins/workspace/Cforall_master@tmp/include/cfa//device'
23:12:14  /usr/bin/mkdir -p '/var/lib/jenkins/workspace/Cforall_master@tmp/include/cfa//stdhdr/libltdl'
23:12:14  /usr/bin/install -c -m 644  /var/lib/jenkins/workspace/Cforall_master/libcfa/src/stdhdr/libltdl/lt_dlloader.h '/var/lib/jenkins/workspace/Cforall_master@tmp/include/cfa//stdhdr/libltdl'
23:12:14  /usr/bin/mkdir -p '/var/lib/jenkins/workspace/Cforall_master@tmp/include/cfa//vec'
23:12:14  /usr/bin/install -c -m 644  /var/lib/jenkins/workspace/Cforall_master/libcfa/src/vec/vec.hfa /var/lib/jenkins/workspace/Cforall_master/libcfa/src/vec/vec2.hfa /var/lib/jenkins/workspace/Cforall_master/libcfa/src/vec/vec3.hfa /var/lib/jenkins/workspace/Cforall_master/libcfa/src/vec/vec4.hfa '/var/lib/jenkins/workspace/Cforall_master@tmp/include/cfa//vec'
23:12:14  /usr/bin/mkdir -p '/var/lib/jenkins/workspace/Cforall_master@tmp/include/cfa//bits'
23:12:14  /usr/bin/install -c -m 644  /var/lib/jenkins/workspace/Cforall_master/libcfa/src/bits/weakso_locks.hfa /var/lib/jenkins/workspace/Cforall_master/libcfa/src/bits/algorithm.hfa /var/lib/jenkins/workspace/Cforall_master/libcfa/src/bits/align.hfa /var/lib/jenkins/workspace/Cforall_master/libcfa/src/bits/collections.hfa /var/lib/jenkins/workspace/Cforall_master/libcfa/src/bits/debug.hfa /var/lib/jenkins/workspace/Cforall_master/libcfa/src/bits/defs.hfa /var/lib/jenkins/workspace/Cforall_master/libcfa/src/bits/locks.hfa /var/lib/jenkins/workspace/Cforall_master/libcfa/src/bits/collection.hfa /var/lib/jenkins/workspace/Cforall_master/libcfa/src/bits/stack.hfa /var/lib/jenkins/workspace/Cforall_master/libcfa/src/bits/queue.hfa /var/lib/jenkins/workspace/Cforall_master/libcfa/src/bits/sequence.hfa /var/lib/jenkins/workspace/Cforall_master/libcfa/src/bits/atomic.hfa /var/lib/jenkins/workspace/Cforall_master/libcfa/src/bits/random.hfa '/var/lib/jenkins/workspace/Cforall_master@tmp/include/cfa//bits'
23:12:14 libtool: install: /usr/bin/install -c .libs/libcfa.so.1.0.0 /var/lib/jenkins/workspace/Cforall_master@tmp/lib/cfa/arm64-nodebug/libcfa.so.1.0.0
23:12:14  /usr/bin/mkdir -p '/var/lib/jenkins/workspace/Cforall_master@tmp/include/cfa//stdhdr'
23:12:14  /usr/bin/install -c -m 644  /var/lib/jenkins/workspace/Cforall_master/libcfa/src/stdhdr/stdalign.h /var/lib/jenkins/workspace/Cforall_master/libcfa/src/stdhdr/stdio.h /var/lib/jenkins/workspace/Cforall_master/libcfa/src/stdhdr/malloc.h /var/lib/jenkins/workspace/Cforall_master/libcfa/src/stdhdr/time.h /var/lib/jenkins/workspace/Cforall_master/libcfa/src/stdhdr/signal.h /var/lib/jenkins/workspace/Cforall_master/libcfa/src/stdhdr/stdbool.h /var/lib/jenkins/workspace/Cforall_master/libcfa/src/stdhdr/unistd.h /var/lib/jenkins/workspace/Cforall_master/libcfa/src/stdhdr/stdatomic.h /var/lib/jenkins/workspace/Cforall_master/libcfa/src/stdhdr/stdint.h /var/lib/jenkins/workspace/Cforall_master/libcfa/src/stdhdr/gmp.h /var/lib/jenkins/workspace/Cforall_master/libcfa/src/stdhdr/locale.h /var/lib/jenkins/workspace/Cforall_master/libcfa/src/stdhdr/string.h /var/lib/jenkins/workspace/Cforall_master/libcfa/src/stdhdr/fenv.h /var/lib/jenkins/workspace/Cforall_master/libcfa/src/stdhdr/wchar.h /var/lib/jenkins/workspace/Cforall_master/libcfa/src/stdhdr/tgmath.h /var/lib/jenkins/workspace/Cforall_master/libcfa/src/stdhdr/math.h /var/lib/jenkins/workspace/Cforall_master/libcfa/src/stdhdr/pthread.h /var/lib/jenkins/workspace/Cforall_master/libcfa/src/stdhdr/complex.h /var/lib/jenkins/workspace/Cforall_master/libcfa/src/stdhdr/wctype.h /var/lib/jenkins/workspace/Cforall_master/libcfa/src/stdhdr/unwind.h /var/lib/jenkins/workspace/Cforall_master/libcfa/src/stdhdr/float.h /var/lib/jenkins/workspace/Cforall_master/libcfa/src/stdhdr/stdarg.h /var/lib/jenkins/workspace/Cforall_master/libcfa/src/stdhdr/stdlib.h /var/lib/jenkins/workspace/Cforall_master/libcfa/src/stdhdr/iso646.h /var/lib/jenkins/workspace/Cforall_master/libcfa/src/stdhdr/stddef.h /var/lib/jenkins/workspace/Cforall_master/libcfa/src/stdhdr/stdnoreturn.h /var/lib/jenkins/workspace/Cforall_master/libcfa/src/stdhdr/assert.h /var/lib/jenkins/workspace/Cforall_master/libcfa/src/stdhdr/ctype.h /var/lib/jenkins/workspace/Cforall_master/libcfa/src/stdhdr/errno.h /var/lib/jenkins/workspace/Cforall_master/libcfa/src/stdhdr/threads.h /var/lib/jenkins/workspace/Cforall_master/libcfa/src/stdhdr/uchar.h /var/lib/jenkins/workspace/Cforall_master/libcfa/src/stdhdr/inttypes.h /var/lib/jenkins/workspace/Cforall_master/libcfa/src/stdhdr/limits.h /var/lib/jenkins/workspace/Cforall_master/libcfa/src/stdhdr/setjmp.h '/var/lib/jenkins/workspace/Cforall_master@tmp/include/cfa//stdhdr'
23:12:14 libtool: install: (cd /var/lib/jenkins/workspace/Cforall_master@tmp/lib/cfa/arm64-nodebug && { ln -s -f libcfa.so.1.0.0 libcfa.so.1 || { rm -f libcfa.so.1 && ln -s libcfa.so.1.0.0 libcfa.so.1; }; })
23:12:14  /usr/bin/mkdir -p '/var/lib/jenkins/workspace/Cforall_master@tmp/include/cfa//collections'
23:12:14  /usr/bin/install -c -m 644  /var/lib/jenkins/workspace/Cforall_master/libcfa/src/collections/maybe.hfa /var/lib/jenkins/workspace/Cforall_master/libcfa/src/collections/pair.hfa /var/lib/jenkins/workspace/Cforall_master/libcfa/src/collections/result.hfa /var/lib/jenkins/workspace/Cforall_master/libcfa/src/collections/string.hfa /var/lib/jenkins/workspace/Cforall_master/libcfa/src/collections/string_res.hfa /var/lib/jenkins/workspace/Cforall_master/libcfa/src/collections/vector.hfa /var/lib/jenkins/workspace/Cforall_master/libcfa/src/collections/array.hfa /var/lib/jenkins/workspace/Cforall_master/libcfa/src/collections/list.hfa /var/lib/jenkins/workspace/Cforall_master/libcfa/src/collections/list2.hfa /var/lib/jenkins/workspace/Cforall_master/libcfa/src/collections/lockfree.hfa /var/lib/jenkins/workspace/Cforall_master/libcfa/src/collections/string_sharectx.hfa /var/lib/jenkins/workspace/Cforall_master/libcfa/src/collections/vector2.hfa '/var/lib/jenkins/workspace/Cforall_master@tmp/include/cfa//collections'
23:12:14 libtool: install: (cd /var/lib/jenkins/workspace/Cforall_master@tmp/lib/cfa/arm64-nodebug && { ln -s -f libcfa.so.1.0.0 libcfa.so || { rm -f libcfa.so && ln -s libcfa.so.1.0.0 libcfa.so; }; })
23:12:14 libtool: install: /usr/bin/install -c .libs/libcfa.lai /var/lib/jenkins/workspace/Cforall_master@tmp/lib/cfa/arm64-nodebug/libcfa.la
23:12:14 libtool: install: /usr/bin/install -c .libs/libcfathread.so.1.0.0 /var/lib/jenkins/workspace/Cforall_master@tmp/lib/cfa/arm64-nodebug/libcfathread.so.1.0.0
23:12:14 libtool: install: (cd /var/lib/jenkins/workspace/Cforall_master@tmp/lib/cfa/arm64-nodebug && { ln -s -f libcfathread.so.1.0.0 libcfathread.so.1 || { rm -f libcfathread.so.1 && ln -s libcfathread.so.1.0.0 libcfathread.so.1; }; })
23:12:14 libtool: install: (cd /var/lib/jenkins/workspace/Cforall_master@tmp/lib/cfa/arm64-nodebug && { ln -s -f libcfathread.so.1.0.0 libcfathread.so || { rm -f libcfathread.so && ln -s libcfathread.so.1.0.0 libcfathread.so; }; })
23:12:14 libtool: install: /usr/bin/install -c .libs/libcfathread.lai /var/lib/jenkins/workspace/Cforall_master@tmp/lib/cfa/arm64-nodebug/libcfathread.la
23:12:14 libtool: warning: remember to run 'libtool --finish /var/lib/jenkins/workspace/Cforall_master@tmp/lib/cfa/arm64-nodebug/'
23:12:14 make[3]: Nothing to be done for 'install-exec-am'.
23:12:14 make[3]: Nothing to be done for 'install-data-am'.
23:12:14 [Pipeline] }
23:12:14 [Pipeline] // dir
23:12:14 [Pipeline] }
23:12:14 [Pipeline] // stage
23:12:14 [Pipeline] sh
23:12:14 + free -h
23:12:14                total        used        free      shared  buff/cache   available
23:12:14 Mem:           502Gi       7.5Gi       491Gi       3.5Mi       5.4Gi       495Gi
23:12:14 Swap:          127Gi          0B       127Gi
23:12:14 [Pipeline] sh
23:12:14 + ulimit -a
23:12:14 time(seconds)        unlimited
23:12:14 file(blocks)         unlimited
23:12:14 data(kbytes)         unlimited
23:12:14 stack(kbytes)        8192
23:12:14 coredump(blocks)     0
23:12:14 memory(kbytes)       unlimited
23:12:14 locked memory(kbytes) 65876424
23:12:14 process              2058180
23:12:14 nofiles              1048576
23:12:14 vmemory(kbytes)      unlimited
23:12:14 locks                unlimited
23:12:14 rtprio               0
23:12:14 [Pipeline] echo
23:12:14  -------- Test: Debug -------- 
23:12:14 [Pipeline] stage
23:12:14 [Pipeline] { (Test: Debug)
23:12:14 [Pipeline] dir
23:12:14 Running in /var/lib/jenkins/workspace/Cforall_master@tmp
23:12:14 [Pipeline] {
23:12:14 [Pipeline] sh
23:12:14 + nproc
23:12:14 + make -j 96 --no-print-directory -C tests timeout=600 global-timeout=14400 tests debug=yes archive-errors=/var/lib/jenkins/workspace/Cforall_master@tmp/tests/crashes/full-debug
23:12:14 Running 375 tests on 96 cores (arm64 - debug)
23:12:14        	array-ERR3                           PASSED     C 0:00.117 - R n/a
23:12:14        	array-ERR2                           PASSED     C 0:00.129 - R n/a
23:12:14        	...ollections/language-dim-mismatch  PASSED     C 0:00.361 - R n/a
23:12:14        	concurrency/mainError                PASSED     C 0:00.463 - R n/a
23:12:14        	concurrency/keywordErrors            PASSED     C 0:00.653 - R n/a
23:12:14        	array-collections/symtab-collision   PASSED     C 0:00.886 - R n/a
23:12:14        	castError                            PASSED     C 0:00.903 - R n/a
23:12:14        	concurrency/ctor-check               PASSED     C 0:01.209 - R n/a
23:12:14        	array-collections/safety-summary     PASSED     C 0:01.294 - R n/a
23:12:14        	attr-priority                        PASSED     C 0:01.484 - R 0:00.004
23:12:14        	array-ERR1                           PASSED     C 0:01.563 - R n/a
23:12:14        	array                                PASSED     C 0:01.725 - R 0:00.039
23:12:14        	array-collections/c-dependent        PASSED     C 0:01.741 - R 0:00.071
23:12:14        	cast                                 PASSED     C 0:01.730 - R 0:00.133
23:12:14        	array-collections/array-raii-c       PASSED     C 0:01.899 - R 0:00.046
23:12:14        	castReturn                           PASSED     C 0:01.899 - R 0:00.075
23:12:14        	builtins/sync                        PASSED     C 0:01.993 - R 0:00.023
23:12:14        	array-collections/dimexpr-match-c    PASSED     C 0:02.146 - R 0:00.022
23:12:14        	array-collections/array-sbscr-types  PASSED     C 0:02.613 - R 0:00.128
23:12:14        	concurrency/clib_tls                 PASSED     C 0:02.757 - R 0:00.072
23:12:14        	array-collections/dimexpr-match-cfa  PASSED     C 0:02.923 - R 0:00.076
23:12:14        	...ns/vector-err-retn-perm-it-byval  PASSED     C 0:03.068 - R n/a
23:12:14        	array-collections/array-basic        PASSED     C 0:03.118 - R 0:00.127
23:12:14        	concurrency/clib                     PASSED     C 0:02.852 - R 0:00.377
23:12:14        	array-collections/boxed              PASSED     C 0:03.282 - R 0:00.120
23:12:14        	...ns/vector-err-pass-perm-it-byval  PASSED     C 0:03.641 - R n/a
23:12:14        	avl_test                             PASSED     C 0:05.406 - R 0:00.021
23:12:14        	collections/string-operator-ERR16    PASSED     C 0:05.439 - R n/a
23:12:14        	collections/string-operator-ERR15    PASSED     C 0:05.472 - R n/a
23:12:14        	collections/string-operator-ERR11    PASSED     C 0:05.542 - R n/a
23:12:14        	collections/string-operator-ERR13    PASSED     C 0:05.589 - R n/a
23:12:14        	collections/string-operator-ERR09    PASSED     C 0:05.645 - R n/a
23:12:14        	...urrency/pthread/pthread_key_test  PASSED     C 0:04.193 - R 0:00.037
23:12:14        	collections/vector-demo              PASSED     C 0:06.164 - R 0:00.024
23:12:14        	alloc-ERROR                          PASSED     C 0:06.244 - R n/a
23:12:14        	algorithms/range_test                PASSED     C 0:06.859 - R 0:00.037
23:12:14        	complex                              PASSED     C 0:07.110 - R 0:00.083
23:12:14        	array-collections/accordion          PASSED     C 0:07.309 - R 0:00.024
23:12:14        	array-collections/array-raii-cfa     PASSED     C 0:07.321 - R 0:00.023
23:12:14        	collections/string-gc                PASSED     C 0:07.401 - R 0:00.024
23:12:14        	collections/string-istream           PASSED     C 0:08.459 - R 0:00.021
23:12:14        	concurrency/cluster                  PASSED     C 0:08.394 - R 0:00.070
23:12:14        	concurrency/futures/abandon          PASSED     C 0:08.623 - R 0:00.227
23:12:14        	collections/stack                    PASSED     C 0:09.265 - R 0:00.023
23:12:14        	concurrency/futures/basic            PASSED     C 0:09.112 - R 0:00.176
23:12:14        	concurrency/park/contention          PASSED     C 0:08.752 - R 0:00.123
23:12:14        	concurrency/park/start_parked        PASSED     C 0:08.531 - R 0:00.127
23:12:14        	collections/multi_list               PASSED     C 0:09.856 - R 0:00.022
23:12:14        	collections/string-compare           PASSED     C 0:10.043 - R 0:00.046
23:12:14        	collections/string-ostream           PASSED     C 0:10.156 - R 0:00.124
23:12:14        	collections/queue                    PASSED     C 0:10.594 - R 0:00.076
23:12:14        	collections/string-ctx-manage        PASSED     C 0:10.805 - R 0:00.042
23:12:14        	collections/sequence                 PASSED     C 0:10.823 - R 0:00.044
23:12:14        	collections/string-istream-manip     PASSED     C 0:11.153 - R 0:00.072
23:12:14        	concurrency/cofor                    PASSED     C 0:11.143 - R 0:00.130
23:12:14        	collections/string-operator          PASSED     C 0:11.362 - R 0:00.075
23:12:14        	collections/string-overwrite         PASSED     C 0:12.130 - R 0:00.076
23:12:14        	...ections/string-overwrite-noshare  PASSED     C 0:12.183 - R 0:00.070
23:12:14        	concurrency/migrate                  PASSED     C 0:12.022 - R 0:00.228
23:12:14        	concurrency/examples/matrixSum       PASSED     C 0:12.250 - R 0:00.125
23:12:14        	concurrency/join                     PASSED     C 0:12.393 - R 0:00.040
23:12:14        	concurrency/examples/gortn           PASSED     C 0:12.328 - R 0:00.120
23:12:14        	concurrency/examples/datingService   PASSED     C 0:12.471 - R 0:00.178
23:12:14        	concurrency/coroutineYield           PASSED     C 0:12.989 - R 0:00.074
23:12:14        	const-init                           PASSED     C 0:01.624 - R 0:00.074
23:12:14        	concurrency/park/force_preempt       PASSED     C 0:12.146 - R 0:00.421
23:12:14        	alloc                                PASSED     C 0:13.487 - R 0:00.072
23:12:14        	...pthread/pthread_demo_create_join  PASSED     C 0:11.941 - R 0:00.076
23:12:14        	...rrency/pthread/pthread_attr_test  PASSED     C 0:12.173 - R 0:00.125
23:12:14        	...rrency/pthread/pthread_once_test  PASSED     C 0:12.003 - R 0:00.070
23:12:14        	...rrency/pthread/pthread_cond_test  PASSED     C 0:12.288 - R 0:00.180
23:12:14        	...ions/string-api-coverage-noshare  PASSED     C 0:14.083 - R 0:00.072
23:12:14        	collections/string-api-coverage      PASSED     C 0:14.045 - R 0:00.121
23:12:14        	const-ref                            PASSED     C 0:01.992 - R 0:00.024
23:12:14        	concurrency/readyQ/leader_spin       PASSED     C 0:11.886 - R 0:00.831
23:12:14        	concurrency/barrier/order            PASSED     C 0:14.666 - R 0:00.182
23:12:14        	concurrency/waitfor/parse            PASSED     C 0:07.475 - R 0:00.040
23:12:14        	concurrency/examples/quickSort       PASSED     C 0:14.830 - R 0:00.039
23:12:14        	concurrency/futures/wait_any         PASSED     C 0:14.971 - R 0:00.125
23:12:14        	concurrency/once                     PASSED     C 0:14.585 - R 0:00.327
23:12:14        	concurrency/barrier/last             PASSED     C 0:15.117 - R 0:00.335
23:12:14        	concurrency/mutexstmt/tuple          PASSED     C 0:15.277 - R 0:00.039
23:12:14        	ctrl-flow/labelledExit               PASSED     C 0:01.740 - R 0:00.072
23:12:14        	concurrency/suspend_then             PASSED     C 0:12.858 - R 0:00.122
23:12:14        	ctrl-flow/loop-inc                   PASSED     C 0:01.720 - R 0:00.122
23:12:14        	concurrency/barrier/generation       PASSED     C 0:14.519 - R 0:01.630
23:12:14        	concurrency/sleep                    PASSED     C 0:12.624 - R 0:01.231
23:12:14        	enum_tests/lvalue                    PASSED     C 0:00.786 - R n/a
23:12:14        	concurrency/signal/wait              PASSED     C 0:13.228 - R 0:00.940
23:12:14        	enum                                 PASSED     C 0:01.751 - R 0:00.071
23:12:14        	concurrency/thread                   PASSED     C 0:13.905 - R 0:00.071
23:12:14        	...cy/unified_locking/pthread_locks  PASSED     C 0:11.186 - R 0:00.376
23:12:14        	alloc2                               PASSED     C 0:17.118 - R 0:00.124
23:12:14        	concurrency/lockfree_stack           PASSED     C 0:11.922 - R 0:05.344
23:12:14        	errors/declaration                   PASSED     C 0:00.162 - R n/a
23:12:14        	errors/scope-type                    PASSED     C 0:00.266 - R n/a
23:12:14        	errors/signature                     PASSED     C 0:00.208 - R n/a
23:12:14        	concurrency/waitfor/else             PASSED     C 0:10.333 - R 0:00.072
23:12:14        	concurrency/mutexstmt/monitors       PASSED     C 0:09.302 - R 0:08.260
23:12:14        	concurrency/readyQ/barrier_sleeper   PASSED     C 0:14.512 - R 0:01.225
23:12:14        	...ency/unified_locking/exp_backoff  PASSED     C 0:14.446 - R 0:00.120
23:12:14        	.../unified_locking/block_spin_lock  PASSED     C 0:14.423 - R 0:00.171
23:12:14        	concurrency/actors/static            PASSED     C 0:17.507 - R 0:00.376
23:12:14        	enum_tests/inc-dec                   PASSED     C 0:01.880 - R 0:00.127
23:12:14        	designations                         PASSED     C 0:03.060 - R 0:00.045
23:12:14        	concurrency/actors/inline            PASSED     C 0:17.991 - R 0:00.069
23:12:14        	errors/scope                         PASSED     C 0:00.829 - R n/a
23:12:14        	enum_tests/funcEnum                  PASSED     C 0:02.639 - R 0:00.041
23:12:14        	concurrency/actors/poison            PASSED     C 0:18.174 - R 0:00.174
23:12:14        	concurrency/actors/executor          PASSED     C 0:18.126 - R 0:00.227
23:12:14        	concurrency/actors/inherit           PASSED     C 0:18.244 - R 0:00.124
23:12:14        	concurrency/actors/types             PASSED     C 0:18.554 - R 0:00.120
23:12:14        	...ncy/unified_locking/timeout_lock  PASSED     C 0:11.191 - R 0:01.433
23:12:14        	.../unified_locking/fast_block_lock  PASSED     C 0:15.345 - R 0:00.224
23:12:14        	concurrency/actors/pingpong          PASSED     C 0:18.863 - R 0:00.172
23:12:14        	eval                                 PASSED     C 0:01.439 - R 0:00.042
23:12:14        	concurrency/waitfor/barge            PASSED     C 0:12.400 - R 0:00.621
23:12:14        	concurrency/actors/matrixMultiply    PASSED     C 0:17.989 - R 0:01.381
23:12:14        	concurrency/signal/block             PASSED     C 0:12.932 - R 0:04.749
23:12:14        	enum_tests/structEnum                PASSED     C 0:02.722 - R 0:00.041
23:12:14        	...urrency/waitfor/lexical_priority  PASSED     C 0:12.375 - R 0:00.071
23:12:14        	exceptions/try-ctrl-flow             PASSED     C 0:00.536 - R n/a
23:12:14        	...nified_locking/simple_owner_lock  PASSED     C 0:14.379 - R 0:00.119
23:12:14        	counter                              PASSED     C 0:06.851 - R 0:00.072
23:12:14        	exceptions/type-check                PASSED     C 0:00.692 - R n/a
23:12:14        	copyfile                             PASSED     C 0:08.143 - R 0:00.071
23:12:14        	...fied_locking/mcs_block_spin_lock  PASSED     C 0:14.352 - R 0:00.982
23:12:14        	ctrl-flow/fallthrough                PASSED     C 0:07.238 - R 0:00.074
23:12:14        	coroutine/devicedriver               PASSED     C 0:08.579 - R 0:00.070
23:12:14        	configs/parsebools                   PASSED     C 0:09.720 - R 0:00.379
23:12:14        	ctrl-flow/break-misc                 PASSED     C 0:07.398 - R 0:00.039
23:12:14        	concurrency/signal/disjoint          PASSED     C 0:12.906 - R 0:06.044
23:12:14        	exceptions/try-leave-catch           PASSED     C 0:01.737 - R 0:00.020
23:12:14        	configs/parseconfig                  PASSED     C 0:09.946 - R 0:00.072
23:12:14        	coroutine/fmtLines                   PASSED     C 0:08.779 - R 0:00.036
23:12:14        	ctrl-flow/ifwhileCtl                 PASSED     C 0:07.322 - R 0:00.039
23:12:14        	coroutine/pingpong                   PASSED     C 0:08.762 - R 0:00.118
23:12:14        	configs/usage                        PASSED     C 0:10.184 - R 0:00.071
23:12:14        	concurrency/waitfor/statment         PASSED     C 0:12.972 - R 0:00.120
23:12:14        	exceptions/message                   PASSED     C 0:03.262 - R 0:00.042
23:12:14        	ctrl-flow/loop_else                  PASSED     C 0:07.426 - R 0:00.070
23:12:14        	coroutine/raii                       PASSED     C 0:08.518 - R 0:00.072
23:12:14        	expression                           PASSED     C 0:01.758 - R 0:00.122
23:12:14        	concurrency/futures/typed            PASSED     C 0:21.561 - R 0:00.222
23:12:14        	coroutine/runningTotal               PASSED     C 0:08.516 - R 0:00.122
23:12:14        	concurrency/preempt                  PASSED     C 0:13.905 - R 0:07.013
23:12:14        	concurrency/waitfor/when             PASSED     C 0:12.995 - R 0:00.476
23:12:14        	concurrency/waituntil/timeout        PASSED     C 0:07.921 - R 0:03.290
23:12:14        	coroutine/fibonacci                  PASSED     C 0:09.674 - R 0:00.037
23:12:14        	ctrl-flow/goto                       PASSED     C 0:08.764 - R 0:00.071
23:12:14        	enum_tests/anonymous                 PASSED     C 0:07.087 - R 0:00.076
23:12:14        	global-monomorph                     PASSED     C 0:01.480 - R 0:00.024
23:12:14        	init1-ERROR                          PASSED     C 0:00.859 - R n/a
23:12:14        	ctrl-flow/loop_else-WRN1             PASSED     C 0:08.402 - R 0:00.004
23:12:14        	...rrency/pthread/pthread_demo_lock  PASSED     C 0:12.006 - R 0:08.931
23:12:14        	identFuncDeclarator                  PASSED     C 0:01.517 - R 0:00.037
23:12:14        	identParamDeclarator                 PASSED     C 0:01.497 - R 0:00.024
23:12:14        	init1                                PASSED     C 0:01.534 - R 0:00.021
23:12:14        	coroutine/prodcons                   PASSED     C 0:10.561 - R 0:00.037
23:12:14        	enum_tests/input                     PASSED     C 0:07.257 - R 0:00.034
23:12:14        	enum_tests/enumInlineValue           PASSED     C 0:07.739 - R 0:00.124
23:12:14        	ctrl-flow/loopctrl                   PASSED     C 0:08.813 - R 0:00.021
23:12:14        	enum_tests/typedIntEnum              PASSED     C 0:06.721 - R 0:00.040
23:12:14        	enum_tests/stringEnum                PASSED     C 0:06.994 - R 0:00.021
23:12:14        	include/vector-sequence              PASSED     C 0:02.182 - R 0:00.040
23:12:14        	enum_tests/voidEnum                  PASSED     C 0:06.866 - R 0:00.046
23:12:14        	limits                               PASSED     C 0:01.591 - R 0:00.042
23:12:14        	div                                  PASSED     C 0:09.523 - R 0:00.041
23:12:14        	include/vector-collections           PASSED     C 0:03.103 - R 0:00.070
23:12:14        	linking/nostdlib                     PASSED     C 0:01.506 - R 0:00.027
23:12:14        	exceptions/conditional               PASSED     C 0:07.096 - R 0:00.123
23:12:14        	exceptions/data-except               PASSED     C 0:07.010 - R 0:00.073
23:12:14        	exceptions/finally                   PASSED     C 0:06.951 - R 0:00.036
23:12:14        	exceptions/defaults                  PASSED     C 0:07.268 - R 0:00.021
23:12:14        	exceptions/interact                  PASSED     C 0:07.064 - R 0:00.040
23:12:14        	enum_tests/planet                    PASSED     C 0:09.133 - R 0:00.040
23:12:14        	nested-types-ERR1                    PASSED     C 0:00.170 - R n/a
23:12:14        	device/cpu                           PASSED     C 0:10.523 - R 0:00.119
23:12:14        	exceptions/polymorphic               PASSED     C 0:07.022 - R 0:00.127
23:12:14        	concurrency/waitfor/dtor             PASSED     C 0:12.143 - R 0:06.553
23:12:14        	linkonce                             PASSED     C 0:01.699 - R 0:00.024
23:12:14        	nested-types-ERR2                    PASSED     C 0:00.368 - R n/a
23:12:14        	exceptions/trash                     PASSED     C 0:06.861 - R 0:00.073
23:12:14        	enum_tests/position                  PASSED     C 0:09.257 - R 0:00.077
23:12:14        	exceptions/resume                    PASSED     C 0:07.413 - R 0:00.036
23:12:14        	exceptions/cancel/coroutine          PASSED     C 0:08.506 - R 0:00.071
23:12:14        	concurrency/channels/daisy_chain     PASSED     C 0:16.131 - R 0:10.120
23:12:14        	opt-params                           PASSED     C 0:00.119 - R n/a
23:12:14        	exceptions/conditional-threads       PASSED     C 0:08.432 - R 0:00.125
23:12:14        	exceptions/terminate                 PASSED     C 0:07.313 - R 0:00.076
23:12:14        	exceptions/finally-threads           PASSED     C 0:08.483 - R 0:00.035
23:12:14        	nested-types                         PASSED     C 0:01.465 - R 0:00.025
23:12:14        	concurrency/channels/zero_size       PASSED     C 0:16.547 - R 0:10.232
23:12:14        	concurrency/channels/hot_potato      PASSED     C 0:16.643 - R 0:10.125
23:12:14        	exceptions/virtual-poly              PASSED     C 0:06.971 - R 0:00.022
23:12:14        	concurrency/channels/pub_sub         PASSED     C 0:16.731 - R 0:10.164
23:12:14        	maybe                                PASSED     C 0:01.918 - R 0:00.074
23:12:14        	fstream_test                         PASSED     C 0:06.781 - R 0:00.039
23:12:14        	polybits                             PASSED     C 0:00.323 - R n/a
23:12:14        	nowarn/no-autogen                    PASSED     C 0:01.577 - R 0:00.077
23:12:14        	nowarn/exception                     PASSED     C 0:01.669 - R 0:00.039
23:12:14        	concurrency/channels/churn           PASSED     C 0:17.118 - R 0:10.159
23:12:14        	exceptions/defaults-threads          PASSED     C 0:09.251 - R 0:00.120
23:12:14        	nowarn/zero-thunk                    PASSED     C 0:01.434 - R 0:00.125
23:12:14        	generator/fibonacci                  PASSED     C 0:06.844 - R 0:00.037
23:12:14        	nowarn/array                         PASSED     C 0:01.788 - R 0:00.040
23:12:14        	nowarn/printf-sizeof                 PASSED     C 0:01.738 - R 0:00.042
23:12:14        	nowarn/unused                        PASSED     C 0:01.640 - R 0:00.046
23:12:14        	operators                            PASSED     C 0:01.501 - R 0:00.070
23:12:14        	poly-member                          PASSED     C 0:01.375 - R 0:00.040
23:12:14        	genericUnion                         PASSED     C 0:06.792 - R 0:00.021
23:12:14        	poly-bare-assn                       PASSED     C 0:01.567 - R 0:00.040
23:12:14        	concurrency/waitfor/recurse          PASSED     C 0:12.744 - R 0:07.662
23:12:14        	poly-d-cycle                         PASSED     C 0:01.516 - R 0:00.072
23:12:14        	numericConstants                     PASSED     C 0:01.732 - R 0:00.040
23:12:14        	generator/suspend_then               PASSED     C 0:06.882 - R 0:00.038
23:12:14        	linking/exception-nothreads          PASSED     C 0:04.999 - R 0:00.039
23:12:14        	exceptions/resume-threads            PASSED     C 0:09.094 - R 0:00.069
23:12:14        	forall                               PASSED     C 0:07.834 - R 0:00.041
23:12:14        	poly-many-arsz                       PASSED     C 0:01.756 - R 0:00.037
23:12:14        	raii/ctor-autogen-ERR1               PASSED     C 0:00.936 - R n/a
23:12:14        	exceptions/terminate-threads         PASSED     C 0:08.929 - R 0:00.123
23:12:14        	poly-selection                       PASSED     C 0:01.434 - R 0:00.073
23:12:14        	hello                                PASSED     C 0:06.946 - R 0:00.074
23:12:14        	include/stdincludes                  PASSED     C 0:06.755 - R 0:00.021
23:12:14        	concurrency/channels/ping_pong       PASSED     C 0:18.130 - R 0:10.072
23:12:14        	identity                             PASSED     C 0:06.858 - R 0:00.040
23:12:14        	poly-o-cycle                         PASSED     C 0:01.687 - R 0:00.121
23:12:14        	concurrency/channels/contend         PASSED     C 0:18.157 - R 0:10.219
23:12:14        	raii/partial-ERR1                    PASSED     C 0:00.980 - R n/a
23:12:14        	poly-self-cycle                      PASSED     C 0:01.710 - R 0:00.036
23:12:14        	generator/fmtLines                   PASSED     C 0:07.587 - R 0:00.125
23:12:14        	exceptions/virtual-cast              PASSED     C 0:08.821 - R 0:00.077
23:12:14        	typedefRedef-ERR1                    PASSED     C 0:00.196 - R n/a
23:12:14        	concurrency/waituntil/basic_else     PASSED     C 0:19.484 - R 0:00.037
23:12:14        	raii/partial                         PASSED     C 0:01.420 - R 0:00.039
23:12:14        	include/vector-fstream               PASSED     C 0:07.234 - R 0:00.039
23:12:14        	var-assert                           PASSED     C 0:00.260 - R n/a
23:12:14        	raii/typeof-member                   PASSED     C 0:01.520 - R 0:00.037
23:12:14        	quasiKeyword                         PASSED     C 0:02.317 - R 0:00.125
23:12:14        	exceptions/fibonacci_nonlocal        PASSED     C 0:11.207 - R 0:00.127
23:12:14        	concurrency/futures/future_except    PASSED     C 0:29.256 - R 0:00.074
23:12:14        	raii/init_once                       PASSED     C 0:02.054 - R 0:00.078
23:12:14        	switch                               PASSED     C 0:01.410 - R 0:00.130
23:12:14        	io/eofType                           PASSED     C 0:07.714 - R 0:00.127
23:12:14        	tuple/tupleCast                      PASSED     C 0:01.481 - R 0:00.059
23:12:14        	concurrency/channels/big_elems       PASSED     C 0:17.078 - R 0:12.738
23:12:14        	meta/fork+exec                       PASSED     C 0:04.637 - R 0:00.177
23:12:14        	tuple/tupleFunction                  PASSED     C 0:01.750 - R 0:00.026
23:12:14        	smart-pointers                       PASSED     C 0:01.995 - R 0:00.076
23:12:14        	simpleGenericTriple                  PASSED     C 0:02.078 - R 0:00.069
23:12:14        	raii/ctor-autogen                    PASSED     C 0:02.882 - R 0:00.054
23:12:14        	result                               PASSED     C 0:02.177 - R 0:00.137
23:12:14        	typedefRedef                         PASSED     C 0:01.703 - R 0:00.063
23:12:14        	tuple/tuplePolymorphism              PASSED     C 0:01.962 - R 0:00.059
23:12:14        	exceptions/cancel/thread             PASSED     C 0:12.582 - R 0:00.074
23:12:14        	tuple/tupleMember                    PASSED     C 0:02.017 - R 0:00.039
23:12:14        	typeof                               PASSED     C 0:01.820 - R 0:00.023
23:12:14        	linking/exception-withthreads        PASSED     C 0:07.168 - R 0:00.081
23:12:14        	exceptions/cor_resumer               PASSED     C 0:12.731 - R 0:00.060
23:12:14        	withconflict                         PASSED     C 0:00.840 - R n/a
23:12:14        	variableDeclarator                   PASSED     C 0:01.866 - R 0:00.049
23:12:14        	linking/mangling/anon                PASSED     C 0:07.430 - R 0:00.036
23:12:14        	function-operator                    PASSED     C 0:10.363 - R 0:00.077
23:12:14        	warnings/self-assignment             PASSED     C 0:01.464 - R 0:00.004
23:12:14        	...collections/dimexpr-match-c-ERRS  PASSED     C 0:01.048 - R n/a
23:12:14        	exceptions/pingpong_nonlocal         PASSED     C 0:12.883 - R 0:00.125
23:12:14        	KRfunctions                          PASSED     C 0:01.502 - R 0:00.005
23:12:14        	voidPtr                              PASSED     C 0:01.745 - R 0:00.124
23:12:14        	errors/completeType                  PASSED     C 0:00.932 - R n/a
23:12:14        	list/dlist-insert-remove             PASSED     C 0:07.661 - R 0:00.071
23:12:14        	raii/memberCtors-ERR1                PASSED     C 0:04.692 - R n/a
23:12:14        	declarationSpecifier                 PASSED     C 0:01.408 - R 0:00.008
23:12:14        	list/dlist2-insert-remove            PASSED     C 0:07.776 - R 0:00.077
23:12:14        	...llections/dimexpr-match-cfa-ERRS  PASSED     C 0:02.006 - R n/a
23:12:14        	literals                             PASSED     C 0:07.818 - R 0:00.048
23:12:14        	linking/io-acquire                   PASSED     C 0:09.150 - R 0:00.023
23:12:14        	raii/dtor-early-exit-ERR2            PASSED     C 0:05.307 - R n/a
23:12:14        	collections/atomic_mpsc              PASSED     C 0:12.406 - R 0:20.371
23:12:14        	raii/dtor-early-exit-ERR1            PASSED     C 0:05.481 - R n/a
23:12:14        	io/io                                PASSED     C 0:10.792 - R 0:00.071
23:12:14        	extension                            PASSED     C 0:01.430 - R 0:00.002
23:12:14        	linking/nothreads                    PASSED     C 0:09.247 - R 0:00.071
23:12:14        	attributes                           PASSED     C 0:02.432 - R 0:00.002
23:12:14        	tuple/tupleVariadic                  PASSED     C 0:04.776 - R 0:00.037
23:12:14        	io/manipulatorsOutput4               PASSED     C 0:10.296 - R 0:00.071
23:12:14        	linking/weakso_nothd                 PASSED     C 0:09.269 - R 0:00.022
23:12:14        	gccExtensions                        PASSED     C 0:01.541 - R 0:00.005
23:12:14        	io/manipulatorsInput-uchunk          PASSED     C 0:10.535 - R 0:00.122
23:12:14        	meta/arch                            PASSED     C 0:00.839 - R n/a
23:12:14        	functions                            PASSED     C 0:01.911 - R 0:00.002
23:12:14        	arithmeticConversions                PASSED     C 0:03.487 - R 0:00.037
23:12:14        	zero_one-ERR1                        PASSED     C 0:03.764 - R n/a
23:12:14        	polymorphism                         PASSED     C 0:07.100 - R 0:00.039
23:12:14        	raii/globals                         PASSED     C 0:06.838 - R 0:00.039
23:12:14        	meta/dumpable                        PASSED     C 0:09.245 - R 0:00.039
23:12:14        	raii/boxed-types                     PASSED     C 0:07.153 - R 0:00.124
23:12:14        	raii/memberCtors                     PASSED     C 0:06.969 - R 0:00.036
23:12:14        	quotedKeyword                        PASSED     C 0:07.449 - R 0:00.037
23:12:14        	io/io-acquire-in                     PASSED     C 0:12.198 - R 0:00.169
23:12:14        	concurrency/waituntil/one_chan       PASSED     C 0:13.885 - R 0:10.423
23:12:14        	tuplearray                           PASSED     C 0:06.816 - R 0:00.037
23:12:14        	malloc                               PASSED     C 0:10.465 - R 0:00.038
23:12:14        	concurrency/preempt2                 PASSED     C 0:12.655 - R 0:21.391
23:12:14        	sizeof                               PASSED     C 0:07.358 - R 0:00.035
23:12:14        	references                           PASSED     C 0:07.462 - R 0:00.038
23:12:14        	io/io-acquire-out                    PASSED     C 0:12.694 - R 0:00.171
23:12:14        	strstream                            PASSED     C 0:07.341 - R 0:00.038
23:12:14        	shortCircuit                         PASSED     C 0:07.612 - R 0:00.036
23:12:14        	linking/withthreads                  PASSED     C 0:11.657 - R 0:00.035
23:12:14        	tuple/tupleAssign                    PASSED     C 0:07.731 - R 0:00.037
23:12:14        	io/io-acquire2                       PASSED     C 0:13.540 - R 0:00.375
23:12:14        	concurrency/waituntil/channel_close  PASSED     C 0:17.226 - R 0:10.060
23:12:14        	time                                 PASSED     C 0:08.475 - R 0:00.040
23:12:14        	zero_one                             PASSED     C 0:06.857 - R 0:00.035
23:12:14        	vector                               PASSED     C 0:08.277 - R 0:00.038
23:12:14        	io/away_fair                         FAILED with code -6    C 0:14.846 - R 0:00.269
23:12:14 starting
23:12:14 100
23:12:14 200
23:12:14 300
23:12:14 400
23:12:14 500
23:12:14 600
23:12:14 700
23:12:14 800
23:12:14 900
23:12:14 1000
23:12:14 done
23:12:14 Processor (0xfffff7fb12c0) tearing down ring with 4294967295 entries allocated but not submitted, out of 256
23:12:14 Cforall Runtime error (UNIX pid:138368): 
23:12:14 Stack back trace for: /var/lib/jenkins/workspace/Cforall_master@tmp/libcfa/arm64-debug/src/.libs/libcfa.so.1
23:12:14 (0) /var/lib/jenkins/workspace/Cforall_master@tmp/libcfa/arm64-debug/src/.libs/libcfa.so.1 :  + 0xef2f8  [0xfffff7e5f2f8]
23:12:14 (1) /var/lib/jenkins/workspace/Cforall_master@tmp/libcfa/arm64-debug/src/.libs/libcfa.so.1 : __cabi_abort + 0  [0xfffff7e5eb10]
23:12:14 (2) /var/lib/jenkins/workspace/Cforall_master@tmp/libcfa/arm64-debug/src/.libs/libcfa.so.1 : _X4endsFv_S8ofstream__1 + 0x88  [0xfffff7dae888]
23:12:14 (3) /var/lib/jenkins/workspace/Cforall_master@tmp/libcfa/arm64-debug/src/.libs/libcfa.so.1 : _X15_operator_bitorQ1_0_0_1__X19basic_ostream_tableKS18basic_ostream_data_BD0__Fv_BD0j__1 + 0x38  [0xfffff7db8e70]
23:12:14 (4) /var/lib/jenkins/workspace/Cforall_master@tmp/libcfa/arm64-debug/src/.libs/libcfathread.so.1 :  + 0x4b7dc  [0xfffff7f3b7dc]
23:12:14 (5) /var/lib/jenkins/workspace/Cforall_master@tmp/libcfa/arm64-debug/src/.libs/libcfathread.so.1 :  + 0x4a63c  [0xfffff7f3a63c]
23:12:14 (6) /var/lib/jenkins/workspace/Cforall_master@tmp/libcfa/arm64-debug/src/.libs/libcfathread.so.1 :  + 0x4bbd8  [0xfffff7f3bbd8]
23:12:14 (7) /var/lib/jenkins/workspace/Cforall_master@tmp/libcfa/arm64-debug/src/.libs/libcfathread.so.1 :  + 0x56ebc  [0xfffff7f46ebc]
23:12:14 (8) /lib/ld-linux-aarch64.so.1 :  + 0xf00  [0xfffff7fbef00]
23:12:14 (9) /lib/ld-linux-aarch64.so.1 :  + 0x4910  [0xfffff7fc2910]
23:12:14 (10) /lib/aarch64-linux-gnu/libc.so.6 :  + 0x3f228  [0xfffff7aff228]
23:12:14 
23:12:14 warning: Can't open file anon_inode:[io_uring] which was expanded to anon_inode:[io_uring] during file-backed mapping note processing
23:12:14 [New LWP 138368]
23:12:14 [Thread debugging using libthread_db enabled]
23:12:14 Using host libthread_db library "/lib/aarch64-linux-gnu/libthread_db.so.1".
23:12:14 Core was generated by `/var/lib/jenkins/workspace/Cforall_master@tmp/tests/io/away_fair'.
23:12:14 Program terminated with signal SIGABRT, Aborted.
23:12:14 #0  __pthread_kill_implementation (threadid=281474842402240, signo=signo@entry=6, no_tid=no_tid@entry=0) at ./nptl/pthread_kill.c:44
23:12:14 
23:12:14 warning: 44	./nptl/pthread_kill.c: No such file or directory
23:12:14 -----
23:12:14 #0  __pthread_kill_implementation (threadid=281474842402240, signo=signo@entry=6, no_tid=no_tid@entry=0) at ./nptl/pthread_kill.c:44
23:12:14 #1  0x0000fffff7b47540 in __pthread_kill_internal (signo=6, threadid=<optimized out>) at ./nptl/pthread_kill.c:78
23:12:14 #2  0x0000fffff7afcb3c in __GI_raise (sig=sig@entry=6) at ../sysdeps/posix/raise.c:26
23:12:14 #3  0x0000fffff7ae7e00 in __GI_abort () at ./stdlib/abort.c:79
23:12:14 #4  0x0000fffff7e5f058 in _X7__abortFv_bPKcY17__builtin_va_list__1 (_X11signalAbortb_1=true, _X3fmtPKc_1=0xfffff7e7e760 "Application interrupted by signal: %s.\n", _X4argsY17__builtin_va_list_1=...) at /var/lib/jenkins/workspace/Cforall_master/libcfa/src/interpose.cfa:263
23:12:14 #5  0x0000fffff7e5f2f8 in _X5abortFv_bPKc__1 (_X11signalAbortb_1=true, _X3fmtPKc_1=0xfffff7e7e760 "Application interrupted by signal: %s.\n") at /var/lib/jenkins/workspace/Cforall_master/libcfa/src/interpose.cfa:301
23:12:14 #6  0x0000fffff7e5f4bc in _X15sigHandler_termFv_iPS21__anonymous_siginfo_tPS10ucontext_t__1 (_X3sigi_1=6, _X3sfpPS21__anonymous_siginfo_t_1=0xfffff7ee1f30 <stack+60832>, _X3cxtPS10ucontext_t_1=0xfffff7ee1fb0 <stack+60960>) at /var/lib/jenkins/workspace/Cforall_master/libcfa/src/interpose.cfa:337
23:12:14 #7  <signal handler called>
23:12:14 #8  __pthread_kill_implementation (threadid=281474842402240, signo=signo@entry=6, no_tid=no_tid@entry=0) at ./nptl/pthread_kill.c:44
23:12:14 #9  0x0000fffff7b47540 in __pthread_kill_internal (signo=6, threadid=<optimized out>) at ./nptl/pthread_kill.c:78
23:12:14 #10 0x0000fffff7afcb3c in __GI_raise (sig=sig@entry=6) at ../sysdeps/posix/raise.c:26
23:12:14 #11 0x0000fffff7ae7e00 in __GI_abort () at ./stdlib/abort.c:79
23:12:14 #12 0x0000fffff7e5f190 in _X7__abortFv_bPKcY17__builtin_va_list__1 (_X11signalAbortb_1=false, _X3fmtPKc_1=0xfffff7e7e4c0 "%s", _X4argsY17__builtin_va_list_1=...) at /var/lib/jenkins/workspace/Cforall_master/libcfa/src/interpose.cfa:286
23:12:14 #13 0x0000fffff7e5f2f8 in _X5abortFv_bPKc__1 (_X11signalAbortb_1=false, _X3fmtPKc_1=0xfffff7e7e4c0 "%s") at /var/lib/jenkins/workspace/Cforall_master/libcfa/src/interpose.cfa:301
23:12:14 #14 0x0000fffff7e5eb10 in abort () at /var/lib/jenkins/workspace/Cforall_master/libcfa/src/interpose.cfa:176
23:12:14 #15 0x0000fffff7dae888 in _X4endsFv_S8ofstream__1 (_X2osS8ofstream_1=0xfffff7ec1368 <_X9abortFileS8ofstream_1>) at /var/lib/jenkins/workspace/Cforall_master/libcfa/src/fstream.cfa:106
23:12:14 #16 0x0000fffff7db8e70 in _X15_operator_bitorQ1_0_0_1__X19basic_ostream_tableKS18basic_ostream_data_BD0__Fv_BD0j__1 (_X19basic_ostream_tableKS18basic_ostream_data_Y6ostype__1=0xfffff7ec13d8 <_X19ofstream_basic_dataS18basic_ostream_data_S8ofstream__1>, _X2osY6ostype_1=0xfffff7ec1368 <_X9abortFileS8ofstream_1>, _X1tj_1=256) at /var/lib/jenkins/workspace/Cforall_master/libcfa/src/iostream.cfa:98
23:12:14 #17 0x0000fffff7f3b7dc in _X19__io_uring_teardownFv_S11io_context$__1 (_X4thisS11io_context$_1=0xaaaaaaad4b00) at /var/lib/jenkins/workspace/Cforall_master/libcfa/src/concurrency/io/setup.cfa:288
23:12:14 #18 0x0000fffff7f3a63c in _X11_destructorFv_S11io_context$__1 (_X4thisS11io_context$_1=0xaaaaaaad4b00) at /var/lib/jenkins/workspace/Cforall_master/libcfa/src/concurrency/io/setup.cfa:125
23:12:14 #19 0x0000fffff7f3bbd8 in _X13__cfa_io_stopFv_PS9processor__1 (_X4procPS9processor_1=0xfffff7fb12c0 <_X21storage_mainProcessorA0c_1>) at /var/lib/jenkins/workspace/Cforall_master/libcfa/src/concurrency/io/setup.cfa:313
23:12:14 #20 0x0000fffff7f46ebc in _X17__kernel_shutdownFv___1 () at /var/lib/jenkins/workspace/Cforall_master/libcfa/src/concurrency/kernel/startup.cfa:312
23:12:14 #21 0x0000fffff7fbef00 in _dl_call_fini (closure_map=closure_map@entry=0xfffff7ff72d0) at ./elf/dl-call_fini.c:43
23:12:14 #22 0x0000fffff7fc2910 in _dl_fini () at ./elf/dl-fini.c:114
23:12:14 #23 0x0000fffff7aff228 in __run_exit_handlers (status=0, listp=0xfffff7c70670 <__exit_funcs>, run_list_atexit=run_list_atexit@entry=true, run_dtors=run_dtors@entry=true) at ./stdlib/exit.c:108
23:12:14 #24 0x0000fffff7aff30c in __GI_exit (status=<optimized out>) at ./stdlib/exit.c:138
23:12:14 #25 0x0000fffff7ae84c8 in __libc_start_call_main (main=main@entry=0xaaaaaaaa4e08 <main>, argc=argc@entry=1, argv=argv@entry=0xfffffffff248) at ../sysdeps/nptl/libc_start_call_main.h:74
23:12:14 #26 0x0000fffff7ae8598 in __libc_start_main_impl (main=0xaaaaaaaa4e08 <main>, argc=1, argv=0xfffffffff248, init=<optimized out>, fini=<optimized out>, rtld_fini=<optimized out>, stack_end=<optimized out>) at ../csu/libc-start.c:360
23:12:14 #27 0x0000aaaaaaaa31f0 in _start ()
23:12:14 -----
23:12:14   Id   Target Id                          Frame 
23:12:14 * 1    Thread 0xfffff7fe9dc0 (LWP 138368) __pthread_kill_implementation (threadid=281474842402240, signo=signo@entry=6, no_tid=no_tid@entry=0) at ./nptl/pthread_kill.c:44
23:12:14 
23:12:14 Archiving io/away_fair (executable and core) to crashes/full-debug/io/away_fair
23:12:14        	userLiterals                         PASSED     C 0:08.745 - R 0:00.039
23:12:14        	swap                                 PASSED     C 0:09.405 - R 0:00.036
23:12:14        	io/io-acquire                        PASSED     C 0:14.993 - R 0:00.471
23:12:14        	minmax                               PASSED     C 0:12.697 - R 0:00.036
23:12:14        	raii/dtor-early-exit                 PASSED     C 0:10.790 - R 0:00.036
23:12:14        	sum                                  PASSED     C 0:10.288 - R 0:00.035
23:12:14        	...collections/array-md-sbscr-cases  PASSED     C 0:08.185 - R 0:00.036
23:12:14        	io/many_read                         PASSED     C 0:15.988 - R 0:00.069
23:12:14        	io/comp_fair                         PASSED     C 0:16.226 - R 0:00.774
23:12:14        	searchsort                           PASSED     C 0:11.123 - R 0:00.036
23:12:14        	io/comp_basic                        PASSED     C 0:16.590 - R 0:00.620
23:12:14        	vector_math/vec2_uint                PASSED     C 0:09.916 - R 0:00.037
23:12:14        	vector_math/vec2_double              PASSED     C 0:10.403 - R 0:00.036
23:12:14        	concurrency/waituntil/futures        PASSED     C 0:29.748 - R 0:00.068
23:12:14        	io/manipulatorsInput                 PASSED     C 0:08.158 - R 0:00.037
23:12:14        	ato                                  PASSED     C 0:09.860 - R 0:00.036
23:12:14        	gmp                                  PASSED     C 0:08.485 - R 0:00.067
23:12:14        	abs                                  PASSED     C 0:10.226 - R 0:00.037
23:12:14        	bitmanip1                            PASSED     C 0:10.430 - R 0:00.117
23:12:14        	bitmanip2                            PASSED     C 0:10.525 - R 0:00.117
23:12:14        	random                               PASSED     C 0:08.795 - R 0:00.035
23:12:14        	exceptions/cardgame                  PASSED     C 0:10.440 - R 0:00.118
23:12:14        	exceptions/hotpotato_checked         PASSED     C 0:10.624 - R 0:00.068
23:12:14        	exceptions/hotpotato                 PASSED     C 0:10.490 - R 0:00.068
23:12:14        	bitmanip3                            PASSED     C 0:11.580 - R 0:00.067
23:12:14        	io/manipulatorsOutput2               PASSED     C 0:10.091 - R 0:00.035
23:12:14        	vector_math/vec3_int                 PASSED     C 0:13.003 - R 0:00.037
23:12:14        	include/includes                     PASSED     C 0:21.412 - R 0:00.021
23:12:14        	vector_math/vec4_int                 PASSED     C 0:13.144 - R 0:00.037
23:12:14        	vector_math/vec2_float               PASSED     C 0:13.908 - R 0:00.067
23:12:14        	vector_math/vec2_int                 PASSED     C 0:13.941 - R 0:00.071
23:12:14        	vector_math/vec2_ldouble             PASSED     C 0:10.708 - R 0:00.036
23:12:14        	vector_math/vec3_float               PASSED     C 0:15.328 - R 0:00.067
23:12:14        	mathX                                PASSED     C 0:12.566 - R 0:00.035
23:12:14        	math                                 PASSED     C 0:12.959 - R 0:00.035
23:12:14        	vector_math/vec4_float               PASSED     C 0:16.209 - R 0:00.069
23:12:14        	io/manipulatorsOutput1               PASSED     C 0:13.942 - R 0:00.069
23:12:14        	io/io-acquire-no-io                  PASSED     C 0:12.178 - R 0:12.010
23:12:14        	io/manipulatorsOutput3               PASSED     C 0:14.550 - R 0:00.119
23:12:14        	...rrency/examples/boundedBufferEXT  PASSED     C 0:12.455 - R 0:35.620
23:12:14        	PRNG                                 PASSED     C 0:15.902 - R 0:02.121
23:12:14        	...rrency/examples/boundedBufferINT  PASSED     C 0:12.546 - R 0:35.736
23:12:14        	heap                                 PASSED     C 0:10.335 - R 0:18.437
23:12:14        	concurrency/waituntil/repeat_close   PASSED     C 0:13.670 - R 0:30.154
23:12:14        	rational                             PASSED     C 0:27.673 - R 0:00.070
23:12:14        	concurrency/waituntil/channels       PASSED     C 0:14.499 - R 0:32.927
23:12:14        	concurrency/unified_locking/mcs      PASSED     C 0:14.008 - R 0:38.256
23:12:14        	...ency/unified_locking/futex_mutex  PASSED     C 0:13.852 - R 0:42.661
23:12:14        	concurrency/monitor                  PASSED     C 0:12.395 - R 0:49.964
23:12:14        	concurrency/actors/dynamic           PASSED     C 0:18.549 - R 0:44.721
23:12:14        	...ency/waituntil/channel_zero_size  PASSED     C 0:13.489 - R 0:43.635
23:12:14        	concurrency/waituntil/all_types      PASSED     C 0:34.105 - R 0:27.706
23:12:14        	.../unified_locking/spin_queue_lock  PASSED     C 0:14.224 - R 0:50.739
23:12:14        	...urrency/unified_locking/mcs_spin  PASSED     C 0:14.364 - R 0:54.462
23:12:14        	concurrency/multi-monitor            PASSED     C 0:12.285 - R 1:08.352
23:12:14        	concurrency/waituntil/locks          PASSED     C 0:15.877 - R 1:07.976
23:12:14        	concurrency/unified_locking/locks    PASSED     C 0:16.156 - R 1:37.563
23:12:14        	concurrency/mutexstmt/locks          PASSED     C 0:12.012 - R 2:21.563
23:12:14 374 passes, 1 failures, 0 timeouts, 0 cancelled, 0 other
23:12:14 Tests took  2:34.484
23:12:14 make: *** [Makefile:986: all-local] Error 1
23:12:14 [Pipeline] }
23:12:14 [Pipeline] // dir
23:12:14 [Pipeline] }
23:12:14 [Pipeline] // stage
23:12:14 [Pipeline] echo
23:12:14 Archiving core dumps
23:12:14 [Pipeline] dir
23:12:14 Running in /var/lib/jenkins/workspace/Cforall_master@tmp
23:12:14 [Pipeline] {
23:12:14 [Pipeline] fileExists
23:12:14 [Pipeline] sh
23:12:14 + /var/lib/jenkins/workspace/Cforall_master/tools/jenkins/archive-gen.sh
23:12:14 [Pipeline] archiveArtifacts
23:12:14 Archiving artifacts
23:12:14 Recording fingerprints
23:12:14 [Pipeline] }
23:12:14 [Pipeline] // dir
23:12:14 [Pipeline] }
23:12:14 [Pipeline] // wrap
23:12:14 [Pipeline] }
23:12:14 [Pipeline] // node
23:12:14 [Pipeline] echo
23:12:14 hudson.AbortException: script returned exit code 2
23:12:14 [Pipeline] node
23:12:14 Running on Algol in /var/lib/jenkins/workspace/Cforall_master
23:12:14 [Pipeline] {
23:12:14 [Pipeline] echo
23:12:14 Notifying users of result
23:12:14 [Pipeline] echo
23:12:14 Reusing previously constructed message
23:12:14 [Pipeline] echo
23:12:14 Would send email to: cforall@lists.uwaterloo.ca
23:12:14 [Pipeline] echo
23:12:14 With title: [cforall git][BUILD# 3850 - FAILURE] - branch master
23:12:14 [Pipeline] echo
23:12:14 Content: 
23:12:14 <p>This is an automated email from the Jenkins build machine. It was
23:12:14 generated because of a git hooks/post-receive script following
23:12:14 a ref change which was pushed to the C∀ repository.</p>
23:12:14 
23:12:14 <p>- Status --------------------------------------------------------------</p>
23:12:14 
23:12:14 <p>BUILD# 3850 - FAILURE</p>
23:12:14 <p>Check console output at https://cforall.uwaterloo.ca/jenkins/job/Cforall/job/master/3850/ to view the results.</p>
23:12:14 
23:12:14 <p>- Changes -------------------------------------------------------------</p>
23:12:14 
23:12:14 <pre>
23:12:14 The branch master has been updated.
23:12:14       from  262e12b24a19d992dad599c1cc6143374ac571f4 (commit)
23:12:14 </pre>
23:12:14 
23:12:14 <p>- Log -----------------------------------------------------------------</p>
23:12:14 
23:12:14 <pre>
23:12:14 
23:12:14 </pre>
23:12:14 
23:12:14 <p>-----------------------------------------------------------------------</p>
23:12:14 <pre>
23:12:14 Summary of changes:
23:12:14 
23:12:14 </pre>
23:12:14 
23:12:14 [Pipeline] }
23:12:14 [Pipeline] // node
23:12:14 [Pipeline] echo
23:12:14 Build Completed
23:12:14 [Pipeline] End of Pipeline
23:12:14 ERROR: script returned exit code 2
23:12:14 Finished: FAILURE
[Pipeline] error
[Pipeline] }
23:12:14 Failed in branch gcc_10_arm64_new
23:15:26 Build Cforall » master #3844 completed: SUCCESS
[Pipeline] echo
23:15:26 SUCCESS
[Pipeline] }
23:29:10 Build Cforall » master #3849 completed: SUCCESS
[Pipeline] echo
23:29:10 SUCCESS
[Pipeline] }
[Pipeline] // parallel
[Pipeline] }
[Pipeline] // stage
[Pipeline] }
[Pipeline] // wrap
[Pipeline] echo
error caught
[Pipeline] node
Running on Brokk 4 in /var/lib/jenkins/workspace/Cforall_Full_Build
[Pipeline] {
[Pipeline] echo
notifying users
[Pipeline] emailext
Sending email to: cforall@lists.uwaterloo.ca
[Pipeline] }
[Pipeline] // node
[Pipeline] }
[Pipeline] // node
[Pipeline] End of Pipeline
ERROR: FAILURE
Finished: FAILURE