Started by timer
Running as Jenkins Build User
Obtained Jenkins/FullBuild from git cforall@plg.uwaterloo.ca:software/cfa/cfa-cc
[Pipeline] Start of Pipeline
[Pipeline] node
Running on Brokk 3 in /var/lib/jenkins/workspace/Cforall_Full_Build
[Pipeline] {
[Pipeline] checkout
The recommended git tool is: NONE
using credential git_key_aug2025
Fetching changes from the remote Git repository
> git rev-parse --resolve-git-dir /var/lib/jenkins/workspace/Cforall_Full_Build/.git # timeout=10
> git config remote.origin.url cforall@plg.uwaterloo.ca:software/cfa/cfa-cc # timeout=10
Fetching upstream changes from cforall@plg.uwaterloo.ca:software/cfa/cfa-cc
> git --version # timeout=10
> git --version # 'git version 2.43.0'
using GIT_SSH to set credentials Git key use to connect to the cforall git repo (August 2025)
Verifying host key using known hosts file
> git fetch --tags --force --progress -- cforall@plg.uwaterloo.ca:software/cfa/cfa-cc +refs/heads/*:refs/remotes/origin/* # timeout=10
Checking out Revision 1c69e6eb208437ab9d5e7868cd58d734741ff97e (refs/remotes/origin/master)
Commit message: "document and test found math function log2_u32_32"
> git rev-parse refs/remotes/origin/master^{commit} # timeout=10
> git config core.sparsecheckout # timeout=10
> git checkout -f 1c69e6eb208437ab9d5e7868cd58d734741ff97e # timeout=10
> git rev-list --no-walk 3e2ed16b69e370dfe4a2250fac5d56db957d3b86 # timeout=10
[Pipeline] wrap
[Pipeline] {
[Pipeline] stage
[Pipeline] { (Build)
[Pipeline] parallel
[Pipeline] { (Branch: gcc_10_x86_new)
[Pipeline] { (Branch: gcc_11_x86_new)
[Pipeline] { (Branch: gcc_12_x86_new)
[Pipeline] { (Branch: gcc_9_x64_new)
[Pipeline] { (Branch: gcc_10_x64_new)
[Pipeline] { (Branch: gcc_11_x64_new)
[Pipeline] { (Branch: gcc_12_x64_new)
[Pipeline] { (Branch: gcc_10_arm64_new)
[Pipeline] { (Branch: gcc_11_arm64_new)
[Pipeline] { (Branch: gcc_12_arm64_new)
[Pipeline] { (Branch: clang_x64_new)
[Pipeline] sleep
Sleeping for 4 min 0 sec
[Pipeline] sleep
Sleeping for 3 min 0 sec
[Pipeline] sleep
Sleeping for 4 min 0 sec
[Pipeline] sleep
Sleeping for 2 min 0 sec
[Pipeline] sleep
Sleeping for 2 min 0 sec
[Pipeline] sleep
Sleeping for 1 min 0 sec
[Pipeline] sleep
Sleeping for 4 min 0 sec
[Pipeline] sleep
Sleeping for 1 min 0 sec
[Pipeline] sleep
Sleeping for 4 min 0 sec
[Pipeline] sleep
Sleeping for 2 min 0 sec
[Pipeline] sleep
Sleeping for 2 min 0 sec
[Pipeline] build
Scheduling project: Cforall » master
[Pipeline] build
Scheduling project: Cforall » master
Starting building: Cforall » master #3804
Starting building: Cforall » master #3805
[Pipeline] build
Scheduling project: Cforall » master
[Pipeline] build
Scheduling project: Cforall » master
[Pipeline] build
Scheduling project: Cforall » master
[Pipeline] build
Scheduling project: Cforall » master
Starting building: Cforall » master #3809
Starting building: Cforall » master #3808
Starting building: Cforall » master #3807
Starting building: Cforall » master #3806
[Pipeline] build
Scheduling project: Cforall » master
Starting building: Cforall » master #3810
[Pipeline] build
Scheduling project: Cforall » master
[Pipeline] build
Scheduling project: Cforall » master
[Pipeline] build
Scheduling project: Cforall » master
[Pipeline] build
Scheduling project: Cforall » master
Starting building: Cforall » master #3813
Starting building: Cforall » master #3812
Starting building: Cforall » master #3811
Starting building: Cforall » master #3814
Build Cforall » master #3805 completed: FAILURE
[Pipeline] echo
FAILURE
[Pipeline] sh
+ wget -q -O - https://cforall.uwaterloo.ca/jenkins/job/Cforall/job/master/3805/consoleText
Started by upstream project "Cforall_Full_Build" build number 426
originally caused by:
Started by timer
Running as Jenkins Build User
> git rev-parse --resolve-git-dir /var/lib/jenkins/caches/git-914b6fdde163b7e17ee75d99ca23f18a/.git # timeout=10
Setting origin to cforall@plg.uwaterloo.ca:software/cfa/cfa-cc
> git config remote.origin.url cforall@plg.uwaterloo.ca:software/cfa/cfa-cc # timeout=10
Fetching origin...
Fetching upstream changes from origin
> git --version # timeout=10
> git --version # 'git version 2.43.0'
> git config --get remote.origin.url # timeout=10
using GIT_SSH to set credentials Git key use to connect to the cforall git repo (August 2025)
Verifying host key using known hosts file
> git fetch --no-tags --force --progress -- origin +refs/heads/*:refs/remotes/origin/* # timeout=10
Seen branch in repository origin/ADT
Seen branch in repository origin/aaron-thesis
Seen branch in repository origin/arm-eh
Seen branch in repository origin/ast-experimental
Seen branch in repository origin/cleanup-dtors
Seen branch in repository origin/ctor
Seen branch in repository origin/deferred_resn
Seen branch in repository origin/demangler
Seen branch in repository origin/enum
Seen branch in repository origin/forall-pointer-decay
Seen branch in repository origin/gc_noraii
Seen branch in repository origin/jacob/cs343-translation
Seen branch in repository origin/jenkins-sandbox
Seen branch in repository origin/master
Seen branch in repository origin/memory
Seen branch in repository origin/new-ast
Seen branch in repository origin/new-ast-unique-expr
Seen branch in repository origin/new-env
Seen branch in repository origin/no_list
Seen branch in repository origin/persistent-indexer
Seen branch in repository origin/pthread-emulation
Seen branch in repository origin/qualifiedEnum
Seen branch in repository origin/resolv-new
Seen branch in repository origin/string
Seen branch in repository origin/stuck-waitfor-destruct
Seen branch in repository origin/with_gc
Seen 26 remote branches
Obtained Jenkinsfile from 1c69e6eb208437ab9d5e7868cd58d734741ff97e
[Pipeline] Start of Pipeline
[Pipeline] node
Running on Algol in /var/lib/jenkins/workspace/Cforall_master
[Pipeline] {
[Pipeline] wrap
[Pipeline] {
[Pipeline] properties
WARNING: Unknown parameter(s) found for class type 'hudson.model.ChoiceParameterDefinition': defaultValue
WARNING: Unknown parameter(s) found for class type 'hudson.model.ChoiceParameterDefinition': defaultValue
[Pipeline] checkout
The recommended git tool is: NONE
using credential git_key_aug2025
Fetching changes from the remote Git repository
Cleaning workspace
Fetching without tags
> git rev-parse --resolve-git-dir /var/lib/jenkins/workspace/Cforall_master/.git # timeout=10
> git config remote.origin.url cforall@plg.uwaterloo.ca:software/cfa/cfa-cc # timeout=10
> git rev-parse --verify HEAD # timeout=10
Resetting working tree
> git reset --hard # timeout=10
> git clean -fdx # timeout=10
Fetching upstream changes from cforall@plg.uwaterloo.ca:software/cfa/cfa-cc
> git --version # timeout=10
> git --version # 'git version 2.43.0'
using GIT_SSH to set credentials Git key use to connect to the cforall git repo (August 2025)
Verifying host key using known hosts file
> git fetch --no-tags --force --progress -- cforall@plg.uwaterloo.ca:software/cfa/cfa-cc +refs/heads/*:refs/remotes/origin/* # timeout=10
Checking out Revision 1c69e6eb208437ab9d5e7868cd58d734741ff97e (master)
Commit message: "document and test found math function log2_u32_32"
[Pipeline] load
[Pipeline] { (Jenkins/tools.groovy)
> git config core.sparsecheckout # timeout=10
> git checkout -f 1c69e6eb208437ab9d5e7868cd58d734741ff97e # timeout=10
> git rev-list --no-walk 1c69e6eb208437ab9d5e7868cd58d734741ff97e # timeout=10
[Pipeline] }
[Pipeline] // load
[Pipeline] echo
Compiler : gcc-10 (g++-10/gcc-10)
Architecture : arm64
Arc Flags : --host=aarch64
Run All Tests : true
Run Benchmark : true
Build Documentation : false
Publish : true
Silent : true
[Pipeline] }
[Pipeline] // wrap
[Pipeline] }
[Pipeline] // node
[Pipeline] node
Running on Algol in /var/lib/jenkins/workspace/Cforall_master
[Pipeline] {
[Pipeline] wrap
[Pipeline] {
[Pipeline] pwd
[Pipeline] pwd
[Pipeline] echo
-------- Cleanup --------
[Pipeline] stage
[Pipeline] { (Cleanup)
[Pipeline] dir
Running in /var/lib/jenkins/workspace/Cforall_master@tmp
[Pipeline] {
[Pipeline] deleteDir
[Pipeline] }
[Pipeline] // dir
[Pipeline] }
[Pipeline] // stage
[Pipeline] echo
-------- Checkout --------
[Pipeline] stage
[Pipeline] { (Checkout)
[Pipeline] checkout
The recommended git tool is: NONE
using credential git_key_aug2025
Fetching changes from the remote Git repository
Cleaning workspace
Fetching without tags
Checking out Revision 1c69e6eb208437ab9d5e7868cd58d734741ff97e (master)
Commit message: "document and test found math function log2_u32_32"
[Pipeline] echo
Constructing new git message
[Pipeline] sh
> git rev-parse --resolve-git-dir /var/lib/jenkins/workspace/Cforall_master/.git # timeout=10
> git config remote.origin.url cforall@plg.uwaterloo.ca:software/cfa/cfa-cc # timeout=10
> git rev-parse --verify HEAD # timeout=10
Resetting working tree
> git reset --hard # timeout=10
> git clean -fdx # timeout=10
Fetching upstream changes from cforall@plg.uwaterloo.ca:software/cfa/cfa-cc
> git --version # timeout=10
> git --version # 'git version 2.43.0'
using GIT_SSH to set credentials Git key use to connect to the cforall git repo (August 2025)
Verifying host key using known hosts file
> git fetch --no-tags --force --progress -- cforall@plg.uwaterloo.ca:software/cfa/cfa-cc +refs/heads/*:refs/remotes/origin/* # timeout=10
> git config core.sparsecheckout # timeout=10
> git checkout -f 1c69e6eb208437ab9d5e7868cd58d734741ff97e # timeout=10
+ git rev-list 1c69e6eb208437ab9d5e7868cd58d734741ff97e..1c69e6eb208437ab9d5e7868cd58d734741ff97e
[Pipeline] sh
+ git cat-file -t 1c69e6eb208437ab9d5e7868cd58d734741ff97e
[Pipeline] sh
+ git rev-list --format=short 1c69e6eb208437ab9d5e7868cd58d734741ff97e...1c69e6eb208437ab9d5e7868cd58d734741ff97e
[Pipeline] sh
+ git diff --stat --color 1c69e6eb208437ab9d5e7868cd58d734741ff97e 1c69e6eb208437ab9d5e7868cd58d734741ff97e
[Pipeline] echo
- Changes -------------------------------------------------------------
The branch master has been updated.
from 1c69e6eb208437ab9d5e7868cd58d734741ff97e (commit)
- Log -----------------------------------------------------------------
-----------------------------------------------------------------------
Summary of changes:
[Pipeline] }
[Pipeline] // stage
[Pipeline] echo
-------- Build : configure --------
[Pipeline] stage
[Pipeline] { (Build : configure)
[Pipeline] dir
Running in /var/lib/jenkins/workspace/Cforall_master
[Pipeline] {
[Pipeline] sh
+ ./autogen.sh
Running aclocal in root
Running libtoolize in root
libtoolize: putting auxiliary files in AC_CONFIG_AUX_DIR, 'automake'.
libtoolize: linking file 'automake/ltmain.sh'
libtoolize: putting macros in AC_CONFIG_MACRO_DIRS, 'automake'.
libtoolize: linking file 'automake/libtool.m4'
libtoolize: linking file 'automake/ltoptions.m4'
libtoolize: linking file 'automake/ltsugar.m4'
libtoolize: linking file 'automake/ltversion.m4'
libtoolize: linking file 'automake/lt~obsolete.m4'
Running autoconf in root
Running automake in root
configure.ac:223: installing 'automake/compile'
configure.ac:138: installing 'automake/config.guess'
configure.ac:138: installing 'automake/config.sub'
configure.ac:17: installing 'automake/install-sh'
benchmark/Makefile.am: installing 'automake/depcomp'
parallel-tests: installing 'automake/test-driver'
configure.ac: installing 'automake/ylwrap'
Running aclocal in libcfa
Running libtoolize in libcfa
libtoolize: putting auxiliary files in AC_CONFIG_AUX_DIR, 'automake'.
libtoolize: linking file 'automake/ltmain.sh'
libtoolize: putting macros in AC_CONFIG_MACRO_DIRS, 'automake'.
libtoolize: linking file 'automake/libtool.m4'
libtoolize: linking file 'automake/ltoptions.m4'
libtoolize: linking file 'automake/ltsugar.m4'
libtoolize: linking file 'automake/ltversion.m4'
libtoolize: linking file 'automake/lt~obsolete.m4'
Running autoconf in libcfa
Running automake in libcfa
configure.ac:119: installing 'automake/compile'
configure.ac:119: installing 'automake/config.guess'
configure.ac:119: installing 'automake/config.sub'
configure.ac:12: installing 'automake/install-sh'
src/Makefile.am: installing 'automake/depcomp'
[Pipeline] }
[Pipeline] // dir
[Pipeline] dir
Running in /var/lib/jenkins/workspace/Cforall_master@tmp
[Pipeline] {
[Pipeline] sh
+ /var/lib/jenkins/workspace/Cforall_master/configure CXX=g++-10 CC=gcc-10 --host=aarch64 AR=gcc-ar RANLIB=gcc-ranlib --with-target-hosts=host:debug,host:nodebug --quiet --prefix=/var/lib/jenkins/workspace/Cforall_master@tmp
[Pipeline] sh
+ nproc
+ make -j 96 --no-print-directory configure-libcfa
libcfa/arm64-debug/config.data
Configuring libcfa (/var/lib/jenkins/workspace/Cforall_master/libcfa/configure) with ''CXX=g++-10' 'CC=gcc-10' 'AR=gcc-ar' 'RANLIB=gcc-ranlib' '--prefix=/var/lib/jenkins/workspace/Cforall_master@tmp' DRIVER_DIR=/var/lib/jenkins/workspace/Cforall_master@tmp/driver/ ARCHITECTURE=arm64 CONFIGURATION=debug CFA_VERSION=1:0:0' from /var/lib/jenkins/workspace/Cforall_master@tmp / libcfa/arm64-debug/
libcfa/arm64-nodebug/config.data
Configuring libcfa (/var/lib/jenkins/workspace/Cforall_master/libcfa/configure) with ''CXX=g++-10' 'CC=gcc-10' 'AR=gcc-ar' 'RANLIB=gcc-ranlib' '--prefix=/var/lib/jenkins/workspace/Cforall_master@tmp' DRIVER_DIR=/var/lib/jenkins/workspace/Cforall_master@tmp/driver/ ARCHITECTURE=arm64 CONFIGURATION=nodebug CFA_VERSION=1:0:0' from /var/lib/jenkins/workspace/Cforall_master@tmp / libcfa/arm64-nodebug/
checking whether make supports nested variables... checking whether make supports nested variables... yes
checking for a BSD-compatible install... yes
checking for a BSD-compatible install... /usr/bin/install -c
checking whether build environment is sane... /usr/bin/install -c
checking whether build environment is sane... yes
yes
checking for a race-free mkdir -p... /usr/bin/mkdir -p
checking for gawk... gawk
checking whether make sets $(MAKE)... checking for a race-free mkdir -p... /usr/bin/mkdir -p
checking for gawk... gawk
checking whether make sets $(MAKE)... yes
yes
checking for distributated build... no
checking for distributated build... no
checking build system type... checking build system type... aarch64-unknown-linux-gnu
checking host system type... aarch64-unknown-linux-gnu
checking how to print strings... aarch64-unknown-linux-gnu
checking host system type... aarch64-unknown-linux-gnu
checking how to print strings... printf
checking whether make supports the include directive... printf
checking whether make supports the include directive... yes (GNU style)
checking for gcc... gcc-10
yes (GNU style)
checking for gcc... gcc-10
checking whether the C compiler works... checking whether the C compiler works... yes
yes
checking for C compiler default output file name... a.out
checking for C compiler default output file name... a.out
checking for suffix of executables... checking for suffix of executables...
checking whether we are cross compiling...
checking whether we are cross compiling... no
checking for suffix of object files... no
checking for suffix of object files... o
checking whether the compiler supports GNU C... o
checking whether the compiler supports GNU C... yes
checking whether gcc-10 accepts -g... yes
checking whether gcc-10 accepts -g... yes
checking for gcc-10 option to enable C11 features... yes
checking for gcc-10 option to enable C11 features... none needed
checking whether gcc-10 understands -c and -o together... none needed
checking whether gcc-10 understands -c and -o together... yes
checking dependency style of gcc-10... yes
checking dependency style of gcc-10... gcc3
checking for a sed that does not truncate output... /usr/bin/sed
checking for grep that handles long lines and -e... /usr/bin/grep
checking for egrep... gcc3
checking for a sed that does not truncate output... /usr/bin/grep -E
checking for fgrep... /usr/bin/grep -F
checking for ld used by gcc-10... /usr/bin/sed
checking for grep that handles long lines and -e... /usr/bin/ld
checking if the linker (/usr/bin/ld) is GNU ld... /usr/bin/grep
checking for egrep... /usr/bin/grep -E
checking for fgrep... yes
checking for BSD- or MS-compatible name lister (nm)... /usr/bin/grep -F
checking for ld used by gcc-10... /usr/bin/nm -B
checking the name lister (/usr/bin/nm -B) interface... /usr/bin/ld
checking if the linker (/usr/bin/ld) is GNU ld... yes
checking for BSD- or MS-compatible name lister (nm)... /usr/bin/nm -B
checking the name lister (/usr/bin/nm -B) interface... BSD nm
checking whether ln -s works... yes
checking the maximum length of command line arguments... 1572864
BSD nm
checking whether ln -s works... yes
checking the maximum length of command line arguments... checking how to convert aarch64-unknown-linux-gnu file names to aarch64-unknown-linux-gnu format... func_convert_file_noop
checking how to convert aarch64-unknown-linux-gnu file names to toolchain format... func_convert_file_noop
checking for /usr/bin/ld option to reload object files... -r
checking for file... file
checking for objdump... objdump
checking how to recognize dependent libraries... pass_all
checking for dlltool... no
checking how to associate runtime and link libraries... printf %s\n
checking for archiver @FILE support... 1572864
checking how to convert aarch64-unknown-linux-gnu file names to aarch64-unknown-linux-gnu format... func_convert_file_noop
checking how to convert aarch64-unknown-linux-gnu file names to toolchain format... func_convert_file_noop
checking for /usr/bin/ld option to reload object files... -r
checking for file... file
checking for objdump... objdump
checking how to recognize dependent libraries... pass_all
checking for dlltool... no
checking how to associate runtime and link libraries... printf %s\n
checking for archiver @FILE support... @
checking for strip... strip
checking for ranlib... gcc-ranlib
checking command to parse /usr/bin/nm -B output from gcc-10 object... @
checking for strip... strip
checking for ranlib... gcc-ranlib
checking command to parse /usr/bin/nm -B output from gcc-10 object... ok
checking for sysroot... no
checking for a working dd... /usr/bin/dd
checking how to truncate binary pipes... ok
/usr/bin/dd bs=4096 count=1
checking for mt... mt
checking if mt is a manifest tool... checking for sysroot... no
checking for a working dd... no
checking for stdio.h... /usr/bin/dd
checking how to truncate binary pipes... /usr/bin/dd bs=4096 count=1
checking for mt... mt
checking if mt is a manifest tool... no
checking for stdio.h... yes
checking for stdlib.h... yes
checking for stdlib.h... yes
checking for string.h... yes
checking for string.h... yes
checking for inttypes.h... yes
checking for inttypes.h... yes
checking for stdint.h... yes
checking for stdint.h... yes
checking for strings.h... yes
checking for strings.h... yes
checking for sys/stat.h... yes
checking for sys/stat.h... yes
checking for sys/types.h... yes
checking for sys/types.h... yes
checking for unistd.h... yes
checking for unistd.h... yes
checking for dlfcn.h... yes
checking for dlfcn.h... yes
checking for objdir... .libs
yes
checking for objdir... .libs
checking if gcc-10 supports -fno-rtti -fno-exceptions... checking if gcc-10 supports -fno-rtti -fno-exceptions... no
checking for gcc-10 option to produce PIC... -fPIC -DPIC
checking if gcc-10 PIC flag -fPIC -DPIC works... yes
checking if gcc-10 static flag -static works... no
checking for gcc-10 option to produce PIC... -fPIC -DPIC
checking if gcc-10 PIC flag -fPIC -DPIC works... yes
checking if gcc-10 static flag -static works... yes
checking if gcc-10 supports -c -o file.o... yes
checking if gcc-10 supports -c -o file.o... yes
checking if gcc-10 supports -c -o file.o... (cached) yes
checking whether the gcc-10 linker (/usr/bin/ld) supports shared libraries... yes
checking whether -lc should be explicitly linked in... yes
checking if gcc-10 supports -c -o file.o... (cached) yes
checking whether the gcc-10 linker (/usr/bin/ld) supports shared libraries... no
checking dynamic linker characteristics... yes
checking whether -lc should be explicitly linked in... no
checking dynamic linker characteristics... GNU/Linux ld.so
checking how to hardcode library paths into programs... immediate
checking whether stripping libraries is possible... yes
checking if libtool supports shared libraries... yes
checking whether to build shared libraries... yes
checking whether to build static libraries... no
checking whether the compiler supports GNU C++... GNU/Linux ld.so
checking how to hardcode library paths into programs... immediate
checking whether stripping libraries is possible... yes
checking if libtool supports shared libraries... yes
checking whether to build shared libraries... yes
checking whether to build static libraries... no
yes
checking whether g++-10 accepts -g... checking whether the compiler supports GNU C++... yes
checking for g++-10 option to enable C++11 features... yes
checking whether g++-10 accepts -g... yes
checking for g++-10 option to enable C++11 features... none needed
checking dependency style of g++-10... none needed
checking dependency style of g++-10... gcc3
checking how to run the C++ preprocessor... gcc3
checking how to run the C++ preprocessor... g++-10 -E
g++-10 -E
checking for ld used by g++-10... /usr/bin/ld
checking if the linker (/usr/bin/ld) is GNU ld... yes
checking whether the g++-10 linker (/usr/bin/ld) supports shared libraries... yes
checking for ld used by g++-10... /usr/bin/ld
checking if the linker (/usr/bin/ld) is GNU ld... yes
checking whether the g++-10 linker (/usr/bin/ld) supports shared libraries... yes
checking for g++-10 option to produce PIC... -fPIC -DPIC
checking if g++-10 PIC flag -fPIC -DPIC works... yes
checking if g++-10 static flag -static works... checking for g++-10 option to produce PIC... -fPIC -DPIC
checking if g++-10 PIC flag -fPIC -DPIC works... yes
checking if g++-10 static flag -static works... yes
checking if g++-10 supports -c -o file.o... yes
checking if g++-10 supports -c -o file.o... yes
checking if g++-10 supports -c -o file.o... (cached) yes
checking whether the g++-10 linker (/usr/bin/ld) supports shared libraries... yes
checking dynamic linker characteristics... (cached) GNU/Linux ld.so
checking how to hardcode library paths into programs... immediate
checking for gcc... (cached) gcc-10
yes
checking if g++-10 supports -c -o file.o... (cached) yes
checking whether the g++-10 linker (/usr/bin/ld) supports shared libraries... yes
checking dynamic linker characteristics... (cached) GNU/Linux ld.so
checking how to hardcode library paths into programs... immediate
checking for gcc... (cached) gcc-10
checking whether the compiler supports GNU C... (cached) yes
checking whether gcc-10 accepts -g... (cached) yes
checking for gcc-10 option to enable C11 features... (cached) none needed
checking whether gcc-10 understands -c and -o together... (cached) yes
checking dependency style of gcc-10... (cached) gcc3
checking dependency style of gcc-10... checking whether the compiler supports GNU C... (cached) yes
checking whether gcc-10 accepts -g... (cached) yes
checking for gcc-10 option to enable C11 features... (cached) none needed
checking whether gcc-10 understands -c and -o together... (cached) yes
checking dependency style of gcc-10... (cached) gcc3
checking dependency style of gcc-10... gcc3
checking whether make sets $(MAKE)... (cached) yes
checking for linux/rseq.h... gcc3
checking whether make sets $(MAKE)... (cached) yes
checking for linux/rseq.h... yes
checking for rseq_available in -lrseq... yes
checking for rseq_available in -lrseq... no
checking for gcc-10 options needed to detect all undeclared functions... no
checking for gcc-10 options needed to detect all undeclared functions... none needed
checking for linux/io_uring.h... none needed
checking for linux/io_uring.h... yes
checking for liburing.h... yes
checking for liburing.h... no
checking whether IORING_OP_NOP is declared... no
checking whether IORING_OP_NOP is declared... yes
checking whether IORING_OP_READV is declared... yes
checking whether IORING_OP_READV is declared... yes
checking whether IORING_OP_WRITEV is declared... yes
checking whether IORING_OP_WRITEV is declared... yes
checking whether IORING_OP_FSYNC is declared... yes
checking whether IORING_OP_FSYNC is declared... yes
checking whether IORING_OP_READ_FIXED is declared... yes
checking whether IORING_OP_READ_FIXED is declared... yes
checking whether IORING_OP_WRITE_FIXED is declared... yes
checking whether IORING_OP_WRITE_FIXED is declared... yes
checking whether IORING_OP_POLL_ADD is declared... yes
checking whether IORING_OP_POLL_ADD is declared... yes
checking whether IORING_OP_POLL_REMOVE is declared... yes
checking whether IORING_OP_POLL_REMOVE is declared... yes
checking whether IORING_OP_SYNC_FILE_RANGE is declared... yes
checking whether IORING_OP_SYNC_FILE_RANGE is declared... yes
checking whether IORING_OP_SENDMSG is declared... yes
checking whether IORING_OP_SENDMSG is declared... yes
checking whether IORING_OP_RECVMSG is declared... yes
checking whether IORING_OP_RECVMSG is declared... yes
checking whether IORING_OP_TIMEOUT is declared... yes
checking whether IORING_OP_TIMEOUT is declared... yes
checking whether IORING_OP_TIMEOUT_REMOVE is declared... yes
checking whether IORING_OP_TIMEOUT_REMOVE is declared... yes
checking whether IORING_OP_ACCEPT is declared... yes
checking whether IORING_OP_ACCEPT is declared... yes
checking whether IORING_OP_ASYNC_CANCEL is declared... yes
checking whether IORING_OP_ASYNC_CANCEL is declared... yes
checking whether IORING_OP_LINK_TIMEOUT is declared... yes
checking whether IORING_OP_LINK_TIMEOUT is declared... yes
checking whether IORING_OP_CONNECT is declared... yes
checking whether IORING_OP_CONNECT is declared... yes
checking whether IORING_OP_FALLOCATE is declared... yes
checking whether IORING_OP_FALLOCATE is declared... yes
checking whether IORING_OP_OPENAT is declared... yes
checking whether IORING_OP_OPENAT is declared... yes
checking whether IORING_OP_CLOSE is declared... yes
checking whether IORING_OP_CLOSE is declared... yes
checking whether IORING_OP_FILES_UPDATE is declared... yes
checking whether IORING_OP_FILES_UPDATE is declared... yes
checking whether IORING_OP_STATX is declared... yes
checking whether IORING_OP_STATX is declared... yes
checking whether IORING_OP_READ is declared... yes
checking whether IORING_OP_READ is declared... yes
checking whether IORING_OP_WRITE is declared... yes
checking whether IORING_OP_WRITE is declared... yes
checking whether IORING_OP_FADVISE is declared... yes
checking whether IORING_OP_FADVISE is declared... yes
checking whether IORING_OP_MADVISE is declared... yes
checking whether IORING_OP_MADVISE is declared... yes
checking whether IORING_OP_SEND is declared... yes
checking whether IORING_OP_SEND is declared... yes
checking whether IORING_OP_RECV is declared... yes
checking whether IORING_OP_RECV is declared... yes
checking whether IORING_OP_OPENAT2 is declared... yes
checking whether IORING_OP_OPENAT2 is declared... yes
checking whether IORING_OP_EPOLL_CTL is declared... yes
checking whether IORING_OP_EPOLL_CTL is declared... yes
checking whether IORING_OP_SPLICE is declared... yes
checking whether IORING_OP_SPLICE is declared... yes
checking whether IORING_OP_PROVIDE_BUFFERS is declared... yes
checking whether IORING_OP_PROVIDE_BUFFERS is declared... yes
checking whether IORING_OP_REMOVE_BUFFER is declared... yes
checking whether IORING_OP_REMOVE_BUFFER is declared... no
checking whether IORING_OP_TEE is declared... no
checking whether IORING_OP_TEE is declared... yes
checking whether IOSQE_FIXED_FILE is declared... yes
checking whether IOSQE_FIXED_FILE is declared... yes
checking whether IOSQE_IO_DRAIN is declared... yes
checking whether IOSQE_IO_DRAIN is declared... yes
checking whether IOSQE_IO_LINK is declared... yes
checking whether IOSQE_IO_LINK is declared... yes
checking whether IOSQE_IO_HARDLINK is declared... yes
checking whether IOSQE_IO_HARDLINK is declared... yes
checking whether IOSQE_ASYNC is declared... yes
checking whether IOSQE_ASYNC is declared... yes
checking whether IOSQE_BUFFER_SELECT is declared... yes
checking whether IOSQE_BUFFER_SELECT is declared... yes
checking whether SPLICE_F_FD_IN_FIXED is declared... yes
checking whether SPLICE_F_FD_IN_FIXED is declared... yes
checking whether IORING_SETUP_ATTACH_WQ is declared... yes
checking whether IORING_SETUP_ATTACH_WQ is declared... yes
checking whether IORING_REGISTER_IOWQ_MAX_WORKERS is declared... yes
checking whether IORING_REGISTER_IOWQ_MAX_WORKERS is declared... yes
checking for preadv2... yes
checking for preadv2... yes
checking for pwritev2... yes
checking for pwritev2... yes
yes
checking that generated files are newer than configure... done
configure: creating ./config.status
checking that generated files are newer than configure... done
configure: creating ./config.status
config.status: creating Makefile
config.status: creating Makefile
config.status: creating src/Makefile
config.status: creating src/Makefile
config.status: creating prelude/Makefile
config.status: creating prelude/Makefile
config.status: creating src/concurrency/io/call.cfa
config.status: creating src/concurrency/io/call.cfa
/var/lib/jenkins/workspace/Cforall_master/libcfa/src/concurrency/io/call.cfa.in:144: SyntaxWarning: invalid escape sequence '\('
sig = re.search("(.*) (.*)\((.*)\)", signature)
/var/lib/jenkins/workspace/Cforall_master/libcfa/src/concurrency/io/call.cfa.in:144: SyntaxWarning: invalid escape sequence '\('
sig = re.search("(.*) (.*)\((.*)\)", signature)
config.status: creating prelude/defines.hfa
config.status: creating prelude/defines.hfa
config.status: executing depfiles commands
config.status: executing depfiles commands
config.status: executing libtool commands
config.status: executing libtool commands
Cforall library configuraton completed. Type "make -j 8 install".
Cforall library configuraton completed. Type "make -j 8 install".
[Pipeline] }
[Pipeline] // dir
[Pipeline] }
[Pipeline] // stage
[Pipeline] echo
-------- Build : cfa-cpp --------
[Pipeline] stage
[Pipeline] { (Build : cfa-cpp)
[Pipeline] dir
Running in /var/lib/jenkins/workspace/Cforall_master@tmp
[Pipeline] {
[Pipeline] sh
+ nproc
+ make -j 96 --no-print-directory -C driver
CXX as.o
CXX cc1.o
CXX cfa.o
CXXLD as
CXXLD cc1
CXXLD cfa
[Pipeline] sh
+ nproc
+ make -j 96 --no-print-directory -C src
YACC Parser/parser.cc
updating Parser/parser.output
updating Parser/parser.hh
make all-am
CXX main.o
CXX CompilationState.o
CXX MakeLibCfa.o
LEX Parser/lex.cc
CXX AST/Attribute.o
CXX AST/Copy.o
CXX AST/Create.o
CXX AST/Decl.o
CXX AST/DeclReplacer.o
CXX AST/Expr.o
CXX AST/GenericSubstitution.o
CXX AST/Init.o
CXX AST/Inspect.o
CXX AST/LinkageSpec.o
CXX AST/Node.o
CXX AST/Pass.o
CXX AST/Print.o
CXX AST/Stmt.o
CXX AST/SymbolTable.o
CXX AST/Type.o
CXX AST/TypeEnvironment.o
CXX AST/TypeSubstitution.o
CXX AST/Util.o
CXX CodeGen/CodeGenerator.o
CXX CodeGen/GenType.o
CXX CodeGen/OperatorTable.o
CXX CodeGen/FixMain.o
CXX CodeGen/FixNames.o
CXX CodeGen/Generate.o
CXX CodeGen/LinkOnce.o
CXX Concurrency/Actors.o
CXX Concurrency/Corun.o
CXX Concurrency/Keywords.o
CXX Concurrency/Waitfor.o
CXX Concurrency/Waituntil.o
CXX Common/Assert.o
CXX Common/CodeLocationTools.o
CXX Common/DeclStats.o
CXX Common/Eval.o
CXX Common/Examine.o
CXX Common/Indenter.o
CXX Common/ResolvProtoDump.o
CXX Common/SemanticError.o
CXX Common/Stats/Counter.o
CXX Common/Stats/Heap.o
CXX Common/Stats/ResolveTime.o
CXX Common/Stats/Stats.o
CXX Common/Stats/Time.o
CXX Common/Symbol.o
CXX Common/UniqueName.o
CXX Common/DebugMalloc.o
CXX ControlStruct/ExceptDecl.o
CXX ControlStruct/ExceptTranslate.o
CXX ControlStruct/FixLabels.o
CXX ControlStruct/HoistControlDecls.o
CXX ControlStruct/LabelGenerator.o
CXX ControlStruct/MultiLevelExit.o
CXX ControlStruct/TranslateEnumRange.o
CXX GenPoly/GenPoly.o
CXX GenPoly/Lvalue2.o
CXX GenPoly/Box.o
CXX GenPoly/FindFunction.o
CXX GenPoly/InstantiateGeneric.o
CXX GenPoly/Lvalue.o
CXX GenPoly/ScrubTypeVars.o
CXX GenPoly/Specialize.o
CXX InitTweak/GenInit.o
CXX InitTweak/InitTweak.o
CXX InitTweak/FixGlobalInit.o
CXX InitTweak/FixInit.o
CXX Parser/DeclarationNode.o
CXX Parser/ExpressionNode.o
CXX Parser/InitializerNode.o
CXX Parser/ParseNode.o
CXX Parser/parser.o
CXX Parser/RunParser.o
CXX Parser/StatementNode.o
CXX Parser/TypeData.o
CXX Parser/TypedefTable.o
CXX ResolvExpr/AdjustExprType.o
CXX ResolvExpr/Candidate.o
CXX ResolvExpr/CandidateFinder.o
CXX ResolvExpr/CastCost.o
CXX ResolvExpr/CommonType.o
CXX ResolvExpr/ConversionCost.o
CXX ResolvExpr/CurrentObject.o
CXX ResolvExpr/ExplodedArg.o
CXX ResolvExpr/FindOpenVars.o
CXX ResolvExpr/PolyCost.o
CXX ResolvExpr/PtrsAssignable.o
CXX ResolvExpr/PtrsCastable.o
CXX ResolvExpr/RenameVars.o
CXX ResolvExpr/Resolver.o
CXX ResolvExpr/ResolveTypeof.o
CXX ResolvExpr/SatisfyAssertions.o
CXX ResolvExpr/SpecCost.o
CXX ResolvExpr/Unify.o
CXX ResolvExpr/CandidatePrinter.o
In file included from /usr/include/aarch64-linux-gnu/c++/10/bits/os_defines.h:39,
from /usr/include/aarch64-linux-gnu/c++/10/bits/c++config.h:522,
from /usr/include/c++/10/cstdio:41,
from /var/lib/jenkins/workspace/Cforall_master/src/Parser/parser.yy:41:
/usr/include/features.h:415:4: warning: #warning _FORTIFY_SOURCE requires GCC 4.1 or later [-Wcpp]
415 | # warning _FORTIFY_SOURCE requires GCC 4.1 or later
| ^~~~~~~
CXX ResolvExpr/EraseWith.o
CXX SymTab/FixFunction.o
CXX SymTab/GenImplicitCall.o
CXX SymTab/Mangler.o
CXX SymTab/ManglerCommon.o
CXX Tuples/Explode.o
CXX Tuples/TupleAssignment.o
CXX Tuples/TupleExpansion.o
CXX Tuples/Tuples.o
CXX Validate/Autogen.o
CXX Validate/CheckAssertions.o
CXX Validate/CompoundLiteral.o
CXX Validate/EliminateTypedef.o
CXX Validate/EnumAndPointerDecay.o
CXX Validate/FindSpecialDecls.o
CXX Validate/FixQualifiedTypes.o
CXX Validate/FixReturnTypes.o
CXX Validate/ForallPointerDecay.o
CXX Validate/GenericParameter.o
CXX Validate/HoistStruct.o
CXX Validate/HoistTypeDecls.o
CXX Validate/ImplementEnumFunc.o
CXX Validate/InitializerLength.o
CXX Validate/LabelAddressFixer.o
CXX Validate/LinkInstanceTypes.o
CXX Validate/ReplaceTypedef.o
CXX Validate/ReturnCheck.o
CXX Validate/VerifyCtorDtorAssign.o
CXX Virtual/ExpandCasts.o
CXX Virtual/Tables.o
CXX Virtual/VirtualDtor.o
CXX Parser/lex.o
/var/lib/jenkins/workspace/Cforall_master/src/ResolvExpr/CommonType.cpp: In function ‘ast::ptr ResolvExpr::{anonymous}::handleReference(ast::ptr&, ast::ptr&, ResolvExpr::WidenMode, ast::TypeEnvironment&, const OpenVarSet&)’:
/var/lib/jenkins/workspace/Cforall_master/src/ResolvExpr/CommonType.cpp:716:23: note: parameter passing for argument of type ‘ResolvExpr::WidenMode’ changed in GCC 9.1
716 | ast::ptr< ast::Type > handleReference(
| ^~~~~~~~~~~~~~~
/var/lib/jenkins/workspace/Cforall_master/src/ResolvExpr/CommonType.cpp: In function ‘ast::ptr ResolvExpr::commonType(ast::ptr&, ast::ptr&, ast::TypeEnvironment&, ast::AssertionSet&, ast::AssertionSet&, const OpenVarSet&, ResolvExpr::WidenMode)’:
/var/lib/jenkins/workspace/Cforall_master/src/ResolvExpr/CommonType.cpp:748:23: note: parameter passing for argument of type ‘ResolvExpr::WidenMode’ changed in GCC 9.1
748 | ast::ptr< ast::Type > commonType(
| ^~~~~~~~~~
/var/lib/jenkins/workspace/Cforall_master/src/ResolvExpr/Unify.cpp: In function ‘bool ResolvExpr::unifyExact(const ast::Type*, const ast::Type*, ast::TypeEnvironment&, ast::AssertionSet&, ast::AssertionSet&, const OpenVarSet&, ResolvExpr::WidenMode)’:
/var/lib/jenkins/workspace/Cforall_master/src/ResolvExpr/Unify.cpp:644:6: note: parameter passing for argument of type ‘ResolvExpr::WidenMode’ changed in GCC 9.1
644 | bool unifyExact(
| ^~~~~~~~~~
/var/lib/jenkins/workspace/Cforall_master/src/AST/TypeEnvironment.cpp: In member function ‘bool ast::TypeEnvironment::bindVar(const ast::TypeInstType*, const ast::Type*, const ast::TypeData&, ast::AssertionSet&, ast::AssertionSet&, const OpenVarSet&, ResolvExpr::WidenMode)’:
/var/lib/jenkins/workspace/Cforall_master/src/AST/TypeEnvironment.cpp:280:6: note: parameter passing for argument of type ‘ResolvExpr::WidenMode’ changed in GCC 9.1
280 | bool TypeEnvironment::bindVar(
| ^~~~~~~~~~~~~~~
/var/lib/jenkins/workspace/Cforall_master/src/AST/TypeEnvironment.cpp: In member function ‘bool ast::TypeEnvironment::bindVarToVar(const ast::TypeInstType*, const ast::TypeInstType*, ast::TypeData&&, ast::AssertionSet&, ast::AssertionSet&, const OpenVarSet&, ResolvExpr::WidenMode)’:
/var/lib/jenkins/workspace/Cforall_master/src/AST/TypeEnvironment.cpp:319:6: note: parameter passing for argument of type ‘ResolvExpr::WidenMode’ changed in GCC 9.1
319 | bool TypeEnvironment::bindVarToVar(
| ^~~~~~~~~~~~~~~
/var/lib/jenkins/workspace/Cforall_master/src/ResolvExpr/Unify.cpp: In function ‘bool ResolvExpr::unifyInexact(ast::ptr&, ast::ptr&, ast::TypeEnvironment&, ast::AssertionSet&, ast::AssertionSet&, const OpenVarSet&, ResolvExpr::WidenMode, ast::ptr&)’:
/var/lib/jenkins/workspace/Cforall_master/src/ResolvExpr/Unify.cpp:671:6: note: parameter passing for argument of type ‘ResolvExpr::WidenMode’ changed in GCC 9.1
671 | bool unifyInexact(
| ^~~~~~~~~~~~
CXXLD ../driver/cfa-cpp
[Pipeline] }
[Pipeline] // dir
[Pipeline] }
[Pipeline] // stage
[Pipeline] echo
-------- Build : libcfa(debug) --------
[Pipeline] stage
[Pipeline] { (Build : libcfa(debug))
[Pipeline] dir
Running in /var/lib/jenkins/workspace/Cforall_master@tmp
[Pipeline] {
[Pipeline] sh
+ nproc
+ make -j 96 --no-print-directory -C libcfa/arm64-debug
Making all in prelude
mkdir .deps
touch .deps/builtins.Po
(CDPATH="${ZSH_VERSION+.}:" && cd /var/lib/jenkins/workspace/Cforall_master/libcfa && /bin/bash '/var/lib/jenkins/workspace/Cforall_master/libcfa/automake/missing' autoheader)
rm -f stamp-h1
touch /var/lib/jenkins/workspace/Cforall_master/libcfa/prelude/defines.hfa.in
cd .. && /bin/bash ./config.status prelude/defines.hfa
config.status: creating prelude/defines.hfa
config.status: prelude/defines.hfa is unchanged
make all-am
GEN gcc-builtins.c
GEN builtins.cfa
GEN prelude.cfa
GEN extras.cfa
GEN extras.cfa
GEN gcc-builtins.cfa
GEN bootloader.c
Making all in src
CFA common.lo
CFA fstream.lo
CFA iostream.lo
CFA heap.lo
CFA iterator.lo
CFA limits.lo
CFA math.lo
CFA memory.lo
CFA parseargs.lo
CFA parseconfig.lo
CFA rational.lo
CFA stdlib.lo
CFA strstream.lo
CFA time.lo
CFA assert.lo
CC exception.lo
CFA interpose.lo
CFA prelude-inline.lo
CFA startup.lo
CC virtual.lo
GEN prelude.lo
CFA interpose_thread.lo
CFA bits/weakso_locks.lo
CFA algorithms/range_iterator.lo
CFA collections/maybe.lo
CFA collections/pair.lo
CFA collections/result.lo
CFA collections/string.lo
CFA collections/string_res.lo
CFA collections/vector.lo
CFA device/cpu.lo
CFA bits/debug.lo
CFA concurrency/alarm.lo
CFA concurrency/coroutine.lo
CFA concurrency/exception.lo
CFA concurrency/kernel.lo
CFA concurrency/kernel/cluster.lo
CFA concurrency/locks.lo
CFA concurrency/monitor.lo
CFA concurrency/mutex.lo
CFA concurrency/select.lo
CFA concurrency/thread.lo
CFA concurrency/cofor.lo
CFA concurrency/clib/cfathread.lo
CPPAS concurrency/CtxSwitch-arm64.lo
CC concurrency/invoke.lo
CFA concurrency/io.lo
CFA concurrency/io/setup.lo
CFA concurrency/io/call.lo
CFA concurrency/kernel/startup.lo
CFA concurrency/preemption.lo
CFA concurrency/ready_queue.lo
CFA concurrency/stats.lo
CFA concurrency/pthread.lo
/usr/include/linux/io_uring.h:83:36: warning: 'packed' attribute ignored for field of type 'union __io_uring_sqe____anonymous65' [-Wattributes]
83 | } __attribute__((packed));
| ^
CCLD libcfa.la
/usr/include/linux/io_uring.h:83:36: warning: 'packed' attribute ignored for field of type 'union __io_uring_sqe____anonymous53' [-Wattributes]
83 | } __attribute__((packed));
| ^
/usr/bin/ld: warning: .libs/common.o: requires executable stack (because the .note.GNU-stack section is executable)
/usr/include/linux/io_uring.h:83:36: warning: 'packed' attribute ignored for field of type 'union __io_uring_sqe____anonymous129' [-Wattributes]
83 | } __attribute__((packed));
| ^
/usr/include/linux/io_uring.h:83:36: warning: 'packed' attribute ignored for field of type 'union __io_uring_sqe____anonymous119' [-Wattributes]
83 | } __attribute__((packed));
| ^
/usr/include/linux/io_uring.h:83:36: warning: 'packed' attribute ignored for field of type 'union __io_uring_sqe____anonymous119' [-Wattributes]
83 | } __attribute__((packed));
| ^
/usr/include/linux/io_uring.h:83:36: warning: 'packed' attribute ignored for field of type 'union __io_uring_sqe____anonymous32' [-Wattributes]
83 | } __attribute__((packed));
| ^
/usr/include/linux/io_uring.h:83:36: warning: 'packed' attribute ignored for field of type 'union __io_uring_sqe____anonymous97' [-Wattributes]
83 | } __attribute__((packed));
| ^
CCLD libcfathread.la
/usr/bin/ld: warning: concurrency/.libs/alarm.o: requires executable stack (because the .note.GNU-stack section is executable)
make[1]: Nothing to be done for 'all-am'.
[Pipeline] }
[Pipeline] // dir
[Pipeline] }
[Pipeline] // stage
[Pipeline] echo
-------- Build : libcfa(nodebug) --------
[Pipeline] stage
[Pipeline] { (Build : libcfa(nodebug))
[Pipeline] dir
Running in /var/lib/jenkins/workspace/Cforall_master@tmp
[Pipeline] {
[Pipeline] sh
+ nproc
+ make -j 96 --no-print-directory -C libcfa/arm64-nodebug
Making all in prelude
mkdir .deps
touch .deps/builtins.Po
cd .. && /bin/bash ./config.status prelude/defines.hfa
config.status: creating prelude/defines.hfa
config.status: prelude/defines.hfa is unchanged
make all-am
GEN gcc-builtins.c
GEN builtins.cfa
GEN prelude.cfa
GEN extras.cfa
GEN gcc-builtins.cfa
GEN extras.cfa
GEN bootloader.c
Making all in src
CFA common.lo
CFA fstream.lo
CFA heap.lo
CFA iostream.lo
CFA iterator.lo
CFA limits.lo
CFA math.lo
CFA memory.lo
CFA parseargs.lo
CFA parseconfig.lo
CFA rational.lo
CFA stdlib.lo
CFA strstream.lo
CFA time.lo
CFA assert.lo
CFA bits/debug.lo
CC exception.lo
CFA interpose.lo
CFA prelude-inline.lo
CFA startup.lo
CC virtual.lo
GEN prelude.lo
CFA interpose_thread.lo
CFA concurrency/preemption.lo
CFA concurrency/ready_queue.lo
CFA concurrency/stats.lo
CFA concurrency/pthread.lo
CFA bits/weakso_locks.lo
CFA algorithms/range_iterator.lo
CFA collections/maybe.lo
CFA collections/pair.lo
CFA collections/result.lo
CFA collections/string.lo
CFA collections/string_res.lo
CFA collections/vector.lo
CFA device/cpu.lo
CFA concurrency/alarm.lo
CFA concurrency/coroutine.lo
CFA concurrency/exception.lo
CFA concurrency/kernel.lo
CFA concurrency/kernel/cluster.lo
CFA concurrency/locks.lo
CFA concurrency/monitor.lo
CFA concurrency/mutex.lo
CFA concurrency/select.lo
CFA concurrency/thread.lo
CFA concurrency/cofor.lo
CFA concurrency/clib/cfathread.lo
CPPAS concurrency/CtxSwitch-arm64.lo
CC concurrency/invoke.lo
CFA concurrency/io.lo
CFA concurrency/io/setup.lo
CFA concurrency/io/call.lo
CFA concurrency/kernel/startup.lo
/var/lib/jenkins/workspace/Cforall_master/libcfa/src/exception.c: In function '__cfaehm_allocate_exception':
/var/lib/jenkins/workspace/Cforall_master/libcfa/src/exception.c:142:3: warning: ignoring return value of 'write' declared with attribute 'warn_unused_result' [-Wunused-result]
142 | write( 2, "abort2\n", 7 );
| ^~~~~~~~~~~~~~~~~~~~~~~~~
/var/lib/jenkins/workspace/Cforall_master/libcfa/src/exception.c: In function '__cfaehm_exception_cleanup':
/var/lib/jenkins/workspace/Cforall_master/libcfa/src/exception.c:127:3: warning: ignoring return value of 'write' declared with attribute 'warn_unused_result' [-Wunused-result]
127 | write( 2, "abort1\n", 7 );
| ^~~~~~~~~~~~~~~~~~~~~~~~~
/var/lib/jenkins/workspace/Cforall_master/libcfa/src/exception.c: In function '__cfaehm_cancel_stack':
/var/lib/jenkins/workspace/Cforall_master/libcfa/src/exception.c:230:2: warning: ignoring return value of 'write' declared with attribute 'warn_unused_result' [-Wunused-result]
230 | write( 2, "abort3\n", 7 );
| ^~~~~~~~~~~~~~~~~~~~~~~~~
/var/lib/jenkins/workspace/Cforall_master/libcfa/src/exception.c: In function '__cfaehm_begin_unwind':
/var/lib/jenkins/workspace/Cforall_master/libcfa/src/exception.c:252:3: warning: ignoring return value of 'write' declared with attribute 'warn_unused_result' [-Wunused-result]
252 | write( 2, "abort4\n", 7 );
| ^~~~~~~~~~~~~~~~~~~~~~~~~
/var/lib/jenkins/workspace/Cforall_master/libcfa/src/exception.c:278:3: warning: ignoring return value of 'write' declared with attribute 'warn_unused_result' [-Wunused-result]
278 | write( 2, "abort5\n", 7 );
| ^~~~~~~~~~~~~~~~~~~~~~~~~
/var/lib/jenkins/workspace/Cforall_master/libcfa/src/exception.c: In function '__cfaehm_rethrow_terminate':
/var/lib/jenkins/workspace/Cforall_master/libcfa/src/exception.c:308:2: warning: ignoring return value of 'write' declared with attribute 'warn_unused_result' [-Wunused-result]
308 | write( 2, "abort7\n", 7 );
| ^~~~~~~~~~~~~~~~~~~~~~~~~
/var/lib/jenkins/workspace/Cforall_master/libcfa/src/exception.c: In function '__cfaehm_rethrow_adapter':
/var/lib/jenkins/workspace/Cforall_master/libcfa/src/exception.c:300:2: warning: ignoring return value of 'write' declared with attribute 'warn_unused_result' [-Wunused-result]
300 | write( 2, "abort6\n", 7 );
| ^~~~~~~~~~~~~~~~~~~~~~~~~
/usr/include/linux/io_uring.h:83:36: warning: 'packed' attribute ignored for field of type 'union __io_uring_sqe____anonymous65' [-Wattributes]
83 | } __attribute__((packed));
| ^
/usr/include/aarch64-linux-gnu/bits/socket2.h:70:94: warning: '_X12_constructorFv_U26__anonymous___SOCKADDR_ARGU26__anonymous___SOCKADDR_ARG_autogen___1' is static but used in inline function 'recvfrom' which is not static
70 | return __recvfrom_chk (__fd, __buf, __n, sz, __flags, __addr, __addr_len);
| ^
/usr/include/aarch64-linux-gnu/bits/socket2.h:70:124: warning: '_X11_destructorFv_U26__anonymous___SOCKADDR_ARG_autogen___1' is static but used in inline function 'recvfrom' which is not static
70 | return __recvfrom_chk (__fd, __buf, __n, sz, __flags, __addr, __addr_len);
| ^
/usr/include/aarch64-linux-gnu/bits/socket2.h:68:103: warning: '_X12_constructorFv_U26__anonymous___SOCKADDR_ARGU26__anonymous___SOCKADDR_ARG_autogen___1' is static but used in inline function 'recvfrom' which is not static
68 | return __recvfrom_chk_warn (__fd, __buf, __n, sz, __flags, __addr,
| ^
/usr/include/aarch64-linux-gnu/bits/socket2.h:68:128: warning: '_X11_destructorFv_U26__anonymous___SOCKADDR_ARG_autogen___1' is static but used in inline function 'recvfrom' which is not static
68 | return __recvfrom_chk_warn (__fd, __buf, __n, sz, __flags, __addr,
| ^
/usr/include/aarch64-linux-gnu/bits/socket2.h:66:96: warning: '_X12_constructorFv_U26__anonymous___SOCKADDR_ARGU26__anonymous___SOCKADDR_ARG_autogen___1' is static but used in inline function 'recvfrom' which is not static
66 | return __recvfrom_alias (__fd, __buf, __n, __flags, __addr, __addr_len);
| ^
/usr/include/aarch64-linux-gnu/bits/socket2.h:66:128: warning: '_X11_destructorFv_U26__anonymous___SOCKADDR_ARG_autogen___1' is static but used in inline function 'recvfrom' which is not static
66 | return __recvfrom_alias (__fd, __buf, __n, __flags, __addr, __addr_len);
| ^
/usr/include/linux/io_uring.h:83:36: warning: 'packed' attribute ignored for field of type 'union __io_uring_sqe____anonymous53' [-Wattributes]
83 | } __attribute__((packed));
| ^
/usr/include/linux/io_uring.h:83:36: warning: 'packed' attribute ignored for field of type 'union __io_uring_sqe____anonymous129' [-Wattributes]
83 | } __attribute__((packed));
| ^
/usr/include/aarch64-linux-gnu/bits/socket2.h:70:95: warning: '_X12_constructorFv_U26__anonymous___SOCKADDR_ARGU26__anonymous___SOCKADDR_ARG_autogen___1' is static but used in inline function 'recvfrom' which is not static
70 | return __recvfrom_chk (__fd, __buf, __n, sz, __flags, __addr, __addr_len);
| ^
/usr/include/aarch64-linux-gnu/bits/socket2.h:70:125: warning: '_X11_destructorFv_U26__anonymous___SOCKADDR_ARG_autogen___1' is static but used in inline function 'recvfrom' which is not static
70 | return __recvfrom_chk (__fd, __buf, __n, sz, __flags, __addr, __addr_len);
| ^
/usr/include/aarch64-linux-gnu/bits/socket2.h:68:104: warning: '_X12_constructorFv_U26__anonymous___SOCKADDR_ARGU26__anonymous___SOCKADDR_ARG_autogen___1' is static but used in inline function 'recvfrom' which is not static
68 | return __recvfrom_chk_warn (__fd, __buf, __n, sz, __flags, __addr,
| ^
/usr/include/aarch64-linux-gnu/bits/socket2.h:68:129: warning: '_X11_destructorFv_U26__anonymous___SOCKADDR_ARG_autogen___1' is static but used in inline function 'recvfrom' which is not static
68 | return __recvfrom_chk_warn (__fd, __buf, __n, sz, __flags, __addr,
| ^
/usr/include/aarch64-linux-gnu/bits/socket2.h:66:97: warning: '_X12_constructorFv_U26__anonymous___SOCKADDR_ARGU26__anonymous___SOCKADDR_ARG_autogen___1' is static but used in inline function 'recvfrom' which is not static
66 | return __recvfrom_alias (__fd, __buf, __n, __flags, __addr, __addr_len);
| ^
/usr/include/aarch64-linux-gnu/bits/socket2.h:66:129: warning: '_X11_destructorFv_U26__anonymous___SOCKADDR_ARG_autogen___1' is static but used in inline function 'recvfrom' which is not static
66 | return __recvfrom_alias (__fd, __buf, __n, __flags, __addr, __addr_len);
| ^
/usr/include/aarch64-linux-gnu/bits/socket2.h:70:95: warning: '_X12_constructorFv_U26__anonymous___SOCKADDR_ARGU26__anonymous___SOCKADDR_ARG_autogen___1' is static but used in inline function 'recvfrom' which is not static
70 | return __recvfrom_chk (__fd, __buf, __n, sz, __flags, __addr, __addr_len);
| ^
/usr/include/aarch64-linux-gnu/bits/socket2.h:70:125: warning: '_X11_destructorFv_U26__anonymous___SOCKADDR_ARG_autogen___1' is static but used in inline function 'recvfrom' which is not static
70 | return __recvfrom_chk (__fd, __buf, __n, sz, __flags, __addr, __addr_len);
| ^
/usr/include/aarch64-linux-gnu/bits/socket2.h:68:104: warning: '_X12_constructorFv_U26__anonymous___SOCKADDR_ARGU26__anonymous___SOCKADDR_ARG_autogen___1' is static but used in inline function 'recvfrom' which is not static
68 | return __recvfrom_chk_warn (__fd, __buf, __n, sz, __flags, __addr,
| ^
/usr/include/aarch64-linux-gnu/bits/socket2.h:68:129: warning: '_X11_destructorFv_U26__anonymous___SOCKADDR_ARG_autogen___1' is static but used in inline function 'recvfrom' which is not static
68 | return __recvfrom_chk_warn (__fd, __buf, __n, sz, __flags, __addr,
| ^
/usr/include/aarch64-linux-gnu/bits/socket2.h:66:97: warning: '_X12_constructorFv_U26__anonymous___SOCKADDR_ARGU26__anonymous___SOCKADDR_ARG_autogen___1' is static but used in inline function 'recvfrom' which is not static
66 | return __recvfrom_alias (__fd, __buf, __n, __flags, __addr, __addr_len);
| ^
/usr/include/aarch64-linux-gnu/bits/socket2.h:66:129: warning: '_X11_destructorFv_U26__anonymous___SOCKADDR_ARG_autogen___1' is static but used in inline function 'recvfrom' which is not static
66 | return __recvfrom_alias (__fd, __buf, __n, __flags, __addr, __addr_len);
| ^
/usr/include/linux/io_uring.h:83:36: warning: 'packed' attribute ignored for field of type 'union __io_uring_sqe____anonymous119' [-Wattributes]
83 | } __attribute__((packed));
| ^
/usr/include/aarch64-linux-gnu/bits/socket2.h:70:95: warning: '_X12_constructorFv_U26__anonymous___SOCKADDR_ARGU26__anonymous___SOCKADDR_ARG_autogen___1' is static but used in inline function 'recvfrom' which is not static
70 | return __recvfrom_chk (__fd, __buf, __n, sz, __flags, __addr, __addr_len);
| ^
/usr/include/aarch64-linux-gnu/bits/socket2.h:70:125: warning: '_X11_destructorFv_U26__anonymous___SOCKADDR_ARG_autogen___1' is static but used in inline function 'recvfrom' which is not static
70 | return __recvfrom_chk (__fd, __buf, __n, sz, __flags, __addr, __addr_len);
| ^
/usr/include/aarch64-linux-gnu/bits/socket2.h:68:104: warning: '_X12_constructorFv_U26__anonymous___SOCKADDR_ARGU26__anonymous___SOCKADDR_ARG_autogen___1' is static but used in inline function 'recvfrom' which is not static
68 | return __recvfrom_chk_warn (__fd, __buf, __n, sz, __flags, __addr,
| ^
/usr/include/aarch64-linux-gnu/bits/socket2.h:68:129: warning: '_X11_destructorFv_U26__anonymous___SOCKADDR_ARG_autogen___1' is static but used in inline function 'recvfrom' which is not static
68 | return __recvfrom_chk_warn (__fd, __buf, __n, sz, __flags, __addr,
| ^
/usr/include/aarch64-linux-gnu/bits/socket2.h:66:97: warning: '_X12_constructorFv_U26__anonymous___SOCKADDR_ARGU26__anonymous___SOCKADDR_ARG_autogen___1' is static but used in inline function 'recvfrom' which is not static
66 | return __recvfrom_alias (__fd, __buf, __n, __flags, __addr, __addr_len);
| ^
/usr/include/aarch64-linux-gnu/bits/socket2.h:66:129: warning: '_X11_destructorFv_U26__anonymous___SOCKADDR_ARG_autogen___1' is static but used in inline function 'recvfrom' which is not static
66 | return __recvfrom_alias (__fd, __buf, __n, __flags, __addr, __addr_len);
| ^
/usr/include/linux/io_uring.h:83:36: warning: 'packed' attribute ignored for field of type 'union __io_uring_sqe____anonymous119' [-Wattributes]
83 | } __attribute__((packed));
| ^
/usr/include/aarch64-linux-gnu/bits/socket2.h:70:95: warning: '_X12_constructorFv_U26__anonymous___SOCKADDR_ARGU26__anonymous___SOCKADDR_ARG_autogen___1' is static but used in inline function 'recvfrom' which is not static
70 | return __recvfrom_chk (__fd, __buf, __n, sz, __flags, __addr, __addr_len);
| ^
/usr/include/aarch64-linux-gnu/bits/socket2.h:70:125: warning: '_X11_destructorFv_U26__anonymous___SOCKADDR_ARG_autogen___1' is static but used in inline function 'recvfrom' which is not static
70 | return __recvfrom_chk (__fd, __buf, __n, sz, __flags, __addr, __addr_len);
| ^
/usr/include/aarch64-linux-gnu/bits/socket2.h:68:104: warning: '_X12_constructorFv_U26__anonymous___SOCKADDR_ARGU26__anonymous___SOCKADDR_ARG_autogen___1' is static but used in inline function 'recvfrom' which is not static
68 | return __recvfrom_chk_warn (__fd, __buf, __n, sz, __flags, __addr,
| ^
/usr/include/aarch64-linux-gnu/bits/socket2.h:68:129: warning: '_X11_destructorFv_U26__anonymous___SOCKADDR_ARG_autogen___1' is static but used in inline function 'recvfrom' which is not static
68 | return __recvfrom_chk_warn (__fd, __buf, __n, sz, __flags, __addr,
| ^
/usr/include/aarch64-linux-gnu/bits/socket2.h:66:97: warning: '_X12_constructorFv_U26__anonymous___SOCKADDR_ARGU26__anonymous___SOCKADDR_ARG_autogen___1' is static but used in inline function 'recvfrom' which is not static
66 | return __recvfrom_alias (__fd, __buf, __n, __flags, __addr, __addr_len);
| ^
/usr/include/aarch64-linux-gnu/bits/socket2.h:66:129: warning: '_X11_destructorFv_U26__anonymous___SOCKADDR_ARG_autogen___1' is static but used in inline function 'recvfrom' which is not static
66 | return __recvfrom_alias (__fd, __buf, __n, __flags, __addr, __addr_len);
| ^
CCLD libcfa.la
/usr/bin/ld: warning: .libs/common.o: requires executable stack (because the .note.GNU-stack section is executable)
/usr/include/linux/io_uring.h:83:36: warning: 'packed' attribute ignored for field of type 'union __io_uring_sqe____anonymous32' [-Wattributes]
83 | } __attribute__((packed));
| ^
/usr/include/aarch64-linux-gnu/bits/socket2.h:70:94: warning: '_X12_constructorFv_U26__anonymous___SOCKADDR_ARGU26__anonymous___SOCKADDR_ARG_autogen___1' is static but used in inline function 'recvfrom' which is not static
70 | return __recvfrom_chk (__fd, __buf, __n, sz, __flags, __addr, __addr_len);
| ^
/usr/include/aarch64-linux-gnu/bits/socket2.h:70:124: warning: '_X11_destructorFv_U26__anonymous___SOCKADDR_ARG_autogen___1' is static but used in inline function 'recvfrom' which is not static
70 | return __recvfrom_chk (__fd, __buf, __n, sz, __flags, __addr, __addr_len);
| ^
/usr/include/aarch64-linux-gnu/bits/socket2.h:68:103: warning: '_X12_constructorFv_U26__anonymous___SOCKADDR_ARGU26__anonymous___SOCKADDR_ARG_autogen___1' is static but used in inline function 'recvfrom' which is not static
68 | return __recvfrom_chk_warn (__fd, __buf, __n, sz, __flags, __addr,
| ^
/usr/include/aarch64-linux-gnu/bits/socket2.h:68:128: warning: '_X11_destructorFv_U26__anonymous___SOCKADDR_ARG_autogen___1' is static but used in inline function 'recvfrom' which is not static
68 | return __recvfrom_chk_warn (__fd, __buf, __n, sz, __flags, __addr,
| ^
/usr/include/aarch64-linux-gnu/bits/socket2.h:66:96: warning: '_X12_constructorFv_U26__anonymous___SOCKADDR_ARGU26__anonymous___SOCKADDR_ARG_autogen___1' is static but used in inline function 'recvfrom' which is not static
66 | return __recvfrom_alias (__fd, __buf, __n, __flags, __addr, __addr_len);
| ^
/usr/include/aarch64-linux-gnu/bits/socket2.h:66:128: warning: '_X11_destructorFv_U26__anonymous___SOCKADDR_ARG_autogen___1' is static but used in inline function 'recvfrom' which is not static
66 | return __recvfrom_alias (__fd, __buf, __n, __flags, __addr, __addr_len);
| ^
/usr/include/linux/io_uring.h:83:36: warning: 'packed' attribute ignored for field of type 'union __io_uring_sqe____anonymous97' [-Wattributes]
83 | } __attribute__((packed));
| ^
/usr/include/aarch64-linux-gnu/bits/socket2.h:70:95: warning: '_X12_constructorFv_U26__anonymous___SOCKADDR_ARGU26__anonymous___SOCKADDR_ARG_autogen___1' is static but used in inline function 'recvfrom' which is not static
70 | return __recvfrom_chk (__fd, __buf, __n, sz, __flags, __addr, __addr_len);
| ^
/usr/include/aarch64-linux-gnu/bits/socket2.h:70:125: warning: '_X11_destructorFv_U26__anonymous___SOCKADDR_ARG_autogen___1' is static but used in inline function 'recvfrom' which is not static
70 | return __recvfrom_chk (__fd, __buf, __n, sz, __flags, __addr, __addr_len);
| ^
/usr/include/aarch64-linux-gnu/bits/socket2.h:68:104: warning: '_X12_constructorFv_U26__anonymous___SOCKADDR_ARGU26__anonymous___SOCKADDR_ARG_autogen___1' is static but used in inline function 'recvfrom' which is not static
68 | return __recvfrom_chk_warn (__fd, __buf, __n, sz, __flags, __addr,
| ^
/usr/include/aarch64-linux-gnu/bits/socket2.h:68:129: warning: '_X11_destructorFv_U26__anonymous___SOCKADDR_ARG_autogen___1' is static but used in inline function 'recvfrom' which is not static
68 | return __recvfrom_chk_warn (__fd, __buf, __n, sz, __flags, __addr,
| ^
/usr/include/aarch64-linux-gnu/bits/socket2.h:66:97: warning: '_X12_constructorFv_U26__anonymous___SOCKADDR_ARGU26__anonymous___SOCKADDR_ARG_autogen___1' is static but used in inline function 'recvfrom' which is not static
66 | return __recvfrom_alias (__fd, __buf, __n, __flags, __addr, __addr_len);
| ^
/usr/include/aarch64-linux-gnu/bits/socket2.h:66:129: warning: '_X11_destructorFv_U26__anonymous___SOCKADDR_ARG_autogen___1' is static but used in inline function 'recvfrom' which is not static
66 | return __recvfrom_alias (__fd, __buf, __n, __flags, __addr, __addr_len);
| ^
CCLD libcfathread.la
/usr/bin/ld: warning: concurrency/.libs/coroutine.o: requires executable stack (because the .note.GNU-stack section is executable)
make[1]: Nothing to be done for 'all-am'.
[Pipeline] }
[Pipeline] // dir
[Pipeline] }
[Pipeline] // stage
[Pipeline] echo
-------- Build : install --------
[Pipeline] stage
[Pipeline] { (Build : install)
[Pipeline] dir
Running in /var/lib/jenkins/workspace/Cforall_master@tmp
[Pipeline] {
[Pipeline] sh
+ nproc
+ make -j 96 --no-print-directory install
Making install in driver
make install-exec-hook
/usr/bin/install -c cfa '/var/lib/jenkins/workspace/Cforall_master@tmp/bin//cfa'
/usr/bin/mkdir -p '/var/lib/jenkins/workspace/Cforall_master@tmp/lib/cfa/'
/bin/bash ../libtool --mode=install /usr/bin/install -c as cc1 '/var/lib/jenkins/workspace/Cforall_master@tmp/lib/cfa/'
libtool: install: /usr/bin/install -c as /var/lib/jenkins/workspace/Cforall_master@tmp/lib/cfa/as
libtool: install: /usr/bin/install -c cc1 /var/lib/jenkins/workspace/Cforall_master@tmp/lib/cfa/cc1
Making install in src
make install-am
make[3]: Nothing to be done for 'install-exec-am'.
/usr/bin/mkdir -p '/var/lib/jenkins/workspace/Cforall_master@tmp/lib/cfa/'
/bin/bash ../libtool --mode=install /usr/bin/install -c ../driver/cfa-cpp '/var/lib/jenkins/workspace/Cforall_master@tmp/lib/cfa/'
libtool: install: /usr/bin/install -c ../driver/cfa-cpp /var/lib/jenkins/workspace/Cforall_master@tmp/lib/cfa/cfa-cpp
Making install in .
(CDPATH="${ZSH_VERSION+.}:" && cd /var/lib/jenkins/workspace/Cforall_master && /bin/bash '/var/lib/jenkins/workspace/Cforall_master/automake/missing' autoheader)
rm -f stamp-h1
touch /var/lib/jenkins/workspace/Cforall_master/src/config.h.in
cd . && /bin/bash ./config.status config.h
config.status: creating config.h
config.status: config.h is unchanged
make[2]: Nothing to be done for 'install-exec-am'.
/usr/bin/mkdir -p '/var/lib/jenkins/workspace/Cforall_master@tmp/share/man/man1'
/usr/bin/install -c -m 644 /var/lib/jenkins/workspace/Cforall_master/doc/man/cfa.1 '/var/lib/jenkins/workspace/Cforall_master@tmp/share/man/man1'
Making install in libcfa/arm64-debug
Making install in prelude
touch .deps/builtins.Po
make[3]: Nothing to be done for 'install-exec-am'.
/usr/bin/mkdir -p '/var/lib/jenkins/workspace/Cforall_master@tmp/lib/cfa/arm64-debug/'
/usr/bin/install -c -m 644 gcc-builtins.cfa builtins.cfa extras.cfa prelude.cfa bootloader.c defines.hfa '/var/lib/jenkins/workspace/Cforall_master@tmp/lib/cfa/arm64-debug/'
Making install in src
/usr/bin/mkdir -p '/var/lib/jenkins/workspace/Cforall_master@tmp/lib/cfa/arm64-debug/'
/bin/bash ../libtool --mode=install /usr/bin/install -c libcfa.la libcfathread.la '/var/lib/jenkins/workspace/Cforall_master@tmp/lib/cfa/arm64-debug/'
/usr/bin/mkdir -p '/var/lib/jenkins/workspace/Cforall_master@tmp/include/cfa/'
/usr/bin/mkdir -p '/var/lib/jenkins/workspace/Cforall_master@tmp/include/cfa//stdhdr/sys'
/usr/bin/install -c -m 644 /var/lib/jenkins/workspace/Cforall_master/libcfa/src/stdhdr/sys/mman.h /var/lib/jenkins/workspace/Cforall_master/libcfa/src/stdhdr/sys/time.h /var/lib/jenkins/workspace/Cforall_master/libcfa/src/stdhdr/sys/socket.h '/var/lib/jenkins/workspace/Cforall_master@tmp/include/cfa//stdhdr/sys'
/usr/bin/mkdir -p '/var/lib/jenkins/workspace/Cforall_master@tmp/include/cfa//algorithms'
/usr/bin/install -c -m 644 /var/lib/jenkins/workspace/Cforall_master/libcfa/src/algorithms/range_iterator.hfa '/var/lib/jenkins/workspace/Cforall_master@tmp/include/cfa//algorithms'
/usr/bin/mkdir -p '/var/lib/jenkins/workspace/Cforall_master@tmp/include/cfa//concurrency/kernel'
/usr/bin/install -c -m 644 /var/lib/jenkins/workspace/Cforall_master/libcfa/src/concurrency/kernel/cluster.hfa /var/lib/jenkins/workspace/Cforall_master/libcfa/src/concurrency/kernel/fwd.hfa '/var/lib/jenkins/workspace/Cforall_master@tmp/include/cfa//concurrency/kernel'
/usr/bin/install -c -m 644 /var/lib/jenkins/workspace/Cforall_master/libcfa/src/common.hfa /var/lib/jenkins/workspace/Cforall_master/libcfa/src/fstream.hfa /var/lib/jenkins/workspace/Cforall_master/libcfa/src/heap.hfa /var/lib/jenkins/workspace/Cforall_master/libcfa/src/iostream.hfa /var/lib/jenkins/workspace/Cforall_master/libcfa/src/iterator.hfa /var/lib/jenkins/workspace/Cforall_master/libcfa/src/limits.hfa /var/lib/jenkins/workspace/Cforall_master/libcfa/src/math.hfa /var/lib/jenkins/workspace/Cforall_master/libcfa/src/memory.hfa /var/lib/jenkins/workspace/Cforall_master/libcfa/src/parseargs.hfa /var/lib/jenkins/workspace/Cforall_master/libcfa/src/parseconfig.hfa /var/lib/jenkins/workspace/Cforall_master/libcfa/src/rational.hfa /var/lib/jenkins/workspace/Cforall_master/libcfa/src/stdlib.hfa /var/lib/jenkins/workspace/Cforall_master/libcfa/src/strstream.hfa /var/lib/jenkins/workspace/Cforall_master/libcfa/src/time.hfa /var/lib/jenkins/workspace/Cforall_master/libcfa/src/Exception.hfa /var/lib/jenkins/workspace/Cforall_master/libcfa/src/bitmanip.hfa /var/lib/jenkins/workspace/Cforall_master/libcfa/src/clock.hfa /var/lib/jenkins/workspace/Cforall_master/libcfa/src/exception.hfa /var/lib/jenkins/workspace/Cforall_master/libcfa/src/exception.h /var/lib/jenkins/workspace/Cforall_master/libcfa/src/gmp.hfa /var/lib/jenkins/workspace/Cforall_master/libcfa/src/math.trait.hfa /var/lib/jenkins/workspace/Cforall_master/libcfa/src/raii.hfa /var/lib/jenkins/workspace/Cforall_master/libcfa/src/time_t.hfa /var/lib/jenkins/workspace/Cforall_master/libcfa/src/virtual_dtor.hfa '/var/lib/jenkins/workspace/Cforall_master@tmp/include/cfa//.'
/usr/bin/mkdir -p '/var/lib/jenkins/workspace/Cforall_master@tmp/include/cfa//concurrency'
/usr/bin/install -c -m 644 /var/lib/jenkins/workspace/Cforall_master/libcfa/src/concurrency/iofwd.hfa /var/lib/jenkins/workspace/Cforall_master/libcfa/src/concurrency/barrier.hfa /var/lib/jenkins/workspace/Cforall_master/libcfa/src/concurrency/alarm.hfa /var/lib/jenkins/workspace/Cforall_master/libcfa/src/concurrency/coroutine.hfa /var/lib/jenkins/workspace/Cforall_master/libcfa/src/concurrency/exception.hfa /var/lib/jenkins/workspace/Cforall_master/libcfa/src/concurrency/kernel.hfa /var/lib/jenkins/workspace/Cforall_master/libcfa/src/concurrency/locks.hfa /var/lib/jenkins/workspace/Cforall_master/libcfa/src/concurrency/monitor.hfa /var/lib/jenkins/workspace/Cforall_master/libcfa/src/concurrency/mutex.hfa /var/lib/jenkins/workspace/Cforall_master/libcfa/src/concurrency/select.hfa /var/lib/jenkins/workspace/Cforall_master/libcfa/src/concurrency/thread.hfa /var/lib/jenkins/workspace/Cforall_master/libcfa/src/concurrency/cofor.hfa /var/lib/jenkins/workspace/Cforall_master/libcfa/src/concurrency/invoke.h /var/lib/jenkins/workspace/Cforall_master/libcfa/src/concurrency/future.hfa /var/lib/jenkins/workspace/Cforall_master/libcfa/src/concurrency/once.hfa /var/lib/jenkins/workspace/Cforall_master/libcfa/src/concurrency/mutex_stmt.hfa /var/lib/jenkins/workspace/Cforall_master/libcfa/src/concurrency/channel.hfa /var/lib/jenkins/workspace/Cforall_master/libcfa/src/concurrency/actor.hfa '/var/lib/jenkins/workspace/Cforall_master@tmp/include/cfa//concurrency'
/usr/bin/mkdir -p '/var/lib/jenkins/workspace/Cforall_master@tmp/include/cfa//concurrency/clib'
/usr/bin/install -c -m 644 /var/lib/jenkins/workspace/Cforall_master/libcfa/src/concurrency/clib/cfathread.h '/var/lib/jenkins/workspace/Cforall_master@tmp/include/cfa//concurrency/clib'
/usr/bin/mkdir -p '/var/lib/jenkins/workspace/Cforall_master@tmp/include/cfa//device'
/usr/bin/install -c -m 644 /var/lib/jenkins/workspace/Cforall_master/libcfa/src/device/cpu.hfa '/var/lib/jenkins/workspace/Cforall_master@tmp/include/cfa//device'
/usr/bin/mkdir -p '/var/lib/jenkins/workspace/Cforall_master@tmp/include/cfa//stdhdr/libltdl'
/usr/bin/install -c -m 644 /var/lib/jenkins/workspace/Cforall_master/libcfa/src/stdhdr/libltdl/lt_dlloader.h '/var/lib/jenkins/workspace/Cforall_master@tmp/include/cfa//stdhdr/libltdl'
/usr/bin/mkdir -p '/var/lib/jenkins/workspace/Cforall_master@tmp/include/cfa//vec'
/usr/bin/install -c -m 644 /var/lib/jenkins/workspace/Cforall_master/libcfa/src/vec/vec.hfa /var/lib/jenkins/workspace/Cforall_master/libcfa/src/vec/vec2.hfa /var/lib/jenkins/workspace/Cforall_master/libcfa/src/vec/vec3.hfa /var/lib/jenkins/workspace/Cforall_master/libcfa/src/vec/vec4.hfa '/var/lib/jenkins/workspace/Cforall_master@tmp/include/cfa//vec'
libtool: install: /usr/bin/install -c .libs/libcfa.so.1.0.0 /var/lib/jenkins/workspace/Cforall_master@tmp/lib/cfa/arm64-debug/libcfa.so.1.0.0
/usr/bin/mkdir -p '/var/lib/jenkins/workspace/Cforall_master@tmp/include/cfa//bits'
/usr/bin/install -c -m 644 /var/lib/jenkins/workspace/Cforall_master/libcfa/src/bits/weakso_locks.hfa /var/lib/jenkins/workspace/Cforall_master/libcfa/src/bits/algorithm.hfa /var/lib/jenkins/workspace/Cforall_master/libcfa/src/bits/align.hfa /var/lib/jenkins/workspace/Cforall_master/libcfa/src/bits/collections.hfa /var/lib/jenkins/workspace/Cforall_master/libcfa/src/bits/debug.hfa /var/lib/jenkins/workspace/Cforall_master/libcfa/src/bits/defs.hfa /var/lib/jenkins/workspace/Cforall_master/libcfa/src/bits/locks.hfa /var/lib/jenkins/workspace/Cforall_master/libcfa/src/bits/collection.hfa /var/lib/jenkins/workspace/Cforall_master/libcfa/src/bits/stack.hfa /var/lib/jenkins/workspace/Cforall_master/libcfa/src/bits/queue.hfa /var/lib/jenkins/workspace/Cforall_master/libcfa/src/bits/sequence.hfa /var/lib/jenkins/workspace/Cforall_master/libcfa/src/bits/atomic.hfa /var/lib/jenkins/workspace/Cforall_master/libcfa/src/bits/random.hfa '/var/lib/jenkins/workspace/Cforall_master@tmp/include/cfa//bits'
libtool: install: (cd /var/lib/jenkins/workspace/Cforall_master@tmp/lib/cfa/arm64-debug && { ln -s -f libcfa.so.1.0.0 libcfa.so.1 || { rm -f libcfa.so.1 && ln -s libcfa.so.1.0.0 libcfa.so.1; }; })
/usr/bin/mkdir -p '/var/lib/jenkins/workspace/Cforall_master@tmp/include/cfa//stdhdr'
/usr/bin/install -c -m 644 /var/lib/jenkins/workspace/Cforall_master/libcfa/src/stdhdr/stdalign.h /var/lib/jenkins/workspace/Cforall_master/libcfa/src/stdhdr/stdio.h /var/lib/jenkins/workspace/Cforall_master/libcfa/src/stdhdr/malloc.h /var/lib/jenkins/workspace/Cforall_master/libcfa/src/stdhdr/time.h /var/lib/jenkins/workspace/Cforall_master/libcfa/src/stdhdr/signal.h /var/lib/jenkins/workspace/Cforall_master/libcfa/src/stdhdr/stdbool.h /var/lib/jenkins/workspace/Cforall_master/libcfa/src/stdhdr/unistd.h /var/lib/jenkins/workspace/Cforall_master/libcfa/src/stdhdr/stdatomic.h /var/lib/jenkins/workspace/Cforall_master/libcfa/src/stdhdr/stdint.h /var/lib/jenkins/workspace/Cforall_master/libcfa/src/stdhdr/gmp.h /var/lib/jenkins/workspace/Cforall_master/libcfa/src/stdhdr/locale.h /var/lib/jenkins/workspace/Cforall_master/libcfa/src/stdhdr/string.h /var/lib/jenkins/workspace/Cforall_master/libcfa/src/stdhdr/fenv.h /var/lib/jenkins/workspace/Cforall_master/libcfa/src/stdhdr/wchar.h /var/lib/jenkins/workspace/Cforall_master/libcfa/src/stdhdr/tgmath.h /var/lib/jenkins/workspace/Cforall_master/libcfa/src/stdhdr/math.h /var/lib/jenkins/workspace/Cforall_master/libcfa/src/stdhdr/pthread.h /var/lib/jenkins/workspace/Cforall_master/libcfa/src/stdhdr/complex.h /var/lib/jenkins/workspace/Cforall_master/libcfa/src/stdhdr/wctype.h /var/lib/jenkins/workspace/Cforall_master/libcfa/src/stdhdr/unwind.h /var/lib/jenkins/workspace/Cforall_master/libcfa/src/stdhdr/float.h /var/lib/jenkins/workspace/Cforall_master/libcfa/src/stdhdr/stdarg.h /var/lib/jenkins/workspace/Cforall_master/libcfa/src/stdhdr/stdlib.h /var/lib/jenkins/workspace/Cforall_master/libcfa/src/stdhdr/iso646.h /var/lib/jenkins/workspace/Cforall_master/libcfa/src/stdhdr/stddef.h /var/lib/jenkins/workspace/Cforall_master/libcfa/src/stdhdr/stdnoreturn.h /var/lib/jenkins/workspace/Cforall_master/libcfa/src/stdhdr/assert.h /var/lib/jenkins/workspace/Cforall_master/libcfa/src/stdhdr/ctype.h /var/lib/jenkins/workspace/Cforall_master/libcfa/src/stdhdr/errno.h /var/lib/jenkins/workspace/Cforall_master/libcfa/src/stdhdr/threads.h /var/lib/jenkins/workspace/Cforall_master/libcfa/src/stdhdr/uchar.h /var/lib/jenkins/workspace/Cforall_master/libcfa/src/stdhdr/inttypes.h /var/lib/jenkins/workspace/Cforall_master/libcfa/src/stdhdr/limits.h /var/lib/jenkins/workspace/Cforall_master/libcfa/src/stdhdr/setjmp.h '/var/lib/jenkins/workspace/Cforall_master@tmp/include/cfa//stdhdr'
/usr/bin/mkdir -p '/var/lib/jenkins/workspace/Cforall_master@tmp/include/cfa//collections'
libtool: install: (cd /var/lib/jenkins/workspace/Cforall_master@tmp/lib/cfa/arm64-debug && { ln -s -f libcfa.so.1.0.0 libcfa.so || { rm -f libcfa.so && ln -s libcfa.so.1.0.0 libcfa.so; }; })
/usr/bin/install -c -m 644 /var/lib/jenkins/workspace/Cforall_master/libcfa/src/collections/maybe.hfa /var/lib/jenkins/workspace/Cforall_master/libcfa/src/collections/pair.hfa /var/lib/jenkins/workspace/Cforall_master/libcfa/src/collections/result.hfa /var/lib/jenkins/workspace/Cforall_master/libcfa/src/collections/string.hfa /var/lib/jenkins/workspace/Cforall_master/libcfa/src/collections/string_res.hfa /var/lib/jenkins/workspace/Cforall_master/libcfa/src/collections/vector.hfa /var/lib/jenkins/workspace/Cforall_master/libcfa/src/collections/array.hfa /var/lib/jenkins/workspace/Cforall_master/libcfa/src/collections/list.hfa /var/lib/jenkins/workspace/Cforall_master/libcfa/src/collections/list2.hfa /var/lib/jenkins/workspace/Cforall_master/libcfa/src/collections/lockfree.hfa /var/lib/jenkins/workspace/Cforall_master/libcfa/src/collections/string_sharectx.hfa /var/lib/jenkins/workspace/Cforall_master/libcfa/src/collections/vector2.hfa '/var/lib/jenkins/workspace/Cforall_master@tmp/include/cfa//collections'
libtool: install: /usr/bin/install -c .libs/libcfa.lai /var/lib/jenkins/workspace/Cforall_master@tmp/lib/cfa/arm64-debug/libcfa.la
libtool: install: /usr/bin/install -c .libs/libcfathread.so.1.0.0 /var/lib/jenkins/workspace/Cforall_master@tmp/lib/cfa/arm64-debug/libcfathread.so.1.0.0
libtool: install: (cd /var/lib/jenkins/workspace/Cforall_master@tmp/lib/cfa/arm64-debug && { ln -s -f libcfathread.so.1.0.0 libcfathread.so.1 || { rm -f libcfathread.so.1 && ln -s libcfathread.so.1.0.0 libcfathread.so.1; }; })
libtool: install: (cd /var/lib/jenkins/workspace/Cforall_master@tmp/lib/cfa/arm64-debug && { ln -s -f libcfathread.so.1.0.0 libcfathread.so || { rm -f libcfathread.so && ln -s libcfathread.so.1.0.0 libcfathread.so; }; })
libtool: install: /usr/bin/install -c .libs/libcfathread.lai /var/lib/jenkins/workspace/Cforall_master@tmp/lib/cfa/arm64-debug/libcfathread.la
libtool: warning: remember to run 'libtool --finish /var/lib/jenkins/workspace/Cforall_master@tmp/lib/cfa/arm64-debug/'
make[3]: Nothing to be done for 'install-exec-am'.
make[3]: Nothing to be done for 'install-data-am'.
Making install in libcfa/arm64-nodebug
Making install in prelude
make[3]: Nothing to be done for 'install-exec-am'.
/usr/bin/mkdir -p '/var/lib/jenkins/workspace/Cforall_master@tmp/lib/cfa/arm64-nodebug/'
/usr/bin/install -c -m 644 gcc-builtins.cfa builtins.cfa extras.cfa prelude.cfa bootloader.c defines.hfa '/var/lib/jenkins/workspace/Cforall_master@tmp/lib/cfa/arm64-nodebug/'
Making install in src
/usr/bin/mkdir -p '/var/lib/jenkins/workspace/Cforall_master@tmp/lib/cfa/arm64-nodebug/'
/bin/bash ../libtool --mode=install /usr/bin/install -c libcfa.la libcfathread.la '/var/lib/jenkins/workspace/Cforall_master@tmp/lib/cfa/arm64-nodebug/'
/usr/bin/mkdir -p '/var/lib/jenkins/workspace/Cforall_master@tmp/include/cfa/'
/usr/bin/mkdir -p '/var/lib/jenkins/workspace/Cforall_master@tmp/include/cfa//stdhdr/sys'
/usr/bin/install -c -m 644 /var/lib/jenkins/workspace/Cforall_master/libcfa/src/stdhdr/sys/mman.h /var/lib/jenkins/workspace/Cforall_master/libcfa/src/stdhdr/sys/time.h /var/lib/jenkins/workspace/Cforall_master/libcfa/src/stdhdr/sys/socket.h '/var/lib/jenkins/workspace/Cforall_master@tmp/include/cfa//stdhdr/sys'
/usr/bin/mkdir -p '/var/lib/jenkins/workspace/Cforall_master@tmp/include/cfa//algorithms'
/usr/bin/install -c -m 644 /var/lib/jenkins/workspace/Cforall_master/libcfa/src/algorithms/range_iterator.hfa '/var/lib/jenkins/workspace/Cforall_master@tmp/include/cfa//algorithms'
/usr/bin/mkdir -p '/var/lib/jenkins/workspace/Cforall_master@tmp/include/cfa//concurrency/kernel'
/usr/bin/install -c -m 644 /var/lib/jenkins/workspace/Cforall_master/libcfa/src/concurrency/kernel/cluster.hfa /var/lib/jenkins/workspace/Cforall_master/libcfa/src/concurrency/kernel/fwd.hfa '/var/lib/jenkins/workspace/Cforall_master@tmp/include/cfa//concurrency/kernel'
/usr/bin/install -c -m 644 /var/lib/jenkins/workspace/Cforall_master/libcfa/src/common.hfa /var/lib/jenkins/workspace/Cforall_master/libcfa/src/fstream.hfa /var/lib/jenkins/workspace/Cforall_master/libcfa/src/heap.hfa /var/lib/jenkins/workspace/Cforall_master/libcfa/src/iostream.hfa /var/lib/jenkins/workspace/Cforall_master/libcfa/src/iterator.hfa /var/lib/jenkins/workspace/Cforall_master/libcfa/src/limits.hfa /var/lib/jenkins/workspace/Cforall_master/libcfa/src/math.hfa /var/lib/jenkins/workspace/Cforall_master/libcfa/src/memory.hfa /var/lib/jenkins/workspace/Cforall_master/libcfa/src/parseargs.hfa /var/lib/jenkins/workspace/Cforall_master/libcfa/src/parseconfig.hfa /var/lib/jenkins/workspace/Cforall_master/libcfa/src/rational.hfa /var/lib/jenkins/workspace/Cforall_master/libcfa/src/stdlib.hfa /var/lib/jenkins/workspace/Cforall_master/libcfa/src/strstream.hfa /var/lib/jenkins/workspace/Cforall_master/libcfa/src/time.hfa /var/lib/jenkins/workspace/Cforall_master/libcfa/src/Exception.hfa /var/lib/jenkins/workspace/Cforall_master/libcfa/src/bitmanip.hfa /var/lib/jenkins/workspace/Cforall_master/libcfa/src/clock.hfa /var/lib/jenkins/workspace/Cforall_master/libcfa/src/exception.hfa /var/lib/jenkins/workspace/Cforall_master/libcfa/src/exception.h /var/lib/jenkins/workspace/Cforall_master/libcfa/src/gmp.hfa /var/lib/jenkins/workspace/Cforall_master/libcfa/src/math.trait.hfa /var/lib/jenkins/workspace/Cforall_master/libcfa/src/raii.hfa /var/lib/jenkins/workspace/Cforall_master/libcfa/src/time_t.hfa /var/lib/jenkins/workspace/Cforall_master/libcfa/src/virtual_dtor.hfa '/var/lib/jenkins/workspace/Cforall_master@tmp/include/cfa//.'
/usr/bin/mkdir -p '/var/lib/jenkins/workspace/Cforall_master@tmp/include/cfa//concurrency'
/usr/bin/install -c -m 644 /var/lib/jenkins/workspace/Cforall_master/libcfa/src/concurrency/iofwd.hfa /var/lib/jenkins/workspace/Cforall_master/libcfa/src/concurrency/barrier.hfa /var/lib/jenkins/workspace/Cforall_master/libcfa/src/concurrency/alarm.hfa /var/lib/jenkins/workspace/Cforall_master/libcfa/src/concurrency/coroutine.hfa /var/lib/jenkins/workspace/Cforall_master/libcfa/src/concurrency/exception.hfa /var/lib/jenkins/workspace/Cforall_master/libcfa/src/concurrency/kernel.hfa /var/lib/jenkins/workspace/Cforall_master/libcfa/src/concurrency/locks.hfa /var/lib/jenkins/workspace/Cforall_master/libcfa/src/concurrency/monitor.hfa /var/lib/jenkins/workspace/Cforall_master/libcfa/src/concurrency/mutex.hfa /var/lib/jenkins/workspace/Cforall_master/libcfa/src/concurrency/select.hfa /var/lib/jenkins/workspace/Cforall_master/libcfa/src/concurrency/thread.hfa /var/lib/jenkins/workspace/Cforall_master/libcfa/src/concurrency/cofor.hfa /var/lib/jenkins/workspace/Cforall_master/libcfa/src/concurrency/invoke.h /var/lib/jenkins/workspace/Cforall_master/libcfa/src/concurrency/future.hfa /var/lib/jenkins/workspace/Cforall_master/libcfa/src/concurrency/once.hfa /var/lib/jenkins/workspace/Cforall_master/libcfa/src/concurrency/mutex_stmt.hfa /var/lib/jenkins/workspace/Cforall_master/libcfa/src/concurrency/channel.hfa /var/lib/jenkins/workspace/Cforall_master/libcfa/src/concurrency/actor.hfa '/var/lib/jenkins/workspace/Cforall_master@tmp/include/cfa//concurrency'
/usr/bin/mkdir -p '/var/lib/jenkins/workspace/Cforall_master@tmp/include/cfa//concurrency/clib'
/usr/bin/install -c -m 644 /var/lib/jenkins/workspace/Cforall_master/libcfa/src/concurrency/clib/cfathread.h '/var/lib/jenkins/workspace/Cforall_master@tmp/include/cfa//concurrency/clib'
/usr/bin/mkdir -p '/var/lib/jenkins/workspace/Cforall_master@tmp/include/cfa//device'
/usr/bin/install -c -m 644 /var/lib/jenkins/workspace/Cforall_master/libcfa/src/device/cpu.hfa '/var/lib/jenkins/workspace/Cforall_master@tmp/include/cfa//device'
/usr/bin/mkdir -p '/var/lib/jenkins/workspace/Cforall_master@tmp/include/cfa//stdhdr/libltdl'
/usr/bin/install -c -m 644 /var/lib/jenkins/workspace/Cforall_master/libcfa/src/stdhdr/libltdl/lt_dlloader.h '/var/lib/jenkins/workspace/Cforall_master@tmp/include/cfa//stdhdr/libltdl'
/usr/bin/mkdir -p '/var/lib/jenkins/workspace/Cforall_master@tmp/include/cfa//vec'
/usr/bin/install -c -m 644 /var/lib/jenkins/workspace/Cforall_master/libcfa/src/vec/vec.hfa /var/lib/jenkins/workspace/Cforall_master/libcfa/src/vec/vec2.hfa /var/lib/jenkins/workspace/Cforall_master/libcfa/src/vec/vec3.hfa /var/lib/jenkins/workspace/Cforall_master/libcfa/src/vec/vec4.hfa '/var/lib/jenkins/workspace/Cforall_master@tmp/include/cfa//vec'
libtool: install: /usr/bin/install -c .libs/libcfa.so.1.0.0 /var/lib/jenkins/workspace/Cforall_master@tmp/lib/cfa/arm64-nodebug/libcfa.so.1.0.0
/usr/bin/mkdir -p '/var/lib/jenkins/workspace/Cforall_master@tmp/include/cfa//bits'
/usr/bin/install -c -m 644 /var/lib/jenkins/workspace/Cforall_master/libcfa/src/bits/weakso_locks.hfa /var/lib/jenkins/workspace/Cforall_master/libcfa/src/bits/algorithm.hfa /var/lib/jenkins/workspace/Cforall_master/libcfa/src/bits/align.hfa /var/lib/jenkins/workspace/Cforall_master/libcfa/src/bits/collections.hfa /var/lib/jenkins/workspace/Cforall_master/libcfa/src/bits/debug.hfa /var/lib/jenkins/workspace/Cforall_master/libcfa/src/bits/defs.hfa /var/lib/jenkins/workspace/Cforall_master/libcfa/src/bits/locks.hfa /var/lib/jenkins/workspace/Cforall_master/libcfa/src/bits/collection.hfa /var/lib/jenkins/workspace/Cforall_master/libcfa/src/bits/stack.hfa /var/lib/jenkins/workspace/Cforall_master/libcfa/src/bits/queue.hfa /var/lib/jenkins/workspace/Cforall_master/libcfa/src/bits/sequence.hfa /var/lib/jenkins/workspace/Cforall_master/libcfa/src/bits/atomic.hfa /var/lib/jenkins/workspace/Cforall_master/libcfa/src/bits/random.hfa '/var/lib/jenkins/workspace/Cforall_master@tmp/include/cfa//bits'
/usr/bin/mkdir -p '/var/lib/jenkins/workspace/Cforall_master@tmp/include/cfa//stdhdr'
/usr/bin/install -c -m 644 /var/lib/jenkins/workspace/Cforall_master/libcfa/src/stdhdr/stdalign.h /var/lib/jenkins/workspace/Cforall_master/libcfa/src/stdhdr/stdio.h /var/lib/jenkins/workspace/Cforall_master/libcfa/src/stdhdr/malloc.h /var/lib/jenkins/workspace/Cforall_master/libcfa/src/stdhdr/time.h /var/lib/jenkins/workspace/Cforall_master/libcfa/src/stdhdr/signal.h /var/lib/jenkins/workspace/Cforall_master/libcfa/src/stdhdr/stdbool.h /var/lib/jenkins/workspace/Cforall_master/libcfa/src/stdhdr/unistd.h /var/lib/jenkins/workspace/Cforall_master/libcfa/src/stdhdr/stdatomic.h /var/lib/jenkins/workspace/Cforall_master/libcfa/src/stdhdr/stdint.h /var/lib/jenkins/workspace/Cforall_master/libcfa/src/stdhdr/gmp.h /var/lib/jenkins/workspace/Cforall_master/libcfa/src/stdhdr/locale.h /var/lib/jenkins/workspace/Cforall_master/libcfa/src/stdhdr/string.h /var/lib/jenkins/workspace/Cforall_master/libcfa/src/stdhdr/fenv.h /var/lib/jenkins/workspace/Cforall_master/libcfa/src/stdhdr/wchar.h /var/lib/jenkins/workspace/Cforall_master/libcfa/src/stdhdr/tgmath.h /var/lib/jenkins/workspace/Cforall_master/libcfa/src/stdhdr/math.h /var/lib/jenkins/workspace/Cforall_master/libcfa/src/stdhdr/pthread.h /var/lib/jenkins/workspace/Cforall_master/libcfa/src/stdhdr/complex.h /var/lib/jenkins/workspace/Cforall_master/libcfa/src/stdhdr/wctype.h /var/lib/jenkins/workspace/Cforall_master/libcfa/src/stdhdr/unwind.h /var/lib/jenkins/workspace/Cforall_master/libcfa/src/stdhdr/float.h /var/lib/jenkins/workspace/Cforall_master/libcfa/src/stdhdr/stdarg.h /var/lib/jenkins/workspace/Cforall_master/libcfa/src/stdhdr/stdlib.h /var/lib/jenkins/workspace/Cforall_master/libcfa/src/stdhdr/iso646.h /var/lib/jenkins/workspace/Cforall_master/libcfa/src/stdhdr/stddef.h /var/lib/jenkins/workspace/Cforall_master/libcfa/src/stdhdr/stdnoreturn.h /var/lib/jenkins/workspace/Cforall_master/libcfa/src/stdhdr/assert.h /var/lib/jenkins/workspace/Cforall_master/libcfa/src/stdhdr/ctype.h /var/lib/jenkins/workspace/Cforall_master/libcfa/src/stdhdr/errno.h /var/lib/jenkins/workspace/Cforall_master/libcfa/src/stdhdr/threads.h /var/lib/jenkins/workspace/Cforall_master/libcfa/src/stdhdr/uchar.h /var/lib/jenkins/workspace/Cforall_master/libcfa/src/stdhdr/inttypes.h /var/lib/jenkins/workspace/Cforall_master/libcfa/src/stdhdr/limits.h /var/lib/jenkins/workspace/Cforall_master/libcfa/src/stdhdr/setjmp.h '/var/lib/jenkins/workspace/Cforall_master@tmp/include/cfa//stdhdr'
libtool: install: (cd /var/lib/jenkins/workspace/Cforall_master@tmp/lib/cfa/arm64-nodebug && { ln -s -f libcfa.so.1.0.0 libcfa.so.1 || { rm -f libcfa.so.1 && ln -s libcfa.so.1.0.0 libcfa.so.1; }; })
/usr/bin/mkdir -p '/var/lib/jenkins/workspace/Cforall_master@tmp/include/cfa//collections'
/usr/bin/install -c -m 644 /var/lib/jenkins/workspace/Cforall_master/libcfa/src/collections/maybe.hfa /var/lib/jenkins/workspace/Cforall_master/libcfa/src/collections/pair.hfa /var/lib/jenkins/workspace/Cforall_master/libcfa/src/collections/result.hfa /var/lib/jenkins/workspace/Cforall_master/libcfa/src/collections/string.hfa /var/lib/jenkins/workspace/Cforall_master/libcfa/src/collections/string_res.hfa /var/lib/jenkins/workspace/Cforall_master/libcfa/src/collections/vector.hfa /var/lib/jenkins/workspace/Cforall_master/libcfa/src/collections/array.hfa /var/lib/jenkins/workspace/Cforall_master/libcfa/src/collections/list.hfa /var/lib/jenkins/workspace/Cforall_master/libcfa/src/collections/list2.hfa /var/lib/jenkins/workspace/Cforall_master/libcfa/src/collections/lockfree.hfa /var/lib/jenkins/workspace/Cforall_master/libcfa/src/collections/string_sharectx.hfa /var/lib/jenkins/workspace/Cforall_master/libcfa/src/collections/vector2.hfa '/var/lib/jenkins/workspace/Cforall_master@tmp/include/cfa//collections'
libtool: install: (cd /var/lib/jenkins/workspace/Cforall_master@tmp/lib/cfa/arm64-nodebug && { ln -s -f libcfa.so.1.0.0 libcfa.so || { rm -f libcfa.so && ln -s libcfa.so.1.0.0 libcfa.so; }; })
libtool: install: /usr/bin/install -c .libs/libcfa.lai /var/lib/jenkins/workspace/Cforall_master@tmp/lib/cfa/arm64-nodebug/libcfa.la
libtool: install: /usr/bin/install -c .libs/libcfathread.so.1.0.0 /var/lib/jenkins/workspace/Cforall_master@tmp/lib/cfa/arm64-nodebug/libcfathread.so.1.0.0
libtool: install: (cd /var/lib/jenkins/workspace/Cforall_master@tmp/lib/cfa/arm64-nodebug && { ln -s -f libcfathread.so.1.0.0 libcfathread.so.1 || { rm -f libcfathread.so.1 && ln -s libcfathread.so.1.0.0 libcfathread.so.1; }; })
libtool: install: (cd /var/lib/jenkins/workspace/Cforall_master@tmp/lib/cfa/arm64-nodebug && { ln -s -f libcfathread.so.1.0.0 libcfathread.so || { rm -f libcfathread.so && ln -s libcfathread.so.1.0.0 libcfathread.so; }; })
libtool: install: /usr/bin/install -c .libs/libcfathread.lai /var/lib/jenkins/workspace/Cforall_master@tmp/lib/cfa/arm64-nodebug/libcfathread.la
libtool: warning: remember to run 'libtool --finish /var/lib/jenkins/workspace/Cforall_master@tmp/lib/cfa/arm64-nodebug/'
make[3]: Nothing to be done for 'install-exec-am'.
make[3]: Nothing to be done for 'install-data-am'.
[Pipeline] }
[Pipeline] // dir
[Pipeline] }
[Pipeline] // stage
[Pipeline] sh
+ free -h
total used free shared buff/cache available
Mem: 502Gi 7.0Gi 491Gi 3.5Mi 6.9Gi 495Gi
Swap: 127Gi 0B 127Gi
[Pipeline] sh
+ ulimit -a
time(seconds) unlimited
file(blocks) unlimited
data(kbytes) unlimited
stack(kbytes) 8192
coredump(blocks) 0
memory(kbytes) unlimited
locked memory(kbytes) 65876420
process 2058179
nofiles 1048576
vmemory(kbytes) unlimited
locks unlimited
rtprio 0
[Pipeline] echo
-------- Test: Debug --------
[Pipeline] stage
[Pipeline] { (Test: Debug)
[Pipeline] dir
Running in /var/lib/jenkins/workspace/Cforall_master@tmp
[Pipeline] {
[Pipeline] sh
+ nproc
+ make -j 96 --no-print-directory -C tests timeout=600 global-timeout=14400 tests debug=yes archive-errors=/var/lib/jenkins/workspace/Cforall_master@tmp/tests/crashes/full-debug
Running 375 tests on 96 cores (arm64 - debug)
array-ERR3 PASSED C 0:00.118 - R n/a
array-ERR2 PASSED C 0:00.144 - R n/a
...ollections/language-dim-mismatch PASSED C 0:00.363 - R n/a
concurrency/mainError PASSED C 0:00.456 - R n/a
concurrency/keywordErrors PASSED C 0:00.605 - R n/a
castError PASSED C 0:00.876 - R n/a
array-collections/symtab-collision PASSED C 0:00.870 - R n/a
array-collections/safety-summary PASSED C 0:01.015 - R n/a
attr-priority PASSED C 0:01.498 - R 0:00.003
concurrency/ctor-check PASSED C 0:01.493 - R n/a
array-ERR1 PASSED C 0:01.545 - R n/a
castReturn PASSED C 0:01.604 - R 0:00.039
cast PASSED C 0:01.660 - R 0:00.072
array PASSED C 0:01.704 - R 0:00.039
array-collections/c-dependent PASSED C 0:01.878 - R 0:00.127
builtins/sync PASSED C 0:01.986 - R 0:00.026
array-collections/array-raii-c PASSED C 0:02.095 - R 0:00.041
array-collections/dimexpr-match-c PASSED C 0:02.354 - R 0:00.125
array-collections/array-sbscr-types PASSED C 0:02.717 - R 0:00.128
concurrency/clib_tls PASSED C 0:02.793 - R 0:00.122
concurrency/clib PASSED C 0:02.684 - R 0:00.223
...ns/vector-err-retn-perm-it-byval PASSED C 0:03.057 - R n/a
array-collections/array-basic PASSED C 0:03.069 - R 0:00.039
array-collections/boxed PASSED C 0:02.987 - R 0:00.130
array-collections/dimexpr-match-cfa PASSED C 0:03.165 - R 0:00.074
...ns/vector-err-pass-perm-it-byval PASSED C 0:03.482 - R n/a
avl_test PASSED C 0:05.349 - R 0:00.023
collections/string-operator-ERR09 PASSED C 0:05.448 - R n/a
collections/string-operator-ERR13 PASSED C 0:05.594 - R n/a
collections/string-operator-ERR15 PASSED C 0:05.611 - R n/a
...urrency/pthread/pthread_key_test PASSED C 0:03.819 - R 0:00.038
collections/string-operator-ERR16 PASSED C 0:05.791 - R n/a
collections/string-operator-ERR11 PASSED C 0:05.978 - R n/a
alloc-ERROR PASSED C 0:06.039 - R n/a
collections/vector-demo PASSED C 0:06.254 - R 0:00.044
algorithms/range_test PASSED C 0:06.847 - R 0:00.024
complex PASSED C 0:07.036 - R 0:00.022
array-collections/accordion PASSED C 0:07.069 - R 0:00.021
collections/string-gc PASSED C 0:07.403 - R 0:00.027
array-collections/array-raii-cfa PASSED C 0:07.432 - R 0:00.024
collections/string-istream PASSED C 0:08.252 - R 0:00.039
concurrency/cluster PASSED C 0:08.757 - R 0:00.072
concurrency/futures/abandon PASSED C 0:08.870 - R 0:00.123
concurrency/futures/basic PASSED C 0:09.037 - R 0:00.171
concurrency/park/contention PASSED C 0:08.773 - R 0:00.224
concurrency/park/start_parked PASSED C 0:08.607 - R 0:00.122
collections/stack PASSED C 0:09.633 - R 0:00.039
collections/string-compare PASSED C 0:09.842 - R 0:00.036
collections/string-ostream PASSED C 0:09.851 - R 0:00.027
collections/multi_list PASSED C 0:09.900 - R 0:00.038
collections/string-ctx-manage PASSED C 0:10.499 - R 0:00.040
collections/queue PASSED C 0:10.436 - R 0:00.130
collections/string-operator PASSED C 0:10.560 - R 0:00.042
concurrency/cofor PASSED C 0:10.886 - R 0:00.075
collections/sequence PASSED C 0:11.095 - R 0:00.038
collections/string-istream-manip PASSED C 0:11.321 - R 0:00.073
concurrency/examples/matrixSum PASSED C 0:11.939 - R 0:00.040
concurrency/join PASSED C 0:11.990 - R 0:00.039
collections/string-overwrite PASSED C 0:12.044 - R 0:00.073
concurrency/examples/gortn PASSED C 0:12.145 - R 0:00.071
concurrency/examples/datingService PASSED C 0:12.339 - R 0:00.082
...ections/string-overwrite-noshare PASSED C 0:12.427 - R 0:00.079
concurrency/migrate PASSED C 0:12.298 - R 0:00.276
concurrency/coroutineYield PASSED C 0:12.514 - R 0:00.085
concurrency/park/force_preempt PASSED C 0:11.843 - R 0:00.327
const-init PASSED C 0:01.691 - R 0:00.077
alloc PASSED C 0:13.159 - R 0:00.077
...pthread/pthread_demo_create_join PASSED C 0:11.929 - R 0:00.126
...rrency/pthread/pthread_attr_test PASSED C 0:12.062 - R 0:00.072
const-ref PASSED C 0:01.657 - R 0:00.074
...rrency/pthread/pthread_cond_test PASSED C 0:12.096 - R 0:00.127
collections/string-api-coverage PASSED C 0:14.002 - R 0:00.121
...ions/string-api-coverage-noshare PASSED C 0:14.783 - R 0:00.127
...rrency/pthread/pthread_once_test PASSED C 0:13.119 - R 0:00.071
concurrency/barrier/last PASSED C 0:14.682 - R 0:00.325
concurrency/futures/wait_any PASSED C 0:14.973 - R 0:00.125
concurrency/mutexstmt/tuple PASSED C 0:14.924 - R 0:00.124
concurrency/waitfor/parse PASSED C 0:07.740 - R 0:00.040
concurrency/barrier/order PASSED C 0:14.888 - R 0:00.374
concurrency/readyQ/leader_spin PASSED C 0:12.079 - R 0:01.429
ctrl-flow/labelledExit PASSED C 0:01.797 - R 0:00.041
ctrl-flow/loop-inc PASSED C 0:01.585 - R 0:00.073
concurrency/suspend_then PASSED C 0:12.839 - R 0:00.172
concurrency/signal/wait PASSED C 0:12.811 - R 0:00.676
concurrency/barrier/generation PASSED C 0:14.542 - R 0:01.832
concurrency/once PASSED C 0:15.615 - R 0:00.527
concurrency/thread PASSED C 0:13.863 - R 0:00.080
concurrency/sleep PASSED C 0:12.856 - R 0:01.279
enum_tests/lvalue PASSED C 0:00.846 - R n/a
enum PASSED C 0:01.986 - R 0:00.037
alloc2 PASSED C 0:17.286 - R 0:00.069
concurrency/readyQ/barrier_sleeper PASSED C 0:14.137 - R 0:01.323
errors/declaration PASSED C 0:00.112 - R n/a
...cy/unified_locking/pthread_locks PASSED C 0:11.417 - R 0:00.628
concurrency/waitfor/else PASSED C 0:10.565 - R 0:00.068
enum_tests/inc-dec PASSED C 0:01.692 - R 0:00.039
concurrency/lockfree_stack PASSED C 0:12.255 - R 0:05.456
.../unified_locking/block_spin_lock PASSED C 0:14.304 - R 0:00.376
errors/signature PASSED C 0:00.161 - R n/a
.../unified_locking/fast_block_lock PASSED C 0:14.538 - R 0:00.122
errors/scope-type PASSED C 0:00.274 - R n/a
concurrency/mutexstmt/monitors PASSED C 0:09.740 - R 0:08.212
designations PASSED C 0:02.964 - R 0:00.021
concurrency/examples/quickSort PASSED C 0:18.186 - R 0:00.082
concurrency/actors/inline PASSED C 0:18.186 - R 0:00.128
concurrency/actors/static PASSED C 0:18.093 - R 0:00.275
concurrency/actors/poison PASSED C 0:18.270 - R 0:00.119
errors/scope PASSED C 0:00.843 - R n/a
concurrency/actors/pingpong PASSED C 0:18.303 - R 0:00.227
...ncy/unified_locking/timeout_lock PASSED C 0:11.350 - R 0:01.229
enum_tests/funcEnum PASSED C 0:02.913 - R 0:00.035
concurrency/actors/inherit PASSED C 0:18.677 - R 0:00.176
eval PASSED C 0:01.427 - R 0:00.043
concurrency/actors/matrixMultiply PASSED C 0:17.816 - R 0:01.533
copyfile PASSED C 0:07.245 - R 0:00.040
concurrency/waitfor/barge PASSED C 0:12.167 - R 0:00.928
concurrency/futures/typed PASSED C 0:18.827 - R 0:00.684
concurrency/actors/executor PASSED C 0:19.616 - R 0:00.172
...urrency/waitfor/lexical_priority PASSED C 0:12.659 - R 0:00.070
concurrency/actors/types PASSED C 0:19.719 - R 0:00.174
...fied_locking/mcs_block_spin_lock PASSED C 0:14.091 - R 0:00.326
enum_tests/structEnum PASSED C 0:02.703 - R 0:00.039
exceptions/try-ctrl-flow PASSED C 0:00.530 - R n/a
concurrency/signal/block PASSED C 0:13.028 - R 0:05.205
...nified_locking/simple_owner_lock PASSED C 0:14.443 - R 0:00.223
exceptions/type-check PASSED C 0:00.650 - R n/a
ctrl-flow/break-misc PASSED C 0:07.258 - R 0:00.039
configs/parsebools PASSED C 0:09.854 - R 0:00.224
counter PASSED C 0:07.460 - R 0:00.042
ctrl-flow/goto PASSED C 0:07.230 - R 0:00.038
...ency/unified_locking/exp_backoff PASSED C 0:17.710 - R 0:00.120
coroutine/fibonacci PASSED C 0:08.758 - R 0:00.068
coroutine/raii PASSED C 0:08.393 - R 0:00.070
concurrency/waitfor/statment PASSED C 0:12.711 - R 0:00.178
ctrl-flow/ifwhileCtl PASSED C 0:07.429 - R 0:00.078
coroutine/devicedriver PASSED C 0:09.192 - R 0:00.073
exceptions/try-leave-catch PASSED C 0:01.562 - R 0:00.040
concurrency/waitfor/when PASSED C 0:12.150 - R 0:00.423
configs/parseconfig PASSED C 0:10.412 - R 0:00.041
ctrl-flow/loop_else PASSED C 0:06.487 - R 0:00.125
coroutine/runningTotal PASSED C 0:08.608 - R 0:00.069
ctrl-flow/fallthrough PASSED C 0:07.877 - R 0:00.120
exceptions/message PASSED C 0:03.061 - R 0:00.076
expression PASSED C 0:01.668 - R 0:00.039
coroutine/fmtLines PASSED C 0:09.052 - R 0:00.281
configs/usage PASSED C 0:10.559 - R 0:00.125
concurrency/waituntil/timeout PASSED C 0:08.101 - R 0:03.693
concurrency/signal/disjoint PASSED C 0:12.761 - R 0:07.156
init1-ERROR PASSED C 0:00.818 - R n/a
...rrency/pthread/pthread_demo_lock PASSED C 0:12.194 - R 0:08.664
global-monomorph PASSED C 0:01.625 - R 0:00.045
identParamDeclarator PASSED C 0:01.409 - R 0:00.037
coroutine/pingpong PASSED C 0:10.022 - R 0:00.123
enum_tests/anonymous PASSED C 0:06.976 - R 0:00.125
identFuncDeclarator PASSED C 0:01.544 - R 0:00.075
init1 PASSED C 0:01.424 - R 0:00.021
concurrency/waitfor/recurse PASSED C 0:12.234 - R 0:03.392
ctrl-flow/loop_else-WRN1 PASSED C 0:08.215 - R 0:00.003
enum_tests/input PASSED C 0:07.207 - R 0:00.072
enum_tests/enumInlineValue PASSED C 0:08.009 - R 0:00.022
ctrl-flow/loopctrl PASSED C 0:08.798 - R 0:00.040
include/vector-sequence PASSED C 0:02.373 - R 0:00.128
enum_tests/typedIntEnum PASSED C 0:06.826 - R 0:00.021
enum_tests/voidEnum PASSED C 0:06.827 - R 0:00.074
coroutine/prodcons PASSED C 0:11.569 - R 0:00.181
limits PASSED C 0:01.578 - R 0:00.021
include/vector-collections PASSED C 0:03.192 - R 0:00.041
exceptions/data-except PASSED C 0:06.710 - R 0:00.042
div PASSED C 0:09.931 - R 0:00.039
exceptions/finally PASSED C 0:06.806 - R 0:00.121
exceptions/conditional PASSED C 0:07.434 - R 0:00.068
enum_tests/stringEnum PASSED C 0:08.282 - R 0:00.123
linking/nostdlib PASSED C 0:01.669 - R 0:00.042
exceptions/defaults PASSED C 0:07.442 - R 0:00.037
concurrency/preempt PASSED C 0:14.122 - R 0:10.675
exceptions/interact PASSED C 0:07.354 - R 0:00.038
nested-types-ERR1 PASSED C 0:00.249 - R n/a
exceptions/polymorphic PASSED C 0:07.191 - R 0:00.038
exceptions/resume PASSED C 0:07.092 - R 0:00.127
linkonce PASSED C 0:01.744 - R 0:00.039
nested-types-ERR2 PASSED C 0:00.277 - R n/a
concurrency/channels/churn PASSED C 0:16.181 - R 0:10.155
exceptions/trash PASSED C 0:06.893 - R 0:00.071
exceptions/conditional-threads PASSED C 0:08.415 - R 0:00.070
exceptions/cancel/coroutine PASSED C 0:08.630 - R 0:00.071
device/cpu PASSED C 0:11.069 - R 0:00.174
concurrency/channels/contend PASSED C 0:16.266 - R 0:10.330
concurrency/channels/daisy_chain PASSED C 0:16.468 - R 0:10.144
enum_tests/position PASSED C 0:09.412 - R 0:00.171
concurrency/waitfor/dtor PASSED C 0:12.387 - R 0:07.399
concurrency/channels/hot_potato PASSED C 0:16.745 - R 0:10.169
opt-params PASSED C 0:00.475 - R n/a
concurrency/channels/zero_size PASSED C 0:17.011 - R 0:10.182
enum_tests/planet PASSED C 0:10.736 - R 0:00.133
concurrency/channels/pub_sub PASSED C 0:17.172 - R 0:10.238
exceptions/virtual-poly PASSED C 0:07.304 - R 0:00.077
concurrency/channels/ping_pong PASSED C 0:17.466 - R 0:10.146
generator/fmtLines PASSED C 0:06.983 - R 0:00.061
maybe PASSED C 0:02.222 - R 0:00.039
exceptions/finally-threads PASSED C 0:09.174 - R 0:00.076
generator/fibonacci PASSED C 0:07.168 - R 0:00.038
polybits PASSED C 0:00.518 - R n/a
nested-types PASSED C 0:02.059 - R 0:00.038
exceptions/terminate PASSED C 0:08.425 - R 0:00.075
fstream_test PASSED C 0:07.466 - R 0:00.024
nowarn/array PASSED C 0:01.895 - R 0:00.022
genericUnion PASSED C 0:07.147 - R 0:00.036
hello PASSED C 0:06.825 - R 0:00.073
linking/exception-nothreads PASSED C 0:04.838 - R 0:00.044
nowarn/exception PASSED C 0:01.914 - R 0:00.040
generator/suspend_then PASSED C 0:07.200 - R 0:00.081
nowarn/no-autogen PASSED C 0:01.833 - R 0:00.122
nowarn/unused PASSED C 0:01.844 - R 0:00.038
numericConstants PASSED C 0:01.618 - R 0:00.070
exceptions/resume-threads PASSED C 0:08.835 - R 0:00.073
operators PASSED C 0:01.659 - R 0:00.043
nowarn/printf-sizeof PASSED C 0:01.892 - R 0:00.037
nowarn/zero-thunk PASSED C 0:01.708 - R 0:00.121
poly-d-cycle PASSED C 0:01.564 - R 0:00.040
forall PASSED C 0:08.077 - R 0:00.039
identity PASSED C 0:06.944 - R 0:00.038
exceptions/defaults-threads PASSED C 0:10.005 - R 0:00.037
poly-bare-assn PASSED C 0:01.751 - R 0:00.039
concurrency/channels/big_elems PASSED C 0:16.672 - R 0:11.737
poly-many-arsz PASSED C 0:01.757 - R 0:00.048
poly-member PASSED C 0:01.744 - R 0:00.040
exceptions/terminate-threads PASSED C 0:09.025 - R 0:00.076
poly-o-cycle PASSED C 0:01.716 - R 0:00.126
concurrency/waituntil/basic_else PASSED C 0:19.262 - R 0:00.073
raii/ctor-autogen-ERR1 PASSED C 0:00.995 - R n/a
include/vector-fstream PASSED C 0:07.150 - R 0:00.038
poly-selection PASSED C 0:01.810 - R 0:00.036
exceptions/virtual-cast PASSED C 0:08.888 - R 0:00.041
typedefRedef-ERR1 PASSED C 0:00.174 - R n/a
raii/partial-ERR1 PASSED C 0:00.953 - R n/a
include/stdincludes PASSED C 0:07.552 - R 0:00.070
poly-self-cycle PASSED C 0:01.794 - R 0:00.039
var-assert PASSED C 0:00.232 - R n/a
quasiKeyword PASSED C 0:01.731 - R 0:00.069
raii/typeof-member PASSED C 0:01.501 - R 0:00.039
raii/partial PASSED C 0:01.595 - R 0:00.023
raii/init_once PASSED C 0:01.722 - R 0:00.045
raii/ctor-autogen PASSED C 0:02.314 - R 0:00.039
tuple/tupleMember PASSED C 0:01.503 - R 0:00.039
io/eofType PASSED C 0:08.189 - R 0:00.042
exceptions/fibonacci_nonlocal PASSED C 0:11.745 - R 0:00.044
simpleGenericTriple PASSED C 0:01.963 - R 0:00.040
exceptions/cor_resumer PASSED C 0:12.108 - R 0:00.072
function-operator PASSED C 0:09.645 - R 0:00.073
tuple/tupleCast PASSED C 0:01.703 - R 0:00.072
tuple/tupleFunction PASSED C 0:01.757 - R 0:00.049
result PASSED C 0:02.157 - R 0:00.037
typedefRedef PASSED C 0:01.626 - R 0:00.041
typeof PASSED C 0:01.515 - R 0:00.041
switch PASSED C 0:02.194 - R 0:00.038
smart-pointers PASSED C 0:02.319 - R 0:00.072
tuple/tuplePolymorphism PASSED C 0:01.978 - R 0:00.072
variableDeclarator PASSED C 0:01.690 - R 0:00.119
meta/fork+exec PASSED C 0:05.052 - R 0:00.272
linking/exception-withthreads PASSED C 0:07.545 - R 0:00.128
withconflict PASSED C 0:00.827 - R n/a
linking/mangling/anon PASSED C 0:07.354 - R 0:00.072
...collections/dimexpr-match-c-ERRS PASSED C 0:01.050 - R n/a
KRfunctions PASSED C 0:01.414 - R 0:00.003
warnings/self-assignment PASSED C 0:01.571 - R 0:00.006
exceptions/cancel/thread PASSED C 0:13.851 - R 0:00.072
voidPtr PASSED C 0:01.683 - R 0:00.073
concurrency/futures/future_except PASSED C 0:31.973 - R 0:00.126
raii/memberCtors-ERR1 PASSED C 0:04.227 - R n/a
list/dlist-insert-remove PASSED C 0:07.348 - R 0:00.175
literals PASSED C 0:07.230 - R 0:00.122
...llections/dimexpr-match-cfa-ERRS PASSED C 0:01.709 - R n/a
attributes PASSED C 0:01.621 - R 0:00.003
errors/completeType PASSED C 0:00.912 - R n/a
io/manipulatorsInput-uchunk PASSED C 0:09.750 - R 0:00.178
declarationSpecifier PASSED C 0:01.543 - R 0:00.002
io/manipulatorsOutput4 PASSED C 0:10.067 - R 0:00.071
linking/io-acquire PASSED C 0:09.192 - R 0:00.036
concurrency/waituntil/one_chan PASSED C 0:13.006 - R 0:09.976
raii/dtor-early-exit-ERR2 PASSED C 0:05.187 - R n/a
linking/nothreads PASSED C 0:08.913 - R 0:00.043
extension PASSED C 0:01.459 - R 0:00.003
arithmeticConversions PASSED C 0:02.965 - R 0:00.121
raii/dtor-early-exit-ERR1 PASSED C 0:05.760 - R n/a
tuple/tupleVariadic PASSED C 0:04.917 - R 0:00.038
functions PASSED C 0:01.577 - R 0:00.002
meta/arch PASSED C 0:00.902 - R n/a
gccExtensions PASSED C 0:01.620 - R 0:00.002
list/dlist2-insert-remove PASSED C 0:09.110 - R 0:00.070
collections/atomic_mpsc PASSED C 0:12.973 - R 0:21.068
zero_one-ERR1 PASSED C 0:03.827 - R n/a
exceptions/pingpong_nonlocal PASSED C 0:15.476 - R 0:00.070
quotedKeyword PASSED C 0:06.927 - R 0:00.038
raii/boxed-types PASSED C 0:06.833 - R 0:00.035
meta/dumpable PASSED C 0:09.406 - R 0:00.041
io/io PASSED C 0:12.498 - R 0:00.038
raii/globals PASSED C 0:07.186 - R 0:00.037
linking/weakso_nothd PASSED C 0:10.849 - R 0:00.038
shortCircuit PASSED C 0:06.919 - R 0:00.037
raii/memberCtors PASSED C 0:07.224 - R 0:00.038
malloc PASSED C 0:09.891 - R 0:00.038
polymorphism PASSED C 0:07.880 - R 0:00.037
references PASSED C 0:07.326 - R 0:00.040
tuplearray PASSED C 0:06.808 - R 0:00.038
concurrency/preempt2 PASSED C 0:12.696 - R 0:21.726
io/io-acquire PASSED C 0:12.762 - R 0:00.273
io/io-acquire2 PASSED C 0:12.754 - R 0:00.318
strstream PASSED C 0:07.587 - R 0:00.025
tuple/tupleAssign PASSED C 0:07.638 - R 0:00.038
linking/withthreads PASSED C 0:11.828 - R 0:00.038
userLiterals PASSED C 0:07.318 - R 0:00.040
io/io-acquire-out PASSED C 0:13.410 - R 0:00.220
concurrency/waituntil/channel_close PASSED C 0:16.890 - R 0:10.099
sizeof PASSED C 0:08.452 - R 0:00.036
io/io-acquire-in PASSED C 0:13.987 - R 0:00.220
zero_one PASSED C 0:06.578 - R 0:00.039
time PASSED C 0:08.570 - R 0:00.036
raii/dtor-early-exit PASSED C 0:09.363 - R 0:00.035
io/away_fair FAILED with code -6 C 0:14.941 - R 0:00.220
starting
100
200
300
400
500
600
700
800
900
1000
done
Processor (0xfffff7fb12c0) tearing down ring with 4294967295 entries allocated but not submitted, out of 256
Cforall Runtime error (UNIX pid:522495):
Stack back trace for: /var/lib/jenkins/workspace/Cforall_master@tmp/libcfa/arm64-debug/src/.libs/libcfa.so.1
(0) /var/lib/jenkins/workspace/Cforall_master@tmp/libcfa/arm64-debug/src/.libs/libcfa.so.1 : + 0xef278 [0xfffff7e5f278]
(1) /var/lib/jenkins/workspace/Cforall_master@tmp/libcfa/arm64-debug/src/.libs/libcfa.so.1 : __cabi_abort + 0 [0xfffff7e5ea90]
(2) /var/lib/jenkins/workspace/Cforall_master@tmp/libcfa/arm64-debug/src/.libs/libcfa.so.1 : _X4endsFv_S8ofstream__1 + 0x88 [0xfffff7dae848]
(3) /var/lib/jenkins/workspace/Cforall_master@tmp/libcfa/arm64-debug/src/.libs/libcfa.so.1 : _X15_operator_bitorQ1_0_0_1__X19basic_ostream_tableKS18basic_ostream_data_BD0__Fv_BD0j__1 + 0x38 [0xfffff7db8e30]
(4) /var/lib/jenkins/workspace/Cforall_master@tmp/libcfa/arm64-debug/src/.libs/libcfathread.so.1 : + 0x4b7dc [0xfffff7f3b7dc]
(5) /var/lib/jenkins/workspace/Cforall_master@tmp/libcfa/arm64-debug/src/.libs/libcfathread.so.1 : + 0x4a63c [0xfffff7f3a63c]
(6) /var/lib/jenkins/workspace/Cforall_master@tmp/libcfa/arm64-debug/src/.libs/libcfathread.so.1 : + 0x4bbd8 [0xfffff7f3bbd8]
(7) /var/lib/jenkins/workspace/Cforall_master@tmp/libcfa/arm64-debug/src/.libs/libcfathread.so.1 : + 0x56ebc [0xfffff7f46ebc]
(8) /lib/ld-linux-aarch64.so.1 : + 0xf00 [0xfffff7fbef00]
(9) /lib/ld-linux-aarch64.so.1 : + 0x4910 [0xfffff7fc2910]
(10) /lib/aarch64-linux-gnu/libc.so.6 : + 0x3f228 [0xfffff7aff228]
warning: Can't open file anon_inode:[io_uring] which was expanded to anon_inode:[io_uring] during file-backed mapping note processing
[New LWP 522495]
[Thread debugging using libthread_db enabled]
Using host libthread_db library "/lib/aarch64-linux-gnu/libthread_db.so.1".
Core was generated by `/var/lib/jenkins/workspace/Cforall_master@tmp/tests/io/away_fair'.
Program terminated with signal SIGABRT, Aborted.
#0 __pthread_kill_implementation (threadid=281474842402240, signo=signo@entry=6, no_tid=no_tid@entry=0) at ./nptl/pthread_kill.c:44
warning: 44 ./nptl/pthread_kill.c: No such file or directory
-----
#0 __pthread_kill_implementation (threadid=281474842402240, signo=signo@entry=6, no_tid=no_tid@entry=0) at ./nptl/pthread_kill.c:44
#1 0x0000fffff7b47540 in __pthread_kill_internal (signo=6, threadid=) at ./nptl/pthread_kill.c:78
#2 0x0000fffff7afcb3c in __GI_raise (sig=sig@entry=6) at ../sysdeps/posix/raise.c:26
#3 0x0000fffff7ae7e00 in __GI_abort () at ./stdlib/abort.c:79
#4 0x0000fffff7e5efd8 in _X7__abortFv_bPKcY17__builtin_va_list__1 (_X11signalAbortb_1=true, _X3fmtPKc_1=0xfffff7e7e6e0 "Application interrupted by signal: %s.\n", _X4argsY17__builtin_va_list_1=...) at /var/lib/jenkins/workspace/Cforall_master/libcfa/src/interpose.cfa:263
#5 0x0000fffff7e5f278 in _X5abortFv_bPKc__1 (_X11signalAbortb_1=true, _X3fmtPKc_1=0xfffff7e7e6e0 "Application interrupted by signal: %s.\n") at /var/lib/jenkins/workspace/Cforall_master/libcfa/src/interpose.cfa:301
#6 0x0000fffff7e5f43c in _X15sigHandler_termFv_iPS21__anonymous_siginfo_tPS10ucontext_t__1 (_X3sigi_1=6, _X3sfpPS21__anonymous_siginfo_t_1=0xfffff7ee1f30 , _X3cxtPS10ucontext_t_1=0xfffff7ee1fb0 ) at /var/lib/jenkins/workspace/Cforall_master/libcfa/src/interpose.cfa:337
#7
#8 __pthread_kill_implementation (threadid=281474842402240, signo=signo@entry=6, no_tid=no_tid@entry=0) at ./nptl/pthread_kill.c:44
#9 0x0000fffff7b47540 in __pthread_kill_internal (signo=6, threadid=) at ./nptl/pthread_kill.c:78
#10 0x0000fffff7afcb3c in __GI_raise (sig=sig@entry=6) at ../sysdeps/posix/raise.c:26
#11 0x0000fffff7ae7e00 in __GI_abort () at ./stdlib/abort.c:79
#12 0x0000fffff7e5f110 in _X7__abortFv_bPKcY17__builtin_va_list__1 (_X11signalAbortb_1=false, _X3fmtPKc_1=0xfffff7e7e440 "%s", _X4argsY17__builtin_va_list_1=...) at /var/lib/jenkins/workspace/Cforall_master/libcfa/src/interpose.cfa:286
#13 0x0000fffff7e5f278 in _X5abortFv_bPKc__1 (_X11signalAbortb_1=false, _X3fmtPKc_1=0xfffff7e7e440 "%s") at /var/lib/jenkins/workspace/Cforall_master/libcfa/src/interpose.cfa:301
#14 0x0000fffff7e5ea90 in abort () at /var/lib/jenkins/workspace/Cforall_master/libcfa/src/interpose.cfa:176
#15 0x0000fffff7dae848 in _X4endsFv_S8ofstream__1 (_X2osS8ofstream_1=0xfffff7ec1368 <_X9abortFileS8ofstream_1>) at /var/lib/jenkins/workspace/Cforall_master/libcfa/src/fstream.cfa:106
#16 0x0000fffff7db8e30 in _X15_operator_bitorQ1_0_0_1__X19basic_ostream_tableKS18basic_ostream_data_BD0__Fv_BD0j__1 (_X19basic_ostream_tableKS18basic_ostream_data_Y6ostype__1=0xfffff7ec13d8 <_X19ofstream_basic_dataS18basic_ostream_data_S8ofstream__1>, _X2osY6ostype_1=0xfffff7ec1368 <_X9abortFileS8ofstream_1>, _X1tj_1=256) at /var/lib/jenkins/workspace/Cforall_master/libcfa/src/iostream.cfa:98
#17 0x0000fffff7f3b7dc in _X19__io_uring_teardownFv_S11io_context$__1 (_X4thisS11io_context$_1=0xaaaaaaad4b00) at /var/lib/jenkins/workspace/Cforall_master/libcfa/src/concurrency/io/setup.cfa:288
#18 0x0000fffff7f3a63c in _X11_destructorFv_S11io_context$__1 (_X4thisS11io_context$_1=0xaaaaaaad4b00) at /var/lib/jenkins/workspace/Cforall_master/libcfa/src/concurrency/io/setup.cfa:125
#19 0x0000fffff7f3bbd8 in _X13__cfa_io_stopFv_PS9processor__1 (_X4procPS9processor_1=0xfffff7fb12c0 <_X21storage_mainProcessorA0c_1>) at /var/lib/jenkins/workspace/Cforall_master/libcfa/src/concurrency/io/setup.cfa:313
#20 0x0000fffff7f46ebc in _X17__kernel_shutdownFv___1 () at /var/lib/jenkins/workspace/Cforall_master/libcfa/src/concurrency/kernel/startup.cfa:312
#21 0x0000fffff7fbef00 in _dl_call_fini (closure_map=closure_map@entry=0xfffff7ff72d0) at ./elf/dl-call_fini.c:43
#22 0x0000fffff7fc2910 in _dl_fini () at ./elf/dl-fini.c:114
#23 0x0000fffff7aff228 in __run_exit_handlers (status=0, listp=0xfffff7c70670 <__exit_funcs>, run_list_atexit=run_list_atexit@entry=true, run_dtors=run_dtors@entry=true) at ./stdlib/exit.c:108
#24 0x0000fffff7aff30c in __GI_exit (status=) at ./stdlib/exit.c:138
#25 0x0000fffff7ae84c8 in __libc_start_call_main (main=main@entry=0xaaaaaaaa4e08 , argc=argc@entry=1, argv=argv@entry=0xfffffffff238) at ../sysdeps/nptl/libc_start_call_main.h:74
#26 0x0000fffff7ae8598 in __libc_start_main_impl (main=0xaaaaaaaa4e08 , argc=1, argv=0xfffffffff238, init=, fini=, rtld_fini=, stack_end=) at ../csu/libc-start.c:360
#27 0x0000aaaaaaaa31f0 in _start ()
-----
Id Target Id Frame
* 1 Thread 0xfffff7fe9dc0 (LWP 522495) __pthread_kill_implementation (threadid=281474842402240, signo=signo@entry=6, no_tid=no_tid@entry=0) at ./nptl/pthread_kill.c:44
Archiving io/away_fair (executable and core) to crashes/full-debug/io/away_fair
vector PASSED C 0:08.730 - R 0:00.035
sum PASSED C 0:09.574 - R 0:00.035
swap PASSED C 0:09.601 - R 0:00.036
io/many_read PASSED C 0:15.101 - R 0:00.069
searchsort PASSED C 0:09.979 - R 0:00.034
...collections/array-md-sbscr-cases PASSED C 0:08.202 - R 0:00.040
...rrency/examples/boundedBufferEXT PASSED C 0:12.421 - R 0:26.318
io/comp_basic PASSED C 0:16.758 - R 0:00.418
io/comp_fair PASSED C 0:16.726 - R 0:00.475
vector_math/vec2_uint PASSED C 0:09.500 - R 0:00.035
minmax PASSED C 0:13.562 - R 0:00.037
vector_math/vec2_double PASSED C 0:10.299 - R 0:00.037
abs PASSED C 0:09.427 - R 0:00.037
ato PASSED C 0:09.609 - R 0:00.035
io/manipulatorsInput PASSED C 0:08.209 - R 0:00.035
random PASSED C 0:08.399 - R 0:00.036
bitmanip2 PASSED C 0:10.469 - R 0:00.068
gmp PASSED C 0:09.264 - R 0:00.036
...rrency/examples/boundedBufferINT PASSED C 0:12.745 - R 0:28.839
bitmanip1 PASSED C 0:10.728 - R 0:00.068
concurrency/waituntil/futures PASSED C 0:32.068 - R 0:00.068
vector_math/vec2_ldouble PASSED C 0:09.416 - R 0:00.036
vector_math/vec3_int PASSED C 0:12.684 - R 0:00.035
exceptions/cardgame PASSED C 0:10.650 - R 0:00.118
io/manipulatorsOutput2 PASSED C 0:09.968 - R 0:00.037
exceptions/hotpotato PASSED C 0:10.710 - R 0:00.067
bitmanip3 PASSED C 0:11.581 - R 0:00.067
vector_math/vec2_int PASSED C 0:13.909 - R 0:00.037
vector_math/vec4_int PASSED C 0:13.771 - R 0:00.037
exceptions/hotpotato_checked PASSED C 0:12.132 - R 0:00.067
include/includes PASSED C 0:22.505 - R 0:00.036
vector_math/vec3_float PASSED C 0:14.392 - R 0:00.036
vector_math/vec2_float PASSED C 0:15.253 - R 0:00.074
vector_math/vec4_float PASSED C 0:14.532 - R 0:00.036
math PASSED C 0:13.474 - R 0:00.035
mathX PASSED C 0:14.154 - R 0:00.037
io/manipulatorsOutput3 PASSED C 0:14.264 - R 0:00.119
io/manipulatorsOutput1 PASSED C 0:15.237 - R 0:00.037
io/io-acquire-no-io PASSED C 0:12.346 - R 0:13.204
PRNG PASSED C 0:17.291 - R 0:02.124
heap PASSED C 0:09.908 - R 0:20.378
concurrency/unified_locking/mcs PASSED C 0:14.967 - R 0:32.691
...ency/waituntil/channel_zero_size PASSED C 0:12.937 - R 0:31.090
concurrency/actors/dynamic PASSED C 0:22.082 - R 0:32.853
rational PASSED C 0:27.284 - R 0:00.039
...ency/unified_locking/futex_mutex PASSED C 0:13.903 - R 0:40.014
concurrency/waituntil/repeat_close PASSED C 0:16.837 - R 0:30.133
concurrency/waituntil/channels PASSED C 0:13.600 - R 0:38.069
concurrency/waituntil/all_types PASSED C 0:35.187 - R 0:20.746
concurrency/monitor PASSED C 0:12.208 - R 0:57.233
concurrency/multi-monitor PASSED C 0:12.074 - R 0:57.765
...urrency/unified_locking/mcs_spin PASSED C 0:14.309 - R 0:51.542
.../unified_locking/spin_queue_lock PASSED C 0:13.939 - R 0:52.286
concurrency/waituntil/locks PASSED C 0:15.151 - R 1:10.423
concurrency/unified_locking/locks PASSED C 0:15.270 - R 1:40.216
concurrency/mutexstmt/locks PASSED C 0:12.274 - R 2:15.406
374 passes, 1 failures, 0 timeouts, 0 cancelled, 0 other
Tests took 2:28.625
make: *** [Makefile:986: all-local] Error 1
[Pipeline] }
[Pipeline] // dir
[Pipeline] }
[Pipeline] // stage
[Pipeline] echo
Archiving core dumps
[Pipeline] dir
Running in /var/lib/jenkins/workspace/Cforall_master@tmp
[Pipeline] {
[Pipeline] fileExists
[Pipeline] sh
+ /var/lib/jenkins/workspace/Cforall_master/tools/jenkins/archive-gen.sh
[Pipeline] archiveArtifacts
Archiving artifacts
Recording fingerprints
[Pipeline] }
[Pipeline] // dir
[Pipeline] }
[Pipeline] // wrap
[Pipeline] }
[Pipeline] // node
[Pipeline] echo
hudson.AbortException: script returned exit code 2
[Pipeline] node
Running on Brokk 1 in /var/lib/jenkins/workspace/Cforall_master
[Pipeline] {
[Pipeline] echo
Notifying users of result
[Pipeline] echo
Reusing previously constructed message
[Pipeline] echo
Would send email to: cforall@lists.uwaterloo.ca
[Pipeline] echo
With title: [cforall git][BUILD# 3805 - FAILURE] - branch master
[Pipeline] echo
Content:
This is an automated email from the Jenkins build machine. It was
generated because of a git hooks/post-receive script following
a ref change which was pushed to the C∀ repository.
- Status --------------------------------------------------------------
BUILD# 3805 - FAILURE
Check console output at https://cforall.uwaterloo.ca/jenkins/job/Cforall/job/master/3805/ to view the results.
- Changes -------------------------------------------------------------
The branch master has been updated.
from 1c69e6eb208437ab9d5e7868cd58d734741ff97e (commit)
- Log -----------------------------------------------------------------
-----------------------------------------------------------------------
Summary of changes:
[Pipeline] }
[Pipeline] // node
[Pipeline] echo
Build Completed
[Pipeline] End of Pipeline
ERROR: script returned exit code 2
Finished: FAILURE
[Pipeline] error
[Pipeline] }
Failed in branch gcc_10_arm64_new
Build Cforall » master #3804 completed: SUCCESS
[Pipeline] echo
SUCCESS
[Pipeline] }
Build Cforall » master #3809 completed: SUCCESS
[Pipeline] echo
SUCCESS
[Pipeline] }
Build Cforall » master #3807 completed: SUCCESS
[Pipeline] echo
SUCCESS
[Pipeline] }
Build Cforall » master #3806 completed: SUCCESS
[Pipeline] echo
SUCCESS
[Pipeline] }
Build Cforall » master #3808 completed: SUCCESS
[Pipeline] echo
SUCCESS
[Pipeline] }
Build Cforall » master #3813 completed: SUCCESS
[Pipeline] echo
SUCCESS
[Pipeline] }
Build Cforall » master #3814 completed: SUCCESS
[Pipeline] echo
SUCCESS
[Pipeline] }
Build Cforall » master #3810 completed: SUCCESS
[Pipeline] echo
SUCCESS
[Pipeline] }
Build Cforall » master #3812 completed: SUCCESS
[Pipeline] echo
SUCCESS
[Pipeline] }
Build Cforall » master #3811 completed: SUCCESS
[Pipeline] echo
SUCCESS
[Pipeline] }
[Pipeline] // parallel
[Pipeline] }
[Pipeline] // stage
[Pipeline] }
[Pipeline] // wrap
[Pipeline] echo
error caught
[Pipeline] node
Running on Brokk 4 in /var/lib/jenkins/workspace/Cforall_Full_Build
[Pipeline] {
[Pipeline] echo
notifying users
[Pipeline] emailext
Sending email to: cforall@lists.uwaterloo.ca
[Pipeline] }
[Pipeline] // node
[Pipeline] }
[Pipeline] // node
[Pipeline] End of Pipeline
ERROR: FAILURE
Finished: FAILURE