Started by timer Running as Jenkins Build User Obtained Jenkins/FullBuild from git cforall@plg.uwaterloo.ca:software/cfa/cfa-cc [Pipeline] Start of Pipeline [Pipeline] node Running on Brokk 3 in /var/lib/jenkins/workspace/Cforall_Full_Build [Pipeline] { [Pipeline] checkout The recommended git tool is: NONE using credential git_key_aug2025 Fetching changes from the remote Git repository Checking out Revision 26db8d037230dd5a87499062454cd8686ee33d26 (refs/remotes/origin/master) Commit message: "Updated the exception proposal. Major additions are sketches of the implementation and panic system." > git rev-parse --resolve-git-dir /var/lib/jenkins/workspace/Cforall_Full_Build/.git # timeout=10 > git config remote.origin.url cforall@plg.uwaterloo.ca:software/cfa/cfa-cc # timeout=10 Fetching upstream changes from cforall@plg.uwaterloo.ca:software/cfa/cfa-cc > git --version # timeout=10 > git --version # 'git version 2.43.0' using GIT_SSH to set credentials Git key use to connect to the cforall git repo (August 2025) Verifying host key using known hosts file > git fetch --tags --force --progress -- cforall@plg.uwaterloo.ca:software/cfa/cfa-cc +refs/heads/*:refs/remotes/origin/* # timeout=10 > git rev-parse refs/remotes/origin/master^{commit} # timeout=10 > git config core.sparsecheckout # timeout=10 > git checkout -f 26db8d037230dd5a87499062454cd8686ee33d26 # timeout=10 > git rev-list --no-walk 26db8d037230dd5a87499062454cd8686ee33d26 # timeout=10 [Pipeline] wrap [Pipeline] { [Pipeline] stage [Pipeline] { (Build) [Pipeline] parallel [Pipeline] { (Branch: gcc_10_x86_new) [Pipeline] { (Branch: gcc_11_x86_new) [Pipeline] { (Branch: gcc_12_x86_new) [Pipeline] { (Branch: gcc_9_x64_new) [Pipeline] { (Branch: gcc_10_x64_new) [Pipeline] { (Branch: gcc_11_x64_new) [Pipeline] { (Branch: gcc_12_x64_new) [Pipeline] { (Branch: gcc_10_arm64_new) [Pipeline] { (Branch: gcc_11_arm64_new) [Pipeline] { (Branch: gcc_12_arm64_new) [Pipeline] { (Branch: clang_x64_new) [Pipeline] sleep Sleeping for 4 min 0 sec [Pipeline] sleep Sleeping for 3 min 0 sec [Pipeline] sleep Sleeping for 3 min 0 sec [Pipeline] sleep No need to sleep any longer [Pipeline] sleep Sleeping for 1 min 0 sec [Pipeline] sleep Sleeping for 4 min 0 sec [Pipeline] sleep Sleeping for 1 min 0 sec [Pipeline] sleep Sleeping for 1 min 0 sec [Pipeline] sleep Sleeping for 3 min 0 sec [Pipeline] sleep Sleeping for 3 min 0 sec [Pipeline] sleep No need to sleep any longer [Pipeline] build Scheduling project: Cforall » master [Pipeline] build Scheduling project: Cforall » master Starting building: Cforall » master #3683 Starting building: Cforall » master #3684 [Pipeline] build Scheduling project: Cforall » master [Pipeline] build Scheduling project: Cforall » master [Pipeline] build Scheduling project: Cforall » master Starting building: Cforall » master #3686 Starting building: Cforall » master #3687 Starting building: Cforall » master #3685 [Pipeline] build Scheduling project: Cforall » master [Pipeline] build Scheduling project: Cforall » master [Pipeline] build Scheduling project: Cforall » master [Pipeline] build Scheduling project: Cforall » master Starting building: Cforall » master #3691 Starting building: Cforall » master #3690 Starting building: Cforall » master #3688 Starting building: Cforall » master #3689 [Pipeline] build Scheduling project: Cforall » master [Pipeline] build Scheduling project: Cforall » master Starting building: Cforall » master #3692 Starting building: Cforall » master #3693 Build Cforall » master #3687 completed: FAILURE [Pipeline] echo FAILURE [Pipeline] sh + wget -q -O - https://cforall.uwaterloo.ca/jenkins/job/Cforall/job/master/3687/consoleText Started by upstream project "Cforall_Full_Build" build number 416 originally caused by: Started by timer Running as Jenkins Build User > git rev-parse --resolve-git-dir /var/lib/jenkins/caches/git-914b6fdde163b7e17ee75d99ca23f18a/.git # timeout=10 Setting origin to cforall@plg.uwaterloo.ca:software/cfa/cfa-cc > git config remote.origin.url cforall@plg.uwaterloo.ca:software/cfa/cfa-cc # timeout=10 Fetching origin... Fetching upstream changes from origin > git --version # timeout=10 > git --version # 'git version 2.43.0' > git config --get remote.origin.url # timeout=10 using GIT_SSH to set credentials Git key use to connect to the cforall git repo (August 2025) Verifying host key using known hosts file > git fetch --no-tags --force --progress -- origin +refs/heads/*:refs/remotes/origin/* # timeout=10 Seen branch in repository origin/ADT Seen branch in repository origin/aaron-thesis Seen branch in repository origin/arm-eh Seen branch in repository origin/ast-experimental Seen branch in repository origin/cleanup-dtors Seen branch in repository origin/ctor Seen branch in repository origin/deferred_resn Seen branch in repository origin/demangler Seen branch in repository origin/enum Seen branch in repository origin/forall-pointer-decay Seen branch in repository origin/gc_noraii Seen branch in repository origin/jacob/cs343-translation Seen branch in repository origin/jenkins-sandbox Seen branch in repository origin/master Seen branch in repository origin/memory Seen branch in repository origin/new-ast Seen branch in repository origin/new-ast-unique-expr Seen branch in repository origin/new-env Seen branch in repository origin/no_list Seen branch in repository origin/persistent-indexer Seen branch in repository origin/pthread-emulation Seen branch in repository origin/qualifiedEnum Seen branch in repository origin/resolv-new Seen branch in repository origin/string Seen branch in repository origin/stuck-waitfor-destruct Seen branch in repository origin/with_gc Seen 26 remote branches Obtained Jenkinsfile from 26db8d037230dd5a87499062454cd8686ee33d26 [Pipeline] Start of Pipeline [Pipeline] node Running on Algol in /var/lib/jenkins/workspace/Cforall_master [Pipeline] { [Pipeline] wrap [Pipeline] { [Pipeline] properties WARNING: Unknown parameter(s) found for class type 'hudson.model.ChoiceParameterDefinition': defaultValue WARNING: Unknown parameter(s) found for class type 'hudson.model.ChoiceParameterDefinition': defaultValue [Pipeline] checkout The recommended git tool is: NONE using credential git_key_aug2025 Fetching changes from the remote Git repository Cleaning workspace Fetching without tags Checking out Revision 26db8d037230dd5a87499062454cd8686ee33d26 (master) Commit message: "Updated the exception proposal. Major additions are sketches of the implementation and panic system." [Pipeline] load [Pipeline] { (Jenkins/tools.groovy) [Pipeline] } [Pipeline] // load [Pipeline] echo Compiler : gcc-10 (g++-10/gcc-10) Architecture : arm64 Arc Flags : --host=aarch64 Run All Tests : true Run Benchmark : true Build Documentation : false Publish : true Silent : true [Pipeline] } [Pipeline] // wrap [Pipeline] } [Pipeline] // node [Pipeline] node Running on Algol in /var/lib/jenkins/workspace/Cforall_master [Pipeline] { [Pipeline] wrap [Pipeline] { [Pipeline] pwd [Pipeline] pwd [Pipeline] echo -------- Cleanup -------- [Pipeline] stage > git rev-parse --resolve-git-dir /var/lib/jenkins/workspace/Cforall_master/.git # timeout=10 > git config remote.origin.url cforall@plg.uwaterloo.ca:software/cfa/cfa-cc # timeout=10 > git rev-parse --verify HEAD # timeout=10 Resetting working tree > git reset --hard # timeout=10 > git clean -fdx # timeout=10 Fetching upstream changes from cforall@plg.uwaterloo.ca:software/cfa/cfa-cc > git --version # timeout=10 > git --version # 'git version 2.43.0' using GIT_SSH to set credentials Git key use to connect to the cforall git repo (August 2025) Verifying host key using known hosts file > git fetch --no-tags --force --progress -- cforall@plg.uwaterloo.ca:software/cfa/cfa-cc +refs/heads/*:refs/remotes/origin/* # timeout=10 > git config core.sparsecheckout # timeout=10 > git checkout -f 26db8d037230dd5a87499062454cd8686ee33d26 # timeout=10 > git rev-list --no-walk 26db8d037230dd5a87499062454cd8686ee33d26 # timeout=10 [Pipeline] { (Cleanup) [Pipeline] dir Running in /var/lib/jenkins/workspace/Cforall_master@tmp [Pipeline] { [Pipeline] deleteDir [Pipeline] } [Pipeline] // dir [Pipeline] } [Pipeline] // stage [Pipeline] echo -------- Checkout -------- [Pipeline] stage [Pipeline] { (Checkout) [Pipeline] checkout The recommended git tool is: NONE using credential git_key_aug2025 Fetching changes from the remote Git repository Cleaning workspace Fetching without tags Checking out Revision 26db8d037230dd5a87499062454cd8686ee33d26 (master) Commit message: "Updated the exception proposal. Major additions are sketches of the implementation and panic system." [Pipeline] echo Constructing new git message [Pipeline] sh > git rev-parse --resolve-git-dir /var/lib/jenkins/workspace/Cforall_master/.git # timeout=10 > git config remote.origin.url cforall@plg.uwaterloo.ca:software/cfa/cfa-cc # timeout=10 > git rev-parse --verify HEAD # timeout=10 Resetting working tree > git reset --hard # timeout=10 > git clean -fdx # timeout=10 Fetching upstream changes from cforall@plg.uwaterloo.ca:software/cfa/cfa-cc > git --version # timeout=10 > git --version # 'git version 2.43.0' using GIT_SSH to set credentials Git key use to connect to the cforall git repo (August 2025) Verifying host key using known hosts file > git fetch --no-tags --force --progress -- cforall@plg.uwaterloo.ca:software/cfa/cfa-cc +refs/heads/*:refs/remotes/origin/* # timeout=10 > git config core.sparsecheckout # timeout=10 > git checkout -f 26db8d037230dd5a87499062454cd8686ee33d26 # timeout=10 + git rev-list 26db8d037230dd5a87499062454cd8686ee33d26..26db8d037230dd5a87499062454cd8686ee33d26 [Pipeline] sh + git cat-file -t 26db8d037230dd5a87499062454cd8686ee33d26 [Pipeline] sh + git rev-list --format=short 26db8d037230dd5a87499062454cd8686ee33d26...26db8d037230dd5a87499062454cd8686ee33d26 [Pipeline] sh + git diff --stat --color 26db8d037230dd5a87499062454cd8686ee33d26 26db8d037230dd5a87499062454cd8686ee33d26 [Pipeline] echo

- Changes -------------------------------------------------------------

The branch master has been updated.
      from  26db8d037230dd5a87499062454cd8686ee33d26 (commit)

- Log -----------------------------------------------------------------


-----------------------------------------------------------------------

Summary of changes:

[Pipeline] } [Pipeline] // stage [Pipeline] echo -------- Build : configure -------- [Pipeline] stage [Pipeline] { (Build : configure) [Pipeline] dir Running in /var/lib/jenkins/workspace/Cforall_master [Pipeline] { [Pipeline] sh + ./autogen.sh Running aclocal in root Running libtoolize in root libtoolize: putting auxiliary files in AC_CONFIG_AUX_DIR, 'automake'. libtoolize: linking file 'automake/ltmain.sh' libtoolize: putting macros in AC_CONFIG_MACRO_DIRS, 'automake'. libtoolize: linking file 'automake/libtool.m4' libtoolize: linking file 'automake/ltoptions.m4' libtoolize: linking file 'automake/ltsugar.m4' libtoolize: linking file 'automake/ltversion.m4' libtoolize: linking file 'automake/lt~obsolete.m4' Running autoconf in root Running automake in root configure.ac:223: installing 'automake/compile' configure.ac:138: installing 'automake/config.guess' configure.ac:138: installing 'automake/config.sub' configure.ac:17: installing 'automake/install-sh' benchmark/Makefile.am: installing 'automake/depcomp' parallel-tests: installing 'automake/test-driver' configure.ac: installing 'automake/ylwrap' Running aclocal in libcfa Running libtoolize in libcfa libtoolize: putting auxiliary files in AC_CONFIG_AUX_DIR, 'automake'. libtoolize: linking file 'automake/ltmain.sh' libtoolize: putting macros in AC_CONFIG_MACRO_DIRS, 'automake'. libtoolize: linking file 'automake/libtool.m4' libtoolize: linking file 'automake/ltoptions.m4' libtoolize: linking file 'automake/ltsugar.m4' libtoolize: linking file 'automake/ltversion.m4' libtoolize: linking file 'automake/lt~obsolete.m4' Running autoconf in libcfa Running automake in libcfa configure.ac:119: installing 'automake/compile' configure.ac:119: installing 'automake/config.guess' configure.ac:119: installing 'automake/config.sub' configure.ac:12: installing 'automake/install-sh' src/Makefile.am: installing 'automake/depcomp' [Pipeline] } [Pipeline] // dir [Pipeline] dir Running in /var/lib/jenkins/workspace/Cforall_master@tmp [Pipeline] { [Pipeline] sh + /var/lib/jenkins/workspace/Cforall_master/configure CXX=g++-10 CC=gcc-10 --host=aarch64 AR=gcc-ar RANLIB=gcc-ranlib --with-target-hosts=host:debug,host:nodebug --quiet --prefix=/var/lib/jenkins/workspace/Cforall_master@tmp [Pipeline] sh + nproc + make -j 96 --no-print-directory configure-libcfa libcfa/arm64-debug/config.data Configuring libcfa (/var/lib/jenkins/workspace/Cforall_master/libcfa/configure) with ''CXX=g++-10' 'CC=gcc-10' 'AR=gcc-ar' 'RANLIB=gcc-ranlib' '--prefix=/var/lib/jenkins/workspace/Cforall_master@tmp' DRIVER_DIR=/var/lib/jenkins/workspace/Cforall_master@tmp/driver/ ARCHITECTURE=arm64 CONFIGURATION=debug CFA_VERSION=1:0:0' from /var/lib/jenkins/workspace/Cforall_master@tmp / libcfa/arm64-debug/ libcfa/arm64-nodebug/config.data Configuring libcfa (/var/lib/jenkins/workspace/Cforall_master/libcfa/configure) with ''CXX=g++-10' 'CC=gcc-10' 'AR=gcc-ar' 'RANLIB=gcc-ranlib' '--prefix=/var/lib/jenkins/workspace/Cforall_master@tmp' DRIVER_DIR=/var/lib/jenkins/workspace/Cforall_master@tmp/driver/ ARCHITECTURE=arm64 CONFIGURATION=nodebug CFA_VERSION=1:0:0' from /var/lib/jenkins/workspace/Cforall_master@tmp / libcfa/arm64-nodebug/ checking whether make supports nested variables... yes checking for a BSD-compatible install... checking whether make supports nested variables... yes checking for a BSD-compatible install... /usr/bin/install -c checking whether build environment is sane... yes /usr/bin/install -c checking whether build environment is sane... checking for a race-free mkdir -p... yes /usr/bin/mkdir -p checking for gawk... gawk checking whether make sets $(MAKE)... checking for a race-free mkdir -p... yes /usr/bin/mkdir -p checking for gawk... gawk checking whether make sets $(MAKE)... checking for distributated build... no yes checking for distributated build... no checking build system type... checking build system type... aarch64-unknown-linux-gnu checking host system type... aarch64-unknown-linux-gnu checking how to print strings... printf checking whether make supports the include directive... aarch64-unknown-linux-gnu checking host system type... aarch64-unknown-linux-gnu checking how to print strings... yes (GNU style) checking for gcc... gcc-10 printf checking whether make supports the include directive... yes (GNU style) checking for gcc... gcc-10 checking whether the C compiler works... checking whether the C compiler works... yes checking for C compiler default output file name... a.out checking for suffix of executables... yes checking for C compiler default output file name... a.out checking for suffix of executables... checking whether we are cross compiling... checking whether we are cross compiling... no checking for suffix of object files... no checking for suffix of object files... o checking whether the compiler supports GNU C... o checking whether the compiler supports GNU C... yes checking whether gcc-10 accepts -g... yes checking whether gcc-10 accepts -g... yes checking for gcc-10 option to enable C11 features... yes checking for gcc-10 option to enable C11 features... none needed checking whether gcc-10 understands -c and -o together... none needed checking whether gcc-10 understands -c and -o together... yes checking dependency style of gcc-10... yes checking dependency style of gcc-10... gcc3 checking for a sed that does not truncate output... /usr/bin/sed checking for grep that handles long lines and -e... /usr/bin/grep checking for egrep... /usr/bin/grep -E checking for fgrep... /usr/bin/grep -F checking for ld used by gcc-10... /usr/bin/ld checking if the linker (/usr/bin/ld) is GNU ld... gcc3 checking for a sed that does not truncate output... yes checking for BSD- or MS-compatible name lister (nm)... /usr/bin/nm -B checking the name lister (/usr/bin/nm -B) interface... /usr/bin/sed checking for grep that handles long lines and -e... /usr/bin/grep checking for egrep... /usr/bin/grep -E checking for fgrep... /usr/bin/grep -F checking for ld used by gcc-10... /usr/bin/ld checking if the linker (/usr/bin/ld) is GNU ld... yes checking for BSD- or MS-compatible name lister (nm)... /usr/bin/nm -B checking the name lister (/usr/bin/nm -B) interface... BSD nm checking whether ln -s works... yes checking the maximum length of command line arguments... 1572864 checking how to convert aarch64-unknown-linux-gnu file names to aarch64-unknown-linux-gnu format... func_convert_file_noop checking how to convert aarch64-unknown-linux-gnu file names to toolchain format... func_convert_file_noop checking for /usr/bin/ld option to reload object files... -r checking for file... file checking for objdump... objdump checking how to recognize dependent libraries... pass_all checking for dlltool... no checking how to associate runtime and link libraries... printf %s\n checking for archiver @FILE support... BSD nm checking whether ln -s works... yes checking the maximum length of command line arguments... 1572864 checking how to convert aarch64-unknown-linux-gnu file names to aarch64-unknown-linux-gnu format... func_convert_file_noop checking how to convert aarch64-unknown-linux-gnu file names to toolchain format... func_convert_file_noop checking for /usr/bin/ld option to reload object files... -r checking for file... file checking for objdump... objdump checking how to recognize dependent libraries... pass_all checking for dlltool... no checking how to associate runtime and link libraries... printf %s\n checking for archiver @FILE support... @ checking for strip... strip checking for ranlib... gcc-ranlib checking command to parse /usr/bin/nm -B output from gcc-10 object... @ checking for strip... strip checking for ranlib... gcc-ranlib checking command to parse /usr/bin/nm -B output from gcc-10 object... ok checking for sysroot... no checking for a working dd... /usr/bin/dd checking how to truncate binary pipes... /usr/bin/dd bs=4096 count=1 checking for mt... mt checking if mt is a manifest tool... no checking for stdio.h... ok checking for sysroot... no checking for a working dd... /usr/bin/dd checking how to truncate binary pipes... yes checking for stdlib.h... /usr/bin/dd bs=4096 count=1 checking for mt... mt checking if mt is a manifest tool... no checking for stdio.h... yes checking for string.h... yes checking for stdlib.h... yes checking for inttypes.h... yes checking for string.h... yes checking for stdint.h... yes checking for inttypes.h... yes checking for strings.h... yes checking for stdint.h... yes checking for sys/stat.h... yes checking for strings.h... yes checking for sys/types.h... yes checking for sys/stat.h... yes checking for unistd.h... yes checking for sys/types.h... yes checking for dlfcn.h... yes checking for unistd.h... yes checking for objdir... yes checking for dlfcn.h... .libs yes checking for objdir... .libs checking if gcc-10 supports -fno-rtti -fno-exceptions... no checking for gcc-10 option to produce PIC... -fPIC -DPIC checking if gcc-10 PIC flag -fPIC -DPIC works... checking if gcc-10 supports -fno-rtti -fno-exceptions... yes checking if gcc-10 static flag -static works... no checking for gcc-10 option to produce PIC... -fPIC -DPIC checking if gcc-10 PIC flag -fPIC -DPIC works... yes checking if gcc-10 static flag -static works... yes checking if gcc-10 supports -c -o file.o... yes checking if gcc-10 supports -c -o file.o... yes checking if gcc-10 supports -c -o file.o... (cached) yes checking whether the gcc-10 linker (/usr/bin/ld) supports shared libraries... yes checking whether -lc should be explicitly linked in... yes checking if gcc-10 supports -c -o file.o... (cached) yes checking whether the gcc-10 linker (/usr/bin/ld) supports shared libraries... no checking dynamic linker characteristics... yes checking whether -lc should be explicitly linked in... no checking dynamic linker characteristics... GNU/Linux ld.so checking how to hardcode library paths into programs... immediate checking whether stripping libraries is possible... yes checking if libtool supports shared libraries... yes checking whether to build shared libraries... yes checking whether to build static libraries... no GNU/Linux ld.so checking how to hardcode library paths into programs... immediate checking whether stripping libraries is possible... yes checking if libtool supports shared libraries... yes checking whether to build shared libraries... yes checking whether to build static libraries... no checking whether the compiler supports GNU C++... yes checking whether g++-10 accepts -g... checking whether the compiler supports GNU C++... yes checking for g++-10 option to enable C++11 features... yes checking whether g++-10 accepts -g... yes checking for g++-10 option to enable C++11 features... none needed checking dependency style of g++-10... none needed checking dependency style of g++-10... gcc3 checking how to run the C++ preprocessor... gcc3 checking how to run the C++ preprocessor... g++-10 -E g++-10 -E checking for ld used by g++-10... /usr/bin/ld checking if the linker (/usr/bin/ld) is GNU ld... yes checking whether the g++-10 linker (/usr/bin/ld) supports shared libraries... yes checking for ld used by g++-10... /usr/bin/ld checking if the linker (/usr/bin/ld) is GNU ld... yes checking whether the g++-10 linker (/usr/bin/ld) supports shared libraries... yes checking for g++-10 option to produce PIC... -fPIC -DPIC checking if g++-10 PIC flag -fPIC -DPIC works... checking for g++-10 option to produce PIC... -fPIC -DPIC checking if g++-10 PIC flag -fPIC -DPIC works... yes checking if g++-10 static flag -static works... yes checking if g++-10 static flag -static works... yes checking if g++-10 supports -c -o file.o... yes checking if g++-10 supports -c -o file.o... yes checking if g++-10 supports -c -o file.o... (cached) yes checking whether the g++-10 linker (/usr/bin/ld) supports shared libraries... yes checking dynamic linker characteristics... (cached) GNU/Linux ld.so checking how to hardcode library paths into programs... immediate checking for gcc... (cached) gcc-10 yes checking if g++-10 supports -c -o file.o... (cached) yes checking whether the g++-10 linker (/usr/bin/ld) supports shared libraries... yes checking dynamic linker characteristics... (cached) GNU/Linux ld.so checking how to hardcode library paths into programs... immediate checking for gcc... (cached) gcc-10 checking whether the compiler supports GNU C... (cached) yes checking whether gcc-10 accepts -g... (cached) yes checking for gcc-10 option to enable C11 features... (cached) none needed checking whether gcc-10 understands -c and -o together... (cached) yes checking dependency style of gcc-10... (cached) gcc3 checking dependency style of gcc-10... checking whether the compiler supports GNU C... (cached) yes checking whether gcc-10 accepts -g... (cached) yes checking for gcc-10 option to enable C11 features... (cached) none needed checking whether gcc-10 understands -c and -o together... (cached) yes checking dependency style of gcc-10... (cached) gcc3 checking dependency style of gcc-10... gcc3 checking whether make sets $(MAKE)... (cached) yes checking for linux/rseq.h... gcc3 checking whether make sets $(MAKE)... (cached) yes checking for linux/rseq.h... yes checking for rseq_available in -lrseq... yes checking for rseq_available in -lrseq... no checking for gcc-10 options needed to detect all undeclared functions... no checking for gcc-10 options needed to detect all undeclared functions... none needed checking for linux/io_uring.h... none needed checking for linux/io_uring.h... yes checking for liburing.h... yes checking for liburing.h... no checking whether IORING_OP_NOP is declared... no checking whether IORING_OP_NOP is declared... yes checking whether IORING_OP_READV is declared... yes checking whether IORING_OP_READV is declared... yes checking whether IORING_OP_WRITEV is declared... yes yes checking whether IORING_OP_WRITEV is declared... checking whether IORING_OP_FSYNC is declared... yes checking whether IORING_OP_READ_FIXED is declared... yes checking whether IORING_OP_FSYNC is declared... yes checking whether IORING_OP_WRITE_FIXED is declared... yes checking whether IORING_OP_READ_FIXED is declared... yes checking whether IORING_OP_POLL_ADD is declared... yes checking whether IORING_OP_WRITE_FIXED is declared... yes checking whether IORING_OP_POLL_REMOVE is declared... yes checking whether IORING_OP_POLL_ADD is declared... yes yes checking whether IORING_OP_SYNC_FILE_RANGE is declared... checking whether IORING_OP_POLL_REMOVE is declared... yes yes checking whether IORING_OP_SENDMSG is declared... checking whether IORING_OP_SYNC_FILE_RANGE is declared... yes checking whether IORING_OP_RECVMSG is declared... yes checking whether IORING_OP_SENDMSG is declared... yes checking whether IORING_OP_TIMEOUT is declared... yes checking whether IORING_OP_RECVMSG is declared... yes checking whether IORING_OP_TIMEOUT_REMOVE is declared... yes checking whether IORING_OP_TIMEOUT is declared... yes checking whether IORING_OP_ACCEPT is declared... yes checking whether IORING_OP_TIMEOUT_REMOVE is declared... yes checking whether IORING_OP_ASYNC_CANCEL is declared... yes checking whether IORING_OP_ACCEPT is declared... yes checking whether IORING_OP_LINK_TIMEOUT is declared... yes checking whether IORING_OP_ASYNC_CANCEL is declared... yes checking whether IORING_OP_CONNECT is declared... yes checking whether IORING_OP_LINK_TIMEOUT is declared... yes checking whether IORING_OP_FALLOCATE is declared... yes checking whether IORING_OP_CONNECT is declared... yes checking whether IORING_OP_OPENAT is declared... yes checking whether IORING_OP_FALLOCATE is declared... yes checking whether IORING_OP_CLOSE is declared... yes checking whether IORING_OP_OPENAT is declared... yes checking whether IORING_OP_FILES_UPDATE is declared... yes checking whether IORING_OP_CLOSE is declared... yes checking whether IORING_OP_STATX is declared... yes checking whether IORING_OP_FILES_UPDATE is declared... yes checking whether IORING_OP_READ is declared... yes checking whether IORING_OP_STATX is declared... yes checking whether IORING_OP_WRITE is declared... yes checking whether IORING_OP_READ is declared... yes checking whether IORING_OP_FADVISE is declared... yes checking whether IORING_OP_WRITE is declared... yes checking whether IORING_OP_MADVISE is declared... yes checking whether IORING_OP_FADVISE is declared... yes checking whether IORING_OP_SEND is declared... yes checking whether IORING_OP_MADVISE is declared... yes checking whether IORING_OP_RECV is declared... yes checking whether IORING_OP_SEND is declared... yes checking whether IORING_OP_OPENAT2 is declared... yes checking whether IORING_OP_RECV is declared... yes checking whether IORING_OP_EPOLL_CTL is declared... yes checking whether IORING_OP_OPENAT2 is declared... yes checking whether IORING_OP_SPLICE is declared... yes checking whether IORING_OP_EPOLL_CTL is declared... yes checking whether IORING_OP_PROVIDE_BUFFERS is declared... yes checking whether IORING_OP_SPLICE is declared... yes checking whether IORING_OP_REMOVE_BUFFER is declared... yes checking whether IORING_OP_PROVIDE_BUFFERS is declared... no checking whether IORING_OP_TEE is declared... yes checking whether IORING_OP_REMOVE_BUFFER is declared... yes checking whether IOSQE_FIXED_FILE is declared... no checking whether IORING_OP_TEE is declared... yes checking whether IOSQE_IO_DRAIN is declared... yes checking whether IOSQE_FIXED_FILE is declared... yes checking whether IOSQE_IO_LINK is declared... yes checking whether IOSQE_IO_DRAIN is declared... yes checking whether IOSQE_IO_HARDLINK is declared... yes checking whether IOSQE_IO_LINK is declared... yes checking whether IOSQE_ASYNC is declared... yes checking whether IOSQE_IO_HARDLINK is declared... yes checking whether IOSQE_BUFFER_SELECT is declared... yes checking whether IOSQE_ASYNC is declared... yes checking whether SPLICE_F_FD_IN_FIXED is declared... yes checking whether IOSQE_BUFFER_SELECT is declared... yes checking whether IORING_SETUP_ATTACH_WQ is declared... yes checking whether SPLICE_F_FD_IN_FIXED is declared... yes checking whether IORING_REGISTER_IOWQ_MAX_WORKERS is declared... yes checking whether IORING_SETUP_ATTACH_WQ is declared... yes checking for preadv2... yes checking whether IORING_REGISTER_IOWQ_MAX_WORKERS is declared... yes checking for pwritev2... yes checking for preadv2... yes yes checking for pwritev2... checking that generated files are newer than configure... done configure: creating ./config.status yes checking that generated files are newer than configure... done configure: creating ./config.status config.status: creating Makefile config.status: creating src/Makefile config.status: creating prelude/Makefile config.status: creating Makefile config.status: creating src/concurrency/io/call.cfa config.status: creating src/Makefile config.status: creating prelude/Makefile /var/lib/jenkins/workspace/Cforall_master/libcfa/src/concurrency/io/call.cfa.in:144: SyntaxWarning: invalid escape sequence '\(' sig = re.search("(.*) (.*)\((.*)\)", signature) config.status: creating prelude/defines.hfa config.status: creating src/concurrency/io/call.cfa config.status: executing depfiles commands /var/lib/jenkins/workspace/Cforall_master/libcfa/src/concurrency/io/call.cfa.in:144: SyntaxWarning: invalid escape sequence '\(' sig = re.search("(.*) (.*)\((.*)\)", signature) config.status: creating prelude/defines.hfa config.status: executing depfiles commands config.status: executing libtool commands Cforall library configuraton completed. Type "make -j 8 install". config.status: executing libtool commands Cforall library configuraton completed. Type "make -j 8 install". [Pipeline] } [Pipeline] // dir [Pipeline] } [Pipeline] // stage [Pipeline] echo -------- Build : cfa-cpp -------- [Pipeline] stage [Pipeline] { (Build : cfa-cpp) [Pipeline] dir Running in /var/lib/jenkins/workspace/Cforall_master@tmp [Pipeline] { [Pipeline] sh + nproc + make -j 96 --no-print-directory -C driver CXX as.o CXX cc1.o CXX cfa.o CXXLD as CXXLD cc1 CXXLD cfa [Pipeline] sh + nproc + make -j 96 --no-print-directory -C src YACC Parser/parser.cc updating Parser/parser.output updating Parser/parser.hh make all-am CXX main.o CXX CompilationState.o CXX MakeLibCfa.o LEX Parser/lex.cc CXX AST/Attribute.o CXX AST/Copy.o CXX AST/Create.o CXX AST/Decl.o CXX AST/DeclReplacer.o CXX AST/Expr.o CXX AST/GenericSubstitution.o CXX AST/Init.o CXX AST/Inspect.o CXX AST/LinkageSpec.o CXX AST/Node.o CXX AST/Pass.o CXX AST/Print.o CXX AST/Stmt.o CXX AST/SymbolTable.o CXX AST/Type.o CXX AST/TypeEnvironment.o CXX AST/TypeSubstitution.o CXX AST/Util.o CXX CodeGen/CodeGenerator.o CXX CodeGen/GenType.o CXX CodeGen/OperatorTable.o CXX CodeGen/FixMain.o CXX CodeGen/FixNames.o CXX CodeGen/Generate.o CXX CodeGen/LinkOnce.o CXX Concurrency/Actors.o CXX Concurrency/Corun.o CXX Concurrency/Keywords.o CXX Concurrency/Waitfor.o CXX Concurrency/Waituntil.o CXX Common/Assert.o CXX Common/CodeLocationTools.o CXX Common/DeclStats.o CXX Common/Eval.o CXX Common/Examine.o CXX Common/Indenter.o CXX Common/ResolvProtoDump.o CXX Common/SemanticError.o CXX Common/Stats/Counter.o CXX Common/Stats/Heap.o CXX Common/Stats/ResolveTime.o CXX Common/Stats/Stats.o CXX Common/Stats/Time.o CXX Common/Symbol.o CXX Common/UniqueName.o CXX Common/DebugMalloc.o CXX ControlStruct/ExceptDecl.o CXX ControlStruct/ExceptTranslate.o CXX ControlStruct/FixLabels.o CXX ControlStruct/HoistControlDecls.o CXX ControlStruct/LabelGenerator.o CXX ControlStruct/MultiLevelExit.o CXX ControlStruct/TranslateEnumRange.o CXX GenPoly/GenPoly.o CXX GenPoly/Lvalue2.o CXX GenPoly/Box.o CXX GenPoly/FindFunction.o CXX GenPoly/InstantiateGeneric.o CXX GenPoly/Lvalue.o CXX GenPoly/ScrubTypeVars.o CXX GenPoly/Specialize.o CXX InitTweak/GenInit.o CXX InitTweak/InitTweak.o CXX InitTweak/FixGlobalInit.o CXX InitTweak/FixInit.o CXX Parser/DeclarationNode.o CXX Parser/ExpressionNode.o CXX Parser/InitializerNode.o CXX Parser/ParseNode.o CXX Parser/parser.o CXX Parser/RunParser.o CXX Parser/StatementNode.o CXX Parser/TypeData.o CXX Parser/TypedefTable.o CXX ResolvExpr/AdjustExprType.o CXX ResolvExpr/Candidate.o CXX ResolvExpr/CandidateFinder.o CXX ResolvExpr/CastCost.o CXX ResolvExpr/CommonType.o CXX ResolvExpr/ConversionCost.o CXX ResolvExpr/CurrentObject.o CXX ResolvExpr/ExplodedArg.o CXX ResolvExpr/FindOpenVars.o CXX ResolvExpr/PolyCost.o CXX ResolvExpr/PtrsAssignable.o CXX ResolvExpr/PtrsCastable.o CXX ResolvExpr/RenameVars.o CXX ResolvExpr/Resolver.o CXX ResolvExpr/ResolveTypeof.o CXX ResolvExpr/SatisfyAssertions.o CXX ResolvExpr/SpecCost.o CXX ResolvExpr/Unify.o CXX ResolvExpr/CandidatePrinter.o In file included from /usr/include/aarch64-linux-gnu/c++/10/bits/os_defines.h:39, from /usr/include/aarch64-linux-gnu/c++/10/bits/c++config.h:522, from /usr/include/c++/10/cstdio:41, from /var/lib/jenkins/workspace/Cforall_master/src/Parser/parser.yy:41: /usr/include/features.h:415:4: warning: #warning _FORTIFY_SOURCE requires GCC 4.1 or later [-Wcpp] 415 | # warning _FORTIFY_SOURCE requires GCC 4.1 or later | ^~~~~~~ CXX ResolvExpr/EraseWith.o CXX SymTab/FixFunction.o CXX SymTab/GenImplicitCall.o CXX SymTab/Mangler.o CXX SymTab/ManglerCommon.o CXX Tuples/Explode.o CXX Tuples/TupleAssignment.o CXX Tuples/TupleExpansion.o CXX Tuples/Tuples.o CXX Validate/Autogen.o CXX Validate/CheckAssertions.o CXX Validate/CompoundLiteral.o CXX Validate/EliminateTypedef.o CXX Validate/EnumAndPointerDecay.o CXX Validate/FindSpecialDecls.o CXX Validate/FixQualifiedTypes.o CXX Validate/FixReturnTypes.o CXX Validate/ForallPointerDecay.o CXX Validate/GenericParameter.o CXX Validate/HoistStruct.o CXX Validate/HoistTypeDecls.o CXX Validate/ImplementEnumFunc.o CXX Validate/InitializerLength.o CXX Validate/LabelAddressFixer.o CXX Validate/LinkInstanceTypes.o CXX Validate/ReplaceTypedef.o CXX Validate/ReturnCheck.o CXX Validate/VerifyCtorDtorAssign.o CXX Virtual/ExpandCasts.o CXX Virtual/Tables.o CXX Virtual/VirtualDtor.o CXX Parser/lex.o /var/lib/jenkins/workspace/Cforall_master/src/ResolvExpr/CommonType.cpp: In function ‘ast::ptr ResolvExpr::{anonymous}::handleReference(ast::ptr&, ast::ptr&, ResolvExpr::WidenMode, ast::TypeEnvironment&, const OpenVarSet&)’: /var/lib/jenkins/workspace/Cforall_master/src/ResolvExpr/CommonType.cpp:716:23: note: parameter passing for argument of type ‘ResolvExpr::WidenMode’ changed in GCC 9.1 716 | ast::ptr< ast::Type > handleReference( | ^~~~~~~~~~~~~~~ /var/lib/jenkins/workspace/Cforall_master/src/ResolvExpr/CommonType.cpp: In function ‘ast::ptr ResolvExpr::commonType(ast::ptr&, ast::ptr&, ast::TypeEnvironment&, ast::AssertionSet&, ast::AssertionSet&, const OpenVarSet&, ResolvExpr::WidenMode)’: /var/lib/jenkins/workspace/Cforall_master/src/ResolvExpr/CommonType.cpp:748:23: note: parameter passing for argument of type ‘ResolvExpr::WidenMode’ changed in GCC 9.1 748 | ast::ptr< ast::Type > commonType( | ^~~~~~~~~~ /var/lib/jenkins/workspace/Cforall_master/src/ResolvExpr/Unify.cpp: In function ‘bool ResolvExpr::unifyExact(const ast::Type*, const ast::Type*, ast::TypeEnvironment&, ast::AssertionSet&, ast::AssertionSet&, const OpenVarSet&, ResolvExpr::WidenMode)’: /var/lib/jenkins/workspace/Cforall_master/src/ResolvExpr/Unify.cpp:644:6: note: parameter passing for argument of type ‘ResolvExpr::WidenMode’ changed in GCC 9.1 644 | bool unifyExact( | ^~~~~~~~~~ /var/lib/jenkins/workspace/Cforall_master/src/ResolvExpr/Unify.cpp: In function ‘bool ResolvExpr::unifyInexact(ast::ptr&, ast::ptr&, ast::TypeEnvironment&, ast::AssertionSet&, ast::AssertionSet&, const OpenVarSet&, ResolvExpr::WidenMode, ast::ptr&)’: /var/lib/jenkins/workspace/Cforall_master/src/ResolvExpr/Unify.cpp:671:6: note: parameter passing for argument of type ‘ResolvExpr::WidenMode’ changed in GCC 9.1 671 | bool unifyInexact( | ^~~~~~~~~~~~ /var/lib/jenkins/workspace/Cforall_master/src/AST/TypeEnvironment.cpp: In member function ‘bool ast::TypeEnvironment::bindVar(const ast::TypeInstType*, const ast::Type*, const ast::TypeData&, ast::AssertionSet&, ast::AssertionSet&, const OpenVarSet&, ResolvExpr::WidenMode)’: /var/lib/jenkins/workspace/Cforall_master/src/AST/TypeEnvironment.cpp:280:6: note: parameter passing for argument of type ‘ResolvExpr::WidenMode’ changed in GCC 9.1 280 | bool TypeEnvironment::bindVar( | ^~~~~~~~~~~~~~~ /var/lib/jenkins/workspace/Cforall_master/src/AST/TypeEnvironment.cpp: In member function ‘bool ast::TypeEnvironment::bindVarToVar(const ast::TypeInstType*, const ast::TypeInstType*, ast::TypeData&&, ast::AssertionSet&, ast::AssertionSet&, const OpenVarSet&, ResolvExpr::WidenMode)’: /var/lib/jenkins/workspace/Cforall_master/src/AST/TypeEnvironment.cpp:319:6: note: parameter passing for argument of type ‘ResolvExpr::WidenMode’ changed in GCC 9.1 319 | bool TypeEnvironment::bindVarToVar( | ^~~~~~~~~~~~~~~ CXXLD ../driver/cfa-cpp [Pipeline] } [Pipeline] // dir [Pipeline] } [Pipeline] // stage [Pipeline] echo -------- Build : libcfa(debug) -------- [Pipeline] stage [Pipeline] { (Build : libcfa(debug)) [Pipeline] dir Running in /var/lib/jenkins/workspace/Cforall_master@tmp [Pipeline] { [Pipeline] sh + nproc + make -j 96 --no-print-directory -C libcfa/arm64-debug Making all in prelude mkdir .deps touch .deps/builtins.Po (CDPATH="${ZSH_VERSION+.}:" && cd /var/lib/jenkins/workspace/Cforall_master/libcfa && /bin/bash '/var/lib/jenkins/workspace/Cforall_master/libcfa/automake/missing' autoheader) rm -f stamp-h1 touch /var/lib/jenkins/workspace/Cforall_master/libcfa/prelude/defines.hfa.in cd .. && /bin/bash ./config.status prelude/defines.hfa config.status: creating prelude/defines.hfa config.status: prelude/defines.hfa is unchanged make all-am GEN gcc-builtins.c GEN builtins.cfa GEN prelude.cfa GEN extras.cfa GEN extras.cfa GEN gcc-builtins.cfa GEN bootloader.c Making all in src CFA common.lo CFA fstream.lo CFA heap.lo CFA iostream.lo CFA iterator.lo CFA limits.lo CFA math.lo CFA memory.lo CFA parseargs.lo CFA parseconfig.lo CFA rational.lo CFA stdlib.lo CFA strstream.lo CFA time.lo CFA assert.lo CC exception.lo CFA interpose.lo CFA prelude-inline.lo CFA startup.lo CC virtual.lo GEN prelude.lo CFA interpose_thread.lo CFA bits/weakso_locks.lo CFA algorithms/range_iterator.lo CFA collections/maybe.lo CFA collections/pair.lo CFA collections/result.lo CFA collections/string.lo CFA collections/string_res.lo CFA collections/vector.lo CFA device/cpu.lo CFA bits/debug.lo CFA concurrency/alarm.lo CFA concurrency/coroutine.lo CFA concurrency/exception.lo CFA concurrency/kernel.lo CFA concurrency/kernel/cluster.lo CFA concurrency/locks.lo CFA concurrency/monitor.lo CFA concurrency/mutex.lo CFA concurrency/select.lo CFA concurrency/thread.lo CFA concurrency/cofor.lo CFA concurrency/clib/cfathread.lo CPPAS concurrency/CtxSwitch-arm64.lo CC concurrency/invoke.lo CFA concurrency/io.lo CFA concurrency/io/setup.lo CFA concurrency/io/call.lo CFA concurrency/kernel/startup.lo CFA concurrency/preemption.lo CFA concurrency/ready_queue.lo CFA concurrency/stats.lo CFA concurrency/pthread.lo /usr/include/linux/io_uring.h:83:36: warning: 'packed' attribute ignored for field of type 'union __io_uring_sqe____anonymous65' [-Wattributes] 83 | } __attribute__((packed)); | ^ CCLD libcfa.la /usr/bin/ld: warning: .libs/common.o: requires executable stack (because the .note.GNU-stack section is executable) /usr/include/linux/io_uring.h:83:36: warning: 'packed' attribute ignored for field of type 'union __io_uring_sqe____anonymous129' [-Wattributes] 83 | } __attribute__((packed)); | ^ /usr/include/linux/io_uring.h:83:36: warning: 'packed' attribute ignored for field of type 'union __io_uring_sqe____anonymous53' [-Wattributes] 83 | } __attribute__((packed)); | ^ /usr/include/linux/io_uring.h:83:36: warning: 'packed' attribute ignored for field of type 'union __io_uring_sqe____anonymous119' [-Wattributes] 83 | } __attribute__((packed)); | ^ /usr/include/linux/io_uring.h:83:36: warning: 'packed' attribute ignored for field of type 'union __io_uring_sqe____anonymous119' [-Wattributes] 83 | } __attribute__((packed)); | ^ /usr/include/linux/io_uring.h:83:36: warning: 'packed' attribute ignored for field of type 'union __io_uring_sqe____anonymous32' [-Wattributes] 83 | } __attribute__((packed)); | ^ /usr/include/linux/io_uring.h:83:36: warning: 'packed' attribute ignored for field of type 'union __io_uring_sqe____anonymous97' [-Wattributes] 83 | } __attribute__((packed)); | ^ CCLD libcfathread.la /usr/bin/ld: warning: concurrency/.libs/alarm.o: requires executable stack (because the .note.GNU-stack section is executable) make[1]: Nothing to be done for 'all-am'. [Pipeline] } [Pipeline] // dir [Pipeline] } [Pipeline] // stage [Pipeline] echo -------- Build : libcfa(nodebug) -------- [Pipeline] stage [Pipeline] { (Build : libcfa(nodebug)) [Pipeline] dir Running in /var/lib/jenkins/workspace/Cforall_master@tmp [Pipeline] { [Pipeline] sh + nproc + make -j 96 --no-print-directory -C libcfa/arm64-nodebug Making all in prelude mkdir .deps touch .deps/builtins.Po cd .. && /bin/bash ./config.status prelude/defines.hfa config.status: creating prelude/defines.hfa config.status: prelude/defines.hfa is unchanged make all-am GEN gcc-builtins.c GEN builtins.cfa GEN prelude.cfa GEN extras.cfa GEN gcc-builtins.cfa GEN extras.cfa GEN bootloader.c Making all in src CFA common.lo CFA fstream.lo CFA heap.lo CFA iostream.lo CFA iterator.lo CFA limits.lo CFA math.lo CFA memory.lo CFA parseargs.lo CFA parseconfig.lo CFA rational.lo CFA stdlib.lo CFA strstream.lo CFA time.lo CFA assert.lo CFA bits/debug.lo CC exception.lo CFA interpose.lo CFA prelude-inline.lo CFA startup.lo CC virtual.lo GEN prelude.lo CFA interpose_thread.lo CFA concurrency/preemption.lo CFA concurrency/ready_queue.lo CFA concurrency/stats.lo CFA concurrency/pthread.lo CFA bits/weakso_locks.lo CFA algorithms/range_iterator.lo CFA collections/maybe.lo CFA collections/pair.lo CFA collections/result.lo CFA collections/string.lo CFA collections/string_res.lo CFA collections/vector.lo CFA device/cpu.lo CFA concurrency/alarm.lo CFA concurrency/coroutine.lo CFA concurrency/exception.lo CFA concurrency/kernel.lo CFA concurrency/kernel/cluster.lo CFA concurrency/locks.lo CFA concurrency/monitor.lo CFA concurrency/mutex.lo CFA concurrency/select.lo CFA concurrency/thread.lo CFA concurrency/cofor.lo CFA concurrency/clib/cfathread.lo CPPAS concurrency/CtxSwitch-arm64.lo CC concurrency/invoke.lo CFA concurrency/io.lo CFA concurrency/io/setup.lo CFA concurrency/io/call.lo CFA concurrency/kernel/startup.lo /var/lib/jenkins/workspace/Cforall_master/libcfa/src/exception.c: In function '__cfaehm_allocate_exception': /var/lib/jenkins/workspace/Cforall_master/libcfa/src/exception.c:142:3: warning: ignoring return value of 'write' declared with attribute 'warn_unused_result' [-Wunused-result] 142 | write( 2, "abort2\n", 7 ); | ^~~~~~~~~~~~~~~~~~~~~~~~~ /var/lib/jenkins/workspace/Cforall_master/libcfa/src/exception.c: In function '__cfaehm_exception_cleanup': /var/lib/jenkins/workspace/Cforall_master/libcfa/src/exception.c:127:3: warning: ignoring return value of 'write' declared with attribute 'warn_unused_result' [-Wunused-result] 127 | write( 2, "abort1\n", 7 ); | ^~~~~~~~~~~~~~~~~~~~~~~~~ /var/lib/jenkins/workspace/Cforall_master/libcfa/src/exception.c: In function '__cfaehm_cancel_stack': /var/lib/jenkins/workspace/Cforall_master/libcfa/src/exception.c:230:2: warning: ignoring return value of 'write' declared with attribute 'warn_unused_result' [-Wunused-result] 230 | write( 2, "abort3\n", 7 ); | ^~~~~~~~~~~~~~~~~~~~~~~~~ /var/lib/jenkins/workspace/Cforall_master/libcfa/src/exception.c: In function '__cfaehm_begin_unwind': /var/lib/jenkins/workspace/Cforall_master/libcfa/src/exception.c:252:3: warning: ignoring return value of 'write' declared with attribute 'warn_unused_result' [-Wunused-result] 252 | write( 2, "abort4\n", 7 ); | ^~~~~~~~~~~~~~~~~~~~~~~~~ /var/lib/jenkins/workspace/Cforall_master/libcfa/src/exception.c:278:3: warning: ignoring return value of 'write' declared with attribute 'warn_unused_result' [-Wunused-result] 278 | write( 2, "abort5\n", 7 ); | ^~~~~~~~~~~~~~~~~~~~~~~~~ /var/lib/jenkins/workspace/Cforall_master/libcfa/src/exception.c: In function '__cfaehm_rethrow_terminate': /var/lib/jenkins/workspace/Cforall_master/libcfa/src/exception.c:308:2: warning: ignoring return value of 'write' declared with attribute 'warn_unused_result' [-Wunused-result] 308 | write( 2, "abort7\n", 7 ); | ^~~~~~~~~~~~~~~~~~~~~~~~~ /var/lib/jenkins/workspace/Cforall_master/libcfa/src/exception.c: In function '__cfaehm_rethrow_adapter': /var/lib/jenkins/workspace/Cforall_master/libcfa/src/exception.c:300:2: warning: ignoring return value of 'write' declared with attribute 'warn_unused_result' [-Wunused-result] 300 | write( 2, "abort6\n", 7 ); | ^~~~~~~~~~~~~~~~~~~~~~~~~ /usr/include/linux/io_uring.h:83:36: warning: 'packed' attribute ignored for field of type 'union __io_uring_sqe____anonymous65' [-Wattributes] 83 | } __attribute__((packed)); | ^ /usr/include/aarch64-linux-gnu/bits/socket2.h:70:94: warning: '_X12_constructorFv_U26__anonymous___SOCKADDR_ARGU26__anonymous___SOCKADDR_ARG_autogen___1' is static but used in inline function 'recvfrom' which is not static 70 | return __recvfrom_chk (__fd, __buf, __n, sz, __flags, __addr, __addr_len); | ^ /usr/include/aarch64-linux-gnu/bits/socket2.h:70:124: warning: '_X11_destructorFv_U26__anonymous___SOCKADDR_ARG_autogen___1' is static but used in inline function 'recvfrom' which is not static 70 | return __recvfrom_chk (__fd, __buf, __n, sz, __flags, __addr, __addr_len); | ^ /usr/include/aarch64-linux-gnu/bits/socket2.h:68:103: warning: '_X12_constructorFv_U26__anonymous___SOCKADDR_ARGU26__anonymous___SOCKADDR_ARG_autogen___1' is static but used in inline function 'recvfrom' which is not static 68 | return __recvfrom_chk_warn (__fd, __buf, __n, sz, __flags, __addr, | ^ /usr/include/aarch64-linux-gnu/bits/socket2.h:68:128: warning: '_X11_destructorFv_U26__anonymous___SOCKADDR_ARG_autogen___1' is static but used in inline function 'recvfrom' which is not static 68 | return __recvfrom_chk_warn (__fd, __buf, __n, sz, __flags, __addr, | ^ /usr/include/aarch64-linux-gnu/bits/socket2.h:66:96: warning: '_X12_constructorFv_U26__anonymous___SOCKADDR_ARGU26__anonymous___SOCKADDR_ARG_autogen___1' is static but used in inline function 'recvfrom' which is not static 66 | return __recvfrom_alias (__fd, __buf, __n, __flags, __addr, __addr_len); | ^ /usr/include/aarch64-linux-gnu/bits/socket2.h:66:128: warning: '_X11_destructorFv_U26__anonymous___SOCKADDR_ARG_autogen___1' is static but used in inline function 'recvfrom' which is not static 66 | return __recvfrom_alias (__fd, __buf, __n, __flags, __addr, __addr_len); | ^ /usr/include/linux/io_uring.h:83:36: warning: 'packed' attribute ignored for field of type 'union __io_uring_sqe____anonymous129' [-Wattributes] 83 | } __attribute__((packed)); | ^ /usr/include/aarch64-linux-gnu/bits/socket2.h:70:95: warning: '_X12_constructorFv_U26__anonymous___SOCKADDR_ARGU26__anonymous___SOCKADDR_ARG_autogen___1' is static but used in inline function 'recvfrom' which is not static 70 | return __recvfrom_chk (__fd, __buf, __n, sz, __flags, __addr, __addr_len); | ^ /usr/include/aarch64-linux-gnu/bits/socket2.h:70:125: warning: '_X11_destructorFv_U26__anonymous___SOCKADDR_ARG_autogen___1' is static but used in inline function 'recvfrom' which is not static 70 | return __recvfrom_chk (__fd, __buf, __n, sz, __flags, __addr, __addr_len); | ^ /usr/include/aarch64-linux-gnu/bits/socket2.h:68:104: warning: '_X12_constructorFv_U26__anonymous___SOCKADDR_ARGU26__anonymous___SOCKADDR_ARG_autogen___1' is static but used in inline function 'recvfrom' which is not static 68 | return __recvfrom_chk_warn (__fd, __buf, __n, sz, __flags, __addr, | ^ /usr/include/aarch64-linux-gnu/bits/socket2.h:68:129: warning: '_X11_destructorFv_U26__anonymous___SOCKADDR_ARG_autogen___1' is static but used in inline function 'recvfrom' which is not static 68 | return __recvfrom_chk_warn (__fd, __buf, __n, sz, __flags, __addr, | ^ /usr/include/aarch64-linux-gnu/bits/socket2.h:66:97: warning: '_X12_constructorFv_U26__anonymous___SOCKADDR_ARGU26__anonymous___SOCKADDR_ARG_autogen___1' is static but used in inline function 'recvfrom' which is not static 66 | return __recvfrom_alias (__fd, __buf, __n, __flags, __addr, __addr_len); | ^ /usr/include/aarch64-linux-gnu/bits/socket2.h:66:129: warning: '_X11_destructorFv_U26__anonymous___SOCKADDR_ARG_autogen___1' is static but used in inline function 'recvfrom' which is not static 66 | return __recvfrom_alias (__fd, __buf, __n, __flags, __addr, __addr_len); | ^ /usr/include/linux/io_uring.h:83:36: warning: 'packed' attribute ignored for field of type 'union __io_uring_sqe____anonymous119' [-Wattributes] 83 | } __attribute__((packed)); | ^ /usr/include/aarch64-linux-gnu/bits/socket2.h:70:95: warning: '_X12_constructorFv_U26__anonymous___SOCKADDR_ARGU26__anonymous___SOCKADDR_ARG_autogen___1' is static but used in inline function 'recvfrom' which is not static 70 | return __recvfrom_chk (__fd, __buf, __n, sz, __flags, __addr, __addr_len); | ^ /usr/include/aarch64-linux-gnu/bits/socket2.h:70:125: warning: '_X11_destructorFv_U26__anonymous___SOCKADDR_ARG_autogen___1' is static but used in inline function 'recvfrom' which is not static 70 | return __recvfrom_chk (__fd, __buf, __n, sz, __flags, __addr, __addr_len); | ^ /usr/include/aarch64-linux-gnu/bits/socket2.h:68:104: warning: '_X12_constructorFv_U26__anonymous___SOCKADDR_ARGU26__anonymous___SOCKADDR_ARG_autogen___1' is static but used in inline function 'recvfrom' which is not static 68 | return __recvfrom_chk_warn (__fd, __buf, __n, sz, __flags, __addr, | ^ /usr/include/aarch64-linux-gnu/bits/socket2.h:68:129: warning: '_X11_destructorFv_U26__anonymous___SOCKADDR_ARG_autogen___1' is static but used in inline function 'recvfrom' which is not static 68 | return __recvfrom_chk_warn (__fd, __buf, __n, sz, __flags, __addr, | ^ /usr/include/aarch64-linux-gnu/bits/socket2.h:66:97: warning: '_X12_constructorFv_U26__anonymous___SOCKADDR_ARGU26__anonymous___SOCKADDR_ARG_autogen___1' is static but used in inline function 'recvfrom' which is not static 66 | return __recvfrom_alias (__fd, __buf, __n, __flags, __addr, __addr_len); | ^ /usr/include/aarch64-linux-gnu/bits/socket2.h:66:129: warning: '_X11_destructorFv_U26__anonymous___SOCKADDR_ARG_autogen___1' is static but used in inline function 'recvfrom' which is not static 66 | return __recvfrom_alias (__fd, __buf, __n, __flags, __addr, __addr_len); | ^ /usr/include/linux/io_uring.h:83:36: warning: 'packed' attribute ignored for field of type 'union __io_uring_sqe____anonymous53' [-Wattributes] 83 | } __attribute__((packed)); | ^ /usr/include/linux/io_uring.h:83:36: warning: 'packed' attribute ignored for field of type 'union __io_uring_sqe____anonymous119' [-Wattributes] 83 | } __attribute__((packed)); | ^ /usr/include/aarch64-linux-gnu/bits/socket2.h:70:95: warning: '_X12_constructorFv_U26__anonymous___SOCKADDR_ARGU26__anonymous___SOCKADDR_ARG_autogen___1' is static but used in inline function 'recvfrom' which is not static 70 | return __recvfrom_chk (__fd, __buf, __n, sz, __flags, __addr, __addr_len); | ^ /usr/include/aarch64-linux-gnu/bits/socket2.h:70:125: warning: '_X11_destructorFv_U26__anonymous___SOCKADDR_ARG_autogen___1' is static but used in inline function 'recvfrom' which is not static 70 | return __recvfrom_chk (__fd, __buf, __n, sz, __flags, __addr, __addr_len); | ^ /usr/include/aarch64-linux-gnu/bits/socket2.h:68:104: warning: '_X12_constructorFv_U26__anonymous___SOCKADDR_ARGU26__anonymous___SOCKADDR_ARG_autogen___1' is static but used in inline function 'recvfrom' which is not static 68 | return __recvfrom_chk_warn (__fd, __buf, __n, sz, __flags, __addr, | ^ /usr/include/aarch64-linux-gnu/bits/socket2.h:68:129: warning: '_X11_destructorFv_U26__anonymous___SOCKADDR_ARG_autogen___1' is static but used in inline function 'recvfrom' which is not static 68 | return __recvfrom_chk_warn (__fd, __buf, __n, sz, __flags, __addr, | ^ /usr/include/aarch64-linux-gnu/bits/socket2.h:66:97: warning: '_X12_constructorFv_U26__anonymous___SOCKADDR_ARGU26__anonymous___SOCKADDR_ARG_autogen___1' is static but used in inline function 'recvfrom' which is not static 66 | return __recvfrom_alias (__fd, __buf, __n, __flags, __addr, __addr_len); | ^ /usr/include/aarch64-linux-gnu/bits/socket2.h:66:129: warning: '_X11_destructorFv_U26__anonymous___SOCKADDR_ARG_autogen___1' is static but used in inline function 'recvfrom' which is not static 66 | return __recvfrom_alias (__fd, __buf, __n, __flags, __addr, __addr_len); | ^ /usr/include/aarch64-linux-gnu/bits/socket2.h:70:95: warning: '_X12_constructorFv_U26__anonymous___SOCKADDR_ARGU26__anonymous___SOCKADDR_ARG_autogen___1' is static but used in inline function 'recvfrom' which is not static 70 | return __recvfrom_chk (__fd, __buf, __n, sz, __flags, __addr, __addr_len); | ^ /usr/include/aarch64-linux-gnu/bits/socket2.h:70:125: warning: '_X11_destructorFv_U26__anonymous___SOCKADDR_ARG_autogen___1' is static but used in inline function 'recvfrom' which is not static 70 | return __recvfrom_chk (__fd, __buf, __n, sz, __flags, __addr, __addr_len); | ^ /usr/include/aarch64-linux-gnu/bits/socket2.h:68:104: warning: '_X12_constructorFv_U26__anonymous___SOCKADDR_ARGU26__anonymous___SOCKADDR_ARG_autogen___1' is static but used in inline function 'recvfrom' which is not static 68 | return __recvfrom_chk_warn (__fd, __buf, __n, sz, __flags, __addr, | ^ /usr/include/aarch64-linux-gnu/bits/socket2.h:68:129: warning: '_X11_destructorFv_U26__anonymous___SOCKADDR_ARG_autogen___1' is static but used in inline function 'recvfrom' which is not static 68 | return __recvfrom_chk_warn (__fd, __buf, __n, sz, __flags, __addr, | ^ /usr/include/aarch64-linux-gnu/bits/socket2.h:66:97: warning: '_X12_constructorFv_U26__anonymous___SOCKADDR_ARGU26__anonymous___SOCKADDR_ARG_autogen___1' is static but used in inline function 'recvfrom' which is not static 66 | return __recvfrom_alias (__fd, __buf, __n, __flags, __addr, __addr_len); | ^ /usr/include/aarch64-linux-gnu/bits/socket2.h:66:129: warning: '_X11_destructorFv_U26__anonymous___SOCKADDR_ARG_autogen___1' is static but used in inline function 'recvfrom' which is not static 66 | return __recvfrom_alias (__fd, __buf, __n, __flags, __addr, __addr_len); | ^ CCLD libcfa.la /usr/bin/ld: warning: .libs/common.o: requires executable stack (because the .note.GNU-stack section is executable) /usr/include/linux/io_uring.h:83:36: warning: 'packed' attribute ignored for field of type 'union __io_uring_sqe____anonymous32' [-Wattributes] 83 | } __attribute__((packed)); | ^ /usr/include/aarch64-linux-gnu/bits/socket2.h:70:94: warning: '_X12_constructorFv_U26__anonymous___SOCKADDR_ARGU26__anonymous___SOCKADDR_ARG_autogen___1' is static but used in inline function 'recvfrom' which is not static 70 | return __recvfrom_chk (__fd, __buf, __n, sz, __flags, __addr, __addr_len); | ^ /usr/include/aarch64-linux-gnu/bits/socket2.h:70:124: warning: '_X11_destructorFv_U26__anonymous___SOCKADDR_ARG_autogen___1' is static but used in inline function 'recvfrom' which is not static 70 | return __recvfrom_chk (__fd, __buf, __n, sz, __flags, __addr, __addr_len); | ^ /usr/include/aarch64-linux-gnu/bits/socket2.h:68:103: warning: '_X12_constructorFv_U26__anonymous___SOCKADDR_ARGU26__anonymous___SOCKADDR_ARG_autogen___1' is static but used in inline function 'recvfrom' which is not static 68 | return __recvfrom_chk_warn (__fd, __buf, __n, sz, __flags, __addr, | ^ /usr/include/aarch64-linux-gnu/bits/socket2.h:68:128: warning: '_X11_destructorFv_U26__anonymous___SOCKADDR_ARG_autogen___1' is static but used in inline function 'recvfrom' which is not static 68 | return __recvfrom_chk_warn (__fd, __buf, __n, sz, __flags, __addr, | ^ /usr/include/aarch64-linux-gnu/bits/socket2.h:66:96: warning: '_X12_constructorFv_U26__anonymous___SOCKADDR_ARGU26__anonymous___SOCKADDR_ARG_autogen___1' is static but used in inline function 'recvfrom' which is not static 66 | return __recvfrom_alias (__fd, __buf, __n, __flags, __addr, __addr_len); | ^ /usr/include/aarch64-linux-gnu/bits/socket2.h:66:128: warning: '_X11_destructorFv_U26__anonymous___SOCKADDR_ARG_autogen___1' is static but used in inline function 'recvfrom' which is not static 66 | return __recvfrom_alias (__fd, __buf, __n, __flags, __addr, __addr_len); | ^ /usr/include/linux/io_uring.h:83:36: warning: 'packed' attribute ignored for field of type 'union __io_uring_sqe____anonymous97' [-Wattributes] 83 | } __attribute__((packed)); | ^ /usr/include/aarch64-linux-gnu/bits/socket2.h:70:95: warning: '_X12_constructorFv_U26__anonymous___SOCKADDR_ARGU26__anonymous___SOCKADDR_ARG_autogen___1' is static but used in inline function 'recvfrom' which is not static 70 | return __recvfrom_chk (__fd, __buf, __n, sz, __flags, __addr, __addr_len); | ^ /usr/include/aarch64-linux-gnu/bits/socket2.h:70:125: warning: '_X11_destructorFv_U26__anonymous___SOCKADDR_ARG_autogen___1' is static but used in inline function 'recvfrom' which is not static 70 | return __recvfrom_chk (__fd, __buf, __n, sz, __flags, __addr, __addr_len); | ^ /usr/include/aarch64-linux-gnu/bits/socket2.h:68:104: warning: '_X12_constructorFv_U26__anonymous___SOCKADDR_ARGU26__anonymous___SOCKADDR_ARG_autogen___1' is static but used in inline function 'recvfrom' which is not static 68 | return __recvfrom_chk_warn (__fd, __buf, __n, sz, __flags, __addr, | ^ /usr/include/aarch64-linux-gnu/bits/socket2.h:68:129: warning: '_X11_destructorFv_U26__anonymous___SOCKADDR_ARG_autogen___1' is static but used in inline function 'recvfrom' which is not static 68 | return __recvfrom_chk_warn (__fd, __buf, __n, sz, __flags, __addr, | ^ /usr/include/aarch64-linux-gnu/bits/socket2.h:66:97: warning: '_X12_constructorFv_U26__anonymous___SOCKADDR_ARGU26__anonymous___SOCKADDR_ARG_autogen___1' is static but used in inline function 'recvfrom' which is not static 66 | return __recvfrom_alias (__fd, __buf, __n, __flags, __addr, __addr_len); | ^ /usr/include/aarch64-linux-gnu/bits/socket2.h:66:129: warning: '_X11_destructorFv_U26__anonymous___SOCKADDR_ARG_autogen___1' is static but used in inline function 'recvfrom' which is not static 66 | return __recvfrom_alias (__fd, __buf, __n, __flags, __addr, __addr_len); | ^ CCLD libcfathread.la /usr/bin/ld: warning: concurrency/.libs/coroutine.o: requires executable stack (because the .note.GNU-stack section is executable) make[1]: Nothing to be done for 'all-am'. [Pipeline] } [Pipeline] // dir [Pipeline] } [Pipeline] // stage [Pipeline] echo -------- Build : install -------- [Pipeline] stage [Pipeline] { (Build : install) [Pipeline] dir Running in /var/lib/jenkins/workspace/Cforall_master@tmp [Pipeline] { [Pipeline] sh + nproc + make -j 96 --no-print-directory install Making install in driver make install-exec-hook /usr/bin/install -c cfa '/var/lib/jenkins/workspace/Cforall_master@tmp/bin//cfa' /usr/bin/mkdir -p '/var/lib/jenkins/workspace/Cforall_master@tmp/lib/cfa/' /bin/bash ../libtool --mode=install /usr/bin/install -c as cc1 '/var/lib/jenkins/workspace/Cforall_master@tmp/lib/cfa/' libtool: install: /usr/bin/install -c as /var/lib/jenkins/workspace/Cforall_master@tmp/lib/cfa/as libtool: install: /usr/bin/install -c cc1 /var/lib/jenkins/workspace/Cforall_master@tmp/lib/cfa/cc1 Making install in src make install-am make[3]: Nothing to be done for 'install-exec-am'. /usr/bin/mkdir -p '/var/lib/jenkins/workspace/Cforall_master@tmp/lib/cfa/' /bin/bash ../libtool --mode=install /usr/bin/install -c ../driver/cfa-cpp '/var/lib/jenkins/workspace/Cforall_master@tmp/lib/cfa/' libtool: install: /usr/bin/install -c ../driver/cfa-cpp /var/lib/jenkins/workspace/Cforall_master@tmp/lib/cfa/cfa-cpp Making install in . (CDPATH="${ZSH_VERSION+.}:" && cd /var/lib/jenkins/workspace/Cforall_master && /bin/bash '/var/lib/jenkins/workspace/Cforall_master/automake/missing' autoheader) rm -f stamp-h1 touch /var/lib/jenkins/workspace/Cforall_master/src/config.h.in cd . && /bin/bash ./config.status config.h config.status: creating config.h config.status: config.h is unchanged make[2]: Nothing to be done for 'install-exec-am'. /usr/bin/mkdir -p '/var/lib/jenkins/workspace/Cforall_master@tmp/share/man/man1' /usr/bin/install -c -m 644 /var/lib/jenkins/workspace/Cforall_master/doc/man/cfa.1 '/var/lib/jenkins/workspace/Cforall_master@tmp/share/man/man1' Making install in libcfa/arm64-debug Making install in prelude make[3]: Nothing to be done for 'install-exec-am'. /usr/bin/mkdir -p '/var/lib/jenkins/workspace/Cforall_master@tmp/lib/cfa/arm64-debug/' /usr/bin/install -c -m 644 gcc-builtins.cfa builtins.cfa extras.cfa prelude.cfa bootloader.c defines.hfa '/var/lib/jenkins/workspace/Cforall_master@tmp/lib/cfa/arm64-debug/' Making install in src /usr/bin/mkdir -p '/var/lib/jenkins/workspace/Cforall_master@tmp/lib/cfa/arm64-debug/' /bin/bash ../libtool --mode=install /usr/bin/install -c libcfa.la libcfathread.la '/var/lib/jenkins/workspace/Cforall_master@tmp/lib/cfa/arm64-debug/' /usr/bin/mkdir -p '/var/lib/jenkins/workspace/Cforall_master@tmp/include/cfa/' /usr/bin/mkdir -p '/var/lib/jenkins/workspace/Cforall_master@tmp/include/cfa//stdhdr/sys' /usr/bin/install -c -m 644 /var/lib/jenkins/workspace/Cforall_master/libcfa/src/stdhdr/sys/mman.h /var/lib/jenkins/workspace/Cforall_master/libcfa/src/stdhdr/sys/time.h /var/lib/jenkins/workspace/Cforall_master/libcfa/src/stdhdr/sys/socket.h '/var/lib/jenkins/workspace/Cforall_master@tmp/include/cfa//stdhdr/sys' /usr/bin/mkdir -p '/var/lib/jenkins/workspace/Cforall_master@tmp/include/cfa//algorithms' /usr/bin/install -c -m 644 /var/lib/jenkins/workspace/Cforall_master/libcfa/src/algorithms/range_iterator.hfa '/var/lib/jenkins/workspace/Cforall_master@tmp/include/cfa//algorithms' /usr/bin/mkdir -p '/var/lib/jenkins/workspace/Cforall_master@tmp/include/cfa//concurrency/kernel' /usr/bin/install -c -m 644 /var/lib/jenkins/workspace/Cforall_master/libcfa/src/concurrency/kernel/cluster.hfa /var/lib/jenkins/workspace/Cforall_master/libcfa/src/concurrency/kernel/fwd.hfa '/var/lib/jenkins/workspace/Cforall_master@tmp/include/cfa//concurrency/kernel' /usr/bin/install -c -m 644 /var/lib/jenkins/workspace/Cforall_master/libcfa/src/common.hfa /var/lib/jenkins/workspace/Cforall_master/libcfa/src/fstream.hfa /var/lib/jenkins/workspace/Cforall_master/libcfa/src/heap.hfa /var/lib/jenkins/workspace/Cforall_master/libcfa/src/iostream.hfa /var/lib/jenkins/workspace/Cforall_master/libcfa/src/iterator.hfa /var/lib/jenkins/workspace/Cforall_master/libcfa/src/limits.hfa /var/lib/jenkins/workspace/Cforall_master/libcfa/src/math.hfa /var/lib/jenkins/workspace/Cforall_master/libcfa/src/memory.hfa /var/lib/jenkins/workspace/Cforall_master/libcfa/src/parseargs.hfa /var/lib/jenkins/workspace/Cforall_master/libcfa/src/parseconfig.hfa /var/lib/jenkins/workspace/Cforall_master/libcfa/src/rational.hfa /var/lib/jenkins/workspace/Cforall_master/libcfa/src/stdlib.hfa /var/lib/jenkins/workspace/Cforall_master/libcfa/src/strstream.hfa /var/lib/jenkins/workspace/Cforall_master/libcfa/src/time.hfa /var/lib/jenkins/workspace/Cforall_master/libcfa/src/Exception.hfa /var/lib/jenkins/workspace/Cforall_master/libcfa/src/bitmanip.hfa /var/lib/jenkins/workspace/Cforall_master/libcfa/src/clock.hfa /var/lib/jenkins/workspace/Cforall_master/libcfa/src/exception.hfa /var/lib/jenkins/workspace/Cforall_master/libcfa/src/exception.h /var/lib/jenkins/workspace/Cforall_master/libcfa/src/gmp.hfa /var/lib/jenkins/workspace/Cforall_master/libcfa/src/math.trait.hfa /var/lib/jenkins/workspace/Cforall_master/libcfa/src/raii.hfa /var/lib/jenkins/workspace/Cforall_master/libcfa/src/time_t.hfa /var/lib/jenkins/workspace/Cforall_master/libcfa/src/virtual_dtor.hfa '/var/lib/jenkins/workspace/Cforall_master@tmp/include/cfa//.' /usr/bin/mkdir -p '/var/lib/jenkins/workspace/Cforall_master@tmp/include/cfa//concurrency' /usr/bin/install -c -m 644 /var/lib/jenkins/workspace/Cforall_master/libcfa/src/concurrency/iofwd.hfa /var/lib/jenkins/workspace/Cforall_master/libcfa/src/concurrency/barrier.hfa /var/lib/jenkins/workspace/Cforall_master/libcfa/src/concurrency/alarm.hfa /var/lib/jenkins/workspace/Cforall_master/libcfa/src/concurrency/coroutine.hfa /var/lib/jenkins/workspace/Cforall_master/libcfa/src/concurrency/exception.hfa /var/lib/jenkins/workspace/Cforall_master/libcfa/src/concurrency/kernel.hfa /var/lib/jenkins/workspace/Cforall_master/libcfa/src/concurrency/locks.hfa /var/lib/jenkins/workspace/Cforall_master/libcfa/src/concurrency/monitor.hfa /var/lib/jenkins/workspace/Cforall_master/libcfa/src/concurrency/mutex.hfa /var/lib/jenkins/workspace/Cforall_master/libcfa/src/concurrency/select.hfa /var/lib/jenkins/workspace/Cforall_master/libcfa/src/concurrency/thread.hfa /var/lib/jenkins/workspace/Cforall_master/libcfa/src/concurrency/cofor.hfa /var/lib/jenkins/workspace/Cforall_master/libcfa/src/concurrency/invoke.h /var/lib/jenkins/workspace/Cforall_master/libcfa/src/concurrency/future.hfa /var/lib/jenkins/workspace/Cforall_master/libcfa/src/concurrency/once.hfa /var/lib/jenkins/workspace/Cforall_master/libcfa/src/concurrency/mutex_stmt.hfa /var/lib/jenkins/workspace/Cforall_master/libcfa/src/concurrency/channel.hfa /var/lib/jenkins/workspace/Cforall_master/libcfa/src/concurrency/actor.hfa '/var/lib/jenkins/workspace/Cforall_master@tmp/include/cfa//concurrency' /usr/bin/mkdir -p '/var/lib/jenkins/workspace/Cforall_master@tmp/include/cfa//concurrency/clib' /usr/bin/install -c -m 644 /var/lib/jenkins/workspace/Cforall_master/libcfa/src/concurrency/clib/cfathread.h '/var/lib/jenkins/workspace/Cforall_master@tmp/include/cfa//concurrency/clib' /usr/bin/mkdir -p '/var/lib/jenkins/workspace/Cforall_master@tmp/include/cfa//device' /usr/bin/install -c -m 644 /var/lib/jenkins/workspace/Cforall_master/libcfa/src/device/cpu.hfa '/var/lib/jenkins/workspace/Cforall_master@tmp/include/cfa//device' /usr/bin/mkdir -p '/var/lib/jenkins/workspace/Cforall_master@tmp/include/cfa//stdhdr/libltdl' /usr/bin/install -c -m 644 /var/lib/jenkins/workspace/Cforall_master/libcfa/src/stdhdr/libltdl/lt_dlloader.h '/var/lib/jenkins/workspace/Cforall_master@tmp/include/cfa//stdhdr/libltdl' libtool: install: /usr/bin/install -c .libs/libcfa.so.1.0.0 /var/lib/jenkins/workspace/Cforall_master@tmp/lib/cfa/arm64-debug/libcfa.so.1.0.0 /usr/bin/mkdir -p '/var/lib/jenkins/workspace/Cforall_master@tmp/include/cfa//vec' /usr/bin/install -c -m 644 /var/lib/jenkins/workspace/Cforall_master/libcfa/src/vec/vec.hfa /var/lib/jenkins/workspace/Cforall_master/libcfa/src/vec/vec2.hfa /var/lib/jenkins/workspace/Cforall_master/libcfa/src/vec/vec3.hfa /var/lib/jenkins/workspace/Cforall_master/libcfa/src/vec/vec4.hfa '/var/lib/jenkins/workspace/Cforall_master@tmp/include/cfa//vec' /usr/bin/mkdir -p '/var/lib/jenkins/workspace/Cforall_master@tmp/include/cfa//bits' /usr/bin/install -c -m 644 /var/lib/jenkins/workspace/Cforall_master/libcfa/src/bits/weakso_locks.hfa /var/lib/jenkins/workspace/Cforall_master/libcfa/src/bits/algorithm.hfa /var/lib/jenkins/workspace/Cforall_master/libcfa/src/bits/align.hfa /var/lib/jenkins/workspace/Cforall_master/libcfa/src/bits/collections.hfa /var/lib/jenkins/workspace/Cforall_master/libcfa/src/bits/debug.hfa /var/lib/jenkins/workspace/Cforall_master/libcfa/src/bits/defs.hfa /var/lib/jenkins/workspace/Cforall_master/libcfa/src/bits/locks.hfa /var/lib/jenkins/workspace/Cforall_master/libcfa/src/bits/collection.hfa /var/lib/jenkins/workspace/Cforall_master/libcfa/src/bits/stack.hfa /var/lib/jenkins/workspace/Cforall_master/libcfa/src/bits/queue.hfa /var/lib/jenkins/workspace/Cforall_master/libcfa/src/bits/sequence.hfa /var/lib/jenkins/workspace/Cforall_master/libcfa/src/bits/atomic.hfa /var/lib/jenkins/workspace/Cforall_master/libcfa/src/bits/random.hfa '/var/lib/jenkins/workspace/Cforall_master@tmp/include/cfa//bits' libtool: install: (cd /var/lib/jenkins/workspace/Cforall_master@tmp/lib/cfa/arm64-debug && { ln -s -f libcfa.so.1.0.0 libcfa.so.1 || { rm -f libcfa.so.1 && ln -s libcfa.so.1.0.0 libcfa.so.1; }; }) /usr/bin/mkdir -p '/var/lib/jenkins/workspace/Cforall_master@tmp/include/cfa//stdhdr' /usr/bin/install -c -m 644 /var/lib/jenkins/workspace/Cforall_master/libcfa/src/stdhdr/stdalign.h /var/lib/jenkins/workspace/Cforall_master/libcfa/src/stdhdr/stdio.h /var/lib/jenkins/workspace/Cforall_master/libcfa/src/stdhdr/malloc.h /var/lib/jenkins/workspace/Cforall_master/libcfa/src/stdhdr/time.h /var/lib/jenkins/workspace/Cforall_master/libcfa/src/stdhdr/signal.h /var/lib/jenkins/workspace/Cforall_master/libcfa/src/stdhdr/stdbool.h /var/lib/jenkins/workspace/Cforall_master/libcfa/src/stdhdr/unistd.h /var/lib/jenkins/workspace/Cforall_master/libcfa/src/stdhdr/stdatomic.h /var/lib/jenkins/workspace/Cforall_master/libcfa/src/stdhdr/stdint.h /var/lib/jenkins/workspace/Cforall_master/libcfa/src/stdhdr/gmp.h /var/lib/jenkins/workspace/Cforall_master/libcfa/src/stdhdr/locale.h /var/lib/jenkins/workspace/Cforall_master/libcfa/src/stdhdr/string.h /var/lib/jenkins/workspace/Cforall_master/libcfa/src/stdhdr/fenv.h /var/lib/jenkins/workspace/Cforall_master/libcfa/src/stdhdr/wchar.h /var/lib/jenkins/workspace/Cforall_master/libcfa/src/stdhdr/tgmath.h /var/lib/jenkins/workspace/Cforall_master/libcfa/src/stdhdr/math.h /var/lib/jenkins/workspace/Cforall_master/libcfa/src/stdhdr/pthread.h /var/lib/jenkins/workspace/Cforall_master/libcfa/src/stdhdr/complex.h /var/lib/jenkins/workspace/Cforall_master/libcfa/src/stdhdr/wctype.h /var/lib/jenkins/workspace/Cforall_master/libcfa/src/stdhdr/unwind.h /var/lib/jenkins/workspace/Cforall_master/libcfa/src/stdhdr/float.h /var/lib/jenkins/workspace/Cforall_master/libcfa/src/stdhdr/stdarg.h /var/lib/jenkins/workspace/Cforall_master/libcfa/src/stdhdr/stdlib.h /var/lib/jenkins/workspace/Cforall_master/libcfa/src/stdhdr/iso646.h /var/lib/jenkins/workspace/Cforall_master/libcfa/src/stdhdr/stddef.h /var/lib/jenkins/workspace/Cforall_master/libcfa/src/stdhdr/stdnoreturn.h /var/lib/jenkins/workspace/Cforall_master/libcfa/src/stdhdr/assert.h /var/lib/jenkins/workspace/Cforall_master/libcfa/src/stdhdr/ctype.h /var/lib/jenkins/workspace/Cforall_master/libcfa/src/stdhdr/errno.h /var/lib/jenkins/workspace/Cforall_master/libcfa/src/stdhdr/threads.h /var/lib/jenkins/workspace/Cforall_master/libcfa/src/stdhdr/uchar.h /var/lib/jenkins/workspace/Cforall_master/libcfa/src/stdhdr/inttypes.h /var/lib/jenkins/workspace/Cforall_master/libcfa/src/stdhdr/limits.h /var/lib/jenkins/workspace/Cforall_master/libcfa/src/stdhdr/setjmp.h '/var/lib/jenkins/workspace/Cforall_master@tmp/include/cfa//stdhdr' libtool: install: (cd /var/lib/jenkins/workspace/Cforall_master@tmp/lib/cfa/arm64-debug && { ln -s -f libcfa.so.1.0.0 libcfa.so || { rm -f libcfa.so && ln -s libcfa.so.1.0.0 libcfa.so; }; }) /usr/bin/mkdir -p '/var/lib/jenkins/workspace/Cforall_master@tmp/include/cfa//collections' /usr/bin/install -c -m 644 /var/lib/jenkins/workspace/Cforall_master/libcfa/src/collections/maybe.hfa /var/lib/jenkins/workspace/Cforall_master/libcfa/src/collections/pair.hfa /var/lib/jenkins/workspace/Cforall_master/libcfa/src/collections/result.hfa /var/lib/jenkins/workspace/Cforall_master/libcfa/src/collections/string.hfa /var/lib/jenkins/workspace/Cforall_master/libcfa/src/collections/string_res.hfa /var/lib/jenkins/workspace/Cforall_master/libcfa/src/collections/vector.hfa /var/lib/jenkins/workspace/Cforall_master/libcfa/src/collections/array.hfa /var/lib/jenkins/workspace/Cforall_master/libcfa/src/collections/list.hfa /var/lib/jenkins/workspace/Cforall_master/libcfa/src/collections/list2.hfa /var/lib/jenkins/workspace/Cforall_master/libcfa/src/collections/lockfree.hfa /var/lib/jenkins/workspace/Cforall_master/libcfa/src/collections/string_sharectx.hfa /var/lib/jenkins/workspace/Cforall_master/libcfa/src/collections/vector2.hfa '/var/lib/jenkins/workspace/Cforall_master@tmp/include/cfa//collections' libtool: install: /usr/bin/install -c .libs/libcfa.lai /var/lib/jenkins/workspace/Cforall_master@tmp/lib/cfa/arm64-debug/libcfa.la libtool: install: /usr/bin/install -c .libs/libcfathread.so.1.0.0 /var/lib/jenkins/workspace/Cforall_master@tmp/lib/cfa/arm64-debug/libcfathread.so.1.0.0 libtool: install: (cd /var/lib/jenkins/workspace/Cforall_master@tmp/lib/cfa/arm64-debug && { ln -s -f libcfathread.so.1.0.0 libcfathread.so.1 || { rm -f libcfathread.so.1 && ln -s libcfathread.so.1.0.0 libcfathread.so.1; }; }) libtool: install: (cd /var/lib/jenkins/workspace/Cforall_master@tmp/lib/cfa/arm64-debug && { ln -s -f libcfathread.so.1.0.0 libcfathread.so || { rm -f libcfathread.so && ln -s libcfathread.so.1.0.0 libcfathread.so; }; }) libtool: install: /usr/bin/install -c .libs/libcfathread.lai /var/lib/jenkins/workspace/Cforall_master@tmp/lib/cfa/arm64-debug/libcfathread.la libtool: warning: remember to run 'libtool --finish /var/lib/jenkins/workspace/Cforall_master@tmp/lib/cfa/arm64-debug/' make[3]: Nothing to be done for 'install-exec-am'. make[3]: Nothing to be done for 'install-data-am'. Making install in libcfa/arm64-nodebug Making install in prelude make[3]: Nothing to be done for 'install-exec-am'. /usr/bin/mkdir -p '/var/lib/jenkins/workspace/Cforall_master@tmp/lib/cfa/arm64-nodebug/' /usr/bin/install -c -m 644 gcc-builtins.cfa builtins.cfa extras.cfa prelude.cfa bootloader.c defines.hfa '/var/lib/jenkins/workspace/Cforall_master@tmp/lib/cfa/arm64-nodebug/' Making install in src /usr/bin/mkdir -p '/var/lib/jenkins/workspace/Cforall_master@tmp/lib/cfa/arm64-nodebug/' /bin/bash ../libtool --mode=install /usr/bin/install -c libcfa.la libcfathread.la '/var/lib/jenkins/workspace/Cforall_master@tmp/lib/cfa/arm64-nodebug/' /usr/bin/mkdir -p '/var/lib/jenkins/workspace/Cforall_master@tmp/include/cfa/' /usr/bin/mkdir -p '/var/lib/jenkins/workspace/Cforall_master@tmp/include/cfa//stdhdr/sys' /usr/bin/install -c -m 644 /var/lib/jenkins/workspace/Cforall_master/libcfa/src/stdhdr/sys/mman.h /var/lib/jenkins/workspace/Cforall_master/libcfa/src/stdhdr/sys/time.h /var/lib/jenkins/workspace/Cforall_master/libcfa/src/stdhdr/sys/socket.h '/var/lib/jenkins/workspace/Cforall_master@tmp/include/cfa//stdhdr/sys' /usr/bin/mkdir -p '/var/lib/jenkins/workspace/Cforall_master@tmp/include/cfa//algorithms' /usr/bin/install -c -m 644 /var/lib/jenkins/workspace/Cforall_master/libcfa/src/algorithms/range_iterator.hfa '/var/lib/jenkins/workspace/Cforall_master@tmp/include/cfa//algorithms' /usr/bin/mkdir -p '/var/lib/jenkins/workspace/Cforall_master@tmp/include/cfa//concurrency/kernel' /usr/bin/install -c -m 644 /var/lib/jenkins/workspace/Cforall_master/libcfa/src/concurrency/kernel/cluster.hfa /var/lib/jenkins/workspace/Cforall_master/libcfa/src/concurrency/kernel/fwd.hfa '/var/lib/jenkins/workspace/Cforall_master@tmp/include/cfa//concurrency/kernel' /usr/bin/install -c -m 644 /var/lib/jenkins/workspace/Cforall_master/libcfa/src/common.hfa /var/lib/jenkins/workspace/Cforall_master/libcfa/src/fstream.hfa /var/lib/jenkins/workspace/Cforall_master/libcfa/src/heap.hfa /var/lib/jenkins/workspace/Cforall_master/libcfa/src/iostream.hfa /var/lib/jenkins/workspace/Cforall_master/libcfa/src/iterator.hfa /var/lib/jenkins/workspace/Cforall_master/libcfa/src/limits.hfa /var/lib/jenkins/workspace/Cforall_master/libcfa/src/math.hfa /var/lib/jenkins/workspace/Cforall_master/libcfa/src/memory.hfa /var/lib/jenkins/workspace/Cforall_master/libcfa/src/parseargs.hfa /var/lib/jenkins/workspace/Cforall_master/libcfa/src/parseconfig.hfa /var/lib/jenkins/workspace/Cforall_master/libcfa/src/rational.hfa /var/lib/jenkins/workspace/Cforall_master/libcfa/src/stdlib.hfa /var/lib/jenkins/workspace/Cforall_master/libcfa/src/strstream.hfa /var/lib/jenkins/workspace/Cforall_master/libcfa/src/time.hfa /var/lib/jenkins/workspace/Cforall_master/libcfa/src/Exception.hfa /var/lib/jenkins/workspace/Cforall_master/libcfa/src/bitmanip.hfa /var/lib/jenkins/workspace/Cforall_master/libcfa/src/clock.hfa /var/lib/jenkins/workspace/Cforall_master/libcfa/src/exception.hfa /var/lib/jenkins/workspace/Cforall_master/libcfa/src/exception.h /var/lib/jenkins/workspace/Cforall_master/libcfa/src/gmp.hfa /var/lib/jenkins/workspace/Cforall_master/libcfa/src/math.trait.hfa /var/lib/jenkins/workspace/Cforall_master/libcfa/src/raii.hfa /var/lib/jenkins/workspace/Cforall_master/libcfa/src/time_t.hfa /var/lib/jenkins/workspace/Cforall_master/libcfa/src/virtual_dtor.hfa '/var/lib/jenkins/workspace/Cforall_master@tmp/include/cfa//.' /usr/bin/mkdir -p '/var/lib/jenkins/workspace/Cforall_master@tmp/include/cfa//concurrency' /usr/bin/install -c -m 644 /var/lib/jenkins/workspace/Cforall_master/libcfa/src/concurrency/iofwd.hfa /var/lib/jenkins/workspace/Cforall_master/libcfa/src/concurrency/barrier.hfa /var/lib/jenkins/workspace/Cforall_master/libcfa/src/concurrency/alarm.hfa /var/lib/jenkins/workspace/Cforall_master/libcfa/src/concurrency/coroutine.hfa /var/lib/jenkins/workspace/Cforall_master/libcfa/src/concurrency/exception.hfa /var/lib/jenkins/workspace/Cforall_master/libcfa/src/concurrency/kernel.hfa /var/lib/jenkins/workspace/Cforall_master/libcfa/src/concurrency/locks.hfa /var/lib/jenkins/workspace/Cforall_master/libcfa/src/concurrency/monitor.hfa /var/lib/jenkins/workspace/Cforall_master/libcfa/src/concurrency/mutex.hfa /var/lib/jenkins/workspace/Cforall_master/libcfa/src/concurrency/select.hfa /var/lib/jenkins/workspace/Cforall_master/libcfa/src/concurrency/thread.hfa /var/lib/jenkins/workspace/Cforall_master/libcfa/src/concurrency/cofor.hfa /var/lib/jenkins/workspace/Cforall_master/libcfa/src/concurrency/invoke.h /var/lib/jenkins/workspace/Cforall_master/libcfa/src/concurrency/future.hfa /var/lib/jenkins/workspace/Cforall_master/libcfa/src/concurrency/once.hfa /var/lib/jenkins/workspace/Cforall_master/libcfa/src/concurrency/mutex_stmt.hfa /var/lib/jenkins/workspace/Cforall_master/libcfa/src/concurrency/channel.hfa /var/lib/jenkins/workspace/Cforall_master/libcfa/src/concurrency/actor.hfa '/var/lib/jenkins/workspace/Cforall_master@tmp/include/cfa//concurrency' /usr/bin/mkdir -p '/var/lib/jenkins/workspace/Cforall_master@tmp/include/cfa//concurrency/clib' /usr/bin/install -c -m 644 /var/lib/jenkins/workspace/Cforall_master/libcfa/src/concurrency/clib/cfathread.h '/var/lib/jenkins/workspace/Cforall_master@tmp/include/cfa//concurrency/clib' /usr/bin/mkdir -p '/var/lib/jenkins/workspace/Cforall_master@tmp/include/cfa//device' /usr/bin/install -c -m 644 /var/lib/jenkins/workspace/Cforall_master/libcfa/src/device/cpu.hfa '/var/lib/jenkins/workspace/Cforall_master@tmp/include/cfa//device' /usr/bin/mkdir -p '/var/lib/jenkins/workspace/Cforall_master@tmp/include/cfa//stdhdr/libltdl' /usr/bin/install -c -m 644 /var/lib/jenkins/workspace/Cforall_master/libcfa/src/stdhdr/libltdl/lt_dlloader.h '/var/lib/jenkins/workspace/Cforall_master@tmp/include/cfa//stdhdr/libltdl' /usr/bin/mkdir -p '/var/lib/jenkins/workspace/Cforall_master@tmp/include/cfa//vec' /usr/bin/install -c -m 644 /var/lib/jenkins/workspace/Cforall_master/libcfa/src/vec/vec.hfa /var/lib/jenkins/workspace/Cforall_master/libcfa/src/vec/vec2.hfa /var/lib/jenkins/workspace/Cforall_master/libcfa/src/vec/vec3.hfa /var/lib/jenkins/workspace/Cforall_master/libcfa/src/vec/vec4.hfa '/var/lib/jenkins/workspace/Cforall_master@tmp/include/cfa//vec' libtool: install: /usr/bin/install -c .libs/libcfa.so.1.0.0 /var/lib/jenkins/workspace/Cforall_master@tmp/lib/cfa/arm64-nodebug/libcfa.so.1.0.0 /usr/bin/mkdir -p '/var/lib/jenkins/workspace/Cforall_master@tmp/include/cfa//bits' /usr/bin/install -c -m 644 /var/lib/jenkins/workspace/Cforall_master/libcfa/src/bits/weakso_locks.hfa /var/lib/jenkins/workspace/Cforall_master/libcfa/src/bits/algorithm.hfa /var/lib/jenkins/workspace/Cforall_master/libcfa/src/bits/align.hfa /var/lib/jenkins/workspace/Cforall_master/libcfa/src/bits/collections.hfa /var/lib/jenkins/workspace/Cforall_master/libcfa/src/bits/debug.hfa /var/lib/jenkins/workspace/Cforall_master/libcfa/src/bits/defs.hfa /var/lib/jenkins/workspace/Cforall_master/libcfa/src/bits/locks.hfa /var/lib/jenkins/workspace/Cforall_master/libcfa/src/bits/collection.hfa /var/lib/jenkins/workspace/Cforall_master/libcfa/src/bits/stack.hfa /var/lib/jenkins/workspace/Cforall_master/libcfa/src/bits/queue.hfa /var/lib/jenkins/workspace/Cforall_master/libcfa/src/bits/sequence.hfa /var/lib/jenkins/workspace/Cforall_master/libcfa/src/bits/atomic.hfa /var/lib/jenkins/workspace/Cforall_master/libcfa/src/bits/random.hfa '/var/lib/jenkins/workspace/Cforall_master@tmp/include/cfa//bits' /usr/bin/mkdir -p '/var/lib/jenkins/workspace/Cforall_master@tmp/include/cfa//stdhdr' libtool: install: (cd /var/lib/jenkins/workspace/Cforall_master@tmp/lib/cfa/arm64-nodebug && { ln -s -f libcfa.so.1.0.0 libcfa.so.1 || { rm -f libcfa.so.1 && ln -s libcfa.so.1.0.0 libcfa.so.1; }; }) /usr/bin/install -c -m 644 /var/lib/jenkins/workspace/Cforall_master/libcfa/src/stdhdr/stdalign.h /var/lib/jenkins/workspace/Cforall_master/libcfa/src/stdhdr/stdio.h /var/lib/jenkins/workspace/Cforall_master/libcfa/src/stdhdr/malloc.h /var/lib/jenkins/workspace/Cforall_master/libcfa/src/stdhdr/time.h /var/lib/jenkins/workspace/Cforall_master/libcfa/src/stdhdr/signal.h /var/lib/jenkins/workspace/Cforall_master/libcfa/src/stdhdr/stdbool.h /var/lib/jenkins/workspace/Cforall_master/libcfa/src/stdhdr/unistd.h /var/lib/jenkins/workspace/Cforall_master/libcfa/src/stdhdr/stdatomic.h /var/lib/jenkins/workspace/Cforall_master/libcfa/src/stdhdr/stdint.h /var/lib/jenkins/workspace/Cforall_master/libcfa/src/stdhdr/gmp.h /var/lib/jenkins/workspace/Cforall_master/libcfa/src/stdhdr/locale.h /var/lib/jenkins/workspace/Cforall_master/libcfa/src/stdhdr/string.h /var/lib/jenkins/workspace/Cforall_master/libcfa/src/stdhdr/fenv.h /var/lib/jenkins/workspace/Cforall_master/libcfa/src/stdhdr/wchar.h /var/lib/jenkins/workspace/Cforall_master/libcfa/src/stdhdr/tgmath.h /var/lib/jenkins/workspace/Cforall_master/libcfa/src/stdhdr/math.h /var/lib/jenkins/workspace/Cforall_master/libcfa/src/stdhdr/pthread.h /var/lib/jenkins/workspace/Cforall_master/libcfa/src/stdhdr/complex.h /var/lib/jenkins/workspace/Cforall_master/libcfa/src/stdhdr/wctype.h /var/lib/jenkins/workspace/Cforall_master/libcfa/src/stdhdr/unwind.h /var/lib/jenkins/workspace/Cforall_master/libcfa/src/stdhdr/float.h /var/lib/jenkins/workspace/Cforall_master/libcfa/src/stdhdr/stdarg.h /var/lib/jenkins/workspace/Cforall_master/libcfa/src/stdhdr/stdlib.h /var/lib/jenkins/workspace/Cforall_master/libcfa/src/stdhdr/iso646.h /var/lib/jenkins/workspace/Cforall_master/libcfa/src/stdhdr/stddef.h /var/lib/jenkins/workspace/Cforall_master/libcfa/src/stdhdr/stdnoreturn.h /var/lib/jenkins/workspace/Cforall_master/libcfa/src/stdhdr/assert.h /var/lib/jenkins/workspace/Cforall_master/libcfa/src/stdhdr/ctype.h /var/lib/jenkins/workspace/Cforall_master/libcfa/src/stdhdr/errno.h /var/lib/jenkins/workspace/Cforall_master/libcfa/src/stdhdr/threads.h /var/lib/jenkins/workspace/Cforall_master/libcfa/src/stdhdr/uchar.h /var/lib/jenkins/workspace/Cforall_master/libcfa/src/stdhdr/inttypes.h /var/lib/jenkins/workspace/Cforall_master/libcfa/src/stdhdr/limits.h /var/lib/jenkins/workspace/Cforall_master/libcfa/src/stdhdr/setjmp.h '/var/lib/jenkins/workspace/Cforall_master@tmp/include/cfa//stdhdr' /usr/bin/mkdir -p '/var/lib/jenkins/workspace/Cforall_master@tmp/include/cfa//collections' /usr/bin/install -c -m 644 /var/lib/jenkins/workspace/Cforall_master/libcfa/src/collections/maybe.hfa /var/lib/jenkins/workspace/Cforall_master/libcfa/src/collections/pair.hfa /var/lib/jenkins/workspace/Cforall_master/libcfa/src/collections/result.hfa /var/lib/jenkins/workspace/Cforall_master/libcfa/src/collections/string.hfa /var/lib/jenkins/workspace/Cforall_master/libcfa/src/collections/string_res.hfa /var/lib/jenkins/workspace/Cforall_master/libcfa/src/collections/vector.hfa /var/lib/jenkins/workspace/Cforall_master/libcfa/src/collections/array.hfa /var/lib/jenkins/workspace/Cforall_master/libcfa/src/collections/list.hfa /var/lib/jenkins/workspace/Cforall_master/libcfa/src/collections/list2.hfa /var/lib/jenkins/workspace/Cforall_master/libcfa/src/collections/lockfree.hfa /var/lib/jenkins/workspace/Cforall_master/libcfa/src/collections/string_sharectx.hfa /var/lib/jenkins/workspace/Cforall_master/libcfa/src/collections/vector2.hfa '/var/lib/jenkins/workspace/Cforall_master@tmp/include/cfa//collections' libtool: install: (cd /var/lib/jenkins/workspace/Cforall_master@tmp/lib/cfa/arm64-nodebug && { ln -s -f libcfa.so.1.0.0 libcfa.so || { rm -f libcfa.so && ln -s libcfa.so.1.0.0 libcfa.so; }; }) libtool: install: /usr/bin/install -c .libs/libcfa.lai /var/lib/jenkins/workspace/Cforall_master@tmp/lib/cfa/arm64-nodebug/libcfa.la libtool: install: /usr/bin/install -c .libs/libcfathread.so.1.0.0 /var/lib/jenkins/workspace/Cforall_master@tmp/lib/cfa/arm64-nodebug/libcfathread.so.1.0.0 libtool: install: (cd /var/lib/jenkins/workspace/Cforall_master@tmp/lib/cfa/arm64-nodebug && { ln -s -f libcfathread.so.1.0.0 libcfathread.so.1 || { rm -f libcfathread.so.1 && ln -s libcfathread.so.1.0.0 libcfathread.so.1; }; }) libtool: install: (cd /var/lib/jenkins/workspace/Cforall_master@tmp/lib/cfa/arm64-nodebug && { ln -s -f libcfathread.so.1.0.0 libcfathread.so || { rm -f libcfathread.so && ln -s libcfathread.so.1.0.0 libcfathread.so; }; }) libtool: install: /usr/bin/install -c .libs/libcfathread.lai /var/lib/jenkins/workspace/Cforall_master@tmp/lib/cfa/arm64-nodebug/libcfathread.la libtool: warning: remember to run 'libtool --finish /var/lib/jenkins/workspace/Cforall_master@tmp/lib/cfa/arm64-nodebug/' make[3]: Nothing to be done for 'install-exec-am'. make[3]: Nothing to be done for 'install-data-am'. [Pipeline] } [Pipeline] // dir [Pipeline] } [Pipeline] // stage [Pipeline] sh + free -h total used free shared buff/cache available Mem: 502Gi 7.3Gi 490Gi 3.5Mi 6.8Gi 495Gi Swap: 127Gi 0B 127Gi [Pipeline] sh + ulimit -a time(seconds) unlimited file(blocks) unlimited data(kbytes) unlimited stack(kbytes) 8192 coredump(blocks) 0 memory(kbytes) unlimited locked memory(kbytes) 65876424 process 2058180 nofiles 1048576 vmemory(kbytes) unlimited locks unlimited rtprio 0 [Pipeline] echo -------- Test: Debug -------- [Pipeline] stage [Pipeline] { (Test: Debug) [Pipeline] dir Running in /var/lib/jenkins/workspace/Cforall_master@tmp [Pipeline] { [Pipeline] sh + nproc + make -j 96 --no-print-directory -C tests timeout=600 global-timeout=14400 tests debug=yes archive-errors=/var/lib/jenkins/workspace/Cforall_master@tmp/tests/crashes/full-debug Running 375 tests on 96 cores (arm64 - debug) array-ERR3 PASSED C 0:00.126 - R n/a array-ERR2 PASSED C 0:00.134 - R n/a ...ollections/language-dim-mismatch PASSED C 0:00.381 - R n/a concurrency/mainError PASSED C 0:00.526 - R n/a concurrency/keywordErrors PASSED C 0:00.599 - R n/a array-collections/symtab-collision PASSED C 0:00.872 - R n/a castError PASSED C 0:01.014 - R n/a array-collections/safety-summary PASSED C 0:01.031 - R n/a concurrency/ctor-check PASSED C 0:01.220 - R n/a attr-priority PASSED C 0:01.444 - R 0:00.005 cast PASSED C 0:01.639 - R 0:00.043 array-collections/c-dependent PASSED C 0:01.663 - R 0:00.076 castReturn PASSED C 0:01.604 - R 0:00.131 array-ERR1 PASSED C 0:01.744 - R n/a array PASSED C 0:01.812 - R 0:00.021 array-collections/array-raii-c PASSED C 0:01.864 - R 0:00.080 array-collections/dimexpr-match-c PASSED C 0:02.205 - R 0:00.042 builtins/sync PASSED C 0:02.173 - R 0:00.127 array-collections/array-sbscr-types PASSED C 0:02.662 - R 0:00.046 array-collections/array-basic PASSED C 0:02.918 - R 0:00.025 concurrency/clib_tls PASSED C 0:02.943 - R 0:00.039 array-collections/boxed PASSED C 0:03.058 - R 0:00.071 array-collections/dimexpr-match-cfa PASSED C 0:03.001 - R 0:00.128 concurrency/clib PASSED C 0:02.995 - R 0:00.220 ...ns/vector-err-pass-perm-it-byval PASSED C 0:03.411 - R n/a ...ns/vector-err-retn-perm-it-byval PASSED C 0:03.482 - R n/a collections/string-operator-ERR09 PASSED C 0:05.416 - R n/a collections/string-operator-ERR15 PASSED C 0:05.435 - R n/a collections/string-operator-ERR13 PASSED C 0:05.480 - R n/a avl_test PASSED C 0:05.466 - R 0:00.023 ...urrency/pthread/pthread_key_test PASSED C 0:03.901 - R 0:00.024 collections/string-operator-ERR11 PASSED C 0:05.856 - R n/a collections/string-operator-ERR16 PASSED C 0:05.866 - R n/a alloc-ERROR PASSED C 0:06.119 - R n/a collections/vector-demo PASSED C 0:06.240 - R 0:00.022 complex PASSED C 0:06.812 - R 0:00.022 algorithms/range_test PASSED C 0:06.897 - R 0:00.022 array-collections/accordion PASSED C 0:07.219 - R 0:00.021 collections/string-gc PASSED C 0:07.427 - R 0:00.038 array-collections/array-raii-cfa PASSED C 0:07.495 - R 0:00.021 collections/string-istream PASSED C 0:08.351 - R 0:00.037 concurrency/cluster PASSED C 0:08.494 - R 0:00.071 concurrency/futures/abandon PASSED C 0:08.698 - R 0:00.123 concurrency/futures/basic PASSED C 0:09.017 - R 0:00.119 collections/stack PASSED C 0:09.175 - R 0:00.023 concurrency/park/start_parked PASSED C 0:08.313 - R 0:00.119 collections/multi_list PASSED C 0:09.548 - R 0:00.022 collections/string-ostream PASSED C 0:09.687 - R 0:00.039 collections/string-compare PASSED C 0:09.907 - R 0:00.080 collections/queue PASSED C 0:10.319 - R 0:00.080 concurrency/cofor PASSED C 0:10.675 - R 0:00.125 collections/sequence PASSED C 0:10.900 - R 0:00.040 collections/string-ctx-manage PASSED C 0:10.914 - R 0:00.040 collections/string-istream-manip PASSED C 0:10.853 - R 0:00.126 collections/string-operator PASSED C 0:11.117 - R 0:00.130 concurrency/park/contention PASSED C 0:10.164 - R 0:00.584 ...ections/string-overwrite-noshare PASSED C 0:11.906 - R 0:00.070 concurrency/examples/matrixSum PASSED C 0:12.300 - R 0:00.125 collections/string-overwrite PASSED C 0:12.379 - R 0:00.077 concurrency/join PASSED C 0:12.237 - R 0:00.180 concurrency/examples/gortn PASSED C 0:12.411 - R 0:00.078 concurrency/examples/datingService PASSED C 0:12.488 - R 0:00.071 concurrency/migrate PASSED C 0:12.360 - R 0:00.228 concurrency/coroutineYield PASSED C 0:12.533 - R 0:00.224 const-init PASSED C 0:01.654 - R 0:00.042 ...rrency/pthread/pthread_attr_test PASSED C 0:11.800 - R 0:00.075 ...rrency/pthread/pthread_cond_test PASSED C 0:11.886 - R 0:00.041 alloc PASSED C 0:13.422 - R 0:00.071 concurrency/park/force_preempt PASSED C 0:12.920 - R 0:00.380 ...pthread/pthread_demo_create_join PASSED C 0:12.113 - R 0:00.175 ...ions/string-api-coverage-noshare PASSED C 0:13.952 - R 0:00.131 ...rrency/pthread/pthread_once_test PASSED C 0:12.136 - R 0:00.176 collections/string-api-coverage PASSED C 0:14.236 - R 0:00.127 const-ref PASSED C 0:02.315 - R 0:00.130 concurrency/waitfor/parse PASSED C 0:07.246 - R 0:00.038 concurrency/examples/quickSort PASSED C 0:14.768 - R 0:00.126 concurrency/futures/wait_any PASSED C 0:14.884 - R 0:00.071 concurrency/barrier/order PASSED C 0:14.831 - R 0:00.327 concurrency/readyQ/leader_spin PASSED C 0:12.415 - R 0:00.976 concurrency/mutexstmt/tuple PASSED C 0:15.201 - R 0:00.020 concurrency/barrier/last PASSED C 0:15.075 - R 0:00.426 ctrl-flow/loop-inc PASSED C 0:01.496 - R 0:00.022 concurrency/barrier/generation PASSED C 0:14.771 - R 0:01.075 concurrency/once PASSED C 0:15.101 - R 0:00.375 ctrl-flow/labelledExit PASSED C 0:01.811 - R 0:00.127 concurrency/suspend_then PASSED C 0:12.971 - R 0:00.228 concurrency/signal/wait PASSED C 0:12.495 - R 0:01.028 enum_tests/lvalue PASSED C 0:00.855 - R n/a alloc2 PASSED C 0:17.131 - R 0:00.075 enum PASSED C 0:01.685 - R 0:00.122 .../unified_locking/fast_block_lock PASSED C 0:13.793 - R 0:00.121 concurrency/readyQ/barrier_sleeper PASSED C 0:14.684 - R 0:00.925 concurrency/waitfor/else PASSED C 0:10.491 - R 0:00.077 concurrency/sleep PASSED C 0:13.303 - R 0:01.229 concurrency/thread PASSED C 0:14.399 - R 0:00.073 errors/declaration PASSED C 0:00.145 - R n/a ...cy/unified_locking/pthread_locks PASSED C 0:11.097 - R 0:00.926 concurrency/lockfree_stack PASSED C 0:12.298 - R 0:05.446 enum_tests/inc-dec PASSED C 0:01.824 - R 0:00.075 errors/scope-type PASSED C 0:00.274 - R n/a errors/signature PASSED C 0:00.282 - R n/a designations PASSED C 0:02.951 - R 0:00.072 concurrency/actors/poison PASSED C 0:17.904 - R 0:00.228 concurrency/actors/pingpong PASSED C 0:18.080 - R 0:00.175 concurrency/actors/inherit PASSED C 0:18.193 - R 0:00.124 errors/scope PASSED C 0:00.791 - R n/a .../unified_locking/block_spin_lock PASSED C 0:14.193 - R 0:01.032 concurrency/mutexstmt/monitors PASSED C 0:09.530 - R 0:08.729 ...ncy/unified_locking/timeout_lock PASSED C 0:10.998 - R 0:01.328 enum_tests/funcEnum PASSED C 0:02.789 - R 0:00.040 concurrency/actors/types PASSED C 0:18.455 - R 0:00.173 ...ency/unified_locking/exp_backoff PASSED C 0:15.285 - R 0:00.174 concurrency/actors/static PASSED C 0:17.937 - R 0:00.876 concurrency/actors/matrixMultiply PASSED C 0:17.840 - R 0:01.174 concurrency/actors/inline PASSED C 0:19.007 - R 0:00.076 eval PASSED C 0:01.560 - R 0:00.068 concurrency/actors/executor PASSED C 0:19.169 - R 0:00.182 concurrency/futures/typed PASSED C 0:18.929 - R 0:00.482 copyfile PASSED C 0:06.969 - R 0:00.128 exceptions/try-ctrl-flow PASSED C 0:00.510 - R n/a ...fied_locking/mcs_block_spin_lock PASSED C 0:14.243 - R 0:00.371 counter PASSED C 0:07.080 - R 0:00.038 concurrency/waitfor/barge PASSED C 0:12.141 - R 0:01.931 concurrency/signal/disjoint PASSED C 0:12.707 - R 0:05.351 exceptions/type-check PASSED C 0:00.788 - R n/a ...urrency/waitfor/lexical_priority PASSED C 0:13.135 - R 0:00.040 enum_tests/structEnum PASSED C 0:03.186 - R 0:00.041 ctrl-flow/fallthrough PASSED C 0:06.940 - R 0:00.039 ctrl-flow/goto PASSED C 0:06.712 - R 0:00.038 ctrl-flow/break-misc PASSED C 0:07.287 - R 0:00.039 ctrl-flow/loop_else PASSED C 0:06.717 - R 0:00.044 exceptions/try-leave-catch PASSED C 0:01.700 - R 0:00.038 ctrl-flow/ifwhileCtl PASSED C 0:07.126 - R 0:00.070 coroutine/devicedriver PASSED C 0:08.766 - R 0:00.070 ...nified_locking/simple_owner_lock PASSED C 0:15.143 - R 0:00.376 configs/parsebools PASSED C 0:09.880 - R 0:00.527 exceptions/message PASSED C 0:02.870 - R 0:00.126 coroutine/runningTotal PASSED C 0:08.424 - R 0:00.068 concurrency/waitfor/when PASSED C 0:12.649 - R 0:00.376 concurrency/waitfor/statment PASSED C 0:13.176 - R 0:00.122 coroutine/raii PASSED C 0:09.025 - R 0:00.038 expression PASSED C 0:01.502 - R 0:00.039 coroutine/fmtLines PASSED C 0:09.485 - R 0:00.071 ...rrency/pthread/pthread_demo_lock PASSED C 0:11.895 - R 0:08.523 global-monomorph PASSED C 0:01.567 - R 0:00.039 enum_tests/anonymous PASSED C 0:06.957 - R 0:00.074 configs/usage PASSED C 0:11.121 - R 0:00.038 configs/parseconfig PASSED C 0:11.490 - R 0:00.040 init1-ERROR PASSED C 0:00.803 - R n/a identFuncDeclarator PASSED C 0:01.497 - R 0:00.038 concurrency/waituntil/timeout PASSED C 0:08.107 - R 0:03.740 coroutine/pingpong PASSED C 0:10.204 - R 0:00.069 identParamDeclarator PASSED C 0:01.544 - R 0:00.042 ctrl-flow/loop_else-WRN1 PASSED C 0:08.455 - R 0:00.002 enum_tests/enumInlineValue PASSED C 0:07.559 - R 0:00.040 coroutine/prodcons PASSED C 0:10.418 - R 0:00.073 enum_tests/input PASSED C 0:07.073 - R 0:00.179 concurrency/waitfor/dtor PASSED C 0:12.053 - R 0:04.291 coroutine/fibonacci PASSED C 0:10.663 - R 0:00.074 concurrency/waitfor/recurse PASSED C 0:13.140 - R 0:02.793 ctrl-flow/loopctrl PASSED C 0:08.724 - R 0:00.041 init1 PASSED C 0:01.683 - R 0:00.081 include/vector-sequence PASSED C 0:02.183 - R 0:00.041 concurrency/signal/block PASSED C 0:12.825 - R 0:08.956 enum_tests/voidEnum PASSED C 0:06.876 - R 0:00.022 enum_tests/stringEnum PASSED C 0:07.370 - R 0:00.041 exceptions/conditional PASSED C 0:06.780 - R 0:00.079 limits PASSED C 0:01.565 - R 0:00.126 exceptions/data-except PASSED C 0:06.898 - R 0:00.023 enum_tests/typedIntEnum PASSED C 0:07.751 - R 0:00.074 include/vector-collections PASSED C 0:03.372 - R 0:00.043 linking/nostdlib PASSED C 0:01.529 - R 0:00.038 exceptions/finally PASSED C 0:06.915 - R 0:00.039 div PASSED C 0:10.095 - R 0:00.025 exceptions/defaults PASSED C 0:07.424 - R 0:00.022 exceptions/interact PASSED C 0:07.217 - R 0:00.040 nested-types-ERR1 PASSED C 0:00.186 - R n/a enum_tests/planet PASSED C 0:09.715 - R 0:00.037 nested-types-ERR2 PASSED C 0:00.318 - R n/a exceptions/polymorphic PASSED C 0:07.441 - R 0:00.041 concurrency/channels/daisy_chain PASSED C 0:16.071 - R 0:10.066 exceptions/trash PASSED C 0:06.785 - R 0:00.025 linkonce PASSED C 0:01.777 - R 0:00.079 enum_tests/position PASSED C 0:09.803 - R 0:00.074 exceptions/cancel/coroutine PASSED C 0:08.299 - R 0:00.121 exceptions/conditional-threads PASSED C 0:08.375 - R 0:00.135 opt-params PASSED C 0:00.150 - R n/a exceptions/resume PASSED C 0:07.519 - R 0:00.129 concurrency/channels/hot_potato PASSED C 0:16.411 - R 0:10.121 concurrency/preempt PASSED C 0:13.919 - R 0:11.633 concurrency/channels/contend PASSED C 0:16.565 - R 0:10.164 concurrency/channels/churn PASSED C 0:16.647 - R 0:10.116 concurrency/channels/zero_size PASSED C 0:16.522 - R 0:10.234 maybe PASSED C 0:01.756 - R 0:00.039 nested-types PASSED C 0:01.548 - R 0:00.038 concurrency/channels/pub_sub PASSED C 0:16.878 - R 0:10.120 exceptions/terminate PASSED C 0:07.991 - R 0:00.078 exceptions/finally-threads PASSED C 0:08.572 - R 0:00.178 polybits PASSED C 0:00.360 - R n/a concurrency/channels/ping_pong PASSED C 0:17.159 - R 0:10.064 generator/fibonacci PASSED C 0:06.708 - R 0:00.072 fstream_test PASSED C 0:06.949 - R 0:00.079 nowarn/array PASSED C 0:01.686 - R 0:00.023 nowarn/zero-thunk PASSED C 0:01.411 - R 0:00.071 exceptions/resume-threads PASSED C 0:08.758 - R 0:00.072 nowarn/unused PASSED C 0:01.531 - R 0:00.070 generator/suspend_then PASSED C 0:07.242 - R 0:00.038 generator/fmtLines PASSED C 0:07.309 - R 0:00.038 nowarn/exception PASSED C 0:01.824 - R 0:00.037 operators PASSED C 0:01.602 - R 0:00.127 concurrency/futures/future_except PASSED C 0:27.733 - R 0:00.174 exceptions/virtual-poly PASSED C 0:07.733 - R 0:00.075 device/cpu PASSED C 0:12.761 - R 0:00.170 nowarn/no-autogen PASSED C 0:01.745 - R 0:00.128 numericConstants PASSED C 0:01.695 - R 0:00.072 exceptions/terminate-threads PASSED C 0:08.855 - R 0:00.037 poly-member PASSED C 0:01.425 - R 0:00.039 linking/exception-nothreads PASSED C 0:04.766 - R 0:00.080 poly-many-arsz PASSED C 0:01.645 - R 0:00.040 concurrency/waituntil/basic_else PASSED C 0:18.929 - R 0:00.072 raii/ctor-autogen-ERR1 PASSED C 0:01.004 - R n/a nowarn/printf-sizeof PASSED C 0:02.021 - R 0:00.076 poly-bare-assn PASSED C 0:01.929 - R 0:00.024 poly-o-cycle PASSED C 0:01.606 - R 0:00.131 hello PASSED C 0:07.009 - R 0:00.128 exceptions/virtual-cast PASSED C 0:08.456 - R 0:00.037 include/stdincludes PASSED C 0:06.964 - R 0:00.079 identity PASSED C 0:07.151 - R 0:00.024 quasiKeyword PASSED C 0:01.639 - R 0:00.037 poly-d-cycle PASSED C 0:02.096 - R 0:00.124 poly-self-cycle PASSED C 0:01.774 - R 0:00.076 poly-selection PASSED C 0:01.877 - R 0:00.041 raii/partial-ERR1 PASSED C 0:00.842 - R n/a typedefRedef-ERR1 PASSED C 0:00.230 - R n/a include/vector-fstream PASSED C 0:07.281 - R 0:00.041 exceptions/fibonacci_nonlocal PASSED C 0:10.505 - R 0:00.178 exceptions/defaults-threads PASSED C 0:10.733 - R 0:00.037 genericUnion PASSED C 0:08.412 - R 0:00.024 var-assert PASSED C 0:00.276 - R n/a io/eofType PASSED C 0:06.825 - R 0:00.038 raii/init_once PASSED C 0:01.668 - R 0:00.037 forall PASSED C 0:08.993 - R 0:00.083 raii/partial PASSED C 0:01.549 - R 0:00.096 smart-pointers PASSED C 0:01.821 - R 0:00.039 simpleGenericTriple PASSED C 0:01.919 - R 0:00.059 switch PASSED C 0:01.671 - R 0:00.136 tuple/tupleCast PASSED C 0:01.571 - R 0:00.067 result PASSED C 0:02.095 - R 0:00.038 tuple/tupleMember PASSED C 0:01.663 - R 0:00.038 raii/ctor-autogen PASSED C 0:02.955 - R 0:00.039 raii/typeof-member PASSED C 0:02.147 - R 0:00.068 tuple/tupleFunction PASSED C 0:01.742 - R 0:00.073 typedefRedef PASSED C 0:01.541 - R 0:00.042 function-operator PASSED C 0:09.801 - R 0:00.050 linking/mangling/anon PASSED C 0:06.786 - R 0:00.024 typeof PASSED C 0:01.667 - R 0:00.035 linking/exception-withthreads PASSED C 0:07.030 - R 0:00.178 exceptions/cancel/thread PASSED C 0:12.642 - R 0:00.075 variableDeclarator PASSED C 0:01.610 - R 0:00.038 tuple/tuplePolymorphism PASSED C 0:02.037 - R 0:00.073 withconflict PASSED C 0:00.899 - R n/a meta/fork+exec PASSED C 0:05.517 - R 0:00.325 concurrency/channels/big_elems PASSED C 0:19.769 - R 0:11.380 ...collections/dimexpr-match-c-ERRS PASSED C 0:01.077 - R n/a exceptions/cor_resumer PASSED C 0:13.510 - R 0:00.038 KRfunctions PASSED C 0:01.314 - R 0:00.006 voidPtr PASSED C 0:01.674 - R 0:00.072 warnings/self-assignment PASSED C 0:01.756 - R 0:00.003 errors/completeType PASSED C 0:00.868 - R n/a raii/dtor-early-exit-ERR1 PASSED C 0:04.853 - R n/a raii/memberCtors-ERR1 PASSED C 0:04.318 - R n/a exceptions/pingpong_nonlocal PASSED C 0:13.517 - R 0:00.070 ...llections/dimexpr-match-cfa-ERRS PASSED C 0:01.739 - R n/a attributes PASSED C 0:01.631 - R 0:00.006 literals PASSED C 0:07.321 - R 0:00.124 linking/nothreads PASSED C 0:08.840 - R 0:00.036 list/dlist-insert-remove PASSED C 0:07.979 - R 0:00.175 declarationSpecifier PASSED C 0:01.568 - R 0:00.005 list/dlist2-insert-remove PASSED C 0:07.885 - R 0:00.123 raii/dtor-early-exit-ERR2 PASSED C 0:05.311 - R n/a linking/io-acquire PASSED C 0:09.786 - R 0:00.121 linking/weakso_nothd PASSED C 0:09.178 - R 0:00.039 io/io PASSED C 0:10.738 - R 0:00.042 extension PASSED C 0:01.499 - R 0:00.005 functions PASSED C 0:01.483 - R 0:00.002 arithmeticConversions PASSED C 0:02.958 - R 0:00.125 meta/arch PASSED C 0:00.854 - R n/a io/manipulatorsOutput4 PASSED C 0:10.401 - R 0:00.120 gccExtensions PASSED C 0:01.456 - R 0:00.003 tuple/tupleVariadic PASSED C 0:04.868 - R 0:00.038 concurrency/waituntil/one_chan PASSED C 0:13.011 - R 0:10.119 zero_one-ERR1 PASSED C 0:03.570 - R n/a io/manipulatorsInput-uchunk PASSED C 0:10.866 - R 0:00.068 meta/dumpable PASSED C 0:08.888 - R 0:00.039 quotedKeyword PASSED C 0:06.990 - R 0:00.038 raii/boxed-types PASSED C 0:07.216 - R 0:00.037 raii/globals PASSED C 0:06.956 - R 0:00.037 malloc PASSED C 0:09.587 - R 0:00.036 polymorphism PASSED C 0:07.820 - R 0:00.039 sizeof PASSED C 0:06.713 - R 0:00.037 raii/memberCtors PASSED C 0:07.411 - R 0:00.038 concurrency/preempt2 PASSED C 0:13.032 - R 0:21.283 strstream PASSED C 0:07.283 - R 0:00.037 tuplearray PASSED C 0:06.806 - R 0:00.039 shortCircuit PASSED C 0:07.508 - R 0:00.037 io/io-acquire-in PASSED C 0:12.606 - R 0:00.220 io/io-acquire-out PASSED C 0:12.782 - R 0:00.120 ...rrency/examples/boundedBufferEXT PASSED C 0:12.595 - R 0:23.282 userLiterals PASSED C 0:07.390 - R 0:00.037 io/io-acquire PASSED C 0:13.438 - R 0:00.173 linking/withthreads PASSED C 0:12.113 - R 0:00.037 concurrency/waituntil/channel_close PASSED C 0:17.015 - R 0:10.118 references PASSED C 0:08.369 - R 0:00.036 tuple/tupleAssign PASSED C 0:08.241 - R 0:00.019 raii/dtor-early-exit PASSED C 0:09.413 - R 0:00.019 zero_one PASSED C 0:06.798 - R 0:00.021 time PASSED C 0:08.767 - R 0:00.020 searchsort PASSED C 0:09.329 - R 0:00.039 vector PASSED C 0:08.726 - R 0:00.037 sum PASSED C 0:09.654 - R 0:00.036 minmax PASSED C 0:12.685 - R 0:00.037 concurrency/waituntil/futures PASSED C 0:28.371 - R 0:00.068 io/io-acquire2 PASSED C 0:15.223 - R 0:00.377 ...collections/array-md-sbscr-cases PASSED C 0:08.224 - R 0:00.036 vector_math/vec2_double PASSED C 0:09.697 - R 0:00.036 vector_math/vec2_uint PASSED C 0:09.659 - R 0:00.036 swap PASSED C 0:10.983 - R 0:00.036 io/comp_basic PASSED C 0:16.454 - R 0:00.671 abs PASSED C 0:09.077 - R 0:00.036 collections/atomic_mpsc PASSED C 0:12.821 - R 0:26.931 io/away_fair PASSED C 0:17.455 - R 0:00.268 ato PASSED C 0:09.533 - R 0:00.037 io/manipulatorsInput PASSED C 0:08.272 - R 0:00.036 gmp PASSED C 0:08.373 - R 0:00.068 random PASSED C 0:08.486 - R 0:00.036 bitmanip1 PASSED C 0:10.488 - R 0:00.068 bitmanip2 PASSED C 0:10.719 - R 0:00.118 io/many_read FAILED with code -6 C 0:18.230 - R 0:00.119 File has size: 72 bytes This is the content of the file to read, it's pretty self explanatory! Processor (0xffffffffd480) tearing down ring with 4294967295 entries allocated but not submitted, out of 256 Cforall Runtime error (UNIX pid:319009): Cforall Assertion error "t" from program "many_read" in "_X13active_threadFPS7thread$___1" at line 109 in file "/var/lib/jenkins/workspace/Cforall_master/libcfa/src/concurrency/kernel/fwd.hfa". warning: Can't open file anon_inode:[io_uring] which was expanded to anon_inode:[io_uring] during file-backed mapping note processing [New LWP 319015] [New LWP 319009] [New LWP 319012] [Thread debugging using libthread_db enabled] Using host libthread_db library "/lib/aarch64-linux-gnu/libthread_db.so.1". Core was generated by `/var/lib/jenkins/workspace/Cforall_master@tmp/tests/io/many_read'. Program terminated with signal SIGABRT, Aborted. #0 __pthread_kill_implementation (threadid=187649985492928, signo=signo@entry=6, no_tid=no_tid@entry=0) at ./nptl/pthread_kill.c:44 warning: 44 ./nptl/pthread_kill.c: No such file or directory [Current thread is 1 (Thread 0xaaaaaaba37c0 (LWP 319015))] ----- #0 __pthread_kill_implementation (threadid=187649985492928, signo=signo@entry=6, no_tid=no_tid@entry=0) at ./nptl/pthread_kill.c:44 #1 0x0000fffff7b47540 in __pthread_kill_internal (signo=6, threadid=) at ./nptl/pthread_kill.c:78 #2 0x0000fffff7afcb3c in __GI_raise (sig=sig@entry=6) at ../sysdeps/posix/raise.c:26 #3 0x0000fffff7ae7e00 in __GI_abort () at ./stdlib/abort.c:79 #4 0x0000fffff7e5dfb8 in _X7__abortFv_bPKcY17__builtin_va_list__1 (_X11signalAbortb_1=false, _X3fmtPKc_1=0xfffff7e7d420 "%s", _X4argsY17__builtin_va_list_1=...) at /var/lib/jenkins/workspace/Cforall_master/libcfa/src/interpose.cfa:263 #5 0x0000fffff7e5e258 in _X5abortFv_bPKc__1 (_X11signalAbortb_1=false, _X3fmtPKc_1=0xfffff7e7d420 "%s") at /var/lib/jenkins/workspace/Cforall_master/libcfa/src/interpose.cfa:301 #6 0x0000fffff7e5da70 in abort () at /var/lib/jenkins/workspace/Cforall_master/libcfa/src/interpose.cfa:176 #7 0x0000fffff7e5bd98 in __assert_fail (assertion=0xfffff7f80228 "t", file=0xfffff7f801d8 "/var/lib/jenkins/workspace/Cforall_master/libcfa/src/concurrency/kernel/fwd.hfa", line=109, function=0xfffff7f80b18 <__PRETTY_FUNCTION__.89> "_X13active_threadFPS7thread$___1") at /var/lib/jenkins/workspace/Cforall_master/libcfa/src/assert.cfa:33 #8 0x0000fffff7f6d908 in _X13active_threadFPS7thread$___1 () at /var/lib/jenkins/workspace/Cforall_master/libcfa/src/concurrency/kernel/fwd.hfa:109 #9 0x0000fffff7f6f7ec in _X4lockFv_S17simple_owner_lock__1 (_X4thisS17simple_owner_lock_1=0xfffff7fb1800 <_X9once_lockS17simple_owner_lock_1>) at /var/lib/jenkins/workspace/Cforall_master/libcfa/src/concurrency/locks.hfa:534 #10 0x0000fffff7f72938 in pthread_once (once_control=0xfffff7cb0284, init_routine=0xfffff7c946e0) at /var/lib/jenkins/workspace/Cforall_master/libcfa/src/concurrency/pthread.cfa:504 #11 0x0000fffff7c97210 in ?? () from /lib/aarch64-linux-gnu/libgcc_s.so.1 #12 0x0000fffff7c97e54 in _Unwind_Backtrace () from /lib/aarch64-linux-gnu/libgcc_s.so.1 #13 0x0000fffff7bb74ac in __GI___backtrace (array=, size=50) at ./debug/backtrace.c:78 #14 0x0000fffff7e5dbc4 in _X18__cfaabi_backtraceFv_i__1 (_X5starti_1=2) at /var/lib/jenkins/workspace/Cforall_master/libcfa/src/interpose.cfa:204 #15 0x0000fffff7e5e0e0 in _X7__abortFv_bPKcY17__builtin_va_list__1 (_X11signalAbortb_1=false, _X3fmtPKc_1=0xfffff7e7d420 "%s", _X4argsY17__builtin_va_list_1=...) at /var/lib/jenkins/workspace/Cforall_master/libcfa/src/interpose.cfa:283 #16 0x0000fffff7e5e258 in _X5abortFv_bPKc__1 (_X11signalAbortb_1=false, _X3fmtPKc_1=0xfffff7e7d420 "%s") at /var/lib/jenkins/workspace/Cforall_master/libcfa/src/interpose.cfa:301 #17 0x0000fffff7e5da70 in abort () at /var/lib/jenkins/workspace/Cforall_master/libcfa/src/interpose.cfa:176 #18 0x0000fffff7dae848 in _X4endsFv_S8ofstream__1 (_X2osS8ofstream_1=0xfffff7ec1368 <_X9abortFileS8ofstream_1>) at /var/lib/jenkins/workspace/Cforall_master/libcfa/src/fstream.cfa:106 #19 0x0000fffff7db8e30 in _X15_operator_bitorQ1_0_0_1__X19basic_ostream_tableKS18basic_ostream_data_BD0__Fv_BD0j__1 (_X19basic_ostream_tableKS18basic_ostream_data_Y6ostype__1=0xfffff7ec13d8 <_X19ofstream_basic_dataS18basic_ostream_data_S8ofstream__1>, _X2osY6ostype_1=0xfffff7ec1368 <_X9abortFileS8ofstream_1>, _X1tj_1=256) at /var/lib/jenkins/workspace/Cforall_master/libcfa/src/iostream.cfa:98 #20 0x0000fffff7f3b7dc in _X19__io_uring_teardownFv_S11io_context$__1 (_X4thisS11io_context$_1=0xaaaaaacc1040) at /var/lib/jenkins/workspace/Cforall_master/libcfa/src/concurrency/io/setup.cfa:288 #21 0x0000fffff7f3a63c in _X11_destructorFv_S11io_context$__1 (_X4thisS11io_context$_1=0xaaaaaacc1040) at /var/lib/jenkins/workspace/Cforall_master/libcfa/src/concurrency/io/setup.cfa:125 #22 0x0000fffff7f3bbd8 in _X13__cfa_io_stopFv_PS9processor__1 (_X4procPS9processor_1=0xffffffffd480) at /var/lib/jenkins/workspace/Cforall_master/libcfa/src/concurrency/io/setup.cfa:313 #23 0x0000fffff7f47a18 in _X18__invoke_processorFPv_Pv__1 (_X3argPv_1=0xffffffffd480) at /var/lib/jenkins/workspace/Cforall_master/libcfa/src/concurrency/kernel/startup.cfa:406 #24 0x0000fffff7b4582c in start_thread (arg=0xfffff7fea500) at ./nptl/pthread_create.c:447 #25 0x0000fffff7babb4c in thread_start () at ../sysdeps/unix/sysv/linux/aarch64/clone3.S:76 ----- Id Target Id Frame * 1 Thread 0xaaaaaaba37c0 (LWP 319015) __pthread_kill_implementation (threadid=187649985492928, signo=signo@entry=6, no_tid=no_tid@entry=0) at ./nptl/pthread_kill.c:44 2 Thread 0xfffff7fe9dc0 (LWP 319009) 0x0000fffff7b41d6c in __futex_abstimed_wait_common64 (private=128, cancel=true, abstime=0x0, op=265, expected=319015, futex_word=0xaaaaaaba3890) at ./nptl/futex-internal.c:57 3 Thread 0xaaaaaab137c0 (LWP 319012) 0x0000fffff7afda18 in __GI___sigtimedwait (set=0xaaaaaab12df8, info=0xaaaaaab12e78, timeout=0x0) at ../sysdeps/unix/sysv/linux/sigtimedwait.c:31 Archiving io/many_read (executable and core) to crashes/full-debug/io/many_read vector_math/vec2_ldouble PASSED C 0:09.177 - R 0:00.037 exceptions/hotpotato_checked PASSED C 0:10.315 - R 0:00.118 io/comp_fair PASSED C 0:18.890 - R 0:00.720 io/manipulatorsOutput2 PASSED C 0:09.967 - R 0:00.037 exceptions/cardgame PASSED C 0:10.732 - R 0:00.117 vector_math/vec3_int PASSED C 0:12.803 - R 0:00.068 bitmanip3 PASSED C 0:11.715 - R 0:00.069 vector_math/vec4_int PASSED C 0:13.041 - R 0:00.068 vector_math/vec2_int PASSED C 0:13.822 - R 0:00.035 exceptions/hotpotato PASSED C 0:11.668 - R 0:00.069 ...rrency/examples/boundedBufferINT PASSED C 0:12.584 - R 0:31.149 vector_math/vec2_float PASSED C 0:14.522 - R 0:00.037 vector_math/vec3_float PASSED C 0:14.655 - R 0:00.073 vector_math/vec4_float PASSED C 0:14.918 - R 0:00.067 mathX PASSED C 0:12.459 - R 0:00.037 math PASSED C 0:13.618 - R 0:00.035 io/manipulatorsOutput3 PASSED C 0:13.940 - R 0:00.118 io/manipulatorsOutput1 PASSED C 0:14.879 - R 0:00.034 include/includes PASSED C 0:25.707 - R 0:00.037 concurrency/actors/dynamic PASSED C 0:17.907 - R 0:29.542 PRNG PASSED C 0:16.211 - R 0:02.170 concurrency/unified_locking/mcs PASSED C 0:15.458 - R 0:28.273 io/io-acquire-no-io PASSED C 0:15.113 - R 0:11.291 heap PASSED C 0:10.062 - R 0:19.632 concurrency/waituntil/repeat_close PASSED C 0:13.719 - R 0:30.113 ...ency/waituntil/channel_zero_size PASSED C 0:12.841 - R 0:32.735 rational PASSED C 0:27.338 - R 0:00.041 ...ency/unified_locking/futex_mutex PASSED C 0:14.474 - R 0:39.801 concurrency/waituntil/channels PASSED C 0:13.772 - R 0:35.126 concurrency/waituntil/all_types PASSED C 0:36.156 - R 0:23.254 concurrency/monitor PASSED C 0:12.391 - R 0:56.988 ...urrency/unified_locking/mcs_spin PASSED C 0:14.498 - R 0:50.811 concurrency/multi-monitor PASSED C 0:12.639 - R 0:58.386 .../unified_locking/spin_queue_lock PASSED C 0:14.430 - R 0:51.997 concurrency/waituntil/locks PASSED C 0:15.090 - R 1:08.121 concurrency/unified_locking/locks PASSED C 0:15.109 - R 1:33.821 concurrency/mutexstmt/locks PASSED C 0:13.793 - R 2:16.612 374 passes, 1 failures, 0 timeouts, 0 cancelled, 0 other Tests took 2:31.365 make: *** [Makefile:986: all-local] Error 1 [Pipeline] } [Pipeline] // dir [Pipeline] } [Pipeline] // stage [Pipeline] echo Archiving core dumps [Pipeline] dir Running in /var/lib/jenkins/workspace/Cforall_master@tmp [Pipeline] { [Pipeline] fileExists [Pipeline] sh + /var/lib/jenkins/workspace/Cforall_master/tools/jenkins/archive-gen.sh [Pipeline] archiveArtifacts Archiving artifacts Recording fingerprints [Pipeline] } [Pipeline] // dir [Pipeline] } [Pipeline] // wrap [Pipeline] } [Pipeline] // node [Pipeline] echo hudson.AbortException: script returned exit code 2 [Pipeline] node Running on Brokk 1 in /var/lib/jenkins/workspace/Cforall_master [Pipeline] { [Pipeline] echo Notifying users of result [Pipeline] echo Reusing previously constructed message [Pipeline] echo Would send email to: cforall@lists.uwaterloo.ca [Pipeline] echo With title: [cforall git][BUILD# 3687 - FAILURE] - branch master [Pipeline] echo Content:

This is an automated email from the Jenkins build machine. It was generated because of a git hooks/post-receive script following a ref change which was pushed to the C∀ repository.

- Status --------------------------------------------------------------

BUILD# 3687 - FAILURE

Check console output at https://cforall.uwaterloo.ca/jenkins/job/Cforall/job/master/3687/ to view the results.

- Changes -------------------------------------------------------------

The branch master has been updated.
      from  26db8d037230dd5a87499062454cd8686ee33d26 (commit)

- Log -----------------------------------------------------------------


-----------------------------------------------------------------------

Summary of changes:

[Pipeline] } [Pipeline] // node [Pipeline] echo Build Completed [Pipeline] End of Pipeline ERROR: script returned exit code 2 Finished: FAILURE [Pipeline] error [Pipeline] } Failed in branch gcc_10_arm64_new Build Cforall » master #3684 completed: SUCCESS [Pipeline] echo SUCCESS [Pipeline] } Build Cforall » master #3683 completed: SUCCESS [Pipeline] echo SUCCESS [Pipeline] } Build Cforall » master #3685 completed: SUCCESS [Pipeline] echo SUCCESS [Pipeline] } Build Cforall » master #3686 completed: SUCCESS [Pipeline] echo SUCCESS [Pipeline] } Build Cforall » master #3691 completed: SUCCESS [Pipeline] echo SUCCESS [Pipeline] } Build Cforall » master #3692 completed: SUCCESS [Pipeline] echo SUCCESS [Pipeline] } Build Cforall » master #3690 completed: SUCCESS [Pipeline] echo SUCCESS [Pipeline] } Build Cforall » master #3688 completed: SUCCESS [Pipeline] echo SUCCESS [Pipeline] } Build Cforall » master #3689 completed: SUCCESS [Pipeline] echo SUCCESS [Pipeline] } Build Cforall » master #3693 completed: SUCCESS [Pipeline] echo SUCCESS [Pipeline] } [Pipeline] // parallel [Pipeline] } [Pipeline] // stage [Pipeline] } [Pipeline] // wrap [Pipeline] echo error caught [Pipeline] node Running on Brokk 4 in /var/lib/jenkins/workspace/Cforall_Full_Build [Pipeline] { [Pipeline] echo notifying users [Pipeline] emailext Sending email to: cforall@lists.uwaterloo.ca [Pipeline] } [Pipeline] // node [Pipeline] } [Pipeline] // node [Pipeline] End of Pipeline ERROR: FAILURE Finished: FAILURE