NKU4P0+vIKc0PTOvWK8kMze1uCQxtyC1SC8ExvbLL0llgABGJgYmLwaB3MycnMzi4My85FTXgvzkDB8G3tScxILi1BRfsEwJg4BPVmJZon5OYl66vk9+Xrp1RRGDFNSy5Py84vycVD1nCI1qPENFAZBecDFcOwToPj6QKXogU/TApnQ/mXCmX/k+EwOjFwNrWWJOaSrQXAGEIr/S3KTUorY1U2W5pzzohpoGBBzMbwBr1FFY8gAAAA==[0m#11 0x0000fffff7bd7e00 in __GI_abort () at ./stdlib/abort.c:79
22:55:46#12 0x0000fffff7ee2e88 in _X7__abortFv_bPKcY17__builtin_va_list__1 (_X11signalAbortb_1=_X11signalAbortb_1@entry=false, _X3fmtPKc_1=_X3fmtPKc_1@entry=0xfffff7ef3250 "%s", _X4argsY17__builtin_va_list_1=...) at /var/lib/jenkins/workspace/Cforall_master/libcfa/src/interpose.cfa:286
22:55:46#13 0x0000fffff7ee32a4 in _X5abortFv_bPKc__1 (_X11signalAbortb_1=_X11signalAbortb_1@entry=false, _X3fmtPKc_1=_X3fmtPKc_1@entry=0xfffff7ef3250 "%s") at /var/lib/jenkins/workspace/Cforall_master/libcfa/src/interpose.cfa:301
22:55:46#14 0x0000fffff7e9b53c in abort () at /var/lib/jenkins/workspace/Cforall_master/libcfa/src/interpose.cfa:176
22:55:46#15 0x0000fffff7e9ceb4 in _X4endsFv_S8ofstream__1 (_X2osS8ofstream_1=0xfffff7f311c8 <_X9abortFileS8ofstream_1>) at /var/lib/jenkins/workspace/Cforall_master/libcfa/src/fstream.cfa:106
22:55:46#16 0x0000aaaaaaaa3dfc in _X5logicFv_XS8global_t__1 (_X1aXS8global_t_1=_X1aXS8global_t_1@entry=0xaaaaaaac02b0 <_X7globalsS13__anonymous66_1>) at concurrency/signal/disjoint.cfa:115
22:55:46#17 0x0000aaaaaaaa3e60 in _X4mainFv_S9Signaller__1 (__anonymous_object2552=__anonymous_object2552@entry=0xffffffffd070) at concurrency/signal/disjoint.cfa:126
22:55:46#18 0x0000fffff7f7a974 in __cfactx_invoke_thread (main=0xaaaaaaaa3e30 <_X4mainFv_S9Signaller__1>, this=0xffffffffd070) at /var/lib/jenkins/workspace/Cforall_master/libcfa/src/concurrency/invoke.c:87
22:55:46#19 0x0000fffff7f7a950 in __cfactx_coroutine_unwind (storage=<optimized out>, cor=<optimized out>) at /var/lib/jenkins/workspace/Cforall_master/libcfa/src/concurrency/invoke.c:76
22:55:46#20 0x0000aaaaaabffff0 in ?? ()
22:55:46Backtrace stopped: previous frame inner to this frame (corrupt stack?)
22:55:46-----
22:55:46 Id Target Id Frame
22:55:46* 1 Thread 0xaaaaaab92dc0 (LWP 3188608) __pthread_kill_implementation (threadid=187649985424832, signo=signo@entry=6, no_tid=no_tid@entry=0) at ./nptl/pthread_kill.c:44
22:55:46 2 Thread 0xfffff7fe9dc0 (LWP 3188594) _X8cache_idFj_PS7clusterj__1 (_X3idxj_1=0, _X4cltrPS7cluster_1=0xfffff7fb0980 <_X19storage_mainClusterA0c_1>) at /var/lib/jenkins/workspace/Cforall_master/libcfa/src/concurrency/kernel/cluster.hfa:138
22:55:46 3 Thread 0xaaaaaab12c00 (LWP 3188607) 0x0000fffff7beda18 in __GI___sigtimedwait (set=set@entry=0xaaaaaab121e8, info=info@entry=0xaaaaaab12268, timeout=timeout@entry=0x0) at ../sysdeps/unix/sysv/linux/sigtimedwait.c:31
22:55:4622:55:46Archiving concurrency/signal/disjoint (executable and core) to crashes/full-nodebug/concurrency/signal/disjoint
22:55:46 errors/declaration PASSED C 0:00.131 - R n/a
22:55:46 concurrency/readyQ/barrier_sleeper PASSED C 0:14.669 - R 0:00.423
22:55:46 errors/scope-type PASSED C 0:00.245 - R n/a
22:55:46 enum PASSED C 0:01.766 - R 0:00.041
22:55:46 concurrency/lockfree_stack PASSED C 0:12.553 - R 0:04.788
22:55:46 concurrency/sleep PASSED C 0:12.772 - R 0:01.175
22:55:46 errors/signature PASSED C 0:00.163 - R n/a
22:55:46 enum_tests/inc-dec PASSED C 0:01.733 - R 0:00.022
22:55:46 concurrency/thread PASSED C 0:13.964 - R 0:00.073
22:55:46 concurrency/waitfor/else PASSED C 0:10.394 - R 0:00.037
22:55:46 errors/scope PASSED C 0:00.826 - R n/a
22:55:46 collections/string-api-coverage PASSED C 0:17.969 - R 0:00.078
22:55:46 ...ions/string-api-coverage-noshare PASSED C 0:18.098 - R 0:00.040
22:55:46 concurrency/signal/block PASSED C 0:15.957 - R 0:00.169
22:55:46 .../unified_locking/block_spin_lock PASSED C 0:14.739 - R 0:00.036
22:55:46 .../unified_locking/fast_block_lock PASSED C 0:14.613 - R 0:00.040
22:55:46 ...ency/unified_locking/exp_backoff PASSED C 0:14.712 - R 0:00.038
22:55:46 ...cy/unified_locking/pthread_locks PASSED C 0:12.754 - R 0:00.042
22:55:46 designations PASSED C 0:03.304 - R 0:00.024
22:55:46 enum_tests/funcEnum PASSED C 0:02.868 - R 0:00.074
22:55:46 eval PASSED C 0:01.489 - R 0:00.022
22:55:46 concurrency/actors/static PASSED C 0:18.828 - R 0:00.227
22:55:46 concurrency/waitfor/barge PASSED C 0:12.379 - R 0:00.072
22:55:46 concurrency/actors/dynamic PASSED C 0:18.902 - R 0:00.372
22:55:46 concurrency/actors/executor PASSED C 0:19.239 - R 0:00.041
22:55:46 concurrency/waitfor/dtor PASSED C 0:12.042 - R 0:00.172
22:55:46 concurrency/actors/matrixMultiply PASSED C 0:19.092 - R 0:00.272
22:55:46 concurrency/futures/typed PASSED C 0:19.256 - R 0:00.076
22:55:46 ...ncy/unified_locking/timeout_lock PASSED C 0:11.491 - R 0:01.122
22:55:46 copyfile PASSED C 0:07.087 - R 0:00.021
22:55:46 enum_tests/structEnum PASSED C 0:02.867 - R 0:00.026
22:55:46 concurrency/actors/pingpong PASSED C 0:19.455 - R 0:00.069
22:55:46 concurrency/actors/inherit PASSED C 0:19.553 - R 0:00.121
22:55:46 ...urrency/waitfor/lexical_priority PASSED C 0:12.281 - R 0:00.022
22:55:46 concurrency/actors/poison PASSED C 0:19.244 - R 0:00.476
22:55:46 exceptions/try-ctrl-flow PASSED C 0:00.547 - R n/a
22:55:46 ...fied_locking/mcs_block_spin_lock PASSED C 0:14.415 - R 0:00.040
22:55:46 alloc PASSED C 0:19.974 - R 0:00.021
22:55:46 exceptions/type-check PASSED C 0:00.682 - R n/a
22:55:46 concurrency/actors/types PASSED C 0:20.012 - R 0:00.119
22:55:46 ...rrency/pthread/pthread_demo_lock PASSED C 0:12.062 - R 0:06.549
22:55:46 counter PASSED C 0:07.267 - R 0:00.039
22:55:46 ctrl-flow/break-misc PASSED C 0:06.855 - R 0:00.020
22:55:46 concurrency/actors/inline PASSED C 0:20.717 - R 0:00.122
22:55:46 ctrl-flow/goto PASSED C 0:06.914 - R 0:00.022
22:55:46 concurrency/waitfor/recurse PASSED C 0:12.680 - R 0:00.171
22:55:46 expression PASSED C 0:01.567 - R 0:00.027
22:55:46 exceptions/try-leave-catch PASSED C 0:01.703 - R 0:00.041
22:55:46 ctrl-flow/ifwhileCtl PASSED C 0:06.906 - R 0:00.042
22:55:46 concurrency/preempt PASSED C 0:14.289 - R 0:05.847
22:55:46 ctrl-flow/fallthrough PASSED C 0:07.073 - R 0:00.023
22:55:46 coroutine/fmtLines PASSED C 0:08.153 - R 0:00.071
22:55:46 concurrency/waitfor/when PASSED C 0:12.345 - R 0:00.075
22:55:46 coroutine/fibonacci PASSED C 0:08.446 - R 0:00.038
22:55:46 coroutine/pingpong PASSED C 0:08.454 - R 0:00.041
22:55:46 global-monomorph PASSED C 0:01.660 - R 0:00.024
22:55:46 identFuncDeclarator PASSED C 0:01.514 - R 0:00.043
22:55:46 concurrency/unified_locking/mcs PASSED C 0:14.990 - R 0:01.278
22:55:46 coroutine/runningTotal PASSED C 0:08.502 - R 0:00.039
22:55:46 identParamDeclarator PASSED C 0:01.457 - R 0:00.021
22:55:46 ctrl-flow/loop_else PASSED C 0:07.128 - R 0:00.024
22:55:46 coroutine/raii PASSED C 0:08.585 - R 0:00.021
22:55:46 exceptions/message PASSED C 0:03.190 - R 0:00.037
22:55:46 init1-ERROR PASSED C 0:00.813 - R n/a
22:55:46 coroutine/devicedriver PASSED C 0:09.207 - R 0:00.023
22:55:46 enum_tests/anonymous PASSED C 0:06.900 - R 0:00.050
22:55:46 concurrency/waituntil/timeout PASSED C 0:07.854 - R 0:03.078
22:55:46 configs/parseconfig PASSED C 0:10.401 - R 0:00.025
22:55:46 init1 PASSED C 0:01.560 - R 0:00.025
22:55:46 concurrency/waitfor/statment PASSED C 0:14.118 - R 0:00.123
22:55:46 ctrl-flow/loop_else-WRN1 PASSED C 0:08.323 - R 0:00.004
22:55:46 include/vector-sequence PASSED C 0:02.138 - R 0:00.042
22:55:46 enum_tests/enumInlineValue PASSED C 0:07.712 - R 0:00.076
22:55:46 enum_tests/stringEnum PASSED C 0:06.947 - R 0:00.022
22:55:46 enum_tests/typedIntEnum PASSED C 0:06.933 - R 0:00.039
22:55:46 configs/parsebools PASSED C 0:11.310 - R 0:00.272
22:55:46 configs/usage PASSED C 0:11.275 - R 0:00.121
22:55:46 limits PASSED C 0:01.705 - R 0:00.023
22:55:46 ...nified_locking/simple_owner_lock PASSED C 0:17.652 - R 0:00.121
22:55:46 enum_tests/voidEnum PASSED C 0:07.007 - R 0:00.037
22:55:46 enum_tests/input PASSED C 0:07.834 - R 0:00.129
22:55:46 linking/nostdlib PASSED C 0:01.554 - R 0:00.076
22:55:46 coroutine/prodcons PASSED C 0:11.125 - R 0:00.122
22:55:46 include/vector-collections PASSED C 0:03.383 - R 0:00.040
22:55:46 nested-types-ERR1 PASSED C 0:00.184 - R n/a
22:55:46 exceptions/conditional PASSED C 0:07.041 - R 0:00.023
22:55:46 nested-types-ERR2 PASSED C 0:00.311 - R n/a
22:55:46 exceptions/data-except PASSED C 0:07.230 - R 0:00.023
22:55:46 ...ency/waituntil/channel_zero_size PASSED C 0:14.576 - R 0:00.776
22:55:46 exceptions/finally PASSED C 0:07.069 - R 0:00.024
22:55:46 exceptions/defaults PASSED C 0:07.567 - R 0:00.070
22:55:46 div PASSED C 0:09.831 - R 0:00.032
22:55:46 linkonce PASSED C 0:02.081 - R 0:00.021
22:55:46 ctrl-flow/loopctrl PASSED C 0:10.051 - R 0:00.043
22:55:46 enum_tests/planet PASSED C 0:09.298 - R 0:00.024
22:55:46 opt-params PASSED C 0:00.159 - R n/a
22:55:46 maybe PASSED C 0:01.897 - R 0:00.040
22:55:46 nested-types PASSED C 0:01.573 - R 0:00.069
22:55:46 concurrency/waituntil/one_chan PASSED C 0:13.970 - R 0:00.324
22:55:46 exceptions/cancel/coroutine PASSED C 0:08.354 - R 0:00.025
22:55:46 enum_tests/position PASSED C 0:09.467 - R 0:00.077
22:55:46 exceptions/conditional-threads PASSED C 0:08.421 - R 0:00.043
22:55:46 nowarn/no-autogen PASSED C 0:01.456 - R 0:00.021
22:55:46 polybits PASSED C 0:00.335 - R n/a
22:55:46 exceptions/interact PASSED C 0:07.481 - R 0:00.023
22:55:46 nowarn/exception PASSED C 0:01.619 - R 0:00.024
22:55:46 nowarn/array PASSED C 0:01.716 - R 0:00.022
22:55:46 exceptions/resume PASSED C 0:07.372 - R 0:00.022
22:55:46 exceptions/polymorphic PASSED C 0:07.418 - R 0:00.042
22:55:46 exceptions/trash PASSED C 0:06.958 - R 0:00.024
22:55:46 exceptions/terminate PASSED C 0:07.344 - R 0:00.076
22:55:46 fstream_test PASSED C 0:06.783 - R 0:00.038
22:55:46 nowarn/printf-sizeof PASSED C 0:01.710 - R 0:00.037
22:55:46 nowarn/unused PASSED C 0:01.531 - R 0:00.037
22:55:46 generator/suspend_then PASSED C 0:06.787 - R 0:00.021
22:55:46 generator/fmtLines PASSED C 0:06.941 - R 0:00.037
22:55:46 nowarn/zero-thunk PASSED C 0:01.485 - R 0:00.075
22:55:46 generator/fibonacci PASSED C 0:06.984 - R 0:00.023
22:55:46 operators PASSED C 0:01.486 - R 0:00.023
22:55:46 hello PASSED C 0:06.736 - R 0:00.038
22:55:46 numericConstants PASSED C 0:01.545 - R 0:00.028
22:55:46 genericUnion PASSED C 0:06.998 - R 0:00.040
22:55:46 exceptions/finally-threads PASSED C 0:08.390 - R 0:00.035
22:55:46 poly-bare-assn PASSED C 0:01.530 - R 0:00.022
22:55:46 concurrency/waituntil/channels PASSED C 0:15.120 - R 0:01.982
22:55:46 poly-d-cycle PASSED C 0:01.478 - R 0:00.043
22:55:46 poly-many-arsz PASSED C 0:01.527 - R 0:00.022
22:55:46 linking/exception-nothreads PASSED C 0:05.088 - R 0:00.024
22:55:46 raii/ctor-autogen-ERR1 PASSED C 0:00.882 - R n/a
22:55:46 concurrency/channels/zero_size PASSED C 0:17.017 - R 0:10.067
22:55:46 concurrency/channels/ping_pong PASSED C 0:17.046 - R 0:10.065
22:55:46 poly-member PASSED C 0:01.567 - R 0:00.024
22:55:46 exceptions/virtual-poly PASSED C 0:07.771 - R 0:00.041
22:55:46 poly-o-cycle PASSED C 0:01.519 - R 0:00.037
22:55:46 poly-selection PASSED C 0:01.560 - R 0:00.022
22:55:46 concurrency/channels/contend PASSED C 0:17.032 - R 0:10.224
22:55:46 concurrency/channels/daisy_chain PASSED C 0:17.312 - R 0:10.069
22:55:46 raii/partial-ERR1 PASSED C 0:00.832 - R n/a
22:55:46 poly-self-cycle PASSED C 0:01.692 - R 0:00.023
22:55:46 concurrency/channels/hot_potato PASSED C 0:17.433 - R 0:10.060
22:55:46 typedefRedef-ERR1 PASSED C 0:00.178 - R n/a
22:55:46 concurrency/channels/churn PASSED C 0:17.581 - R 0:10.071
22:55:46 exceptions/defaults-threads PASSED C 0:09.758 - R 0:00.036
22:55:46 quasiKeyword PASSED C 0:01.668 - R 0:00.040
22:55:46 device/cpu PASSED C 0:12.215 - R 0:00.171
22:55:46 identity PASSED C 0:07.133 - R 0:00.042
22:55:46 concurrency/channels/pub_sub PASSED C 0:17.735 - R 0:10.061
22:55:46 var-assert PASSED C 0:00.211 - R n/a
22:55:46 forall PASSED C 0:08.467 - R 0:00.025
22:55:46 concurrency/channels/big_elems PASSED C 0:17.415 - R 0:10.531
22:55:46 exceptions/terminate-threads PASSED C 0:08.797 - R 0:00.076
22:55:46 raii/partial PASSED C 0:01.568 - R 0:00.020
22:55:46 raii/init_once PASSED C 0:01.825 - R 0:00.043
22:55:46 exceptions/resume-threads PASSED C 0:09.393 - R 0:00.023
22:55:46 raii/ctor-autogen PASSED C 0:02.136 - R 0:00.026
22:55:46 raii/typeof-member PASSED C 0:01.653 - R 0:00.040
22:55:46 exceptions/virtual-cast PASSED C 0:09.226 - R 0:00.022
22:55:46 switch PASSED C 0:01.549 - R 0:00.022
22:55:46 tuple/tupleCast PASSED C 0:01.608 - R 0:00.022
22:55:46 concurrency/waituntil/basic_else PASSED C 0:19.118 - R 0:00.024
22:55:46 tuple/tupleFunction PASSED C 0:01.640 - R 0:00.021
22:55:46 concurrency/futures/future_except PASSED C 0:28.756 - R 0:00.076
22:55:46 tuple/tupleMember PASSED C 0:01.608 - R 0:00.044
22:55:46 include/vector-fstream PASSED C 0:07.869 - R 0:00.038
22:55:46 smart-pointers PASSED C 0:01.889 - R 0:00.048
22:55:46 typedefRedef PASSED C 0:01.531 - R 0:00.022
22:55:46 io/eofType PASSED C 0:07.485 - R 0:00.077
22:55:46 typeof PASSED C 0:01.554 - R 0:00.020
22:55:46 linking/exception-withthreads PASSED C 0:06.969 - R 0:00.038
22:55:46 simpleGenericTriple PASSED C 0:02.127 - R 0:00.070
22:55:46 withconflict PASSED C 0:00.925 - R n/a
22:55:46 variableDeclarator PASSED C 0:01.443 - R 0:00.021
22:55:46 result PASSED C 0:02.286 - R 0:00.021
22:55:46 tuple/tuplePolymorphism PASSED C 0:01.997 - R 0:00.025
22:55:46 exceptions/fibonacci_nonlocal PASSED C 0:11.203 - R 0:00.073
22:55:46 meta/fork+exec PASSED C 0:05.575 - R 0:00.122
22:55:46 warnings/self-assignment PASSED C 0:01.447 - R 0:00.004
22:55:46 voidPtr PASSED C 0:01.503 - R 0:00.038
22:55:46 exceptions/cancel/thread PASSED C 0:12.309 - R 0:00.073
22:55:46 include/stdincludes PASSED C 0:09.039 - R 0:00.039
22:55:46 ...collections/dimexpr-match-c-ERRS PASSED C 0:01.052 - R n/a
22:55:46 KRfunctions PASSED C 0:01.318 - R 0:00.004
22:55:46 function-operator PASSED C 0:10.412 - R 0:00.041
22:55:46 linking/mangling/anon PASSED C 0:07.404 - R 0:00.042
22:55:46 errors/completeType PASSED C 0:00.847 - R n/a
22:55:46 attributes PASSED C 0:01.585 - R 0:00.005
22:55:46 declarationSpecifier PASSED C 0:01.399 - R 0:00.002
22:55:46 ...llections/dimexpr-match-cfa-ERRS PASSED C 0:01.663 - R n/a
22:55:46 extension PASSED C 0:01.380 - R 0:00.003
22:55:46 raii/memberCtors-ERR1 PASSED C 0:04.252 - R n/a
22:55:46 meta/arch PASSED C 0:00.793 - R n/a
22:55:46 functions PASSED C 0:01.487 - R 0:00.004
22:55:46 gccExtensions PASSED C 0:01.347 - R 0:00.002
22:55:46 literals PASSED C 0:07.373 - R 0:00.022
22:55:46 raii/dtor-early-exit-ERR2 PASSED C 0:05.010 - R n/a
22:55:46 raii/dtor-early-exit-ERR1 PASSED C 0:05.060 - R n/a
22:55:46 list/dlist-insert-remove PASSED C 0:07.865 - R 0:00.024
22:55:46 exceptions/pingpong_nonlocal PASSED C 0:12.639 - R 0:00.043
22:55:46 linking/nothreads PASSED C 0:08.750 - R 0:00.020
22:55:46 concurrency/waituntil/locks PASSED C 0:16.578 - R 0:04.444
22:55:46 linking/io-acquire PASSED C 0:09.269 - R 0:00.020
22:55:46 linking/weakso_nothd PASSED C 0:09.010 - R 0:00.021
22:55:46 arithmeticConversions PASSED C 0:03.129 - R 0:00.020
22:55:46 exceptions/cor_resumer PASSED C 0:14.428 - R 0:00.021
22:55:46 zero_one-ERR1 PASSED C 0:03.718 - R n/a
22:55:46 list/dlist2-insert-remove PASSED C 0:09.086 - R 0:00.020
22:55:46 alloc2 PASSED C 0:32.804 - R 0:00.021
22:55:46 tuple/tupleVariadic PASSED C 0:05.551 - R 0:00.022
22:55:46 polymorphism PASSED C 0:07.300 - R 0:00.022
22:55:46 raii/boxed-types PASSED C 0:07.073 - R 0:00.021
22:55:46 raii/globals PASSED C 0:06.925 - R 0:00.020
22:55:46 io/io PASSED C 0:11.950 - R 0:00.019
22:55:46 io/manipulatorsInput-uchunk PASSED C 0:11.685 - R 0:00.068
22:55:46 quotedKeyword PASSED C 0:07.542 - R 0:00.019
22:55:46 raii/memberCtors PASSED C 0:07.380 - R 0:00.021
22:55:46 sizeof PASSED C 0:06.815 - R 0:00.036
22:55:46 shortCircuit PASSED C 0:06.893 - R 0:00.035
22:55:46 concurrency/unified_locking/locks PASSED C 0:16.227 - R 0:12.414
22:55:46 concurrency/preempt2 PASSED C 0:12.844 - R 0:20.328
22:55:46 io/io-acquire-in PASSED C 0:12.442 - R 0:00.036
22:55:46 io/io-acquire-out PASSED C 0:12.364 - R 0:00.036
22:55:46 tuplearray PASSED C 0:06.962 - R 0:00.019
22:55:46 malloc PASSED C 0:10.741 - R 0:00.019
22:55:46 heap PASSED C 0:09.605 - R 0:04.791
22:55:46 strstream PASSED C 0:07.414 - R 0:00.020
22:55:46 io/io-acquire PASSED C 0:12.870 - R 0:00.039
22:55:46 meta/dumpable PASSED C 0:10.846 - R 0:00.019
22:55:46 tuple/tupleAssign PASSED C 0:07.600 - R 0:00.021
22:55:46 io/io-acquire2 PASSED C 0:13.036 - R 0:00.036
22:55:46 zero_one PASSED C 0:06.862 - R 0:00.035
22:55:46 references PASSED C 0:08.438 - R 0:00.035
22:55:46 linking/withthreads PASSED C 0:12.131 - R 0:00.019
22:55:46 raii/dtor-early-exit PASSED C 0:09.372 - R 0:00.020
22:55:46 userLiterals PASSED C 0:08.130 - R 0:00.019
22:55:46 io/manipulatorsOutput4 PASSED C 0:14.169 - R 0:00.036
22:55:46 vector PASSED C 0:08.554 - R 0:00.019
22:55:46 time PASSED C 0:09.227 - R 0:00.019
22:55:46 io/away_fair PASSED C 0:15.377 - R 0:00.035
22:55:46 sum PASSED C 0:09.878 - R 0:00.020
22:55:46 minmax PASSED C 0:12.986 - R 0:00.019
22:55:46 io/many_read PASSED C 0:15.211 - R 0:00.021
22:55:46 searchsort PASSED C 0:10.335 - R 0:00.020
22:55:46 swap PASSED C 0:10.308 - R 0:00.019
22:55:46 vector_math/vec2_double PASSED C 0:09.907 - R 0:00.019
22:55:46 vector_math/vec2_uint PASSED C 0:09.984 - R 0:00.020
22:55:46 io/comp_basic PASSED C 0:16.764 - R 0:00.035
22:55:46 abs PASSED C 0:09.169 - R 0:00.019
22:55:46 concurrency/waituntil/channel_close PASSED C 0:18.896 - R 0:10.063
22:55:46 ato PASSED C 0:09.827 - R 0:00.019
22:55:46 io/comp_fair PASSED C 0:17.612 - R 0:00.037
22:55:46 random PASSED C 0:09.503 - R 0:00.018
22:55:46 io/manipulatorsInput PASSED C 0:10.209 - R 0:00.019
22:55:46 exceptions/hotpotato_checked PASSED C 0:10.866 - R 0:00.020
22:55:46 exceptions/hotpotato PASSED C 0:11.046 - R 0:00.019
22:55:46 ...collections/array-md-sbscr-cases PASSED C 0:11.384 - R 0:00.018
22:55:46 vector_math/vec2_ldouble PASSED C 0:09.741 - R 0:00.018
22:55:46 concurrency/waituntil/futures PASSED C 0:30.170 - R 0:00.020
22:55:46 gmp PASSED C 0:11.068 - R 0:00.020
22:55:46 exceptions/cardgame PASSED C 0:11.725 - R 0:00.018
22:55:46 bitmanip3 PASSED C 0:13.337 - R 0:00.035
22:55:46 bitmanip1 PASSED C 0:13.552 - R 0:00.035
22:55:46 mathX PASSED C 0:12.779 - R 0:00.036
22:55:46 bitmanip2 PASSED C 0:13.930 - R 0:00.037
22:55:46 math PASSED C 0:13.340 - R 0:00.019
22:55:46 io/manipulatorsOutput2 PASSED C 0:13.418 - R 0:00.018
22:55:46 PRNG PASSED C 0:16.355 - R 0:00.369
22:55:46 vector_math/vec3_int PASSED C 0:17.594 - R 0:00.019
22:55:46 include/includes PASSED C 0:24.962 - R 0:00.021
22:55:46 concurrency/waituntil/all_types PASSED C 0:36.700 - R 0:00.122
22:55:46 vector_math/vec4_int PASSED C 0:18.769 - R 0:00.020
22:55:46 vector_math/vec2_float PASSED C 0:19.092 - R 0:00.021
22:55:46 vector_math/vec4_float PASSED C 0:19.103 - R 0:00.036
22:55:46 vector_math/vec2_int PASSED C 0:19.877 - R 0:00.023
22:55:46 vector_math/vec3_float PASSED C 0:20.593 - R 0:00.022
22:55:46 io/manipulatorsOutput1 PASSED C 0:21.768 - R 0:00.018
22:55:46 ...ency/unified_locking/futex_mutex PASSED C 0:14.383 - R 0:35.037
22:55:46 rational PASSED C 0:28.961 - R 0:00.038
22:55:46 io/io-acquire-no-io PASSED C 0:12.812 - R 0:22.610
22:55:46 concurrency/waituntil/repeat_close PASSED C 0:15.797 - R 0:30.041
22:55:46 io/manipulatorsOutput3 PASSED C 0:37.225 - R 0:00.025
22:55:46 ...urrency/unified_locking/mcs_spin PASSED C 0:15.677 - R 0:48.731
22:55:46 .../unified_locking/spin_queue_lock PASSED C 0:14.779 - R 0:49.190
22:55:46374 passes, 1 failures, 0 timeouts, 0 cancelled, 0 other
22:55:46Tests took 1:11.199
22:55:46make: *** [Makefile:986: all-local] Error 1
22:55:46[Pipeline] }
22:55:46[Pipeline] // dir
22:55:46[Pipeline] }
22:55:46[Pipeline] // stage
22:55:46[Pipeline] echo
22:55:46Archiving core dumps
22:55:46[Pipeline] dir
22:55:46Running in /var/lib/jenkins/workspace/Cforall_master@tmp
22:55:46[Pipeline] {
22:55:46[Pipeline] fileExists
22:55:46[Pipeline] sh
22:55:46+ /var/lib/jenkins/workspace/Cforall_master/tools/jenkins/archive-gen.sh
22:55:46[Pipeline] archiveArtifacts
22:55:46Archiving artifacts
22:55:46Recording fingerprints
22:55:46[Pipeline] }
22:55:46[Pipeline] // dir
22:55:46[Pipeline] }
22:55:46[Pipeline] // wrap
22:55:46[Pipeline] }
22:55:46[Pipeline] // node
22:55:46[Pipeline] echo
22:55:46hudson.AbortException: script returned exit code 2
22:55:46[Pipeline] node
22:55:46Running on Brokk 4 in /var/lib/jenkins/workspace/Cforall_master
22:55:46[Pipeline] {
22:55:46[Pipeline] echo
22:55:46Notifying users of result
22:55:46[Pipeline] echo
22:55:46Reusing previously constructed message
22:55:46[Pipeline] echo
22:55:46Would send email to: cforall@lists.uwaterloo.ca
22:55:46[Pipeline] echo
22:55:46With title: [cforall git][BUILD# 3656 - FAILURE] - branch master
22:55:46[Pipeline] echo
22:55:46Content:
22:55:46<p>This is an automated email from the Jenkins build machine. It was
22:55:46generated because of a git hooks/post-receive script following
22:55:46a ref change which was pushed to the Cā repository.</p>
22:55:4622:55:46<p>- Status --------------------------------------------------------------</p>
22:55:4622:55:46<p>BUILD# 3656 - FAILURE</p>
22:55:46<p>Check console output at https://cforall.uwaterloo.ca/jenkins/job/Cforall/job/master/3656/ to view the results.</p>
22:55:4622:55:46<p>- Changes -------------------------------------------------------------</p>
22:55:4622:55:46<pre>
22:55:46The branch master has been updated.
22:55:46 from 4ff8cb209307cd30c3626d4fbe3cc2d2ce4219ea (commit)
22:55:46</pre>
22:55:4622:55:46<p>- Log -----------------------------------------------------------------</p>
22:55:4622:55:46<pre>
22:55:4622:55:46</pre>
22:55:4622:55:46<p>-----------------------------------------------------------------------</p>
22:55:46<pre>
22:55:46Summary of changes:
22:55:4622:55:46</pre>
22:55:4622:55:46[Pipeline] }
22:55:46[Pipeline] // node
22:55:46[Pipeline] echo
22:55:46Build Completed
22:55:46[Pipeline] End of Pipeline
22:55:46ERROR: script returned exit code 2
22:55:46Finished: FAILURE