Started by timer
Running as Jenkins Build User
Obtained Jenkins/FullBuild from git cforall@plg.uwaterloo.ca:software/cfa/cfa-cc
[Pipeline] Start of Pipeline
[Pipeline] node
Running on Brokk 3 in /var/lib/jenkins/workspace/Cforall_Full_Build
[Pipeline] {
[Pipeline] checkout
The recommended git tool is: NONE
using credential git_key_aug2025
Fetching changes from the remote Git repository
Checking out Revision e2563b2a147d3a25fbf6bfab7e5e5efc06c56824 (refs/remotes/origin/master)
Commit message: "adjust arm64 testing after updating integer log2/ceillog2 tests"
> git rev-parse --resolve-git-dir /var/lib/jenkins/workspace/Cforall_Full_Build/.git # timeout=10
> git config remote.origin.url cforall@plg.uwaterloo.ca:software/cfa/cfa-cc # timeout=10
Fetching upstream changes from cforall@plg.uwaterloo.ca:software/cfa/cfa-cc
> git --version # timeout=10
> git --version # 'git version 2.43.0'
using GIT_SSH to set credentials Git key use to connect to the cforall git repo (August 2025)
Verifying host key using known hosts file
> git fetch --tags --force --progress -- cforall@plg.uwaterloo.ca:software/cfa/cfa-cc +refs/heads/*:refs/remotes/origin/* # timeout=10
> git rev-parse refs/remotes/origin/master^{commit} # timeout=10
> git config core.sparsecheckout # timeout=10
> git checkout -f e2563b2a147d3a25fbf6bfab7e5e5efc06c56824 # timeout=10
> git rev-list --no-walk e2563b2a147d3a25fbf6bfab7e5e5efc06c56824 # timeout=10
[Pipeline] wrap
[Pipeline] {
[Pipeline] stage
[Pipeline] { (Build)
[Pipeline] parallel
[Pipeline] { (Branch: gcc_10_x86_new)
[Pipeline] { (Branch: gcc_11_x86_new)
[Pipeline] { (Branch: gcc_12_x86_new)
[Pipeline] { (Branch: gcc_9_x64_new)
[Pipeline] { (Branch: gcc_10_x64_new)
[Pipeline] { (Branch: gcc_11_x64_new)
[Pipeline] { (Branch: gcc_12_x64_new)
[Pipeline] { (Branch: gcc_10_arm64_new)
[Pipeline] { (Branch: gcc_11_arm64_new)
[Pipeline] { (Branch: gcc_12_arm64_new)
[Pipeline] { (Branch: clang_x64_new)
[Pipeline] sleep
22:47:03Sleeping for 4 min 0 sec
[Pipeline] sleep
22:47:03Sleeping for 3 min 0 sec
[Pipeline] sleep
22:47:03Sleeping for 2 min 0 sec
[Pipeline] sleep
22:47:03No need to sleep any longer
[Pipeline] sleep
22:47:03No need to sleep any longer
[Pipeline] sleep
22:47:03Sleeping for 2 min 0 sec
[Pipeline] sleep
22:47:03Sleeping for 2 min 0 sec
[Pipeline] sleep
22:47:03Sleeping for 1 min 0 sec
[Pipeline] sleep
22:47:03Sleeping for 3 min 0 sec
[Pipeline] sleep
22:47:03Sleeping for 1 min 0 sec
[Pipeline] sleep
22:47:03Sleeping for 2 min 0 sec
[Pipeline] build
22:47:03Scheduling project: Cforall » master[Pipeline] build
22:47:03Scheduling project: Cforall » master22:47:13Starting building: Cforall » master #387922:47:13Starting building: Cforall » master #3880[Pipeline] build
22:48:03Scheduling project: Cforall » master[Pipeline] build
22:48:03Scheduling project: Cforall » master22:48:08Starting building: Cforall » master #388122:48:10Starting building: Cforall » master #3882[Pipeline] build
22:49:03Scheduling project: Cforall » master[Pipeline] build
22:49:03Scheduling project: Cforall » master[Pipeline] build
22:49:03Scheduling project: Cforall » master[Pipeline] build
22:49:03Scheduling project: Cforall » master22:49:08Starting building: Cforall » master #388422:49:08Starting building: Cforall » master #388522:49:08Starting building: Cforall » master #388322:49:12Starting building: Cforall » master #3886[Pipeline] build
22:50:03Scheduling project: Cforall » master[Pipeline] build
22:50:03Scheduling project: Cforall » master22:50:08Starting building: Cforall » master #388822:50:08Starting building: Cforall » master #3887[Pipeline] build
22:51:03Scheduling project: Cforall » master22:51:08Starting building: Cforall » master #388922:56:42Build Cforall » master #3881 completed: SUCCESS
[Pipeline] echo
22:56:42SUCCESS
[Pipeline] }
23:00:18Build Cforall » master #3879 completed: SUCCESS
[Pipeline] echo
23:00:18SUCCESS
[Pipeline] }
23:00:21Build Cforall » master #3880 completed: SUCCESS
[Pipeline] echo
23:00:21SUCCESS
[Pipeline] }
23:00:45Build Cforall » master #3885 completed: FAILURE
[Pipeline] echo
23:00:45FAILURE
[Pipeline] sh
23:00:45+ wget -q -O - https://cforall.uwaterloo.ca/jenkins/job/Cforall/job/master/3885/consoleText23:00:45Started by upstream project "Cforall_Full_Build" build number 432
23:00:45originally caused by:
23:00:45 Started by timer
23:00:45Running as Jenkins Build User
23:00:45 > git rev-parse --resolve-git-dir /var/lib/jenkins/caches/git-914b6fdde163b7e17ee75d99ca23f18a/.git # timeout=10
23:00:45Setting origin to cforall@plg.uwaterloo.ca:software/cfa/cfa-cc
23:00:45 > git config remote.origin.url cforall@plg.uwaterloo.ca:software/cfa/cfa-cc # timeout=10
23:00:45Fetching origin...
23:00:45Fetching upstream changes from origin
23:00:45 > git --version # timeout=10
23:00:45 > git --version # 'git version 2.43.0'
23:00:45 > git config --get remote.origin.url # timeout=10
23:00:45using GIT_SSH to set credentials Git key use to connect to the cforall git repo (August 2025)
23:00:45Verifying host key using known hosts file
23:00:45 > git fetch --no-tags --force --progress -- origin +refs/heads/*:refs/remotes/origin/* # timeout=10
23:00:45Seen branch in repository origin/ADT
23:00:45Seen branch in repository origin/aaron-thesis
23:00:45Seen branch in repository origin/arm-eh
23:00:45Seen branch in repository origin/ast-experimental
23:00:45Seen branch in repository origin/cleanup-dtors
23:00:45Seen branch in repository origin/ctor
23:00:45Seen branch in repository origin/deferred_resn
23:00:45Seen branch in repository origin/demangler
23:00:45Seen branch in repository origin/enum
23:00:45Seen branch in repository origin/forall-pointer-decay
23:00:45Seen branch in repository origin/gc_noraii
23:00:45Seen branch in repository origin/jacob/cs343-translation
23:00:45Seen branch in repository origin/jenkins-sandbox
23:00:45Seen branch in repository origin/master
23:00:45Seen branch in repository origin/memory
23:00:45Seen branch in repository origin/new-ast
23:00:45Seen branch in repository origin/new-ast-unique-expr
23:00:45Seen branch in repository origin/new-env
23:00:45Seen branch in repository origin/no_list
23:00:45Seen branch in repository origin/persistent-indexer
23:00:45Seen branch in repository origin/pthread-emulation
23:00:45Seen branch in repository origin/qualifiedEnum
23:00:45Seen branch in repository origin/resolv-new
23:00:45Seen branch in repository origin/string
23:00:45Seen branch in repository origin/stuck-waitfor-destruct
23:00:45Seen branch in repository origin/with_gc
23:00:45Seen 26 remote branches
23:00:45Obtained Jenkinsfile from e2563b2a147d3a25fbf6bfab7e5e5efc06c56824
23:00:45[Pipeline] Start of Pipeline
23:00:45[Pipeline] node
23:00:45Running on Brokk 2 in /var/lib/jenkins/workspace/Cforall_master_2
23:00:45[Pipeline] {
23:00:45[Pipeline] wrap
23:00:45[Pipeline] {
23:00:45[Pipeline] properties
23:00:45WARNING: Unknown parameter(s) found for class type 'hudson.model.ChoiceParameterDefinition': defaultValue
23:00:45WARNING: Unknown parameter(s) found for class type 'hudson.model.ChoiceParameterDefinition': defaultValue
23:00:45[Pipeline] checkout
23:00:45The recommended git tool is: NONE
23:00:45using credential git_key_aug2025
23:00:45Fetching changes from the remote Git repository
23:00:45Cleaning workspace
23:00:45Fetching without tags
23:00:45Checking out Revision e2563b2a147d3a25fbf6bfab7e5e5efc06c56824 (master)
23:00:45Commit message: "adjust arm64 testing after updating integer log2/ceillog2 tests"
23:00:45[Pipeline] load
23:00:45[Pipeline] { (Jenkins/tools.groovy)
23:00:45[Pipeline] }
23:00:45[Pipeline] // load
23:00:45[Pipeline] echo
23:00:45Compiler : gcc-12 (g++-12/gcc-12)
23:00:45Architecture : x64
23:00:45Arc Flags : --host=x86_64
23:00:45Run All Tests : true
23:00:45Run Benchmark : true
23:00:45Build Documentation : false
23:00:45Publish : true
23:00:45Silent : true
23:00:4523:00:45[Pipeline] }
23:00:45[Pipeline] // wrap
23:00:45[Pipeline] }
23:00:45[Pipeline] // node
23:00:45[Pipeline] node
23:00:45Running on Brokk 2 in /var/lib/jenkins/workspace/Cforall_master_2
23:00:45[Pipeline] {
23:00:45 > git rev-parse --resolve-git-dir /var/lib/jenkins/workspace/Cforall_master_2/.git # timeout=10
23:00:45 > git config remote.origin.url cforall@plg.uwaterloo.ca:software/cfa/cfa-cc # timeout=10
23:00:45 > git rev-parse --verify HEAD # timeout=10
23:00:45Resetting working tree
23:00:45 > git reset --hard # timeout=10
23:00:45 > git clean -fdx # timeout=10
23:00:45Fetching upstream changes from cforall@plg.uwaterloo.ca:software/cfa/cfa-cc
23:00:45 > git --version # timeout=10
23:00:45 > git --version # 'git version 2.43.0'
23:00:45using GIT_SSH to set credentials Git key use to connect to the cforall git repo (August 2025)
23:00:45Verifying host key using known hosts file
23:00:45 > git fetch --no-tags --force --progress -- cforall@plg.uwaterloo.ca:software/cfa/cfa-cc +refs/heads/*:refs/remotes/origin/* # timeout=10
23:00:45 > git config core.sparsecheckout # timeout=10
23:00:45 > git checkout -f e2563b2a147d3a25fbf6bfab7e5e5efc06c56824 # timeout=10
23:00:45 > git rev-list --no-walk e2563b2a147d3a25fbf6bfab7e5e5efc06c56824 # timeout=10
23:00:45[Pipeline] wrap
23:00:45[Pipeline] {
23:00:45[Pipeline] pwd
23:00:45[Pipeline] pwd
23:00:45[Pipeline] echo
23:00:45 -------- Cleanup --------
23:00:45[Pipeline] stage
23:00:45[Pipeline] { (Cleanup)
23:00:45[Pipeline] dir
23:00:45Running in /var/lib/jenkins/workspace/Cforall_master_2@tmp
23:00:45[Pipeline] {
23:00:45[Pipeline] deleteDir
23:00:45[Pipeline] }
23:00:45[Pipeline] // dir
23:00:45[Pipeline] }
23:00:45[Pipeline] // stage
23:00:45[Pipeline] echo
23:00:45 -------- Checkout --------
23:00:45[Pipeline] stage
23:00:45[Pipeline] { (Checkout)
23:00:45[Pipeline] checkout
23:00:45The recommended git tool is: NONE
23:00:45using credential git_key_aug2025
23:00:45Fetching changes from the remote Git repository
23:00:45Cleaning workspace
23:00:45Fetching without tags
23:00:45Checking out Revision e2563b2a147d3a25fbf6bfab7e5e5efc06c56824 (master)
23:00:45Commit message: "adjust arm64 testing after updating integer log2/ceillog2 tests"
23:00:45[Pipeline] echo
23:00:45Constructing new git message
23:00:45[Pipeline] sh
23:00:45 > git rev-parse --resolve-git-dir /var/lib/jenkins/workspace/Cforall_master_2/.git # timeout=10
23:00:45 > git config remote.origin.url cforall@plg.uwaterloo.ca:software/cfa/cfa-cc # timeout=10
23:00:45 > git rev-parse --verify HEAD # timeout=10
23:00:45Resetting working tree
23:00:45 > git reset --hard # timeout=10
23:00:45 > git clean -fdx # timeout=10
23:00:45Fetching upstream changes from cforall@plg.uwaterloo.ca:software/cfa/cfa-cc
23:00:45 > git --version # timeout=10
23:00:45 > git --version # 'git version 2.43.0'
23:00:45using GIT_SSH to set credentials Git key use to connect to the cforall git repo (August 2025)
23:00:45Verifying host key using known hosts file
23:00:45 > git fetch --no-tags --force --progress -- cforall@plg.uwaterloo.ca:software/cfa/cfa-cc +refs/heads/*:refs/remotes/origin/* # timeout=10
23:00:45 > git config core.sparsecheckout # timeout=10
23:00:45 > git checkout -f e2563b2a147d3a25fbf6bfab7e5e5efc06c56824 # timeout=10
23:00:45+ git rev-list e2563b2a147d3a25fbf6bfab7e5e5efc06c56824..e2563b2a147d3a25fbf6bfab7e5e5efc06c56824
23:00:45[Pipeline] sh
23:00:45+ git cat-file -t e2563b2a147d3a25fbf6bfab7e5e5efc06c56824
23:00:45[Pipeline] sh
23:00:45+ git rev-list --format=short e2563b2a147d3a25fbf6bfab7e5e5efc06c56824...e2563b2a147d3a25fbf6bfab7e5e5efc06c56824
23:00:45[Pipeline] sh
23:00:45+ git diff --stat --color e2563b2a147d3a25fbf6bfab7e5e5efc06c56824 e2563b2a147d3a25fbf6bfab7e5e5efc06c56824
23:00:45[Pipeline] echo
23:00:4523:00:45<p>- Changes -------------------------------------------------------------</p>
23:00:4523:00:45<pre>
23:00:45The branch master has been updated.
23:00:45 from e2563b2a147d3a25fbf6bfab7e5e5efc06c56824 (commit)
23:00:45</pre>
23:00:4523:00:45<p>- Log -----------------------------------------------------------------</p>
23:00:4523:00:45<pre>
23:00:4523:00:45</pre>
23:00:4523:00:45<p>-----------------------------------------------------------------------</p>
23:00:45<pre>
23:00:45Summary of changes:
23:00:4523:00:45</pre>
23:00:4523:00:45[Pipeline] }
23:00:45[Pipeline] // stage
23:00:45[Pipeline] echo
23:00:45 -------- Build : configure --------
23:00:45[Pipeline] stage
23:00:45[Pipeline] { (Build : configure)
23:00:45[Pipeline] dir
23:00:45Running in /var/lib/jenkins/workspace/Cforall_master_2
23:00:45[Pipeline] {
23:00:45[Pipeline] sh
23:00:45+ ./autogen.sh
23:00:45Running aclocal in root
23:00:45Running libtoolize in root
23:00:45libtoolize: putting auxiliary files in AC_CONFIG_AUX_DIR, 'automake'.
23:00:45libtoolize: linking file 'automake/ltmain.sh'
23:00:45libtoolize: putting macros in AC_CONFIG_MACRO_DIRS, 'automake'.
23:00:45libtoolize: linking file 'automake/libtool.m4'
23:00:45libtoolize: linking file 'automake/ltoptions.m4'
23:00:45libtoolize: linking file 'automake/ltsugar.m4'
23:00:45libtoolize: linking file 'automake/ltversion.m4'
23:00:45libtoolize: linking file 'automake/lt~obsolete.m4'
23:00:45Running autoconf in root
23:00:45Running automake in root
23:00:45configure.ac:223: installing 'automake/compile'
23:00:45configure.ac:138: installing 'automake/config.guess'
23:00:45configure.ac:138: installing 'automake/config.sub'
23:00:45configure.ac:17: installing 'automake/install-sh'
23:00:45benchmark/Makefile.am: installing 'automake/depcomp'
23:00:45parallel-tests: installing 'automake/test-driver'
23:00:45configure.ac: installing 'automake/ylwrap'
23:00:45Running aclocal in libcfa
23:00:45Running libtoolize in libcfa
23:00:45libtoolize: putting auxiliary files in AC_CONFIG_AUX_DIR, 'automake'.
23:00:45libtoolize: linking file 'automake/ltmain.sh'
23:00:45libtoolize: putting macros in AC_CONFIG_MACRO_DIRS, 'automake'.
23:00:45libtoolize: linking file 'automake/libtool.m4'
23:00:45libtoolize: linking file 'automake/ltoptions.m4'
23:00:45libtoolize: linking file 'automake/ltsugar.m4'
23:00:45libtoolize: linking file 'automake/ltversion.m4'
23:00:45libtoolize: linking file 'automake/lt~obsolete.m4'
23:00:45Running autoconf in libcfa
23:00:45Running automake in libcfa
23:00:45configure.ac:119: installing 'automake/compile'
23:00:45configure.ac:119: installing 'automake/config.guess'
23:00:45configure.ac:119: installing 'automake/config.sub'
23:00:45configure.ac:12: installing 'automake/install-sh'
23:00:45src/Makefile.am: installing 'automake/depcomp'
23:00:45[Pipeline] }
23:00:45[Pipeline] // dir
23:00:45[Pipeline] dir
23:00:45Running in /var/lib/jenkins/workspace/Cforall_master_2@tmp
23:00:45[Pipeline] {
23:00:45[Pipeline] sh
23:00:45+ /var/lib/jenkins/workspace/Cforall_master_2/configure CXX=g++-12 CC=gcc-12 --host=x86_64 AR=gcc-ar RANLIB=gcc-ranlib --with-target-hosts=host:debug,host:nodebug --quiet --prefix=/var/lib/jenkins/workspace/Cforall_master_2@tmp
23:00:45[Pipeline] sh
23:00:45+ nproc
23:00:45+ make -j 16 --no-print-directory configure-libcfa
23:00:45libcfa/x64-debug/config.data
23:00:45Configuring libcfa (/var/lib/jenkins/workspace/Cforall_master_2/libcfa/configure) with ''CXX=g++-12' 'CC=gcc-12' 'AR=gcc-ar' 'RANLIB=gcc-ranlib' '--prefix=/var/lib/jenkins/workspace/Cforall_master_2@tmp' DRIVER_DIR=/var/lib/jenkins/workspace/Cforall_master_2@tmp/driver/ ARCHITECTURE=x64 CONFIGURATION=debug CFA_VERSION=1:0:0' from /var/lib/jenkins/workspace/Cforall_master_2@tmp / libcfa/x64-debug/
23:00:45libcfa/x64-nodebug/config.data
23:00:45Configuring libcfa (/var/lib/jenkins/workspace/Cforall_master_2/libcfa/configure) with ''CXX=g++-12' 'CC=gcc-12' 'AR=gcc-ar' 'RANLIB=gcc-ranlib' '--prefix=/var/lib/jenkins/workspace/Cforall_master_2@tmp' DRIVER_DIR=/var/lib/jenkins/workspace/Cforall_master_2@tmp/driver/ ARCHITECTURE=x64 CONFIGURATION=nodebug CFA_VERSION=1:0:0' from /var/lib/jenkins/workspace/Cforall_master_2@tmp / libcfa/x64-nodebug/
23:00:45checking whether make supports nested variables... checking whether make supports nested variables... yes
23:00:45checking for a BSD-compatible install... yes
23:00:45checking for a BSD-compatible install... /usr/bin/install -c
23:00:45checking whether build environment is sane... /usr/bin/install -c
23:00:45checking whether build environment is sane... yes
23:00:45yes
23:00:45checking for a race-free mkdir -p... checking for a race-free mkdir -p... /usr/bin/mkdir -p
23:00:45checking for gawk... gawk
23:00:45checking whether make sets $(MAKE)... /usr/bin/mkdir -p
23:00:45checking for gawk... gawk
23:00:45checking whether make sets $(MAKE)... yes
23:00:45yes
23:00:45checking for distributated build... no
23:00:45checking for distributated build... no
23:00:45checking build system type... checking build system type... x86_64-pc-linux-gnu
23:00:45checking host system type... x86_64-pc-linux-gnu
23:00:45checking how to print strings... x86_64-pc-linux-gnu
23:00:45printf
23:00:45checking host system type... checking whether make supports the include directive... x86_64-pc-linux-gnu
23:00:45checking how to print strings... printf
23:00:45checking whether make supports the include directive... yes (GNU style)
23:00:45checking for gcc... gcc-12
23:00:45yes (GNU style)
23:00:45checking for gcc... gcc-12
23:00:45checking whether the C compiler works... checking whether the C compiler works... yes
23:00:45checking for C compiler default output file name... a.out
23:00:45checking for suffix of executables... yes
23:00:45checking for C compiler default output file name... a.out
23:00:45checking for suffix of executables...
23:00:45checking whether we are cross compiling...
23:00:45checking whether we are cross compiling... no
23:00:45checking for suffix of object files... no
23:00:45checking for suffix of object files... o
23:00:45checking whether the compiler supports GNU C... o
23:00:45checking whether the compiler supports GNU C... yes
23:00:45checking whether gcc-12 accepts -g... yes
23:00:45checking whether gcc-12 accepts -g... yes
23:00:45checking for gcc-12 option to enable C11 features... yes
23:00:45checking for gcc-12 option to enable C11 features... none needed
23:00:45checking whether gcc-12 understands -c and -o together... none needed
23:00:45checking whether gcc-12 understands -c and -o together... yes
23:00:45checking dependency style of gcc-12... yes
23:00:45checking dependency style of gcc-12... gcc3
23:00:45checking for a sed that does not truncate output... gcc3
23:00:45checking for a sed that does not truncate output... /usr/bin/sed
23:00:45checking for grep that handles long lines and -e... /usr/bin/grep
23:00:45checking for egrep... /usr/bin/sed
23:00:45checking for grep that handles long lines and -e... /usr/bin/grep -E
23:00:45checking for fgrep... /usr/bin/grep -F
23:00:45checking for ld used by gcc-12... /usr/bin/grep
23:00:45checking for egrep... /usr/bin/grep -E
23:00:45checking for fgrep... /usr/bin/grep -F
23:00:45checking for ld used by gcc-12... /usr/bin/ld
23:00:45checking if the linker (/usr/bin/ld) is GNU ld... yes
23:00:45checking for BSD- or MS-compatible name lister (nm)... /usr/bin/ld
23:00:45checking if the linker (/usr/bin/ld) is GNU ld... /usr/bin/nm -B
23:00:45checking the name lister (/usr/bin/nm -B) interface... yes
23:00:45checking for BSD- or MS-compatible name lister (nm)... /usr/bin/nm -B
23:00:45checking the name lister (/usr/bin/nm -B) interface... BSD nm
23:00:45checking whether ln -s works... yes
23:00:45checking the maximum length of command line arguments... BSD nm
23:00:45checking whether ln -s works... 1572864
23:00:45yes
23:00:45checking the maximum length of command line arguments... checking how to convert x86_64-pc-linux-gnu file names to x86_64-pc-linux-gnu format... func_convert_file_noop
23:00:45checking how to convert x86_64-pc-linux-gnu file names to toolchain format... func_convert_file_noop
23:00:45checking for /usr/bin/ld option to reload object files... -r
23:00:45checking for file... file
23:00:45checking for objdump... objdump
23:00:45checking how to recognize dependent libraries... 1572864
23:00:45pass_all
23:00:45checking for dlltool... no
23:00:45checking how to associate runtime and link libraries... printf %s\n
23:00:45checking for archiver @FILE support... checking how to convert x86_64-pc-linux-gnu file names to x86_64-pc-linux-gnu format... func_convert_file_noop
23:00:45checking how to convert x86_64-pc-linux-gnu file names to toolchain format... func_convert_file_noop
23:00:45checking for /usr/bin/ld option to reload object files... -r
23:00:45checking for file... file
23:00:45checking for objdump... objdump
23:00:45checking how to recognize dependent libraries... pass_all
23:00:45checking for dlltool... no
23:00:45checking how to associate runtime and link libraries... printf %s\n
23:00:45checking for archiver @FILE support... @
23:00:45checking for strip... strip
23:00:45checking for ranlib... gcc-ranlib
23:00:45checking command to parse /usr/bin/nm -B output from gcc-12 object... @
23:00:45checking for strip... strip
23:00:45checking for ranlib... gcc-ranlib
23:00:45checking command to parse /usr/bin/nm -B output from gcc-12 object... ok
23:00:45checking for sysroot... no
23:00:45checking for a working dd... /usr/bin/dd
23:00:45checking how to truncate binary pipes... ok
23:00:45checking for sysroot... no
23:00:45checking for a working dd... /usr/bin/dd bs=4096 count=1
23:00:45/usr/bin/dd
23:00:45checking how to truncate binary pipes... /usr/bin/dd bs=4096 count=1
23:00:45checking for mt... mt
23:00:45checking if mt is a manifest tool... no
23:00:45checking for stdio.h... checking for mt... mt
23:00:45checking if mt is a manifest tool... no
23:00:45checking for stdio.h... yes
23:00:45checking for stdlib.h... yes
23:00:45checking for stdlib.h... yes
23:00:45checking for string.h... yes
23:00:45checking for string.h... yes
23:00:45checking for inttypes.h... yes
23:00:45checking for inttypes.h... yes
23:00:45checking for stdint.h... yes
23:00:45checking for stdint.h... yes
23:00:45checking for strings.h... yes
23:00:45checking for strings.h... yes
23:00:45checking for sys/stat.h... yes
23:00:45checking for sys/stat.h... yes
23:00:45checking for sys/types.h... yes
23:00:45checking for sys/types.h... yes
23:00:45checking for unistd.h... yes
23:00:45checking for unistd.h... yes
23:00:45checking for dlfcn.h... yes
23:00:45checking for dlfcn.h... yes
23:00:45checking for objdir... .libs
23:00:45yes
23:00:45checking for objdir... .libs
23:00:45checking if gcc-12 supports -fno-rtti -fno-exceptions... checking if gcc-12 supports -fno-rtti -fno-exceptions... no
23:00:45checking for gcc-12 option to produce PIC... -fPIC -DPIC
23:00:45checking if gcc-12 PIC flag -fPIC -DPIC works... no
23:00:45checking for gcc-12 option to produce PIC... -fPIC -DPIC
23:00:45checking if gcc-12 PIC flag -fPIC -DPIC works... yes
23:00:45checking if gcc-12 static flag -static works... yes
23:00:45checking if gcc-12 static flag -static works... yes
23:00:45checking if gcc-12 supports -c -o file.o... yes
23:00:45checking if gcc-12 supports -c -o file.o... yes
23:00:45checking if gcc-12 supports -c -o file.o... (cached) yes
23:00:45checking whether the gcc-12 linker (/usr/bin/ld -m elf_x86_64) supports shared libraries... yes
23:00:45checking if gcc-12 supports -c -o file.o... (cached) yes
23:00:45checking whether the gcc-12 linker (/usr/bin/ld -m elf_x86_64) supports shared libraries... yes
23:00:45checking whether -lc should be explicitly linked in... yes
23:00:45checking whether -lc should be explicitly linked in... no
23:00:45checking dynamic linker characteristics... no
23:00:45checking dynamic linker characteristics... GNU/Linux ld.so
23:00:45checking how to hardcode library paths into programs... immediate
23:00:45checking whether stripping libraries is possible... yes
23:00:45checking if libtool supports shared libraries... yes
23:00:45checking whether to build shared libraries... yes
23:00:45checking whether to build static libraries... no
23:00:45GNU/Linux ld.so
23:00:45checking how to hardcode library paths into programs... immediate
23:00:45checking whether stripping libraries is possible... yes
23:00:45checking if libtool supports shared libraries... yes
23:00:45checking whether to build shared libraries... yes
23:00:45checking whether to build static libraries... no
23:00:45checking whether the compiler supports GNU C++... checking whether the compiler supports GNU C++... yes
23:00:45checking whether g++-12 accepts -g... yes
23:00:45checking whether g++-12 accepts -g... yes
23:00:45checking for g++-12 option to enable C++11 features... yes
23:00:45checking for g++-12 option to enable C++11 features... none needed
23:00:45checking dependency style of g++-12... none needed
23:00:45checking dependency style of g++-12... gcc3
23:00:45gcc3
23:00:45checking how to run the C++ preprocessor... checking how to run the C++ preprocessor... g++-12 -E
23:00:45g++-12 -E
23:00:45checking for ld used by g++-12... /usr/bin/ld -m elf_x86_64
23:00:45checking if the linker (/usr/bin/ld -m elf_x86_64) is GNU ld... yes
23:00:45checking for ld used by g++-12... /usr/bin/ld -m elf_x86_64
23:00:45checking if the linker (/usr/bin/ld -m elf_x86_64) is GNU ld... checking whether the g++-12 linker (/usr/bin/ld -m elf_x86_64) supports shared libraries... yes
23:00:45yes
23:00:45checking whether the g++-12 linker (/usr/bin/ld -m elf_x86_64) supports shared libraries... yes
23:00:45checking for g++-12 option to produce PIC... -fPIC -DPIC
23:00:45checking if g++-12 PIC flag -fPIC -DPIC works... checking for g++-12 option to produce PIC... -fPIC -DPIC
23:00:45checking if g++-12 PIC flag -fPIC -DPIC works... yes
23:00:45checking if g++-12 static flag -static works... yes
23:00:45checking if g++-12 static flag -static works... yes
23:00:45checking if g++-12 supports -c -o file.o... yes
23:00:45checking if g++-12 supports -c -o file.o... yes
23:00:45checking if g++-12 supports -c -o file.o... (cached) yes
23:00:45checking whether the g++-12 linker (/usr/bin/ld -m elf_x86_64) supports shared libraries... yes
23:00:45checking dynamic linker characteristics... (cached) GNU/Linux ld.so
23:00:45checking how to hardcode library paths into programs... immediate
23:00:45checking for gcc... (cached) gcc-12
23:00:45yes
23:00:45checking if g++-12 supports -c -o file.o... (cached) yes
23:00:45checking whether the g++-12 linker (/usr/bin/ld -m elf_x86_64) supports shared libraries... yes
23:00:45checking dynamic linker characteristics... (cached) GNU/Linux ld.so
23:00:45checking how to hardcode library paths into programs... immediate
23:00:45checking for gcc... (cached) gcc-12
23:00:45checking whether the compiler supports GNU C... (cached) yes
23:00:45checking whether gcc-12 accepts -g... (cached) yes
23:00:45checking for gcc-12 option to enable C11 features... (cached) none needed
23:00:45checking whether gcc-12 understands -c and -o together... (cached) yes
23:00:45checking dependency style of gcc-12... (cached) gcc3
23:00:45checking dependency style of gcc-12... checking whether the compiler supports GNU C... (cached) yes
23:00:45checking whether gcc-12 accepts -g... (cached) yes
23:00:45checking for gcc-12 option to enable C11 features... (cached) none needed
23:00:45checking whether gcc-12 understands -c and -o together... (cached) yes
23:00:45checking dependency style of gcc-12... (cached) gcc3
23:00:45checking dependency style of gcc-12... gcc3
23:00:45checking whether make sets $(MAKE)... (cached) yes
23:00:45checking for linux/rseq.h... gcc3
23:00:45checking whether make sets $(MAKE)... (cached) yes
23:00:45checking for linux/rseq.h... yes
23:00:45checking for rseq_available in -lrseq... yes
23:00:45checking for rseq_available in -lrseq... no
23:00:45checking for gcc-12 options needed to detect all undeclared functions... no
23:00:45checking for gcc-12 options needed to detect all undeclared functions... none needed
23:00:45none needed
23:00:45checking for linux/io_uring.h... checking for linux/io_uring.h... yes
23:00:45checking for liburing.h... yes
23:00:45checking for liburing.h... no
23:00:45checking whether IORING_OP_NOP is declared... no
23:00:45checking whether IORING_OP_NOP is declared... yes
23:00:45checking whether IORING_OP_READV is declared... yes
23:00:45checking whether IORING_OP_READV is declared... yes
23:00:45checking whether IORING_OP_WRITEV is declared... yes
23:00:45checking whether IORING_OP_WRITEV is declared... yes
23:00:45checking whether IORING_OP_FSYNC is declared... yes
23:00:45checking whether IORING_OP_FSYNC is declared... yes
23:00:45checking whether IORING_OP_READ_FIXED is declared... yes
23:00:45checking whether IORING_OP_READ_FIXED is declared... yes
23:00:45checking whether IORING_OP_WRITE_FIXED is declared... yes
23:00:45checking whether IORING_OP_WRITE_FIXED is declared... yes
23:00:45checking whether IORING_OP_POLL_ADD is declared... yes
23:00:45checking whether IORING_OP_POLL_ADD is declared... yes
23:00:45checking whether IORING_OP_POLL_REMOVE is declared... yes
23:00:45checking whether IORING_OP_POLL_REMOVE is declared... yes
23:00:45checking whether IORING_OP_SYNC_FILE_RANGE is declared... yes
23:00:45checking whether IORING_OP_SYNC_FILE_RANGE is declared... yes
23:00:45checking whether IORING_OP_SENDMSG is declared... yes
23:00:45checking whether IORING_OP_SENDMSG is declared... yes
23:00:45checking whether IORING_OP_RECVMSG is declared... yes
23:00:45checking whether IORING_OP_RECVMSG is declared... yes
23:00:45checking whether IORING_OP_TIMEOUT is declared... yes
23:00:45checking whether IORING_OP_TIMEOUT is declared... yes
23:00:45checking whether IORING_OP_TIMEOUT_REMOVE is declared... yes
23:00:45checking whether IORING_OP_TIMEOUT_REMOVE is declared... yes
23:00:45checking whether IORING_OP_ACCEPT is declared... yes
23:00:45checking whether IORING_OP_ACCEPT is declared... yes
23:00:45checking whether IORING_OP_ASYNC_CANCEL is declared... yes
23:00:45checking whether IORING_OP_ASYNC_CANCEL is declared... yes
23:00:45checking whether IORING_OP_LINK_TIMEOUT is declared... yes
23:00:45checking whether IORING_OP_LINK_TIMEOUT is declared... yes
23:00:45checking whether IORING_OP_CONNECT is declared... yes
23:00:45checking whether IORING_OP_CONNECT is declared... yes
23:00:45checking whether IORING_OP_FALLOCATE is declared... yes
23:00:45checking whether IORING_OP_FALLOCATE is declared... yes
23:00:45checking whether IORING_OP_OPENAT is declared... yes
23:00:45checking whether IORING_OP_OPENAT is declared... yes
23:00:45checking whether IORING_OP_CLOSE is declared... yes
23:00:45checking whether IORING_OP_CLOSE is declared... yes
23:00:45checking whether IORING_OP_FILES_UPDATE is declared... yes
23:00:45checking whether IORING_OP_FILES_UPDATE is declared... yes
23:00:45checking whether IORING_OP_STATX is declared... yes
23:00:45checking whether IORING_OP_STATX is declared... yes
23:00:45checking whether IORING_OP_READ is declared... yes
23:00:45checking whether IORING_OP_READ is declared... yes
23:00:45checking whether IORING_OP_WRITE is declared... yes
23:00:45checking whether IORING_OP_WRITE is declared... yes
23:00:45checking whether IORING_OP_FADVISE is declared... yes
23:00:45checking whether IORING_OP_FADVISE is declared... yes
23:00:45checking whether IORING_OP_MADVISE is declared... yes
23:00:45checking whether IORING_OP_MADVISE is declared... yes
23:00:45checking whether IORING_OP_SEND is declared... yes
23:00:45checking whether IORING_OP_SEND is declared... yes
23:00:45checking whether IORING_OP_RECV is declared... yes
23:00:45checking whether IORING_OP_RECV is declared... yes
23:00:45checking whether IORING_OP_OPENAT2 is declared... yes
23:00:45checking whether IORING_OP_OPENAT2 is declared... yes
23:00:45checking whether IORING_OP_EPOLL_CTL is declared... yes
23:00:45checking whether IORING_OP_EPOLL_CTL is declared... yes
23:00:45checking whether IORING_OP_SPLICE is declared... yes
23:00:45checking whether IORING_OP_SPLICE is declared... yes
23:00:45checking whether IORING_OP_PROVIDE_BUFFERS is declared... yes
23:00:45yes
23:00:45checking whether IORING_OP_PROVIDE_BUFFERS is declared... checking whether IORING_OP_REMOVE_BUFFER is declared... yes
23:00:45checking whether IORING_OP_REMOVE_BUFFER is declared... no
23:00:45checking whether IORING_OP_TEE is declared... yes
23:00:45no
23:00:45checking whether IOSQE_FIXED_FILE is declared... checking whether IORING_OP_TEE is declared... yes
23:00:45checking whether IOSQE_FIXED_FILE is declared... yes
23:00:45checking whether IOSQE_IO_DRAIN is declared... yes
23:00:45yes
23:00:45checking whether IOSQE_IO_DRAIN is declared... checking whether IOSQE_IO_LINK is declared... yes
23:00:45checking whether IOSQE_IO_LINK is declared... yes
23:00:45checking whether IOSQE_IO_HARDLINK is declared... yes
23:00:45checking whether IOSQE_IO_HARDLINK is declared... yes
23:00:45checking whether IOSQE_ASYNC is declared... yes
23:00:45checking whether IOSQE_ASYNC is declared... yes
23:00:45checking whether IOSQE_BUFFER_SELECT is declared... yes
23:00:45checking whether IOSQE_BUFFER_SELECT is declared... yes
23:00:45checking whether SPLICE_F_FD_IN_FIXED is declared... yes
23:00:45checking whether SPLICE_F_FD_IN_FIXED is declared... yes
23:00:45checking whether IORING_SETUP_ATTACH_WQ is declared... yes
23:00:45checking whether IORING_SETUP_ATTACH_WQ is declared... yes
23:00:45checking whether IORING_REGISTER_IOWQ_MAX_WORKERS is declared... yes
23:00:45checking whether IORING_REGISTER_IOWQ_MAX_WORKERS is declared... yes
23:00:45checking for preadv2... yes
23:00:45yes
23:00:45checking for preadv2... checking for pwritev2... yes
23:00:45checking for pwritev2... yes
23:00:45checking that generated files are newer than configure... done
23:00:45configure: creating ./config.status
23:00:45yes
23:00:45checking that generated files are newer than configure... done
23:00:45configure: creating ./config.status
23:00:45config.status: creating Makefile
23:00:45config.status: creating src/Makefile
23:00:45config.status: creating Makefile
23:00:45config.status: creating prelude/Makefile
23:00:45config.status: creating src/Makefile
23:00:45config.status: creating src/concurrency/io/call.cfa
23:00:45config.status: creating prelude/Makefile
23:00:45config.status: creating src/concurrency/io/call.cfa
23:00:45/var/lib/jenkins/workspace/Cforall_master_2/libcfa/src/concurrency/io/call.cfa.in:144: SyntaxWarning: invalid escape sequence '\('
23:00:45 sig = re.search("(.*) (.*)\((.*)\)", signature)
23:00:45config.status: creating prelude/defines.hfa
23:00:45config.status: executing depfiles commands
23:00:45/var/lib/jenkins/workspace/Cforall_master_2/libcfa/src/concurrency/io/call.cfa.in:144: SyntaxWarning: invalid escape sequence '\('
23:00:45 sig = re.search("(.*) (.*)\((.*)\)", signature)
23:00:45config.status: creating prelude/defines.hfa
23:00:45config.status: executing depfiles commands
23:00:45config.status: executing libtool commands
23:00:45Cforall library configuraton completed. Type "make -j 8 install".
23:00:45config.status: executing libtool commands
23:00:45Cforall library configuraton completed. Type "make -j 8 install".
23:00:45[Pipeline] }
23:00:45[Pipeline] // dir
23:00:45[Pipeline] }
23:00:45[Pipeline] // stage
23:00:45[Pipeline] echo
23:00:45 -------- Build : cfa-cpp --------
23:00:45[Pipeline] stage
23:00:45[Pipeline] { (Build : cfa-cpp)
23:00:45[Pipeline] dir
23:00:45Running in /var/lib/jenkins/workspace/Cforall_master_2@tmp
23:00:45[Pipeline] {
23:00:45[Pipeline] sh
23:00:45+ nproc
23:00:45+ make -j 16 --no-print-directory -C driver
23:00:45 CXX as.o
23:00:45 CXX cc1.o
23:00:45 CXX cfa.o
23:00:45 CXXLD as
23:00:45 CXXLD cc1
23:00:45 CXXLD cfa
23:00:45[Pipeline] sh
23:00:45+ nproc
23:00:45+ make -j 16 --no-print-directory -C src
23:00:45 YACC Parser/parser.cc
23:00:45updating Parser/parser.output
23:00:45updating Parser/parser.hh
23:00:45make all-am
23:00:45 CXX CompilationState.o
23:00:45 CXX main.o
23:00:45 CXX MakeLibCfa.o
23:00:45 LEX Parser/lex.cc
23:00:45 CXX AST/Attribute.o
23:00:45 CXX AST/Copy.o
23:00:45 CXX AST/Create.o
23:00:45 CXX AST/Decl.o
23:00:45 CXX AST/DeclReplacer.o
23:00:45 CXX AST/Expr.o
23:00:45 CXX AST/GenericSubstitution.o
23:00:45 CXX AST/Inspect.o
23:00:45 CXX AST/Init.o
23:00:45 CXX AST/LinkageSpec.o
23:00:45 CXX AST/Node.o
23:00:45 CXX AST/Pass.o
23:00:45 CXX AST/Print.o
23:00:45 CXX AST/Stmt.o
23:00:45 CXX AST/SymbolTable.o
23:00:45 CXX AST/Type.o
23:00:45 CXX AST/TypeEnvironment.o
23:00:45 CXX AST/TypeSubstitution.o
23:00:45 CXX AST/Util.o
23:00:45 CXX CodeGen/CodeGenerator.o
23:00:45 CXX CodeGen/GenType.o
23:00:45 CXX CodeGen/OperatorTable.o
23:00:45 CXX CodeGen/FixMain.o
23:00:45 CXX CodeGen/FixNames.o
23:00:45 CXX CodeGen/Generate.o
23:00:45 CXX CodeGen/LinkOnce.o
23:00:45 CXX Concurrency/Actors.o
23:00:45 CXX Concurrency/Corun.o
23:00:45 CXX Concurrency/Keywords.o
23:00:45 CXX Concurrency/Waitfor.o
23:00:45 CXX Concurrency/Waituntil.o
23:00:45 CXX Common/Assert.o
23:00:45 CXX Common/CodeLocationTools.o
23:00:45 CXX Common/DeclStats.o
23:00:45 CXX Common/Eval.o
23:00:45 CXX Common/Examine.o
23:00:45 CXX Common/Indenter.o
23:00:45 CXX Common/ResolvProtoDump.o
23:00:45 CXX Common/SemanticError.o
23:00:45 CXX Common/Stats/Counter.o
23:00:45 CXX Common/Stats/Heap.o
23:00:45 CXX Common/Stats/ResolveTime.o
23:00:45 CXX Common/Stats/Stats.o
23:00:45 CXX Common/Stats/Time.o
23:00:45 CXX Common/Symbol.o
23:00:45 CXX Common/UniqueName.o
23:00:45 CXX Common/DebugMalloc.o
23:00:45 CXX ControlStruct/ExceptDecl.o
23:00:45 CXX ControlStruct/ExceptTranslate.o
23:00:45 CXX ControlStruct/FixLabels.o
23:00:45 CXX ControlStruct/HoistControlDecls.o
23:00:45 CXX ControlStruct/LabelGenerator.o
23:00:45 CXX ControlStruct/MultiLevelExit.o
23:00:45 CXX ControlStruct/TranslateEnumRange.o
23:00:45 CXX GenPoly/GenPoly.o
23:00:45 CXX GenPoly/Lvalue2.o
23:00:45 CXX GenPoly/Box.o
23:00:45 CXX GenPoly/FindFunction.o
23:00:45 CXX GenPoly/InstantiateGeneric.o
23:00:45 CXX GenPoly/Lvalue.o
23:00:45 CXX GenPoly/ScrubTypeVars.o
23:00:45 CXX GenPoly/Specialize.o
23:00:45 CXX InitTweak/GenInit.o
23:00:45 CXX InitTweak/InitTweak.o
23:00:45 CXX InitTweak/FixGlobalInit.o
23:00:45 CXX InitTweak/FixInit.o
23:00:45 CXX Parser/DeclarationNode.o
23:00:45 CXX Parser/ExpressionNode.o
23:00:45 CXX Parser/InitializerNode.o
23:00:45 CXX Parser/lex.o
23:00:45 CXX Parser/ParseNode.o
23:00:45 CXX Parser/parser.o
23:00:45In file included from /usr/include/x86_64-linux-gnu/c++/12/bits/os_defines.h:39,
23:00:45 from /usr/include/x86_64-linux-gnu/c++/12/bits/c++config.h:662,
23:00:45 from /usr/include/c++/12/cstdio:41,
23:00:45 from /var/lib/jenkins/workspace/Cforall_master_2/src/Parser/parser.yy:41:
23:00:45/usr/include/features.h:415:4: warning: #warning _FORTIFY_SOURCE requires GCC 4.1 or later [-Wcpp]
23:00:45 415 | # warning _FORTIFY_SOURCE requires GCC 4.1 or later
23:00:45 | ^~~~~~~
23:00:45 CXX Parser/RunParser.o
23:00:45 CXX Parser/StatementNode.o
23:00:45 CXX Parser/TypeData.o
23:00:45 CXX Parser/TypedefTable.o
23:00:45 CXX ResolvExpr/AdjustExprType.o
23:00:45 CXX ResolvExpr/Candidate.o
23:00:45 CXX ResolvExpr/CandidateFinder.o
23:00:45 CXX ResolvExpr/CastCost.o
23:00:45 CXX ResolvExpr/CommonType.o
23:00:45 CXX ResolvExpr/ConversionCost.o
23:00:45 CXX ResolvExpr/CurrentObject.o
23:00:45 CXX ResolvExpr/ExplodedArg.o
23:00:45 CXX ResolvExpr/FindOpenVars.o
23:00:45 CXX ResolvExpr/PolyCost.o
23:00:45 CXX ResolvExpr/PtrsAssignable.o
23:00:45 CXX ResolvExpr/PtrsCastable.o
23:00:45 CXX ResolvExpr/RenameVars.o
23:00:45 CXX ResolvExpr/Resolver.o
23:00:45 CXX ResolvExpr/ResolveTypeof.o
23:00:45 CXX ResolvExpr/SatisfyAssertions.o
23:00:45 CXX ResolvExpr/SpecCost.o
23:00:45 CXX ResolvExpr/Unify.o
23:00:45 CXX ResolvExpr/CandidatePrinter.o
23:00:45 CXX ResolvExpr/EraseWith.o
23:00:45 CXX SymTab/FixFunction.o
23:00:45 CXX SymTab/GenImplicitCall.o
23:00:45 CXX SymTab/Mangler.o
23:00:45 CXX SymTab/ManglerCommon.o
23:00:45 CXX Tuples/Explode.o
23:00:45 CXX Tuples/TupleAssignment.o
23:00:45 CXX Tuples/TupleExpansion.o
23:00:45 CXX Tuples/Tuples.o
23:00:45 CXX Validate/Autogen.o
23:00:45 CXX Validate/CheckAssertions.o
23:00:45 CXX Validate/CompoundLiteral.o
23:00:45 CXX Validate/EliminateTypedef.o
23:00:45 CXX Validate/EnumAndPointerDecay.o
23:00:45 CXX Validate/FindSpecialDecls.o
23:00:45 CXX Validate/FixQualifiedTypes.o
23:00:45 CXX Validate/FixReturnTypes.o
23:00:45 CXX Validate/ForallPointerDecay.o
23:00:45 CXX Validate/GenericParameter.o
23:00:45 CXX Validate/HoistStruct.o
23:00:45 CXX Validate/HoistTypeDecls.o
23:00:45 CXX Validate/ImplementEnumFunc.o
23:00:45 CXX Validate/InitializerLength.o
23:00:45 CXX Validate/LabelAddressFixer.o
23:00:45 CXX Validate/LinkInstanceTypes.o
23:00:45 CXX Validate/ReplaceTypedef.o
23:00:45 CXX Validate/ReturnCheck.o
23:00:45 CXX Validate/VerifyCtorDtorAssign.o
23:00:45 CXX Virtual/ExpandCasts.o
23:00:45 CXX Virtual/Tables.o
23:00:45 CXX Virtual/VirtualDtor.o
23:00:45 CXXLD ../driver/cfa-cpp
23:00:45[Pipeline] }
23:00:45[Pipeline] // dir
23:00:45[Pipeline] }
23:00:45[Pipeline] // stage
23:00:45[Pipeline] echo
23:00:45 -------- Build : libcfa(debug) --------
23:00:45[Pipeline] stage
23:00:45[Pipeline] { (Build : libcfa(debug))
23:00:45[Pipeline] dir
23:00:45Running in /var/lib/jenkins/workspace/Cforall_master_2@tmp
23:00:45[Pipeline] {
23:00:45[Pipeline] sh
23:00:45+ nproc
23:00:45+ make -j 16 --no-print-directory -C libcfa/x64-debug
23:00:45Making all in prelude
23:00:45mkdir .deps
23:00:45touch .deps/builtins.Po
23:00:45(CDPATH="${ZSH_VERSION+.}:" && cd /var/lib/jenkins/workspace/Cforall_master_2/libcfa && /bin/bash '/var/lib/jenkins/workspace/Cforall_master_2/libcfa/automake/missing' autoheader)
23:00:45rm -f stamp-h1
23:00:45touch /var/lib/jenkins/workspace/Cforall_master_2/libcfa/prelude/defines.hfa.in
23:00:45cd .. && /bin/bash ./config.status prelude/defines.hfa
23:00:45config.status: creating prelude/defines.hfa
23:00:45config.status: prelude/defines.hfa is unchanged
23:00:45make all-am
23:00:45 GEN gcc-builtins.c
23:00:45 GEN builtins.cfa
23:00:45 GEN prelude.cfa
23:00:45 GEN extras.cfa
23:00:45 GEN extras.cfa
23:00:45 GEN gcc-builtins.cfa
23:00:45 GEN bootloader.c
23:00:45Making all in src
23:00:45 CFA common.lo
23:00:45 CFA fstream.lo
23:00:45 CFA heap.lo
23:00:45 CFA iostream.lo
23:00:45 CFA iterator.lo
23:00:45 CFA limits.lo
23:00:45 CFA math.lo
23:00:45 CFA memory.lo
23:00:45 CFA parseargs.lo
23:00:45 CFA parseconfig.lo
23:00:45 CFA rational.lo
23:00:45 CFA stdlib.lo
23:00:45 CFA strstream.lo
23:00:45 CFA time.lo
23:00:45 CFA assert.lo
23:00:45 CFA bits/debug.lo
23:00:45 CC exception.lo
23:00:45 CFA interpose.lo
23:00:45 CFA prelude-inline.lo
23:00:45 CFA startup.lo
23:00:45 CC virtual.lo
23:00:45 GEN prelude.lo
23:00:45 CFA concurrency/locks.lo
23:00:45 CFA concurrency/monitor.lo
23:00:45 CFA concurrency/mutex.lo
23:00:45 CFA concurrency/select.lo
23:00:45 CFA concurrency/thread.lo
23:00:45 CFA concurrency/cofor.lo
23:00:45 CFA interpose_thread.lo
23:00:45 CPPAS concurrency/CtxSwitch-x64.lo
23:00:45 CC concurrency/invoke.lo
23:00:45 CFA concurrency/io.lo
23:00:45 CFA concurrency/kernel/startup.lo
23:00:45 CFA concurrency/preemption.lo
23:00:45 CFA concurrency/ready_queue.lo
23:00:45 CFA concurrency/stats.lo
23:00:45 CFA concurrency/pthread.lo
23:00:45 CFA bits/weakso_locks.lo
23:00:45 CFA algorithms/range_iterator.lo
23:00:45 CFA collections/maybe.lo
23:00:45 CFA collections/pair.lo
23:00:45 CFA collections/result.lo
23:00:45 CFA collections/string.lo
23:00:45 CFA collections/string_res.lo
23:00:45 CFA collections/vector.lo
23:00:45 CFA device/cpu.lo
23:00:45 CFA concurrency/alarm.lo
23:00:45 CFA concurrency/coroutine.lo
23:00:45 CFA concurrency/exception.lo
23:00:45 CFA concurrency/kernel.lo
23:00:45 CFA concurrency/kernel/cluster.lo
23:00:45 CFA concurrency/clib/cfathread.lo
23:00:45 CFA concurrency/io/setup.lo
23:00:45 CFA concurrency/io/call.lo
23:00:45/usr/include/linux/io_uring.h:83:43: warning: 'packed' attribute ignored for field of type 'union __io_uring_sqe____anonymous55' [-Wattributes]
23:00:45 83 | } __attribute__((packed));
23:00:45 | ^
23:00:45/usr/include/linux/io_uring.h:83:43: warning: 'packed' attribute ignored for field of type 'union __io_uring_sqe____anonymous131' [-Wattributes]
23:00:45 83 | } __attribute__((packed));
23:00:45 | ^
23:00:45 CCLD libcfa.la
23:00:45/usr/bin/ld: warning: .libs/common.o: requires executable stack (because the .note.GNU-stack section is executable)
23:00:45/usr/bin/ld: .libs/exception.o: warning: relocation against `__gcfa_personality_v0' in read-only section `.rodata'
23:00:45/usr/bin/ld: warning: creating DT_TEXTREL in a shared object
23:00:45/usr/include/linux/io_uring.h:83:43: warning: 'packed' attribute ignored for field of type 'union __io_uring_sqe____anonymous65' [-Wattributes]
23:00:45 83 | } __attribute__((packed));
23:00:45 | ^
23:00:45/usr/include/linux/io_uring.h:83:43: warning: 'packed' attribute ignored for field of type 'union __io_uring_sqe____anonymous121' [-Wattributes]
23:00:45 83 | } __attribute__((packed));
23:00:45 | ^
23:00:45/usr/include/linux/io_uring.h:83:43: warning: 'packed' attribute ignored for field of type 'union __io_uring_sqe____anonymous121' [-Wattributes]
23:00:45 83 | } __attribute__((packed));
23:00:45 | ^
23:00:45/usr/include/linux/io_uring.h:83:43: warning: 'packed' attribute ignored for field of type 'union __io_uring_sqe____anonymous32' [-Wattributes]
23:00:45 83 | } __attribute__((packed));
23:00:45 | ^
23:00:45/usr/include/linux/io_uring.h:83:43: warning: 'packed' attribute ignored for field of type 'union __io_uring_sqe____anonymous97' [-Wattributes]
23:00:45 83 | } __attribute__((packed));
23:00:45 | ^
23:00:45 CCLD libcfathread.la
23:00:45/usr/bin/ld: warning: concurrency/.libs/alarm.o: requires executable stack (because the .note.GNU-stack section is executable)
23:00:45make[1]: Nothing to be done for 'all-am'.
23:00:45[Pipeline] }
23:00:45[Pipeline] // dir
23:00:45[Pipeline] }
23:00:45[Pipeline] // stage
23:00:45[Pipeline] echo
23:00:45 -------- Build : libcfa(nodebug) --------
23:00:45[Pipeline] stage
23:00:45[Pipeline] { (Build : libcfa(nodebug))
23:00:45[Pipeline] dir
23:00:45Running in /var/lib/jenkins/workspace/Cforall_master_2@tmp
23:00:45[Pipeline] {
23:00:45[Pipeline] sh
23:00:45+ nproc
23:00:45+ make -j 16 --no-print-directory -C libcfa/x64-nodebug
23:00:45Making all in prelude
23:00:45mkdir .deps
23:00:45touch .deps/builtins.Po
23:00:45cd .. && /bin/bash ./config.status prelude/defines.hfa
23:00:45config.status: creating prelude/defines.hfa
23:00:45config.status: prelude/defines.hfa is unchanged
23:00:45make all-am
23:00:45 GEN gcc-builtins.c
23:00:45 GEN builtins.cfa
23:00:45 GEN prelude.cfa
23:00:45 GEN extras.cfa
23:00:45 GEN gcc-builtins.cfa
23:00:45 GEN extras.cfa
23:00:45 GEN bootloader.c
23:00:45Making all in src
23:00:45 CFA common.lo
23:00:45 CFA fstream.lo
23:00:45 CFA iostream.lo
23:00:45 CFA heap.lo
23:00:45 CFA iterator.lo
23:00:45 CFA limits.lo
23:00:45 CFA math.lo
23:00:45 CFA memory.lo
23:00:45 CFA parseargs.lo
23:00:45 CFA parseconfig.lo
23:00:45 CFA rational.lo
23:00:45 CFA stdlib.lo
23:00:45 CFA strstream.lo
23:00:45 CFA time.lo
23:00:45 CFA assert.lo
23:00:45 CFA bits/debug.lo
23:00:45 CC exception.lo
23:00:45/var/lib/jenkins/workspace/Cforall_master_2/libcfa/src/exception.c: In function '__cfaehm_allocate_exception':
23:00:45/var/lib/jenkins/workspace/Cforall_master_2/libcfa/src/exception.c:142:17: warning: ignoring return value of 'write' declared with attribute 'warn_unused_result' [-Wunused-result]
23:00:45 142 | write( 2, "abort2\n", 7 );
23:00:45 | ^~~~~~~~~~~~~~~~~~~~~~~~~
23:00:45/var/lib/jenkins/workspace/Cforall_master_2/libcfa/src/exception.c: In function '__cfaehm_exception_cleanup':
23:00:45/var/lib/jenkins/workspace/Cforall_master_2/libcfa/src/exception.c:127:17: warning: ignoring return value of 'write' declared with attribute 'warn_unused_result' [-Wunused-result]
23:00:45 127 | write( 2, "abort1\n", 7 );
23:00:45 | ^~~~~~~~~~~~~~~~~~~~~~~~~
23:00:45/var/lib/jenkins/workspace/Cforall_master_2/libcfa/src/exception.c: In function '__cfaehm_cancel_stack':
23:00:45/var/lib/jenkins/workspace/Cforall_master_2/libcfa/src/exception.c:230:9: warning: ignoring return value of 'write' declared with attribute 'warn_unused_result' [-Wunused-result]
23:00:45 230 | write( 2, "abort3\n", 7 );
23:00:45 | ^~~~~~~~~~~~~~~~~~~~~~~~~
23:00:45/var/lib/jenkins/workspace/Cforall_master_2/libcfa/src/exception.c: In function '__cfaehm_begin_unwind':
23:00:45/var/lib/jenkins/workspace/Cforall_master_2/libcfa/src/exception.c:252:17: warning: ignoring return value of 'write' declared with attribute 'warn_unused_result' [-Wunused-result]
23:00:45 252 | write( 2, "abort4\n", 7 );
23:00:45 | ^~~~~~~~~~~~~~~~~~~~~~~~~
23:00:45/var/lib/jenkins/workspace/Cforall_master_2/libcfa/src/exception.c:278:17: warning: ignoring return value of 'write' declared with attribute 'warn_unused_result' [-Wunused-result]
23:00:45 278 | write( 2, "abort5\n", 7 );
23:00:45 | ^~~~~~~~~~~~~~~~~~~~~~~~~
23:00:45/var/lib/jenkins/workspace/Cforall_master_2/libcfa/src/exception.c: In function '__cfaehm_rethrow_terminate':
23:00:45/var/lib/jenkins/workspace/Cforall_master_2/libcfa/src/exception.c:308:9: warning: ignoring return value of 'write' declared with attribute 'warn_unused_result' [-Wunused-result]
23:00:45 308 | write( 2, "abort7\n", 7 );
23:00:45 | ^~~~~~~~~~~~~~~~~~~~~~~~~
23:00:45/var/lib/jenkins/workspace/Cforall_master_2/libcfa/src/exception.c: In function '__cfaehm_rethrow_adapter':
23:00:45/var/lib/jenkins/workspace/Cforall_master_2/libcfa/src/exception.c:300:9: warning: ignoring return value of 'write' declared with attribute 'warn_unused_result' [-Wunused-result]
23:00:45 300 | write( 2, "abort6\n", 7 );
23:00:45 | ^~~~~~~~~~~~~~~~~~~~~~~~~
23:00:45 CFA interpose.lo
23:00:45 CFA prelude-inline.lo
23:00:45 CFA startup.lo
23:00:45 CC virtual.lo
23:00:45 GEN prelude.lo
23:00:45 CFA concurrency/locks.lo
23:00:45 CFA concurrency/monitor.lo
23:00:45 CFA concurrency/mutex.lo
23:00:45 CFA concurrency/select.lo
23:00:45 CFA concurrency/thread.lo
23:00:45 CFA concurrency/cofor.lo
23:00:45 CFA interpose_thread.lo
23:00:45 CPPAS concurrency/CtxSwitch-x64.lo
23:00:45 CC concurrency/invoke.lo
23:00:45 CFA concurrency/io.lo
23:00:45 CFA concurrency/kernel/startup.lo
23:00:45 CFA concurrency/preemption.lo
23:00:45 CFA concurrency/ready_queue.lo
23:00:45 CFA concurrency/stats.lo
23:00:45 CFA concurrency/pthread.lo
23:00:45 CFA bits/weakso_locks.lo
23:00:45 CFA algorithms/range_iterator.lo
23:00:45 CFA collections/maybe.lo
23:00:45 CFA collections/pair.lo
23:00:45 CFA collections/result.lo
23:00:45 CFA collections/string.lo
23:00:45 CFA collections/string_res.lo
23:00:45 CFA collections/vector.lo
23:00:45 CFA device/cpu.lo
23:00:45 CFA concurrency/alarm.lo
23:00:45 CFA concurrency/coroutine.lo
23:00:45 CFA concurrency/exception.lo
23:00:45 CFA concurrency/kernel.lo
23:00:45 CFA concurrency/kernel/cluster.lo
23:00:45 CFA concurrency/clib/cfathread.lo
23:00:45 CFA concurrency/io/setup.lo
23:00:45/var/lib/jenkins/workspace/Cforall_master_2/libcfa/src/concurrency/kernel/cluster.hfa: In function '_X15__atomic_load_nFd_PVdi__1':
23:00:45/var/lib/jenkins/workspace/Cforall_master_2/libcfa/src/concurrency/kernel/cluster.hfa:58:19: warning: '_X3retm_2' is used uninitialized [-Wuninitialized]
23:00:45 58 | double ret = *(volatile double *)rp;
23:00:45 | ^~~~~~~~~
23:00:45/var/lib/jenkins/workspace/Cforall_master_2/libcfa/src/concurrency/kernel/cluster.hfa:55:30: note: '_X3retm_2' declared here
23:00:45 55 | uint64_t ret = 0;
23:00:45 | ^
23:00:45 CFA concurrency/io/call.lo
23:00:45/usr/include/linux/io_uring.h:83:43: warning: 'packed' attribute ignored for field of type 'union __io_uring_sqe____anonymous55' [-Wattributes]
23:00:45 83 | } __attribute__((packed));
23:00:45 | ^
23:00:45/usr/include/linux/io_uring.h:83:43: warning: 'packed' attribute ignored for field of type 'union __io_uring_sqe____anonymous131' [-Wattributes]
23:00:45 83 | } __attribute__((packed));
23:00:45 | ^
23:00:45/usr/include/x86_64-linux-gnu/bits/socket2.h:70:95: warning: '_X12_constructorFv_U26__anonymous___SOCKADDR_ARGU26__anonymous___SOCKADDR_ARG_autogen___1' is static but used in inline function 'recvfrom' which is not static
23:00:45 70 | return __recvfrom_chk (__fd, __buf, __n, sz, __flags, __addr, __addr_len);
23:00:45 | ^
23:00:45/usr/include/x86_64-linux-gnu/bits/socket2.h:70:125: warning: '_X11_destructorFv_U26__anonymous___SOCKADDR_ARG_autogen___1' is static but used in inline function 'recvfrom' which is not static
23:00:45 70 | return __recvfrom_chk (__fd, __buf, __n, sz, __flags, __addr, __addr_len);
23:00:45 | ^
23:00:45/usr/include/x86_64-linux-gnu/bits/socket2.h:68:104: warning: '_X12_constructorFv_U26__anonymous___SOCKADDR_ARGU26__anonymous___SOCKADDR_ARG_autogen___1' is static but used in inline function 'recvfrom' which is not static
23:00:45 68 | return __recvfrom_chk_warn (__fd, __buf, __n, sz, __flags, __addr,
23:00:45 | ^
23:00:45/usr/include/x86_64-linux-gnu/bits/socket2.h:68:129: warning: '_X11_destructorFv_U26__anonymous___SOCKADDR_ARG_autogen___1' is static but used in inline function 'recvfrom' which is not static
23:00:45 68 | return __recvfrom_chk_warn (__fd, __buf, __n, sz, __flags, __addr,
23:00:45 | ^
23:00:45/usr/include/x86_64-linux-gnu/bits/socket2.h:66:97: warning: '_X12_constructorFv_U26__anonymous___SOCKADDR_ARGU26__anonymous___SOCKADDR_ARG_autogen___1' is static but used in inline function 'recvfrom' which is not static
23:00:45 66 | return __recvfrom_alias (__fd, __buf, __n, __flags, __addr, __addr_len);
23:00:45 | ^
23:00:45/usr/include/x86_64-linux-gnu/bits/socket2.h:66:129: warning: '_X11_destructorFv_U26__anonymous___SOCKADDR_ARG_autogen___1' is static but used in inline function 'recvfrom' which is not static
23:00:45 66 | return __recvfrom_alias (__fd, __buf, __n, __flags, __addr, __addr_len);
23:00:45 | ^
23:00:45/usr/include/x86_64-linux-gnu/bits/socket2.h:70:95: warning: '_X12_constructorFv_U26__anonymous___SOCKADDR_ARGU26__anonymous___SOCKADDR_ARG_autogen___1' is static but used in inline function 'recvfrom' which is not static
23:00:45 70 | return __recvfrom_chk (__fd, __buf, __n, sz, __flags, __addr, __addr_len);
23:00:45 | ^
23:00:45/usr/include/x86_64-linux-gnu/bits/socket2.h:70:125: warning: '_X11_destructorFv_U26__anonymous___SOCKADDR_ARG_autogen___1' is static but used in inline function 'recvfrom' which is not static
23:00:45 70 | return __recvfrom_chk (__fd, __buf, __n, sz, __flags, __addr, __addr_len);
23:00:45 | ^
23:00:45/usr/include/x86_64-linux-gnu/bits/socket2.h:68:104: warning: '_X12_constructorFv_U26__anonymous___SOCKADDR_ARGU26__anonymous___SOCKADDR_ARG_autogen___1' is static but used in inline function 'recvfrom' which is not static
23:00:45 68 | return __recvfrom_chk_warn (__fd, __buf, __n, sz, __flags, __addr,
23:00:45 | ^
23:00:45/usr/include/x86_64-linux-gnu/bits/socket2.h:68:129: warning: '_X11_destructorFv_U26__anonymous___SOCKADDR_ARG_autogen___1' is static but used in inline function 'recvfrom' which is not static
23:00:45 68 | return __recvfrom_chk_warn (__fd, __buf, __n, sz, __flags, __addr,
23:00:45 | ^
23:00:45/usr/include/x86_64-linux-gnu/bits/socket2.h:66:97: warning: '_X12_constructorFv_U26__anonymous___SOCKADDR_ARGU26__anonymous___SOCKADDR_ARG_autogen___1' is static but used in inline function 'recvfrom' which is not static
23:00:45 66 | return __recvfrom_alias (__fd, __buf, __n, __flags, __addr, __addr_len);
23:00:45 | ^
23:00:45/usr/include/x86_64-linux-gnu/bits/socket2.h:66:129: warning: '_X11_destructorFv_U26__anonymous___SOCKADDR_ARG_autogen___1' is static but used in inline function 'recvfrom' which is not static
23:00:45 66 | return __recvfrom_alias (__fd, __buf, __n, __flags, __addr, __addr_len);
23:00:45 | ^
23:00:45/var/lib/jenkins/workspace/Cforall_master_2/libcfa/src/concurrency/kernel/cluster.hfa: In function '_X15__atomic_load_nFd_PVdi__1':
23:00:45/var/lib/jenkins/workspace/Cforall_master_2/libcfa/src/concurrency/kernel/cluster.hfa:58:19: warning: '_X3retm_2' is used uninitialized [-Wuninitialized]
23:00:45 58 | double ret = *(volatile double *)rp;
23:00:45 | ^~~~~~~~~
23:00:45/var/lib/jenkins/workspace/Cforall_master_2/libcfa/src/concurrency/kernel/cluster.hfa:55:30: note: '_X3retm_2' declared here
23:00:45 55 | uint64_t ret = 0;
23:00:45 | ^
23:00:45 CCLD libcfa.la
23:00:45/usr/bin/ld: warning: .libs/common.o: requires executable stack (because the .note.GNU-stack section is executable)
23:00:45/usr/bin/ld: .libs/exception.o: warning: relocation against `__gcfa_personality_v0' in read-only section `.text'
23:00:45/usr/bin/ld: warning: creating DT_TEXTREL in a shared object
23:00:45/usr/include/linux/io_uring.h:83:43: warning: 'packed' attribute ignored for field of type 'union __io_uring_sqe____anonymous65' [-Wattributes]
23:00:45 83 | } __attribute__((packed));
23:00:45 | ^
23:00:45/usr/include/x86_64-linux-gnu/bits/socket2.h:70:94: warning: '_X12_constructorFv_U26__anonymous___SOCKADDR_ARGU26__anonymous___SOCKADDR_ARG_autogen___1' is static but used in inline function 'recvfrom' which is not static
23:00:45 70 | return __recvfrom_chk (__fd, __buf, __n, sz, __flags, __addr, __addr_len);
23:00:45 | ^
23:00:45/usr/include/x86_64-linux-gnu/bits/socket2.h:70:124: warning: '_X11_destructorFv_U26__anonymous___SOCKADDR_ARG_autogen___1' is static but used in inline function 'recvfrom' which is not static
23:00:45 70 | return __recvfrom_chk (__fd, __buf, __n, sz, __flags, __addr, __addr_len);
23:00:45 | ^
23:00:45/usr/include/x86_64-linux-gnu/bits/socket2.h:68:103: warning: '_X12_constructorFv_U26__anonymous___SOCKADDR_ARGU26__anonymous___SOCKADDR_ARG_autogen___1' is static but used in inline function 'recvfrom' which is not static
23:00:45 68 | return __recvfrom_chk_warn (__fd, __buf, __n, sz, __flags, __addr,
23:00:45 | ^
23:00:45/usr/include/x86_64-linux-gnu/bits/socket2.h:68:128: warning: '_X11_destructorFv_U26__anonymous___SOCKADDR_ARG_autogen___1' is static but used in inline function 'recvfrom' which is not static
23:00:45 68 | return __recvfrom_chk_warn (__fd, __buf, __n, sz, __flags, __addr,
23:00:45 | ^
23:00:45/usr/include/x86_64-linux-gnu/bits/socket2.h:66:96: warning: '_X12_constructorFv_U26__anonymous___SOCKADDR_ARGU26__anonymous___SOCKADDR_ARG_autogen___1' is static but used in inline function 'recvfrom' which is not static
23:00:45 66 | return __recvfrom_alias (__fd, __buf, __n, __flags, __addr, __addr_len);
23:00:45 | ^
23:00:45/usr/include/x86_64-linux-gnu/bits/socket2.h:66:128: warning: '_X11_destructorFv_U26__anonymous___SOCKADDR_ARG_autogen___1' is static but used in inline function 'recvfrom' which is not static
23:00:45 66 | return __recvfrom_alias (__fd, __buf, __n, __flags, __addr, __addr_len);
23:00:45 | ^
23:00:45/usr/include/linux/io_uring.h:83:43: warning: 'packed' attribute ignored for field of type 'union __io_uring_sqe____anonymous121' [-Wattributes]
23:00:45 83 | } __attribute__((packed));
23:00:45 | ^
23:00:45/usr/include/x86_64-linux-gnu/bits/socket2.h:70:95: warning: '_X12_constructorFv_U26__anonymous___SOCKADDR_ARGU26__anonymous___SOCKADDR_ARG_autogen___1' is static but used in inline function 'recvfrom' which is not static
23:00:45 70 | return __recvfrom_chk (__fd, __buf, __n, sz, __flags, __addr, __addr_len);
23:00:45 | ^
23:00:45/usr/include/x86_64-linux-gnu/bits/socket2.h:70:125: warning: '_X11_destructorFv_U26__anonymous___SOCKADDR_ARG_autogen___1' is static but used in inline function 'recvfrom' which is not static
23:00:45 70 | return __recvfrom_chk (__fd, __buf, __n, sz, __flags, __addr, __addr_len);
23:00:45 | ^
23:00:45/usr/include/x86_64-linux-gnu/bits/socket2.h:68:104: warning: '_X12_constructorFv_U26__anonymous___SOCKADDR_ARGU26__anonymous___SOCKADDR_ARG_autogen___1' is static but used in inline function 'recvfrom' which is not static
23:00:45 68 | return __recvfrom_chk_warn (__fd, __buf, __n, sz, __flags, __addr,
23:00:45 | ^
23:00:45/usr/include/x86_64-linux-gnu/bits/socket2.h:68:129: warning: '_X11_destructorFv_U26__anonymous___SOCKADDR_ARG_autogen___1' is static but used in inline function 'recvfrom' which is not static
23:00:45 68 | return __recvfrom_chk_warn (__fd, __buf, __n, sz, __flags, __addr,
23:00:45 | ^
23:00:45/usr/include/x86_64-linux-gnu/bits/socket2.h:66:97: warning: '_X12_constructorFv_U26__anonymous___SOCKADDR_ARGU26__anonymous___SOCKADDR_ARG_autogen___1' is static but used in inline function 'recvfrom' which is not static
23:00:45 66 | return __recvfrom_alias (__fd, __buf, __n, __flags, __addr, __addr_len);
23:00:45 | ^
23:00:45/usr/include/x86_64-linux-gnu/bits/socket2.h:66:129: warning: '_X11_destructorFv_U26__anonymous___SOCKADDR_ARG_autogen___1' is static but used in inline function 'recvfrom' which is not static
23:00:45 66 | return __recvfrom_alias (__fd, __buf, __n, __flags, __addr, __addr_len);
23:00:45 | ^
23:00:45/usr/include/linux/io_uring.h:83:43: warning: 'packed' attribute ignored for field of type 'union __io_uring_sqe____anonymous121' [-Wattributes]
23:00:45 83 | } __attribute__((packed));
23:00:45 | ^
23:00:45/usr/include/x86_64-linux-gnu/bits/socket2.h:70:95: warning: '_X12_constructorFv_U26__anonymous___SOCKADDR_ARGU26__anonymous___SOCKADDR_ARG_autogen___1' is static but used in inline function 'recvfrom' which is not static
23:00:45 70 | return __recvfrom_chk (__fd, __buf, __n, sz, __flags, __addr, __addr_len);
23:00:45 | ^
23:00:45/usr/include/x86_64-linux-gnu/bits/socket2.h:70:125: warning: '_X11_destructorFv_U26__anonymous___SOCKADDR_ARG_autogen___1' is static but used in inline function 'recvfrom' which is not static
23:00:45 70 | return __recvfrom_chk (__fd, __buf, __n, sz, __flags, __addr, __addr_len);
23:00:45 | ^
23:00:45/usr/include/x86_64-linux-gnu/bits/socket2.h:68:104: warning: '_X12_constructorFv_U26__anonymous___SOCKADDR_ARGU26__anonymous___SOCKADDR_ARG_autogen___1' is static but used in inline function 'recvfrom' which is not static
23:00:45 68 | return __recvfrom_chk_warn (__fd, __buf, __n, sz, __flags, __addr,
23:00:45 | ^
23:00:45/usr/include/x86_64-linux-gnu/bits/socket2.h:68:129: warning: '_X11_destructorFv_U26__anonymous___SOCKADDR_ARG_autogen___1' is static but used in inline function 'recvfrom' which is not static
23:00:45 68 | return __recvfrom_chk_warn (__fd, __buf, __n, sz, __flags, __addr,
23:00:45 | ^
23:00:45/usr/include/x86_64-linux-gnu/bits/socket2.h:66:97: warning: '_X12_constructorFv_U26__anonymous___SOCKADDR_ARGU26__anonymous___SOCKADDR_ARG_autogen___1' is static but used in inline function 'recvfrom' which is not static
23:00:45 66 | return __recvfrom_alias (__fd, __buf, __n, __flags, __addr, __addr_len);
23:00:45 | ^
23:00:45/usr/include/x86_64-linux-gnu/bits/socket2.h:66:129: warning: '_X11_destructorFv_U26__anonymous___SOCKADDR_ARG_autogen___1' is static but used in inline function 'recvfrom' which is not static
23:00:45 66 | return __recvfrom_alias (__fd, __buf, __n, __flags, __addr, __addr_len);
23:00:45 | ^
23:00:45/usr/include/linux/io_uring.h:83:43: warning: 'packed' attribute ignored for field of type 'union __io_uring_sqe____anonymous32' [-Wattributes]
23:00:45 83 | } __attribute__((packed));
23:00:45 | ^
23:00:45/usr/include/x86_64-linux-gnu/bits/socket2.h:70:94: warning: '_X12_constructorFv_U26__anonymous___SOCKADDR_ARGU26__anonymous___SOCKADDR_ARG_autogen___1' is static but used in inline function 'recvfrom' which is not static
23:00:45 70 | return __recvfrom_chk (__fd, __buf, __n, sz, __flags, __addr, __addr_len);
23:00:45 | ^
23:00:45/usr/include/x86_64-linux-gnu/bits/socket2.h:70:124: warning: '_X11_destructorFv_U26__anonymous___SOCKADDR_ARG_autogen___1' is static but used in inline function 'recvfrom' which is not static
23:00:45 70 | return __recvfrom_chk (__fd, __buf, __n, sz, __flags, __addr, __addr_len);
23:00:45 | ^
23:00:45/usr/include/x86_64-linux-gnu/bits/socket2.h:68:103: warning: '_X12_constructorFv_U26__anonymous___SOCKADDR_ARGU26__anonymous___SOCKADDR_ARG_autogen___1' is static but used in inline function 'recvfrom' which is not static
23:00:45 68 | return __recvfrom_chk_warn (__fd, __buf, __n, sz, __flags, __addr,
23:00:45 | ^
23:00:45/usr/include/x86_64-linux-gnu/bits/socket2.h:68:128: warning: '_X11_destructorFv_U26__anonymous___SOCKADDR_ARG_autogen___1' is static but used in inline function 'recvfrom' which is not static
23:00:45 68 | return __recvfrom_chk_warn (__fd, __buf, __n, sz, __flags, __addr,
23:00:45 | ^
23:00:45/usr/include/x86_64-linux-gnu/bits/socket2.h:66:96: warning: '_X12_constructorFv_U26__anonymous___SOCKADDR_ARGU26__anonymous___SOCKADDR_ARG_autogen___1' is static but used in inline function 'recvfrom' which is not static
23:00:45 66 | return __recvfrom_alias (__fd, __buf, __n, __flags, __addr, __addr_len);
23:00:45 | ^
23:00:45/usr/include/x86_64-linux-gnu/bits/socket2.h:66:128: warning: '_X11_destructorFv_U26__anonymous___SOCKADDR_ARG_autogen___1' is static but used in inline function 'recvfrom' which is not static
23:00:45 66 | return __recvfrom_alias (__fd, __buf, __n, __flags, __addr, __addr_len);
23:00:45 | ^
23:00:45/usr/include/linux/io_uring.h:83:43: warning: 'packed' attribute ignored for field of type 'union __io_uring_sqe____anonymous97' [-Wattributes]
23:00:45 83 | } __attribute__((packed));
23:00:45 | ^
23:00:45/usr/include/x86_64-linux-gnu/bits/socket2.h:70:95: warning: '_X12_constructorFv_U26__anonymous___SOCKADDR_ARGU26__anonymous___SOCKADDR_ARG_autogen___1' is static but used in inline function 'recvfrom' which is not static
23:00:45 70 | return __recvfrom_chk (__fd, __buf, __n, sz, __flags, __addr, __addr_len);
23:00:45 | ^
23:00:45/usr/include/x86_64-linux-gnu/bits/socket2.h:70:125: warning: '_X11_destructorFv_U26__anonymous___SOCKADDR_ARG_autogen___1' is static but used in inline function 'recvfrom' which is not static
23:00:45 70 | return __recvfrom_chk (__fd, __buf, __n, sz, __flags, __addr, __addr_len);
23:00:45 | ^
23:00:45/usr/include/x86_64-linux-gnu/bits/socket2.h:68:104: warning: '_X12_constructorFv_U26__anonymous___SOCKADDR_ARGU26__anonymous___SOCKADDR_ARG_autogen___1' is static but used in inline function 'recvfrom' which is not static
23:00:45 68 | return __recvfrom_chk_warn (__fd, __buf, __n, sz, __flags, __addr,
23:00:45 | ^
23:00:45/usr/include/x86_64-linux-gnu/bits/socket2.h:68:129: warning: '_X11_destructorFv_U26__anonymous___SOCKADDR_ARG_autogen___1' is static but used in inline function 'recvfrom' which is not static
23:00:45 68 | return __recvfrom_chk_warn (__fd, __buf, __n, sz, __flags, __addr,
23:00:45 | ^
23:00:45/usr/include/x86_64-linux-gnu/bits/socket2.h:66:97: warning: '_X12_constructorFv_U26__anonymous___SOCKADDR_ARGU26__anonymous___SOCKADDR_ARG_autogen___1' is static but used in inline function 'recvfrom' which is not static
23:00:45 66 | return __recvfrom_alias (__fd, __buf, __n, __flags, __addr, __addr_len);
23:00:45 | ^
23:00:45/usr/include/x86_64-linux-gnu/bits/socket2.h:66:129: warning: '_X11_destructorFv_U26__anonymous___SOCKADDR_ARG_autogen___1' is static but used in inline function 'recvfrom' which is not static
23:00:45 66 | return __recvfrom_alias (__fd, __buf, __n, __flags, __addr, __addr_len);
23:00:45 | ^
23:00:45 CCLD libcfathread.la
23:00:45/usr/bin/ld: warning: concurrency/.libs/coroutine.o: requires executable stack (because the .note.GNU-stack section is executable)
23:00:45make[1]: Nothing to be done for 'all-am'.
23:00:45[Pipeline] }
23:00:45[Pipeline] // dir
23:00:45[Pipeline] }
23:00:45[Pipeline] // stage
23:00:45[Pipeline] echo
23:00:45 -------- Build : install --------
23:00:45[Pipeline] stage
23:00:45[Pipeline] { (Build : install)
23:00:45[Pipeline] dir
23:00:45Running in /var/lib/jenkins/workspace/Cforall_master_2@tmp
23:00:45[Pipeline] {
23:00:45[Pipeline] sh
23:00:45+ nproc
23:00:45+ make -j 16 --no-print-directory install
23:00:45Making install in driver
23:00:45make install-exec-hook
23:00:45 /usr/bin/install -c cfa '/var/lib/jenkins/workspace/Cforall_master_2@tmp/bin//cfa'
23:00:45 /usr/bin/mkdir -p '/var/lib/jenkins/workspace/Cforall_master_2@tmp/lib/cfa/'
23:00:45 /bin/bash ../libtool --mode=install /usr/bin/install -c as cc1 '/var/lib/jenkins/workspace/Cforall_master_2@tmp/lib/cfa/'
23:00:45libtool: install: /usr/bin/install -c as /var/lib/jenkins/workspace/Cforall_master_2@tmp/lib/cfa/as
23:00:45libtool: install: /usr/bin/install -c cc1 /var/lib/jenkins/workspace/Cforall_master_2@tmp/lib/cfa/cc1
23:00:45Making install in src
23:00:45make install-am
23:00:45make[3]: Nothing to be done for 'install-exec-am'.
23:00:45 /usr/bin/mkdir -p '/var/lib/jenkins/workspace/Cforall_master_2@tmp/lib/cfa/'
23:00:45 /bin/bash ../libtool --mode=install /usr/bin/install -c ../driver/cfa-cpp '/var/lib/jenkins/workspace/Cforall_master_2@tmp/lib/cfa/'
23:00:45libtool: install: /usr/bin/install -c ../driver/cfa-cpp /var/lib/jenkins/workspace/Cforall_master_2@tmp/lib/cfa/cfa-cpp
23:00:45Making install in .
23:00:45(CDPATH="${ZSH_VERSION+.}:" && cd /var/lib/jenkins/workspace/Cforall_master_2 && /bin/bash '/var/lib/jenkins/workspace/Cforall_master_2/automake/missing' autoheader)
23:00:45rm -f stamp-h1
23:00:45touch /var/lib/jenkins/workspace/Cforall_master_2/src/config.h.in
23:00:45cd . && /bin/bash ./config.status config.h
23:00:45config.status: creating config.h
23:00:45config.status: config.h is unchanged
23:00:45make[2]: Nothing to be done for 'install-exec-am'.
23:00:45 /usr/bin/mkdir -p '/var/lib/jenkins/workspace/Cforall_master_2@tmp/share/man/man1'
23:00:45 /usr/bin/install -c -m 644 /var/lib/jenkins/workspace/Cforall_master_2/doc/man/cfa.1 '/var/lib/jenkins/workspace/Cforall_master_2@tmp/share/man/man1'
23:00:45Making install in libcfa/x64-debug
23:00:45Making install in prelude
23:00:45make[3]: Nothing to be done for 'install-exec-am'.
23:00:45 /usr/bin/mkdir -p '/var/lib/jenkins/workspace/Cforall_master_2@tmp/lib/cfa/x64-debug/'
23:00:45 /usr/bin/install -c -m 644 gcc-builtins.cfa builtins.cfa extras.cfa prelude.cfa bootloader.c defines.hfa '/var/lib/jenkins/workspace/Cforall_master_2@tmp/lib/cfa/x64-debug/'
23:00:45Making install in src
23:00:45 /usr/bin/mkdir -p '/var/lib/jenkins/workspace/Cforall_master_2@tmp/lib/cfa/x64-debug/'
23:00:45 /bin/bash ../libtool --mode=install /usr/bin/install -c libcfa.la libcfathread.la '/var/lib/jenkins/workspace/Cforall_master_2@tmp/lib/cfa/x64-debug/'
23:00:45 /usr/bin/mkdir -p '/var/lib/jenkins/workspace/Cforall_master_2@tmp/include/cfa/'
23:00:45 /usr/bin/mkdir -p '/var/lib/jenkins/workspace/Cforall_master_2@tmp/include/cfa//stdhdr/sys'
23:00:45 /usr/bin/install -c -m 644 /var/lib/jenkins/workspace/Cforall_master_2/libcfa/src/stdhdr/sys/socket.h /var/lib/jenkins/workspace/Cforall_master_2/libcfa/src/stdhdr/sys/time.h /var/lib/jenkins/workspace/Cforall_master_2/libcfa/src/stdhdr/sys/mman.h '/var/lib/jenkins/workspace/Cforall_master_2@tmp/include/cfa//stdhdr/sys'
23:00:45 /usr/bin/mkdir -p '/var/lib/jenkins/workspace/Cforall_master_2@tmp/include/cfa//algorithms'
23:00:45 /usr/bin/install -c -m 644 /var/lib/jenkins/workspace/Cforall_master_2/libcfa/src/algorithms/range_iterator.hfa '/var/lib/jenkins/workspace/Cforall_master_2@tmp/include/cfa//algorithms'
23:00:45 /usr/bin/mkdir -p '/var/lib/jenkins/workspace/Cforall_master_2@tmp/include/cfa//concurrency/kernel'
23:00:45 /usr/bin/install -c -m 644 /var/lib/jenkins/workspace/Cforall_master_2/libcfa/src/concurrency/kernel/cluster.hfa /var/lib/jenkins/workspace/Cforall_master_2/libcfa/src/concurrency/kernel/fwd.hfa '/var/lib/jenkins/workspace/Cforall_master_2@tmp/include/cfa//concurrency/kernel'
23:00:45 /usr/bin/install -c -m 644 /var/lib/jenkins/workspace/Cforall_master_2/libcfa/src/common.hfa /var/lib/jenkins/workspace/Cforall_master_2/libcfa/src/fstream.hfa /var/lib/jenkins/workspace/Cforall_master_2/libcfa/src/heap.hfa /var/lib/jenkins/workspace/Cforall_master_2/libcfa/src/iostream.hfa /var/lib/jenkins/workspace/Cforall_master_2/libcfa/src/iterator.hfa /var/lib/jenkins/workspace/Cforall_master_2/libcfa/src/limits.hfa /var/lib/jenkins/workspace/Cforall_master_2/libcfa/src/math.hfa /var/lib/jenkins/workspace/Cforall_master_2/libcfa/src/memory.hfa /var/lib/jenkins/workspace/Cforall_master_2/libcfa/src/parseargs.hfa /var/lib/jenkins/workspace/Cforall_master_2/libcfa/src/parseconfig.hfa /var/lib/jenkins/workspace/Cforall_master_2/libcfa/src/rational.hfa /var/lib/jenkins/workspace/Cforall_master_2/libcfa/src/stdlib.hfa /var/lib/jenkins/workspace/Cforall_master_2/libcfa/src/strstream.hfa /var/lib/jenkins/workspace/Cforall_master_2/libcfa/src/time.hfa /var/lib/jenkins/workspace/Cforall_master_2/libcfa/src/Exception.hfa /var/lib/jenkins/workspace/Cforall_master_2/libcfa/src/bitmanip.hfa /var/lib/jenkins/workspace/Cforall_master_2/libcfa/src/clock.hfa /var/lib/jenkins/workspace/Cforall_master_2/libcfa/src/exception.hfa /var/lib/jenkins/workspace/Cforall_master_2/libcfa/src/exception.h /var/lib/jenkins/workspace/Cforall_master_2/libcfa/src/gmp.hfa /var/lib/jenkins/workspace/Cforall_master_2/libcfa/src/math.trait.hfa /var/lib/jenkins/workspace/Cforall_master_2/libcfa/src/raii.hfa /var/lib/jenkins/workspace/Cforall_master_2/libcfa/src/time_t.hfa /var/lib/jenkins/workspace/Cforall_master_2/libcfa/src/virtual_dtor.hfa '/var/lib/jenkins/workspace/Cforall_master_2@tmp/include/cfa//.'
23:00:45 /usr/bin/mkdir -p '/var/lib/jenkins/workspace/Cforall_master_2@tmp/include/cfa//concurrency'
23:00:45 /usr/bin/install -c -m 644 /var/lib/jenkins/workspace/Cforall_master_2/libcfa/src/concurrency/iofwd.hfa /var/lib/jenkins/workspace/Cforall_master_2/libcfa/src/concurrency/barrier.hfa /var/lib/jenkins/workspace/Cforall_master_2/libcfa/src/concurrency/alarm.hfa /var/lib/jenkins/workspace/Cforall_master_2/libcfa/src/concurrency/coroutine.hfa /var/lib/jenkins/workspace/Cforall_master_2/libcfa/src/concurrency/exception.hfa /var/lib/jenkins/workspace/Cforall_master_2/libcfa/src/concurrency/kernel.hfa /var/lib/jenkins/workspace/Cforall_master_2/libcfa/src/concurrency/locks.hfa /var/lib/jenkins/workspace/Cforall_master_2/libcfa/src/concurrency/monitor.hfa /var/lib/jenkins/workspace/Cforall_master_2/libcfa/src/concurrency/mutex.hfa /var/lib/jenkins/workspace/Cforall_master_2/libcfa/src/concurrency/select.hfa /var/lib/jenkins/workspace/Cforall_master_2/libcfa/src/concurrency/thread.hfa /var/lib/jenkins/workspace/Cforall_master_2/libcfa/src/concurrency/cofor.hfa /var/lib/jenkins/workspace/Cforall_master_2/libcfa/src/concurrency/invoke.h /var/lib/jenkins/workspace/Cforall_master_2/libcfa/src/concurrency/future.hfa /var/lib/jenkins/workspace/Cforall_master_2/libcfa/src/concurrency/once.hfa /var/lib/jenkins/workspace/Cforall_master_2/libcfa/src/concurrency/mutex_stmt.hfa /var/lib/jenkins/workspace/Cforall_master_2/libcfa/src/concurrency/channel.hfa /var/lib/jenkins/workspace/Cforall_master_2/libcfa/src/concurrency/actor.hfa '/var/lib/jenkins/workspace/Cforall_master_2@tmp/include/cfa//concurrency'
23:00:45 /usr/bin/mkdir -p '/var/lib/jenkins/workspace/Cforall_master_2@tmp/include/cfa//concurrency/clib'
23:00:45 /usr/bin/install -c -m 644 /var/lib/jenkins/workspace/Cforall_master_2/libcfa/src/concurrency/clib/cfathread.h '/var/lib/jenkins/workspace/Cforall_master_2@tmp/include/cfa//concurrency/clib'
23:00:45 /usr/bin/mkdir -p '/var/lib/jenkins/workspace/Cforall_master_2@tmp/include/cfa//device'
23:00:45 /usr/bin/install -c -m 644 /var/lib/jenkins/workspace/Cforall_master_2/libcfa/src/device/cpu.hfa '/var/lib/jenkins/workspace/Cforall_master_2@tmp/include/cfa//device'
23:00:45 /usr/bin/mkdir -p '/var/lib/jenkins/workspace/Cforall_master_2@tmp/include/cfa//stdhdr/libltdl'
23:00:45libtool: install: /usr/bin/install -c .libs/libcfa.so.1.0.0 /var/lib/jenkins/workspace/Cforall_master_2@tmp/lib/cfa/x64-debug/libcfa.so.1.0.0
23:00:45 /usr/bin/install -c -m 644 /var/lib/jenkins/workspace/Cforall_master_2/libcfa/src/stdhdr/libltdl/lt_dlloader.h '/var/lib/jenkins/workspace/Cforall_master_2@tmp/include/cfa//stdhdr/libltdl'
23:00:45 /usr/bin/mkdir -p '/var/lib/jenkins/workspace/Cforall_master_2@tmp/include/cfa//vec'
23:00:45 /usr/bin/install -c -m 644 /var/lib/jenkins/workspace/Cforall_master_2/libcfa/src/vec/vec.hfa /var/lib/jenkins/workspace/Cforall_master_2/libcfa/src/vec/vec2.hfa /var/lib/jenkins/workspace/Cforall_master_2/libcfa/src/vec/vec3.hfa /var/lib/jenkins/workspace/Cforall_master_2/libcfa/src/vec/vec4.hfa '/var/lib/jenkins/workspace/Cforall_master_2@tmp/include/cfa//vec'
23:00:45 /usr/bin/mkdir -p '/var/lib/jenkins/workspace/Cforall_master_2@tmp/include/cfa//bits'
23:00:45libtool: install: (cd /var/lib/jenkins/workspace/Cforall_master_2@tmp/lib/cfa/x64-debug && { ln -s -f libcfa.so.1.0.0 libcfa.so.1 || { rm -f libcfa.so.1 && ln -s libcfa.so.1.0.0 libcfa.so.1; }; })
23:00:45 /usr/bin/install -c -m 644 /var/lib/jenkins/workspace/Cforall_master_2/libcfa/src/bits/weakso_locks.hfa /var/lib/jenkins/workspace/Cforall_master_2/libcfa/src/bits/algorithm.hfa /var/lib/jenkins/workspace/Cforall_master_2/libcfa/src/bits/align.hfa /var/lib/jenkins/workspace/Cforall_master_2/libcfa/src/bits/collections.hfa /var/lib/jenkins/workspace/Cforall_master_2/libcfa/src/bits/debug.hfa /var/lib/jenkins/workspace/Cforall_master_2/libcfa/src/bits/defs.hfa /var/lib/jenkins/workspace/Cforall_master_2/libcfa/src/bits/locks.hfa /var/lib/jenkins/workspace/Cforall_master_2/libcfa/src/bits/collection.hfa /var/lib/jenkins/workspace/Cforall_master_2/libcfa/src/bits/stack.hfa /var/lib/jenkins/workspace/Cforall_master_2/libcfa/src/bits/queue.hfa /var/lib/jenkins/workspace/Cforall_master_2/libcfa/src/bits/sequence.hfa /var/lib/jenkins/workspace/Cforall_master_2/libcfa/src/bits/atomic.hfa /var/lib/jenkins/workspace/Cforall_master_2/libcfa/src/bits/random.hfa '/var/lib/jenkins/workspace/Cforall_master_2@tmp/include/cfa//bits'
23:00:45libtool: install: (cd /var/lib/jenkins/workspace/Cforall_master_2@tmp/lib/cfa/x64-debug && { ln -s -f libcfa.so.1.0.0 libcfa.so || { rm -f libcfa.so && ln -s libcfa.so.1.0.0 libcfa.so; }; })
23:00:45 /usr/bin/mkdir -p '/var/lib/jenkins/workspace/Cforall_master_2@tmp/include/cfa//stdhdr'
23:00:45 /usr/bin/install -c -m 644 /var/lib/jenkins/workspace/Cforall_master_2/libcfa/src/stdhdr/string.h /var/lib/jenkins/workspace/Cforall_master_2/libcfa/src/stdhdr/uchar.h /var/lib/jenkins/workspace/Cforall_master_2/libcfa/src/stdhdr/stdbool.h /var/lib/jenkins/workspace/Cforall_master_2/libcfa/src/stdhdr/iso646.h /var/lib/jenkins/workspace/Cforall_master_2/libcfa/src/stdhdr/stddef.h /var/lib/jenkins/workspace/Cforall_master_2/libcfa/src/stdhdr/inttypes.h /var/lib/jenkins/workspace/Cforall_master_2/libcfa/src/stdhdr/wctype.h /var/lib/jenkins/workspace/Cforall_master_2/libcfa/src/stdhdr/limits.h /var/lib/jenkins/workspace/Cforall_master_2/libcfa/src/stdhdr/malloc.h /var/lib/jenkins/workspace/Cforall_master_2/libcfa/src/stdhdr/assert.h /var/lib/jenkins/workspace/Cforall_master_2/libcfa/src/stdhdr/setjmp.h /var/lib/jenkins/workspace/Cforall_master_2/libcfa/src/stdhdr/complex.h /var/lib/jenkins/workspace/Cforall_master_2/libcfa/src/stdhdr/threads.h /var/lib/jenkins/workspace/Cforall_master_2/libcfa/src/stdhdr/locale.h /var/lib/jenkins/workspace/Cforall_master_2/libcfa/src/stdhdr/ctype.h /var/lib/jenkins/workspace/Cforall_master_2/libcfa/src/stdhdr/stdlib.h /var/lib/jenkins/workspace/Cforall_master_2/libcfa/src/stdhdr/stdalign.h /var/lib/jenkins/workspace/Cforall_master_2/libcfa/src/stdhdr/fenv.h /var/lib/jenkins/workspace/Cforall_master_2/libcfa/src/stdhdr/stdarg.h /var/lib/jenkins/workspace/Cforall_master_2/libcfa/src/stdhdr/wchar.h /var/lib/jenkins/workspace/Cforall_master_2/libcfa/src/stdhdr/gmp.h /var/lib/jenkins/workspace/Cforall_master_2/libcfa/src/stdhdr/pthread.h /var/lib/jenkins/workspace/Cforall_master_2/libcfa/src/stdhdr/stdnoreturn.h /var/lib/jenkins/workspace/Cforall_master_2/libcfa/src/stdhdr/stdint.h /var/lib/jenkins/workspace/Cforall_master_2/libcfa/src/stdhdr/float.h /var/lib/jenkins/workspace/Cforall_master_2/libcfa/src/stdhdr/time.h /var/lib/jenkins/workspace/Cforall_master_2/libcfa/src/stdhdr/unistd.h /var/lib/jenkins/workspace/Cforall_master_2/libcfa/src/stdhdr/signal.h /var/lib/jenkins/workspace/Cforall_master_2/libcfa/src/stdhdr/stdio.h /var/lib/jenkins/workspace/Cforall_master_2/libcfa/src/stdhdr/tgmath.h /var/lib/jenkins/workspace/Cforall_master_2/libcfa/src/stdhdr/errno.h /var/lib/jenkins/workspace/Cforall_master_2/libcfa/src/stdhdr/stdatomic.h /var/lib/jenkins/workspace/Cforall_master_2/libcfa/src/stdhdr/unwind.h /var/lib/jenkins/workspace/Cforall_master_2/libcfa/src/stdhdr/math.h '/var/lib/jenkins/workspace/Cforall_master_2@tmp/include/cfa//stdhdr'
23:00:45 /usr/bin/mkdir -p '/var/lib/jenkins/workspace/Cforall_master_2@tmp/include/cfa//collections'
23:00:45libtool: install: /usr/bin/install -c .libs/libcfa.lai /var/lib/jenkins/workspace/Cforall_master_2@tmp/lib/cfa/x64-debug/libcfa.la
23:00:45 /usr/bin/install -c -m 644 /var/lib/jenkins/workspace/Cforall_master_2/libcfa/src/collections/maybe.hfa /var/lib/jenkins/workspace/Cforall_master_2/libcfa/src/collections/pair.hfa /var/lib/jenkins/workspace/Cforall_master_2/libcfa/src/collections/result.hfa /var/lib/jenkins/workspace/Cforall_master_2/libcfa/src/collections/string.hfa /var/lib/jenkins/workspace/Cforall_master_2/libcfa/src/collections/string_res.hfa /var/lib/jenkins/workspace/Cforall_master_2/libcfa/src/collections/vector.hfa /var/lib/jenkins/workspace/Cforall_master_2/libcfa/src/collections/array.hfa /var/lib/jenkins/workspace/Cforall_master_2/libcfa/src/collections/list.hfa /var/lib/jenkins/workspace/Cforall_master_2/libcfa/src/collections/list2.hfa /var/lib/jenkins/workspace/Cforall_master_2/libcfa/src/collections/lockfree.hfa /var/lib/jenkins/workspace/Cforall_master_2/libcfa/src/collections/string_sharectx.hfa /var/lib/jenkins/workspace/Cforall_master_2/libcfa/src/collections/vector2.hfa '/var/lib/jenkins/workspace/Cforall_master_2@tmp/include/cfa//collections'
23:00:45libtool: install: /usr/bin/install -c .libs/libcfathread.so.1.0.0 /var/lib/jenkins/workspace/Cforall_master_2@tmp/lib/cfa/x64-debug/libcfathread.so.1.0.0
23:00:45libtool: install: (cd /var/lib/jenkins/workspace/Cforall_master_2@tmp/lib/cfa/x64-debug && { ln -s -f libcfathread.so.1.0.0 libcfathread.so.1 || { rm -f libcfathread.so.1 && ln -s libcfathread.so.1.0.0 libcfathread.so.1; }; })
23:00:45libtool: install: (cd /var/lib/jenkins/workspace/Cforall_master_2@tmp/lib/cfa/x64-debug && { ln -s -f libcfathread.so.1.0.0 libcfathread.so || { rm -f libcfathread.so && ln -s libcfathread.so.1.0.0 libcfathread.so; }; })
23:00:45libtool: install: /usr/bin/install -c .libs/libcfathread.lai /var/lib/jenkins/workspace/Cforall_master_2@tmp/lib/cfa/x64-debug/libcfathread.la
23:00:45libtool: warning: remember to run 'libtool --finish /var/lib/jenkins/workspace/Cforall_master_2@tmp/lib/cfa/x64-debug/'
23:00:45make[3]: Nothing to be done for 'install-exec-am'.
23:00:45make[3]: Nothing to be done for 'install-data-am'.
23:00:45Making install in libcfa/x64-nodebug
23:00:45Making install in prelude
23:00:45make[3]: Nothing to be done for 'install-exec-am'.
23:00:45 /usr/bin/mkdir -p '/var/lib/jenkins/workspace/Cforall_master_2@tmp/lib/cfa/x64-nodebug/'
23:00:45 /usr/bin/install -c -m 644 gcc-builtins.cfa builtins.cfa extras.cfa prelude.cfa bootloader.c defines.hfa '/var/lib/jenkins/workspace/Cforall_master_2@tmp/lib/cfa/x64-nodebug/'
23:00:45Making install in src
23:00:45 /usr/bin/mkdir -p '/var/lib/jenkins/workspace/Cforall_master_2@tmp/lib/cfa/x64-nodebug/'
23:00:45 /bin/bash ../libtool --mode=install /usr/bin/install -c libcfa.la libcfathread.la '/var/lib/jenkins/workspace/Cforall_master_2@tmp/lib/cfa/x64-nodebug/'
23:00:45 /usr/bin/mkdir -p '/var/lib/jenkins/workspace/Cforall_master_2@tmp/include/cfa/'
23:00:45 /usr/bin/mkdir -p '/var/lib/jenkins/workspace/Cforall_master_2@tmp/include/cfa//stdhdr/sys'
23:00:45 /usr/bin/install -c -m 644 /var/lib/jenkins/workspace/Cforall_master_2/libcfa/src/stdhdr/sys/socket.h /var/lib/jenkins/workspace/Cforall_master_2/libcfa/src/stdhdr/sys/time.h /var/lib/jenkins/workspace/Cforall_master_2/libcfa/src/stdhdr/sys/mman.h '/var/lib/jenkins/workspace/Cforall_master_2@tmp/include/cfa//stdhdr/sys'
23:00:45 /usr/bin/mkdir -p '/var/lib/jenkins/workspace/Cforall_master_2@tmp/include/cfa//algorithms'
23:00:45 /usr/bin/install -c -m 644 /var/lib/jenkins/workspace/Cforall_master_2/libcfa/src/algorithms/range_iterator.hfa '/var/lib/jenkins/workspace/Cforall_master_2@tmp/include/cfa//algorithms'
23:00:45 /usr/bin/mkdir -p '/var/lib/jenkins/workspace/Cforall_master_2@tmp/include/cfa//concurrency/kernel'
23:00:45 /usr/bin/install -c -m 644 /var/lib/jenkins/workspace/Cforall_master_2/libcfa/src/concurrency/kernel/cluster.hfa /var/lib/jenkins/workspace/Cforall_master_2/libcfa/src/concurrency/kernel/fwd.hfa '/var/lib/jenkins/workspace/Cforall_master_2@tmp/include/cfa//concurrency/kernel'
23:00:45 /usr/bin/install -c -m 644 /var/lib/jenkins/workspace/Cforall_master_2/libcfa/src/common.hfa /var/lib/jenkins/workspace/Cforall_master_2/libcfa/src/fstream.hfa /var/lib/jenkins/workspace/Cforall_master_2/libcfa/src/heap.hfa /var/lib/jenkins/workspace/Cforall_master_2/libcfa/src/iostream.hfa /var/lib/jenkins/workspace/Cforall_master_2/libcfa/src/iterator.hfa /var/lib/jenkins/workspace/Cforall_master_2/libcfa/src/limits.hfa /var/lib/jenkins/workspace/Cforall_master_2/libcfa/src/math.hfa /var/lib/jenkins/workspace/Cforall_master_2/libcfa/src/memory.hfa /var/lib/jenkins/workspace/Cforall_master_2/libcfa/src/parseargs.hfa /var/lib/jenkins/workspace/Cforall_master_2/libcfa/src/parseconfig.hfa /var/lib/jenkins/workspace/Cforall_master_2/libcfa/src/rational.hfa /var/lib/jenkins/workspace/Cforall_master_2/libcfa/src/stdlib.hfa /var/lib/jenkins/workspace/Cforall_master_2/libcfa/src/strstream.hfa /var/lib/jenkins/workspace/Cforall_master_2/libcfa/src/time.hfa /var/lib/jenkins/workspace/Cforall_master_2/libcfa/src/Exception.hfa /var/lib/jenkins/workspace/Cforall_master_2/libcfa/src/bitmanip.hfa /var/lib/jenkins/workspace/Cforall_master_2/libcfa/src/clock.hfa /var/lib/jenkins/workspace/Cforall_master_2/libcfa/src/exception.hfa /var/lib/jenkins/workspace/Cforall_master_2/libcfa/src/exception.h /var/lib/jenkins/workspace/Cforall_master_2/libcfa/src/gmp.hfa /var/lib/jenkins/workspace/Cforall_master_2/libcfa/src/math.trait.hfa /var/lib/jenkins/workspace/Cforall_master_2/libcfa/src/raii.hfa /var/lib/jenkins/workspace/Cforall_master_2/libcfa/src/time_t.hfa /var/lib/jenkins/workspace/Cforall_master_2/libcfa/src/virtual_dtor.hfa '/var/lib/jenkins/workspace/Cforall_master_2@tmp/include/cfa//.'
23:00:45 /usr/bin/mkdir -p '/var/lib/jenkins/workspace/Cforall_master_2@tmp/include/cfa//concurrency'
23:00:45 /usr/bin/install -c -m 644 /var/lib/jenkins/workspace/Cforall_master_2/libcfa/src/concurrency/iofwd.hfa /var/lib/jenkins/workspace/Cforall_master_2/libcfa/src/concurrency/barrier.hfa /var/lib/jenkins/workspace/Cforall_master_2/libcfa/src/concurrency/alarm.hfa /var/lib/jenkins/workspace/Cforall_master_2/libcfa/src/concurrency/coroutine.hfa /var/lib/jenkins/workspace/Cforall_master_2/libcfa/src/concurrency/exception.hfa /var/lib/jenkins/workspace/Cforall_master_2/libcfa/src/concurrency/kernel.hfa /var/lib/jenkins/workspace/Cforall_master_2/libcfa/src/concurrency/locks.hfa /var/lib/jenkins/workspace/Cforall_master_2/libcfa/src/concurrency/monitor.hfa /var/lib/jenkins/workspace/Cforall_master_2/libcfa/src/concurrency/mutex.hfa /var/lib/jenkins/workspace/Cforall_master_2/libcfa/src/concurrency/select.hfa /var/lib/jenkins/workspace/Cforall_master_2/libcfa/src/concurrency/thread.hfa /var/lib/jenkins/workspace/Cforall_master_2/libcfa/src/concurrency/cofor.hfa /var/lib/jenkins/workspace/Cforall_master_2/libcfa/src/concurrency/invoke.h /var/lib/jenkins/workspace/Cforall_master_2/libcfa/src/concurrency/future.hfa /var/lib/jenkins/workspace/Cforall_master_2/libcfa/src/concurrency/once.hfa /var/lib/jenkins/workspace/Cforall_master_2/libcfa/src/concurrency/mutex_stmt.hfa /var/lib/jenkins/workspace/Cforall_master_2/libcfa/src/concurrency/channel.hfa /var/lib/jenkins/workspace/Cforall_master_2/libcfa/src/concurrency/actor.hfa '/var/lib/jenkins/workspace/Cforall_master_2@tmp/include/cfa//concurrency'
23:00:45 /usr/bin/mkdir -p '/var/lib/jenkins/workspace/Cforall_master_2@tmp/include/cfa//concurrency/clib'
23:00:45 /usr/bin/install -c -m 644 /var/lib/jenkins/workspace/Cforall_master_2/libcfa/src/concurrency/clib/cfathread.h '/var/lib/jenkins/workspace/Cforall_master_2@tmp/include/cfa//concurrency/clib'
23:00:45 /usr/bin/mkdir -p '/var/lib/jenkins/workspace/Cforall_master_2@tmp/include/cfa//device'
23:00:45 /usr/bin/install -c -m 644 /var/lib/jenkins/workspace/Cforall_master_2/libcfa/src/device/cpu.hfa '/var/lib/jenkins/workspace/Cforall_master_2@tmp/include/cfa//device'
23:00:45 /usr/bin/mkdir -p '/var/lib/jenkins/workspace/Cforall_master_2@tmp/include/cfa//stdhdr/libltdl'
23:00:45 /usr/bin/install -c -m 644 /var/lib/jenkins/workspace/Cforall_master_2/libcfa/src/stdhdr/libltdl/lt_dlloader.h '/var/lib/jenkins/workspace/Cforall_master_2@tmp/include/cfa//stdhdr/libltdl'
23:00:45libtool: install: /usr/bin/install -c .libs/libcfa.so.1.0.0 /var/lib/jenkins/workspace/Cforall_master_2@tmp/lib/cfa/x64-nodebug/libcfa.so.1.0.0
23:00:45 /usr/bin/mkdir -p '/var/lib/jenkins/workspace/Cforall_master_2@tmp/include/cfa//vec'
23:00:45 /usr/bin/install -c -m 644 /var/lib/jenkins/workspace/Cforall_master_2/libcfa/src/vec/vec.hfa /var/lib/jenkins/workspace/Cforall_master_2/libcfa/src/vec/vec2.hfa /var/lib/jenkins/workspace/Cforall_master_2/libcfa/src/vec/vec3.hfa /var/lib/jenkins/workspace/Cforall_master_2/libcfa/src/vec/vec4.hfa '/var/lib/jenkins/workspace/Cforall_master_2@tmp/include/cfa//vec'
23:00:45 /usr/bin/mkdir -p '/var/lib/jenkins/workspace/Cforall_master_2@tmp/include/cfa//bits'
23:00:45 /usr/bin/install -c -m 644 /var/lib/jenkins/workspace/Cforall_master_2/libcfa/src/bits/weakso_locks.hfa /var/lib/jenkins/workspace/Cforall_master_2/libcfa/src/bits/algorithm.hfa /var/lib/jenkins/workspace/Cforall_master_2/libcfa/src/bits/align.hfa /var/lib/jenkins/workspace/Cforall_master_2/libcfa/src/bits/collections.hfa /var/lib/jenkins/workspace/Cforall_master_2/libcfa/src/bits/debug.hfa /var/lib/jenkins/workspace/Cforall_master_2/libcfa/src/bits/defs.hfa /var/lib/jenkins/workspace/Cforall_master_2/libcfa/src/bits/locks.hfa /var/lib/jenkins/workspace/Cforall_master_2/libcfa/src/bits/collection.hfa /var/lib/jenkins/workspace/Cforall_master_2/libcfa/src/bits/stack.hfa /var/lib/jenkins/workspace/Cforall_master_2/libcfa/src/bits/queue.hfa /var/lib/jenkins/workspace/Cforall_master_2/libcfa/src/bits/sequence.hfa /var/lib/jenkins/workspace/Cforall_master_2/libcfa/src/bits/atomic.hfa /var/lib/jenkins/workspace/Cforall_master_2/libcfa/src/bits/random.hfa '/var/lib/jenkins/workspace/Cforall_master_2@tmp/include/cfa//bits'
23:00:45libtool: install: (cd /var/lib/jenkins/workspace/Cforall_master_2@tmp/lib/cfa/x64-nodebug && { ln -s -f libcfa.so.1.0.0 libcfa.so.1 || { rm -f libcfa.so.1 && ln -s libcfa.so.1.0.0 libcfa.so.1; }; })
23:00:45 /usr/bin/mkdir -p '/var/lib/jenkins/workspace/Cforall_master_2@tmp/include/cfa//stdhdr'
23:00:45libtool: install: (cd /var/lib/jenkins/workspace/Cforall_master_2@tmp/lib/cfa/x64-nodebug && { ln -s -f libcfa.so.1.0.0 libcfa.so || { rm -f libcfa.so && ln -s libcfa.so.1.0.0 libcfa.so; }; })
23:00:45 /usr/bin/install -c -m 644 /var/lib/jenkins/workspace/Cforall_master_2/libcfa/src/stdhdr/string.h /var/lib/jenkins/workspace/Cforall_master_2/libcfa/src/stdhdr/uchar.h /var/lib/jenkins/workspace/Cforall_master_2/libcfa/src/stdhdr/stdbool.h /var/lib/jenkins/workspace/Cforall_master_2/libcfa/src/stdhdr/iso646.h /var/lib/jenkins/workspace/Cforall_master_2/libcfa/src/stdhdr/stddef.h /var/lib/jenkins/workspace/Cforall_master_2/libcfa/src/stdhdr/inttypes.h /var/lib/jenkins/workspace/Cforall_master_2/libcfa/src/stdhdr/wctype.h /var/lib/jenkins/workspace/Cforall_master_2/libcfa/src/stdhdr/limits.h /var/lib/jenkins/workspace/Cforall_master_2/libcfa/src/stdhdr/malloc.h /var/lib/jenkins/workspace/Cforall_master_2/libcfa/src/stdhdr/assert.h /var/lib/jenkins/workspace/Cforall_master_2/libcfa/src/stdhdr/setjmp.h /var/lib/jenkins/workspace/Cforall_master_2/libcfa/src/stdhdr/complex.h /var/lib/jenkins/workspace/Cforall_master_2/libcfa/src/stdhdr/threads.h /var/lib/jenkins/workspace/Cforall_master_2/libcfa/src/stdhdr/locale.h /var/lib/jenkins/workspace/Cforall_master_2/libcfa/src/stdhdr/ctype.h /var/lib/jenkins/workspace/Cforall_master_2/libcfa/src/stdhdr/stdlib.h /var/lib/jenkins/workspace/Cforall_master_2/libcfa/src/stdhdr/stdalign.h /var/lib/jenkins/workspace/Cforall_master_2/libcfa/src/stdhdr/fenv.h /var/lib/jenkins/workspace/Cforall_master_2/libcfa/src/stdhdr/stdarg.h /var/lib/jenkins/workspace/Cforall_master_2/libcfa/src/stdhdr/wchar.h /var/lib/jenkins/workspace/Cforall_master_2/libcfa/src/stdhdr/gmp.h /var/lib/jenkins/workspace/Cforall_master_2/libcfa/src/stdhdr/pthread.h /var/lib/jenkins/workspace/Cforall_master_2/libcfa/src/stdhdr/stdnoreturn.h /var/lib/jenkins/workspace/Cforall_master_2/libcfa/src/stdhdr/stdint.h /var/lib/jenkins/workspace/Cforall_master_2/libcfa/src/stdhdr/float.h /var/lib/jenkins/workspace/Cforall_master_2/libcfa/src/stdhdr/time.h /var/lib/jenkins/workspace/Cforall_master_2/libcfa/src/stdhdr/unistd.h /var/lib/jenkins/workspace/Cforall_master_2/libcfa/src/stdhdr/signal.h /var/lib/jenkins/workspace/Cforall_master_2/libcfa/src/stdhdr/stdio.h /var/lib/jenkins/workspace/Cforall_master_2/libcfa/src/stdhdr/tgmath.h /var/lib/jenkins/workspace/Cforall_master_2/libcfa/src/stdhdr/errno.h /var/lib/jenkins/workspace/Cforall_master_2/libcfa/src/stdhdr/stdatomic.h /var/lib/jenkins/workspace/Cforall_master_2/libcfa/src/stdhdr/unwind.h /var/lib/jenkins/workspace/Cforall_master_2/libcfa/src/stdhdr/math.h '/var/lib/jenkins/workspace/Cforall_master_2@tmp/include/cfa//stdhdr'
23:00:45 /usr/bin/mkdir -p '/var/lib/jenkins/workspace/Cforall_master_2@tmp/include/cfa//collections'
23:00:45 /usr/bin/install -c -m 644 /var/lib/jenkins/workspace/Cforall_master_2/libcfa/src/collections/maybe.hfa /var/lib/jenkins/workspace/Cforall_master_2/libcfa/src/collections/pair.hfa /var/lib/jenkins/workspace/Cforall_master_2/libcfa/src/collections/result.hfa /var/lib/jenkins/workspace/Cforall_master_2/libcfa/src/collections/string.hfa /var/lib/jenkins/workspace/Cforall_master_2/libcfa/src/collections/string_res.hfa /var/lib/jenkins/workspace/Cforall_master_2/libcfa/src/collections/vector.hfa /var/lib/jenkins/workspace/Cforall_master_2/libcfa/src/collections/array.hfa /var/lib/jenkins/workspace/Cforall_master_2/libcfa/src/collections/list.hfa /var/lib/jenkins/workspace/Cforall_master_2/libcfa/src/collections/list2.hfa /var/lib/jenkins/workspace/Cforall_master_2/libcfa/src/collections/lockfree.hfa /var/lib/jenkins/workspace/Cforall_master_2/libcfa/src/collections/string_sharectx.hfa /var/lib/jenkins/workspace/Cforall_master_2/libcfa/src/collections/vector2.hfa '/var/lib/jenkins/workspace/Cforall_master_2@tmp/include/cfa//collections'
23:00:45libtool: install: /usr/bin/install -c .libs/libcfa.lai /var/lib/jenkins/workspace/Cforall_master_2@tmp/lib/cfa/x64-nodebug/libcfa.la
23:00:45libtool: install: /usr/bin/install -c .libs/libcfathread.so.1.0.0 /var/lib/jenkins/workspace/Cforall_master_2@tmp/lib/cfa/x64-nodebug/libcfathread.so.1.0.0
23:00:45libtool: install: (cd /var/lib/jenkins/workspace/Cforall_master_2@tmp/lib/cfa/x64-nodebug && { ln -s -f libcfathread.so.1.0.0 libcfathread.so.1 || { rm -f libcfathread.so.1 && ln -s libcfathread.so.1.0.0 libcfathread.so.1; }; })
23:00:45libtool: install: (cd /var/lib/jenkins/workspace/Cforall_master_2@tmp/lib/cfa/x64-nodebug && { ln -s -f libcfathread.so.1.0.0 libcfathread.so || { rm -f libcfathread.so && ln -s libcfathread.so.1.0.0 libcfathread.so; }; })
23:00:45libtool: install: /usr/bin/install -c .libs/libcfathread.lai /var/lib/jenkins/workspace/Cforall_master_2@tmp/lib/cfa/x64-nodebug/libcfathread.la
23:00:45libtool: warning: remember to run 'libtool --finish /var/lib/jenkins/workspace/Cforall_master_2@tmp/lib/cfa/x64-nodebug/'
23:00:45make[3]: Nothing to be done for 'install-exec-am'.
23:00:45make[3]: Nothing to be done for 'install-data-am'.
23:00:45[Pipeline] }
23:00:45[Pipeline] // dir
23:00:45[Pipeline] }
23:00:45[Pipeline] // stage
23:00:45[Pipeline] sh
23:00:45+ free -h
23:00:45 total used free shared buff/cache available
23:00:45Mem: 62Gi 2.6Gi 57Gi 4.9Mi 3.4Gi 60Gi
23:00:45Swap: 8.0Gi 0B 8.0Gi
23:00:45[Pipeline] sh
23:00:45+ ulimit -a
23:00:45time(seconds) unlimited
23:00:45file(blocks) unlimited
23:00:45data(kbytes) unlimited
23:00:45stack(kbytes) 8192
23:00:45coredump(blocks) 0
23:00:45memory(kbytes) unlimited
23:00:45locked memory(kbytes) 8238436
23:00:45process 257124
23:00:45nofiles 1048576
23:00:45vmemory(kbytes) unlimited
23:00:45locks unlimited
23:00:45rtprio 0
23:00:45[Pipeline] echo
23:00:45 -------- Test: Debug --------
23:00:45[Pipeline] stage
23:00:45[Pipeline] { (Test: Debug)
23:00:45[Pipeline] dir
23:00:45Running in /var/lib/jenkins/workspace/Cforall_master_2@tmp
23:00:45[Pipeline] {
23:00:45[Pipeline] sh
23:00:45+ nproc
23:00:45+ make -j 16 --no-print-directory -C tests timeout=600 global-timeout=14400 tests debug=yes archive-errors=/var/lib/jenkins/workspace/Cforall_master_2@tmp/tests/crashes/full-debug
23:00:45Running 378 tests on 16 cores (x64 - debug)
23:00:45 array-ERR3 PASSED C 0:00.070 - R n/a
23:00:45 array-ERR2 PASSED C 0:00.072 - R n/a
23:00:45 ...ollections/language-dim-mismatch PASSED C 0:00.465 - R n/a
23:00:45 array-ERR1 PASSED C 0:01.112 - R n/a
23:00:45 array PASSED C 0:01.209 - R 0:00.013
23:00:45 array-collections/c-dependent PASSED C 0:01.314 - R 0:00.020
23:00:45 array-collections/array-raii-c PASSED C 0:01.477 - R 0:00.023
23:00:45 array-collections/safety-summary PASSED C 0:00.965 - R n/a
23:00:45 array-collections/dimexpr-match-c PASSED C 0:01.605 - R 0:00.024
23:00:45 array-collections/symtab-collision PASSED C 0:00.642 - R n/a
23:00:45 array-collections/array-sbscr-types PASSED C 0:02.481 - R 0:00.024
23:00:45 attr-priority PASSED C 0:01.590 - R 0:00.001
23:00:45 castError PASSED C 0:01.277 - R n/a
23:00:45 array-collections/boxed PASSED C 0:02.989 - R 0:00.021
23:00:45 array-collections/array-basic PASSED C 0:03.064 - R 0:00.021
23:00:45 castReturn PASSED C 0:01.316 - R 0:00.036
23:00:45 cast PASSED C 0:01.564 - R 0:00.034
23:00:45 builtins/sync PASSED C 0:01.728 - R 0:00.006
23:00:45 array-collections/dimexpr-match-cfa PASSED C 0:03.272 - R 0:00.007
23:00:45 algorithms/range_test PASSED C 0:06.578 - R 0:00.012
23:00:45 array-collections/array-raii-cfa PASSED C 0:06.770 - R 0:00.006
23:00:45 avl_test PASSED C 0:05.554 - R 0:00.006
23:00:45 array-collections/accordion PASSED C 0:07.004 - R 0:00.007
23:00:45 alloc-ERROR PASSED C 0:07.043 - R n/a
23:00:45 collections/string-operator-ERR09 PASSED C 0:04.730 - R n/a
23:00:45 alloc PASSED C 0:11.782 - R 0:00.007
23:00:45 collections/stack PASSED C 0:08.834 - R 0:00.019
23:00:45 collections/multi_list PASSED C 0:09.297 - R 0:00.007
23:00:45 collections/queue PASSED C 0:09.276 - R 0:00.007
23:00:45 collections/string-compare PASSED C 0:09.176 - R 0:00.011
23:00:45 collections/string-ctx-manage PASSED C 0:09.497 - R 0:00.007
23:00:45 collections/string-gc PASSED C 0:06.386 - R 0:00.015
23:00:45 collections/sequence PASSED C 0:10.354 - R 0:00.005
23:00:45 collections/string-istream PASSED C 0:07.111 - R 0:00.007
23:00:45 alloc2 PASSED C 0:14.989 - R 0:00.010
23:00:45 ...ions/string-api-coverage-noshare PASSED C 0:12.452 - R 0:00.008
23:00:45 ...ns/vector-err-pass-perm-it-byval PASSED C 0:02.716 - R n/a
23:00:45 collections/string-operator PASSED C 0:09.167 - R 0:00.020
23:00:45 collections/string-api-coverage PASSED C 0:13.020 - R 0:00.006
23:00:45 ...ns/vector-err-retn-perm-it-byval PASSED C 0:02.542 - R n/a
23:00:45 collections/string-istream-manip PASSED C 0:09.564 - R 0:00.011
23:00:45 collections/string-operator-ERR13 PASSED C 0:04.792 - R n/a
23:00:45 collections/string-operator-ERR11 PASSED C 0:04.806 - R n/a
23:00:45 collections/string-operator-ERR15 PASSED C 0:04.774 - R n/a
23:00:45 collections/string-operator-ERR16 PASSED C 0:04.878 - R n/a
23:00:45 collections/vector-demo PASSED C 0:05.385 - R 0:00.006
23:00:45 collections/atomic_mpsc PASSED C 0:10.977 - R 0:06.590
23:00:45 collections/string-ostream PASSED C 0:08.692 - R 0:00.007
23:00:45 complex PASSED C 0:05.945 - R 0:00.009
23:00:45 collections/string-overwrite PASSED C 0:10.535 - R 0:00.012
23:00:45 ...ections/string-overwrite-noshare PASSED C 0:10.507 - R 0:00.010
23:00:45 concurrency/barrier/generation PASSED C 0:12.601 - R 0:00.326
23:00:45 concurrency/barrier/last PASSED C 0:12.658 - R 0:00.087
23:00:45 concurrency/actors/inline PASSED C 0:16.052 - R 0:00.070
23:00:45 concurrency/actors/inherit PASSED C 0:16.714 - R 0:00.036
23:00:45 concurrency/actors/poison PASSED C 0:16.401 - R 0:00.124
23:00:45 concurrency/barrier/order PASSED C 0:13.011 - R 0:00.068
23:00:45 concurrency/actors/executor PASSED C 0:17.033 - R 0:00.070
23:00:45 concurrency/actors/static PASSED C 0:16.492 - R 0:00.218
23:00:45 concurrency/actors/pingpong PASSED C 0:16.720 - R 0:00.120
23:00:45 concurrency/actors/types PASSED C 0:16.550 - R 0:00.126
23:00:45 concurrency/actors/matrixMultiply PASSED C 0:16.499 - R 0:00.772
23:00:45 concurrency/actors/dynamic PASSED C 0:15.539 - R 0:03.077
23:00:45 concurrency/ctor-check PASSED C 0:00.860 - R n/a
23:00:45 concurrency/clib_tls PASSED C 0:02.313 - R 0:00.019
23:00:45 concurrency/clib PASSED C 0:02.364 - R 0:00.274
23:00:45 concurrency/cluster PASSED C 0:07.340 - R 0:00.012
23:00:45 concurrency/cofor PASSED C 0:09.226 - R 0:00.020
23:00:45 concurrency/coroutineYield PASSED C 0:10.960 - R 0:00.033
23:00:45 concurrency/examples/datingService PASSED C 0:10.471 - R 0:00.019
23:00:45 concurrency/channels/big_elems PASSED C 0:14.018 - R 0:10.520
23:00:45 concurrency/examples/gortn PASSED C 0:10.281 - R 0:00.011
23:00:45 concurrency/channels/churn PASSED C 0:14.980 - R 0:10.063
23:00:45 concurrency/examples/matrixSum PASSED C 0:10.300 - R 0:00.019
23:00:45 concurrency/keywordErrors PASSED C 0:00.407 - R n/a
23:00:45 concurrency/channels/contend PASSED C 0:13.840 - R 0:10.061
23:00:45 concurrency/mainError PASSED C 0:00.252 - R n/a
23:00:45 concurrency/channels/daisy_chain PASSED C 0:13.725 - R 0:10.030
23:00:45 concurrency/futures/abandon PASSED C 0:07.411 - R 0:00.067
23:00:45 ...rrency/examples/boundedBufferEXT PASSED C 0:10.815 - R 0:05.692
23:00:45 ...rrency/examples/boundedBufferINT PASSED C 0:10.582 - R 0:05.940
23:00:45 concurrency/futures/basic PASSED C 0:07.969 - R 0:00.068
23:00:45 concurrency/examples/quickSort PASSED C 0:12.394 - R 0:00.009
23:00:45 concurrency/channels/hot_potato PASSED C 0:13.691 - R 0:10.044
23:00:45 concurrency/channels/ping_pong PASSED C 0:13.863 - R 0:10.052
23:00:45 concurrency/join PASSED C 0:10.265 - R 0:00.010
23:00:45 concurrency/channels/pub_sub PASSED C 0:14.036 - R 0:10.050
23:00:45 concurrency/channels/zero_size PASSED C 0:13.728 - R 0:10.056
23:00:45 concurrency/migrate PASSED C 0:10.192 - R 0:00.121
23:00:45 concurrency/futures/wait_any PASSED C 0:12.543 - R 0:00.040
23:00:45 concurrency/lockfree_stack PASSED C 0:10.588 - R 0:02.888
23:00:45 concurrency/mutexstmt/monitors PASSED C 0:08.286 - R 0:02.472
23:00:45 concurrency/park/contention PASSED C 0:08.234 - R 0:00.067
23:00:45 concurrency/futures/typed PASSED C 0:16.703 - R 0:00.417
23:00:45 concurrency/park/start_parked PASSED C 0:08.265 - R 0:00.034
23:00:45 concurrency/once PASSED C 0:12.117 - R 0:00.068
23:00:45 ...urrency/pthread/pthread_key_test PASSED C 0:03.264 - R 0:00.035
23:00:45 concurrency/mutexstmt/tuple PASSED C 0:13.094 - R 0:00.007
23:00:45 concurrency/park/force_preempt PASSED C 0:11.154 - R 0:00.368
23:00:45 ...rrency/pthread/pthread_attr_test PASSED C 0:11.203 - R 0:00.011
23:00:45 ...rrency/pthread/pthread_cond_test PASSED C 0:10.489 - R 0:00.017
23:00:45 concurrency/monitor PASSED C 0:10.329 - R 0:12.007
23:00:45 concurrency/futures/future_except PASSED C 0:25.697 - R 0:00.035
23:00:45 ...pthread/pthread_demo_create_join PASSED C 0:11.632 - R 0:00.036
23:00:45 ...rrency/pthread/pthread_once_test PASSED C 0:10.062 - R 0:00.018
23:00:45 concurrency/multi-monitor PASSED C 0:11.084 - R 0:13.656
23:00:45 concurrency/readyQ/leader_spin PASSED C 0:10.471 - R 0:00.770
23:00:45 concurrency/signal/wait PASSED C 0:10.784 - R 0:00.218
23:00:45 concurrency/signal/block PASSED C 0:11.296 - R 0:01.173
23:00:45 concurrency/signal/disjoint PASSED C 0:10.878 - R 0:01.825
23:00:45 concurrency/readyQ/barrier_sleeper PASSED C 0:13.301 - R 0:00.321
23:00:45 ...rrency/pthread/pthread_demo_lock PASSED C 0:10.159 - R 0:06.736
23:00:45 concurrency/suspend_then PASSED C 0:10.587 - R 0:00.035
23:00:45 concurrency/preempt PASSED C 0:11.862 - R 0:11.657
23:00:45 concurrency/sleep PASSED C 0:10.910 - R 0:01.122
23:00:45 concurrency/thread PASSED C 0:12.011 - R 0:00.012
23:00:45 .../unified_locking/block_spin_lock PASSED C 0:12.122 - R 0:00.068
23:00:45 ...ency/unified_locking/exp_backoff PASSED C 0:12.976 - R 0:00.034
23:00:45 .../unified_locking/fast_block_lock PASSED C 0:13.366 - R 0:00.020
23:00:45 ...cy/unified_locking/pthread_locks PASSED C 0:09.458 - R 0:00.317
23:00:45 concurrency/preempt2 PASSED C 0:11.403 - R 0:20.341
23:00:45 ...ncy/unified_locking/timeout_lock PASSED C 0:09.110 - R 0:01.072
23:00:45 ...fied_locking/mcs_block_spin_lock PASSED C 0:12.322 - R 0:00.071
23:00:45 ...nified_locking/simple_owner_lock PASSED C 0:12.296 - R 0:00.044
23:00:45 concurrency/waitfor/else PASSED C 0:08.739 - R 0:00.008
23:00:45 concurrency/waitfor/barge PASSED C 0:11.013 - R 0:00.471
23:00:45 concurrency/waitfor/parse PASSED C 0:06.899 - R 0:00.008
23:00:45 concurrency/waitfor/dtor PASSED C 0:10.427 - R 0:01.121
23:00:45 ...urrency/waitfor/lexical_priority PASSED C 0:11.109 - R 0:00.021
23:00:45 concurrency/unified_locking/mcs PASSED C 0:12.568 - R 0:07.838
23:00:45 concurrency/waitfor/statment PASSED C 0:10.755 - R 0:00.020
23:00:45 concurrency/waitfor/recurse PASSED C 0:11.240 - R 0:00.769
23:00:45 concurrency/waitfor/when PASSED C 0:10.744 - R 0:00.118
23:00:45 concurrency/waituntil/basic_else PASSED C 0:16.006 - R 0:00.008
23:00:45 ...ency/waituntil/channel_zero_size PASSED C 0:11.270 - R 0:04.327
23:00:45 configs/parsebools PASSED C 0:08.243 - R 0:00.070
23:00:45 concurrency/waituntil/timeout PASSED C 0:06.417 - R 0:03.125
23:00:45 concurrency/waituntil/one_chan PASSED C 0:10.784 - R 0:01.226
23:00:45 const-init PASSED C 0:01.005 - R 0:00.020
23:00:45 const-ref PASSED C 0:01.117 - R 0:00.058
23:00:45 configs/parseconfig PASSED C 0:08.266 - R 0:00.035
23:00:45 concurrency/waituntil/channels PASSED C 0:12.404 - R 0:09.986
23:00:45 copyfile PASSED C 0:06.076 - R 0:00.011
23:00:45 concurrency/waituntil/channel_close PASSED C 0:14.807 - R 0:10.048
23:00:45 configs/usage PASSED C 0:08.687 - R 0:00.012
23:00:45 coroutine/devicedriver PASSED C 0:07.142 - R 0:00.011
23:00:45 coroutine/fibonacci PASSED C 0:07.054 - R 0:00.008
23:00:45 concurrency/waituntil/futures PASSED C 0:25.087 - R 0:00.036
23:00:45 coroutine/fmtLines PASSED C 0:07.181 - R 0:00.011
23:00:45 coroutine/pingpong PASSED C 0:07.010 - R 0:00.009
23:00:45 coroutine/raii PASSED C 0:07.014 - R 0:00.007
23:00:45 counter PASSED C 0:05.935 - R 0:00.020
23:00:45 ctrl-flow/break-misc PASSED C 0:05.693 - R 0:00.009
23:00:45 coroutine/runningTotal PASSED C 0:07.092 - R 0:00.009
23:00:45 ctrl-flow/fallthrough PASSED C 0:05.864 - R 0:00.020
23:00:45 ctrl-flow/labelledExit PASSED C 0:01.137 - R 0:00.008
23:00:45 ctrl-flow/loop-inc PASSED C 0:01.054 - R 0:00.006
23:00:45 coroutine/prodcons PASSED C 0:08.686 - R 0:00.018
23:00:45 designations PASSED C 0:02.186 - R 0:00.011
23:00:45 concurrency/waituntil/all_types PASSED C 0:29.832 - R 0:07.194
23:00:45 enum PASSED C 0:01.061 - R 0:00.013
23:00:45 ...ency/unified_locking/futex_mutex PASSED C 0:13.130 - R 0:40.077
23:00:45 ctrl-flow/goto PASSED C 0:05.625 - R 0:00.024
23:00:45 ctrl-flow/ifwhileCtl PASSED C 0:06.222 - R 0:00.007
23:00:45 ctrl-flow/loop_else PASSED C 0:05.723 - R 0:00.019
23:00:45 enum_tests/inc-dec PASSED C 0:01.326 - R 0:00.083
23:00:45 enum_tests/funcEnum PASSED C 0:02.036 - R 0:00.018
23:00:45 enum_tests/lvalue PASSED C 0:00.845 - R n/a
23:00:45 ctrl-flow/loop_else-WRN1 PASSED C 0:07.287 - R 0:00.003
23:00:45 ctrl-flow/loopctrl PASSED C 0:08.040 - R 0:00.019
23:00:45 enum_tests/structEnum PASSED C 0:02.203 - R 0:00.006
23:00:45 div PASSED C 0:08.397 - R 0:00.010
23:00:45 errors/declaration PASSED C 0:00.116 - R n/a
23:00:45 errors/scope PASSED C 0:00.506 - R n/a
23:00:45 enum_tests/anonymous PASSED C 0:06.867 - R 0:00.009
23:00:45 errors/scope-type PASSED C 0:00.156 - R n/a
23:00:45 errors/signature PASSED C 0:00.154 - R n/a
23:00:45 device/cpu PASSED C 0:09.654 - R 0:00.017
23:00:45 enum_tests/enumInlineValue PASSED C 0:06.839 - R 0:00.009
23:00:45 eval PASSED C 0:01.040 - R 0:00.019
23:00:45 enum_tests/input PASSED C 0:07.154 - R 0:00.007
23:00:45 enum_tests/stringEnum PASSED C 0:06.442 - R 0:00.007
23:00:45 enum_tests/planet PASSED C 0:08.202 - R 0:00.022
23:00:45 enum_tests/position PASSED C 0:08.235 - R 0:00.010
23:00:45 enum_tests/typedIntEnum PASSED C 0:06.244 - R 0:00.016
23:00:45 ...urrency/unified_locking/mcs_spin PASSED C 0:13.436 - R 0:48.456
23:00:45 enum_tests/voidEnum PASSED C 0:06.859 - R 0:00.006
23:00:45 exceptions/conditional PASSED C 0:05.912 - R 0:00.005
23:00:45 concurrency/waituntil/repeat_close PASSED C 0:11.505 - R 0:30.068
23:00:45 .../unified_locking/spin_queue_lock PASSED C 0:13.230 - R 0:48.341
23:00:45 exceptions/conditional-threads PASSED C 0:07.178 - R 0:00.008
23:00:45 exceptions/cancel/coroutine PASSED C 0:08.268 - R 0:00.035
23:00:45 exceptions/data-except PASSED C 0:06.098 - R 0:00.009
23:00:45 exceptions/message PASSED C 0:02.406 - R 0:00.007
23:00:45 exceptions/defaults PASSED C 0:06.186 - R 0:00.006
23:00:45 exceptions/cancel/thread PASSED C 0:10.780 - R 0:00.009
23:00:45 exceptions/finally PASSED C 0:05.836 - R 0:00.006
23:00:45 exceptions/defaults-threads PASSED C 0:07.770 - R 0:00.011
23:00:45 exceptions/try-ctrl-flow PASSED C 0:00.323 - R n/a
23:00:45 exceptions/cor_resumer PASSED C 0:10.508 - R 0:00.011
23:00:45 exceptions/type-check PASSED C 0:00.424 - R n/a
23:00:45 exceptions/interact PASSED C 0:06.156 - R 0:00.119
23:00:45 exceptions/try-leave-catch PASSED C 0:01.264 - R 0:00.035
23:00:45 exceptions/fibonacci_nonlocal PASSED C 0:09.082 - R 0:00.010
23:00:45 exceptions/finally-threads PASSED C 0:07.853 - R 0:00.011
23:00:45 concurrency/waituntil/locks PASSED C 0:12.948 - R 0:39.264
23:00:45 expression PASSED C 0:01.209 - R 0:00.007
23:00:45 exceptions/polymorphic PASSED C 0:05.911 - R 0:00.006
23:00:45 exceptions/resume PASSED C 0:06.203 - R 0:00.005
23:00:45 exceptions/terminate PASSED C 0:06.551 - R 0:00.120
23:00:45 concurrency/mutexstmt/locks PASSED C 0:11.095 - R 1:28.640
23:00:45 exceptions/resume-threads PASSED C 0:07.744 - R 0:00.016
23:00:45 exceptions/trash PASSED C 0:05.855 - R 0:00.005
23:00:45 global-monomorph PASSED C 0:01.100 - R 0:00.007
23:00:45 exceptions/terminate-threads PASSED C 0:07.493 - R 0:00.010
23:00:45 exceptions/pingpong_nonlocal PASSED C 0:10.556 - R 0:00.018
23:00:45 identFuncDeclarator PASSED C 0:01.100 - R 0:00.006
23:00:45 identParamDeclarator PASSED C 0:01.076 - R 0:00.009
23:00:45 exceptions/virtual-poly PASSED C 0:06.176 - R 0:00.006
23:00:45 fstream_test PASSED C 0:05.886 - R 0:00.012
23:00:45 generator/fibonacci PASSED C 0:05.735 - R 0:00.022
23:00:45 generator/fmtLines PASSED C 0:05.750 - R 0:00.021
23:00:45 generator/suspend_then PASSED C 0:05.717 - R 0:00.022
23:00:45 exceptions/virtual-cast PASSED C 0:07.868 - R 0:00.009
23:00:45 forall PASSED C 0:06.780 - R 0:00.021
23:00:45 init1-ERROR PASSED C 0:00.641 - R n/a
23:00:45 genericUnion PASSED C 0:05.954 - R 0:00.009
23:00:45 include/vector-collections PASSED C 0:02.714 - R 0:00.006
23:00:45 init1 PASSED C 0:01.338 - R 0:00.010
23:00:45 include/vector-sequence PASSED C 0:01.689 - R 0:00.006
23:00:45 function-operator PASSED C 0:08.284 - R 0:00.007
23:00:45 hello PASSED C 0:06.229 - R 0:00.006
23:00:45 identity PASSED C 0:06.011 - R 0:00.005
23:00:45 include/stdincludes PASSED C 0:06.182 - R 0:00.021
23:00:45 include/vector-fstream PASSED C 0:06.634 - R 0:00.020
23:00:45 io/eofType PASSED C 0:06.251 - R 0:00.006
23:00:45 limits PASSED C 0:01.245 - R 0:00.021
23:00:45 io/io PASSED C 0:09.454 - R 0:00.034
23:00:45 linking/exception-nothreads PASSED C 0:04.091 - R 0:00.008
23:00:45 io/manipulatorsInput-uchunk PASSED C 0:09.385 - R 0:00.018
23:00:45 io/io-acquire-in PASSED C 0:11.227 - R 0:00.471
23:00:45 io/manipulatorsOutput4 PASSED C 0:08.680 - R 0:00.066
23:00:45 io/io-acquire PASSED C 0:12.251 - R 0:00.168
23:00:45 io/away_fair PASSED C 0:13.118 - R 0:00.170
23:00:45 linking/nostdlib PASSED C 0:01.501 - R 0:00.019
23:00:45 io/io-acquire-out PASSED C 0:12.311 - R 0:00.037
23:00:45 io/io-acquire-no-io PASSED C 0:11.309 - R 0:02.633
23:00:45 io/comp_fair PASSED C 0:15.055 - R 0:00.420
23:00:45 io/io-acquire2 PASSED C 0:12.977 - R 0:00.068
23:00:45 linkonce PASSED C 0:01.495 - R 0:00.006
23:00:45 io/comp_basic PASSED C 0:15.534 - R 0:00.168
23:00:45 linking/exception-withthreads PASSED C 0:06.978 - R 0:00.020
23:00:45 maybe PASSED C 0:01.505 - R 0:00.034
23:00:45 include/includes PASSED C 0:21.308 - R 0:00.020
23:00:45 linking/mangling/anon PASSED C 0:06.409 - R 0:00.012
23:00:45 nested-types-ERR1 PASSED C 0:00.140 - R n/a
23:00:45 nested-types-ERR2 PASSED C 0:00.193 - R n/a
23:00:45 io/many_read PASSED C 0:14.750 - R 0:00.065
23:00:45 linking/io-acquire PASSED C 0:08.223 - R 0:00.009
23:00:45 nested-types PASSED C 0:01.503 - R 0:00.021
23:00:45 nowarn/array PASSED C 0:01.357 - R 0:00.019
23:00:45 linking/nothreads PASSED C 0:08.410 - R 0:00.006
23:00:45 list/dlist-insert-remove PASSED C 0:06.847 - R 0:00.035
23:00:45 nowarn/no-autogen PASSED C 0:01.117 - R 0:00.020
23:00:45 linking/weakso_nothd PASSED C 0:08.469 - R 0:00.006
23:00:45 nowarn/exception PASSED C 0:01.401 - R 0:00.007
23:00:45 opt-params PASSED C 0:00.103 - R n/a
23:00:45 nowarn/printf-sizeof PASSED C 0:01.475 - R 0:00.006
23:00:45 meta/fork+exec PASSED C 0:04.700 - R 0:00.066
23:00:45 list/dlist2-insert-remove PASSED C 0:06.890 - R 0:00.011
23:00:45 nowarn/unused PASSED C 0:01.279 - R 0:00.019
23:00:45 literals PASSED C 0:06.718 - R 0:00.023
23:00:45 nowarn/zero-thunk PASSED C 0:01.231 - R 0:00.021
23:00:45 numericConstants PASSED C 0:01.306 - R 0:00.020
23:00:45 operators PASSED C 0:01.193 - R 0:00.020
23:00:45 poly-bare-assn PASSED C 0:01.127 - R 0:00.005
23:00:45 polybits PASSED C 0:00.240 - R n/a
23:00:45 poly-d-cycle PASSED C 0:01.129 - R 0:00.026
23:00:45 poly-many-arsz PASSED C 0:01.211 - R 0:00.012
23:00:45 poly-member PASSED C 0:01.200 - R 0:00.010
23:00:45 poly-o-cycle PASSED C 0:01.224 - R 0:00.021
23:00:45 poly-selection PASSED C 0:01.258 - R 0:00.007
23:00:45 poly-self-cycle PASSED C 0:01.255 - R 0:00.006
23:00:45 linking/withthreads PASSED C 0:10.430 - R 0:00.008
23:00:45 raii/ctor-autogen-ERR1 PASSED C 0:00.671 - R n/a
23:00:45 quasiKeyword PASSED C 0:01.270 - R 0:00.006
23:00:45 meta/dumpable PASSED C 0:08.519 - R 0:00.009
23:00:45 heap PASSED C 0:08.103 - R 0:20.743
23:00:45 raii/ctor-autogen PASSED C 0:01.956 - R 0:00.020
23:00:45 raii/init_once PASSED C 0:01.290 - R 0:00.011
23:00:45 raii/partial-ERR1 PASSED C 0:00.627 - R n/a
23:00:45 malloc PASSED C 0:09.762 - R 0:00.033
23:00:45 raii/partial PASSED C 0:01.194 - R 0:00.019
23:00:45 raii/typeof-member PASSED C 0:01.066 - R 0:00.007
23:00:45 result PASSED C 0:01.554 - R 0:00.006
23:00:45 raii/dtor-early-exit-ERR1 PASSED C 0:04.347 - R n/a
23:00:45 raii/memberCtors-ERR1 PASSED C 0:03.719 - R n/a
23:00:45 raii/dtor-early-exit-ERR2 PASSED C 0:04.323 - R n/a
23:00:45 minmax PASSED C 0:10.720 - R 0:00.007
23:00:45 simpleGenericTriple PASSED C 0:01.338 - R 0:00.008
23:00:45 quotedKeyword PASSED C 0:05.754 - R 0:00.009
23:00:45 raii/boxed-types PASSED C 0:05.827 - R 0:00.022
23:00:45 smart-pointers PASSED C 0:01.362 - R 0:00.007
23:00:45 polymorphism PASSED C 0:06.906 - R 0:00.005
23:00:45 switch PASSED C 0:01.094 - R 0:00.006
23:00:45 raii/memberCtors PASSED C 0:06.018 - R 0:00.006
23:00:45 raii/globals PASSED C 0:06.417 - R 0:00.005
23:00:45 tuple/tupleCast PASSED C 0:01.091 - R 0:00.006
23:00:45 tuple/tupleFunction PASSED C 0:01.217 - R 0:00.007
23:00:45 tuple/tupleMember PASSED C 0:01.164 - R 0:00.008
23:00:45 tuple/tuplePolymorphism PASSED C 0:01.338 - R 0:00.007
23:00:45 raii/dtor-early-exit PASSED C 0:08.309 - R 0:00.008
23:00:45 typedefRedef-ERR1 PASSED C 0:00.138 - R n/a
23:00:45 references PASSED C 0:06.751 - R 0:00.010
23:00:45 var-assert PASSED C 0:00.134 - R n/a
23:00:45 typedefRedef PASSED C 0:01.112 - R 0:00.009
23:00:45 shortCircuit PASSED C 0:06.175 - R 0:00.006
23:00:45 typeof PASSED C 0:01.087 - R 0:00.006
23:00:45 variableDeclarator PASSED C 0:01.123 - R 0:00.007
23:00:45 sizeof PASSED C 0:05.899 - R 0:00.006
23:00:45 strstream PASSED C 0:06.145 - R 0:00.006
23:00:45 searchsort PASSED C 0:09.128 - R 0:00.006
23:00:45 tuple/tupleVariadic PASSED C 0:04.039 - R 0:00.006
23:00:45 tuple/tupleAssign PASSED C 0:06.404 - R 0:00.007
23:00:45 time PASSED C 0:07.503 - R 0:00.005
23:00:45 sum PASSED C 0:08.198 - R 0:00.011
23:00:45 tuplearray PASSED C 0:05.982 - R 0:00.010
23:00:45 warnings/self-assignment PASSED C 0:01.040 - R 0:00.001
23:00:45 voidPtr PASSED C 0:01.081 - R 0:00.007
23:00:45 withconflict PASSED C 0:00.583 - R n/a
23:00:45 swap PASSED C 0:09.153 - R 0:00.014
23:00:45 userLiterals PASSED C 0:06.444 - R 0:00.005
23:00:45 KRfunctions PASSED C 0:01.007 - R 0:00.004
23:00:45 vector PASSED C 0:07.472 - R 0:00.007
23:00:45 vector_math/vec2_double PASSED C 0:08.252 - R 0:00.009
23:00:45 zero_one-ERR1 PASSED C 0:03.193 - R n/a
23:00:45 arithmeticConversions PASSED C 0:02.260 - R 0:00.005
23:00:45 ...collections/dimexpr-match-c-ERRS PASSED C 0:00.714 - R n/a
23:00:45 ...llections/dimexpr-match-cfa-ERRS PASSED C 0:01.310 - R n/a
23:00:45 vector_math/vec2_uint PASSED C 0:08.437 - R 0:00.006
23:00:45 attributes PASSED C 0:01.196 - R 0:00.001
23:00:45 zero_one PASSED C 0:05.892 - R 0:00.007
23:00:45 vector_math/vec2_float PASSED C 0:12.593 - R 0:00.010
23:00:45 vector_math/vec3_int PASSED C 0:11.051 - R 0:00.007
23:00:45 abs PASSED C 0:07.932 - R 0:00.005
23:00:45 vector_math/vec2_int PASSED C 0:12.715 - R 0:00.007
23:00:45 errors/completeType PASSED C 0:00.555 - R n/a
23:00:45 declarationSpecifier PASSED C 0:00.997 - R 0:00.003
23:00:45 ...collections/array-md-sbscr-cases PASSED C 0:07.171 - R 0:00.009
23:00:45 vector_math/vec3_float PASSED C 0:13.081 - R 0:00.010
23:00:45 vector_math/vec4_int PASSED C 0:11.619 - R 0:00.006
23:00:45 extension PASSED C 0:00.991 - R 0:00.002
23:00:45 functions PASSED C 0:01.032 - R 0:00.001
23:00:45 gccExtensions PASSED C 0:01.087 - R 0:00.001
23:00:45 vector_math/vec4_float PASSED C 0:13.594 - R 0:00.006
23:00:45 rational PASSED C 0:23.984 - R 0:00.007
23:00:45 ato PASSED C 0:08.935 - R 0:00.007
23:00:45 bitmanip1 PASSED C 0:09.385 - R 0:00.014
23:00:45 bitmanip2 PASSED C 0:09.532 - R 0:00.019
23:00:45 meta/arch PASSED C 0:00.587 - R n/a
23:00:45 bitmanip3 PASSED C 0:11.065 - R 0:00.069
23:00:45 configs/parsenums PASSED C 0:08.542 - R 0:00.067
23:00:45 concurrency/pthread/bounded_buffer PASSED C 0:10.872 - R 0:00.773
23:00:45 PRNG PASSED C 0:14.215 - R 0:03.378
23:00:45 exceptions/cardgame PASSED C 0:09.457 - R 0:00.017
23:00:45 io/manipulatorsInput PASSED C 0:07.537 - R 0:00.009
23:00:45 gmp PASSED C 0:07.891 - R 0:00.009
23:00:45 exceptions/hotpotato_checked PASSED C 0:10.227 - R 0:00.009
23:00:45 exceptions/hotpotato PASSED C 0:10.146 - R 0:00.009
23:00:45 concurrency/unified_locking/locks PASSED C 0:13.936 - R 2:01.263
23:00:45 io/manipulatorsOutput2 PASSED C 0:09.113 - R 0:00.009
23:00:45 io/manipulatorsOutput1 PASSED C 0:12.419 - R 0:00.009
23:00:45 random PASSED C 0:07.622 - R 0:00.005
23:00:45 io/manipulatorsOutput3 PASSED C 0:12.840 - R 0:00.009
23:00:45 vector_math/vec2_ldouble PASSED C 0:08.119 - R 0:00.005
23:00:45 mathX PASSED C 0:12.158 - R 0:00.108
23:00:45 nested_function PASSED C 0:10.142 - R 0:00.011
23:00:45 math PASSED C 0:11.146 - R 0:00.010
23:00:45378 passes, 0 failures, 0 timeouts, 0 cancelled, 0 other
23:00:45Tests took 3:37.393
23:00:45[Pipeline] }
23:00:45[Pipeline] // dir
23:00:45[Pipeline] }
23:00:45[Pipeline] // stage
23:00:45[Pipeline] echo
23:00:45 -------- Test: Release --------
23:00:45[Pipeline] stage
23:00:45[Pipeline] { (Test: Release)
23:00:45[Pipeline] dir
23:00:45Running in /var/lib/jenkins/workspace/Cforall_master_2@tmp
23:00:45[Pipeline] {
23:00:45[Pipeline] sh
23:00:45+ nproc
23:00:45+ make -j 16 --no-print-directory -C tests timeout=600 global-timeout=14400 tests debug=no archive-errors=/var/lib/jenkins/workspace/Cforall_master_2@tmp/tests/crashes/full-nodebug
23:00:45Running 378 tests on 16 cores (x64 - no debug)
23:00:45 array-ERR2 PASSED C 0:00.074 - R n/a
23:00:45 array-ERR3 PASSED C 0:00.133 - R n/a
23:00:45 ...ollections/language-dim-mismatch PASSED C 0:00.488 - R n/a
23:00:45 array-ERR1 PASSED C 0:01.133 - R n/a
23:00:45 array PASSED C 0:01.215 - R 0:00.009
23:00:45 array-collections/c-dependent PASSED C 0:01.320 - R 0:00.023
23:00:45 array-collections/array-raii-c PASSED C 0:01.564 - R 0:00.006
23:00:45 array-collections/safety-summary PASSED C 0:00.964 - R n/a
23:00:45 array-collections/symtab-collision PASSED C 0:00.686 - R n/a
23:00:45 array-collections/dimexpr-match-c PASSED C 0:01.813 - R 0:00.037
23:00:45 attr-priority PASSED C 0:01.111 - R 0:00.001
23:00:45 castError PASSED C 0:00.742 - R n/a
23:00:45 array-collections/array-sbscr-types PASSED C 0:02.885 - R 0:00.021
23:00:45 cast PASSED C 0:01.574 - R 0:00.019
23:00:45 builtins/sync PASSED C 0:01.677 - R 0:00.020
23:00:45 array-collections/dimexpr-match-cfa PASSED C 0:03.224 - R 0:00.022
23:00:45 array-collections/boxed PASSED C 0:03.582 - R 0:00.020
23:00:45 castReturn PASSED C 0:02.132 - R 0:00.006
23:00:45 array-collections/array-basic PASSED C 0:04.389 - R 0:00.021
23:00:45 alloc-ERROR PASSED C 0:06.284 - R n/a
23:00:45 algorithms/range_test PASSED C 0:06.661 - R 0:00.021
23:00:45 avl_test PASSED C 0:05.956 - R 0:00.005
23:00:45 array-collections/array-raii-cfa PASSED C 0:07.397 - R 0:00.006
23:00:45 array-collections/accordion PASSED C 0:07.508 - R 0:00.006
23:00:45 collections/multi_list PASSED C 0:09.102 - R 0:00.005
23:00:45 collections/stack PASSED C 0:08.511 - R 0:00.021
23:00:45 collections/string-operator-ERR09 PASSED C 0:04.809 - R n/a
23:00:45 collections/string-gc PASSED C 0:06.588 - R 0:00.006
23:00:45 collections/queue PASSED C 0:09.974 - R 0:00.005
23:00:45 collections/sequence PASSED C 0:10.699 - R 0:00.011
23:00:45 collections/string-ctx-manage PASSED C 0:09.636 - R 0:00.006
23:00:45 collections/string-istream PASSED C 0:07.437 - R 0:00.022
23:00:45 collections/atomic_mpsc PASSED C 0:11.204 - R 0:00.972
23:00:45 collections/string-compare PASSED C 0:11.477 - R 0:00.007
23:00:45 alloc PASSED C 0:16.065 - R 0:00.007
23:00:45 collections/string-operator-ERR11 PASSED C 0:04.857 - R n/a
23:00:45 collections/string-operator-ERR13 PASSED C 0:04.937 - R n/a
23:00:45 collections/string-operator-ERR15 PASSED C 0:04.830 - R n/a
23:00:45 ...ns/vector-err-pass-perm-it-byval PASSED C 0:03.013 - R n/a
23:00:45 collections/string-istream-manip PASSED C 0:10.483 - R 0:00.006
23:00:45 collections/string-operator-ERR16 PASSED C 0:04.999 - R n/a
23:00:45 ...ns/vector-err-retn-perm-it-byval PASSED C 0:02.525 - R n/a
23:00:45 collections/string-operator PASSED C 0:11.606 - R 0:00.006
23:00:45 collections/string-api-coverage PASSED C 0:15.837 - R 0:00.007
23:00:45 ...ions/string-api-coverage-noshare PASSED C 0:15.872 - R 0:00.007
23:00:45 collections/vector-demo PASSED C 0:06.198 - R 0:00.005
23:00:45 complex PASSED C 0:06.076 - R 0:00.005
23:00:45 collections/string-ostream PASSED C 0:09.328 - R 0:00.005
23:00:45 alloc2 PASSED C 0:25.028 - R 0:00.007
23:00:45 collections/string-overwrite PASSED C 0:11.046 - R 0:00.009
23:00:45 ...ections/string-overwrite-noshare PASSED C 0:11.152 - R 0:00.009
23:00:45 concurrency/barrier/generation PASSED C 0:12.987 - R 0:00.068
23:00:45 concurrency/barrier/last PASSED C 0:12.657 - R 0:00.019
23:00:45 concurrency/actors/executor PASSED C 0:16.270 - R 0:00.012
23:00:45 concurrency/actors/dynamic PASSED C 0:16.619 - R 0:00.255
23:00:45 concurrency/actors/inline PASSED C 0:16.113 - R 0:00.069
23:00:45 concurrency/actors/inherit PASSED C 0:16.562 - R 0:00.074
23:00:45 concurrency/actors/pingpong PASSED C 0:16.128 - R 0:00.035
23:00:45 concurrency/actors/matrixMultiply PASSED C 0:16.180 - R 0:00.218
23:00:45 concurrency/barrier/order PASSED C 0:12.638 - R 0:00.011
23:00:45 concurrency/actors/static PASSED C 0:15.968 - R 0:00.118
23:00:45 concurrency/actors/poison PASSED C 0:17.356 - R 0:00.116
23:00:45 concurrency/ctor-check PASSED C 0:00.867 - R n/a
23:00:45 concurrency/actors/types PASSED C 0:16.828 - R 0:00.069
23:00:45 concurrency/clib PASSED C 0:02.904 - R 0:00.070
23:00:45 concurrency/clib_tls PASSED C 0:02.892 - R 0:00.010
23:00:45 concurrency/cluster PASSED C 0:07.304 - R 0:00.009
23:00:45 concurrency/cofor PASSED C 0:09.605 - R 0:00.010
23:00:45 concurrency/coroutineYield PASSED C 0:10.914 - R 0:00.018
23:00:45 concurrency/examples/gortn PASSED C 0:10.268 - R 0:00.009
23:00:45 concurrency/examples/datingService PASSED C 0:10.947 - R 0:00.009
23:00:45 concurrency/channels/big_elems PASSED C 0:14.511 - R 0:10.665
23:00:45 concurrency/examples/matrixSum PASSED C 0:11.171 - R 0:00.009
23:00:45 ...rrency/examples/boundedBufferINT PASSED C 0:11.135 - R 0:01.170
23:00:45 ...rrency/examples/boundedBufferEXT PASSED C 0:11.967 - R 0:00.972
23:00:45 concurrency/keywordErrors PASSED C 0:00.371 - R n/a
23:00:45 concurrency/mainError PASSED C 0:00.260 - R n/a
23:00:45 concurrency/channels/churn PASSED C 0:14.631 - R 0:10.057
23:00:45 concurrency/channels/contend PASSED C 0:14.546 - R 0:10.118
23:00:45 concurrency/channels/daisy_chain PASSED C 0:14.476 - R 0:10.011
23:00:45 concurrency/futures/abandon PASSED C 0:07.601 - R 0:00.036
23:00:45 concurrency/futures/basic PASSED C 0:07.474 - R 0:00.035
23:00:45 concurrency/examples/quickSort PASSED C 0:12.547 - R 0:00.007
23:00:45 concurrency/channels/hot_potato PASSED C 0:14.423 - R 0:10.049
23:00:45 concurrency/channels/ping_pong PASSED C 0:14.432 - R 0:10.043
23:00:45 concurrency/channels/pub_sub PASSED C 0:14.893 - R 0:10.052
23:00:45 concurrency/channels/zero_size PASSED C 0:14.616 - R 0:10.042
23:00:45 concurrency/join PASSED C 0:10.320 - R 0:00.007
23:00:45 concurrency/migrate PASSED C 0:11.477 - R 0:00.020
23:00:45 concurrency/futures/wait_any PASSED C 0:13.094 - R 0:00.036
23:00:45 concurrency/mutexstmt/monitors PASSED C 0:08.853 - R 0:00.324
23:00:45 concurrency/lockfree_stack PASSED C 0:10.407 - R 0:01.973
23:00:45 concurrency/monitor PASSED C 0:10.927 - R 0:01.273
23:00:45 concurrency/multi-monitor PASSED C 0:10.832 - R 0:01.723
23:00:45 concurrency/futures/typed PASSED C 0:16.264 - R 0:00.376
23:00:45 concurrency/park/contention PASSED C 0:08.074 - R 0:00.068
23:00:45 concurrency/park/start_parked PASSED C 0:07.525 - R 0:00.018
23:00:45 ...urrency/pthread/pthread_key_test PASSED C 0:03.692 - R 0:00.010
23:00:45 concurrency/once PASSED C 0:12.561 - R 0:00.071
23:00:45 concurrency/mutexstmt/tuple PASSED C 0:14.564 - R 0:00.006
23:00:45 concurrency/park/force_preempt PASSED C 0:11.309 - R 0:00.270
23:00:45 ...rrency/pthread/pthread_cond_test PASSED C 0:10.360 - R 0:00.035
23:00:45 ...pthread/pthread_demo_create_join PASSED C 0:10.334 - R 0:00.006
23:00:45 ...rrency/pthread/pthread_attr_test PASSED C 0:10.753 - R 0:00.019
23:00:45 concurrency/futures/future_except PASSED C 0:25.520 - R 0:00.021
23:00:45 concurrency/mutexstmt/locks PASSED C 0:11.359 - R 0:12.207
23:00:45 ...rrency/pthread/pthread_once_test PASSED C 0:11.221 - R 0:00.014
23:00:45 concurrency/readyQ/barrier_sleeper PASSED C 0:12.466 - R 0:00.318
23:00:45 ...rrency/pthread/pthread_demo_lock PASSED C 0:10.440 - R 0:05.938
23:00:45 concurrency/readyQ/leader_spin PASSED C 0:11.188 - R 0:00.921
23:00:45 concurrency/signal/block PASSED C 0:11.556 - R 0:00.166
23:00:45 concurrency/signal/disjoint PASSED C 0:11.588 - R 0:00.269
23:00:45 concurrency/signal/wait PASSED C 0:11.380 - R 0:00.038
23:00:45 concurrency/preempt PASSED C 0:12.289 - R 0:08.753
23:00:45 concurrency/sleep PASSED C 0:10.975 - R 0:01.122
23:00:45 concurrency/suspend_then PASSED C 0:11.292 - R 0:00.036
23:00:45 concurrency/thread PASSED C 0:12.399 - R 0:00.009
23:00:45 .../unified_locking/block_spin_lock PASSED C 0:12.428 - R 0:00.316
23:00:45 ...ency/unified_locking/exp_backoff PASSED C 0:12.603 - R 0:00.011
23:00:45 .../unified_locking/fast_block_lock PASSED C 0:12.545 - R 0:00.021
23:00:45 ...cy/unified_locking/pthread_locks PASSED C 0:10.113 - R 0:00.066
23:00:45 ...ncy/unified_locking/timeout_lock PASSED C 0:09.358 - R 0:01.073
23:00:45 concurrency/preempt2 PASSED C 0:11.619 - R 0:20.089
23:00:45 ...fied_locking/mcs_block_spin_lock PASSED C 0:12.794 - R 0:00.019
23:00:45 ...nified_locking/simple_owner_lock PASSED C 0:12.632 - R 0:00.010
23:00:45 concurrency/waitfor/parse PASSED C 0:06.578 - R 0:00.009
23:00:45 concurrency/waitfor/barge PASSED C 0:10.657 - R 0:00.065
23:00:45 concurrency/unified_locking/mcs PASSED C 0:13.420 - R 0:01.421
23:00:45 concurrency/waitfor/dtor PASSED C 0:11.364 - R 0:00.167
23:00:45 concurrency/waitfor/else PASSED C 0:08.839 - R 0:00.006
23:00:45 ...urrency/waitfor/lexical_priority PASSED C 0:11.415 - R 0:00.019
23:00:45 concurrency/waitfor/recurse PASSED C 0:11.605 - R 0:00.417
23:00:45 concurrency/waitfor/statment PASSED C 0:11.642 - R 0:00.011
23:00:45 concurrency/waitfor/when PASSED C 0:10.649 - R 0:00.067
23:00:45 concurrency/unified_locking/locks PASSED C 0:13.853 - R 0:15.018
23:00:45 ...ency/waituntil/channel_zero_size PASSED C 0:12.290 - R 0:00.368
23:00:45 concurrency/waituntil/one_chan PASSED C 0:11.975 - R 0:00.167
23:00:45 const-init PASSED C 0:01.341 - R 0:00.005
23:00:45 concurrency/waituntil/channels PASSED C 0:13.086 - R 0:01.173
23:00:45 const-ref PASSED C 0:01.566 - R 0:00.020
23:00:45 concurrency/waituntil/locks PASSED C 0:13.986 - R 0:00.970
23:00:45 concurrency/waituntil/timeout PASSED C 0:07.006 - R 0:03.077
23:00:45 configs/parsebools PASSED C 0:09.337 - R 0:00.034
23:00:45 concurrency/waituntil/basic_else PASSED C 0:18.558 - R 0:00.006
23:00:45 configs/parseconfig PASSED C 0:08.659 - R 0:00.007
23:00:45 copyfile PASSED C 0:06.323 - R 0:00.006
23:00:45 configs/usage PASSED C 0:09.125 - R 0:00.011
23:00:45 coroutine/devicedriver PASSED C 0:07.616 - R 0:00.013
23:00:45 coroutine/fibonacci PASSED C 0:07.085 - R 0:00.006
23:00:45 coroutine/pingpong PASSED C 0:07.000 - R 0:00.007
23:00:45 coroutine/fmtLines PASSED C 0:07.674 - R 0:00.036
23:00:45 coroutine/raii PASSED C 0:07.056 - R 0:00.019
23:00:45 coroutine/runningTotal PASSED C 0:06.880 - R 0:00.019
23:00:45 ctrl-flow/labelledExit PASSED C 0:01.175 - R 0:00.017
23:00:45 concurrency/waituntil/channel_close PASSED C 0:15.916 - R 0:10.046
23:00:45 counter PASSED C 0:05.818 - R 0:00.005
23:00:45 ctrl-flow/loop-inc PASSED C 0:01.056 - R 0:00.005
23:00:45 ctrl-flow/break-misc PASSED C 0:06.564 - R 0:00.019
23:00:45 coroutine/prodcons PASSED C 0:09.646 - R 0:00.014
23:00:45 ctrl-flow/fallthrough PASSED C 0:06.203 - R 0:00.020
23:00:45 concurrency/waituntil/futures PASSED C 0:27.561 - R 0:00.019
23:00:45 ctrl-flow/goto PASSED C 0:05.856 - R 0:00.019
23:00:45 enum PASSED C 0:01.088 - R 0:00.011
23:00:45 designations PASSED C 0:02.794 - R 0:00.006
23:00:45 ctrl-flow/ifwhileCtl PASSED C 0:06.085 - R 0:00.010
23:00:45 enum_tests/inc-dec PASSED C 0:01.215 - R 0:00.007
23:00:45 enum_tests/lvalue PASSED C 0:00.528 - R n/a
23:00:45 enum_tests/funcEnum PASSED C 0:02.620 - R 0:00.006
23:00:45 ctrl-flow/loop_else PASSED C 0:06.126 - R 0:00.007
23:00:45 ctrl-flow/loop_else-WRN1 PASSED C 0:07.284 - R 0:00.001
23:00:45 enum_tests/structEnum PASSED C 0:02.316 - R 0:00.009
23:00:45 ctrl-flow/loopctrl PASSED C 0:08.322 - R 0:00.014
23:00:45 errors/declaration PASSED C 0:00.127 - R n/a
23:00:45 enum_tests/anonymous PASSED C 0:06.190 - R 0:00.006
23:00:45 errors/scope-type PASSED C 0:00.143 - R n/a
23:00:45 errors/scope PASSED C 0:00.622 - R n/a
23:00:45 errors/signature PASSED C 0:00.162 - R n/a
23:00:45 enum_tests/enumInlineValue PASSED C 0:06.755 - R 0:00.024
23:00:45 concurrency/waituntil/all_types PASSED C 0:34.807 - R 0:01.026
23:00:45 enum_tests/input PASSED C 0:06.363 - R 0:00.022
23:00:45 ...ency/unified_locking/futex_mutex PASSED C 0:12.281 - R 0:40.335
23:00:45 div PASSED C 0:08.062 - R 0:00.005
23:00:45 eval PASSED C 0:01.112 - R 0:00.021
23:00:45 device/cpu PASSED C 0:09.892 - R 0:00.035
23:00:45 enum_tests/stringEnum PASSED C 0:05.850 - R 0:00.005
23:00:45 enum_tests/planet PASSED C 0:08.428 - R 0:00.020
23:00:45 enum_tests/typedIntEnum PASSED C 0:05.875 - R 0:00.019
23:00:45 enum_tests/position PASSED C 0:08.278 - R 0:00.018
23:00:45 enum_tests/voidEnum PASSED C 0:06.069 - R 0:00.007
23:00:45 exceptions/data-except PASSED C 0:06.144 - R 0:00.024
23:00:45 exceptions/conditional PASSED C 0:06.745 - R 0:00.006
23:00:45 exceptions/cancel/coroutine PASSED C 0:07.464 - R 0:00.014
23:00:45 exceptions/message PASSED C 0:02.728 - R 0:00.005
23:00:45 exceptions/defaults PASSED C 0:06.898 - R 0:00.009
23:00:45 exceptions/conditional-threads PASSED C 0:07.445 - R 0:00.009
23:00:45 exceptions/defaults-threads PASSED C 0:07.907 - R 0:00.007
23:00:45 exceptions/finally PASSED C 0:06.186 - R 0:00.009
23:00:45 exceptions/try-ctrl-flow PASSED C 0:00.470 - R n/a
23:00:45 exceptions/interact PASSED C 0:06.760 - R 0:00.008
23:00:45 exceptions/finally-threads PASSED C 0:07.240 - R 0:00.007
23:00:45 exceptions/type-check PASSED C 0:00.402 - R n/a
23:00:45 exceptions/cancel/thread PASSED C 0:10.833 - R 0:00.009
23:00:45 exceptions/fibonacci_nonlocal PASSED C 0:09.068 - R 0:00.017
23:00:45 exceptions/try-leave-catch PASSED C 0:01.203 - R 0:00.005
23:00:45 exceptions/cor_resumer PASSED C 0:11.328 - R 0:00.006
23:00:45 expression PASSED C 0:01.361 - R 0:00.019
23:00:45 concurrency/waituntil/repeat_close PASSED C 0:13.457 - R 0:30.062
23:00:45 exceptions/polymorphic PASSED C 0:06.460 - R 0:00.009
23:00:45 exceptions/resume PASSED C 0:06.585 - R 0:00.007
23:00:45 ...urrency/unified_locking/mcs_spin PASSED C 0:13.194 - R 0:49.932
23:00:45 exceptions/terminate PASSED C 0:07.207 - R 0:00.017
23:00:45 exceptions/trash PASSED C 0:06.252 - R 0:00.019
23:00:45 exceptions/resume-threads PASSED C 0:08.006 - R 0:00.038
23:00:45 exceptions/terminate-threads PASSED C 0:07.980 - R 0:00.006
23:00:45 global-monomorph PASSED C 0:01.340 - R 0:00.020
23:00:45 exceptions/virtual-poly PASSED C 0:05.932 - R 0:00.007
23:00:45 identParamDeclarator PASSED C 0:01.051 - R 0:00.022
23:00:45 .../unified_locking/spin_queue_lock PASSED C 0:12.736 - R 0:51.967
23:00:45 identFuncDeclarator PASSED C 0:01.438 - R 0:00.005
23:00:45 fstream_test PASSED C 0:05.947 - R 0:00.006
23:00:45 exceptions/pingpong_nonlocal PASSED C 0:11.237 - R 0:00.008
23:00:45 generator/fibonacci PASSED C 0:05.859 - R 0:00.007
23:00:45 forall PASSED C 0:07.683 - R 0:00.007
23:00:45 init1-ERROR PASSED C 0:00.582 - R n/a
23:00:45 exceptions/virtual-cast PASSED C 0:08.102 - R 0:00.005
23:00:45 include/vector-sequence PASSED C 0:01.679 - R 0:00.006
23:00:45 init1 PASSED C 0:01.101 - R 0:00.006
23:00:45 generator/fmtLines PASSED C 0:06.151 - R 0:00.007
23:00:45 generator/suspend_then PASSED C 0:06.040 - R 0:00.009
23:00:45 include/vector-collections PASSED C 0:02.743 - R 0:00.006
23:00:45 genericUnion PASSED C 0:06.142 - R 0:00.006
23:00:45 function-operator PASSED C 0:09.389 - R 0:00.007
23:00:45 hello PASSED C 0:05.994 - R 0:00.007
23:00:45 identity PASSED C 0:06.272 - R 0:00.007
23:00:45 include/vector-fstream PASSED C 0:06.055 - R 0:00.007
23:00:45 include/stdincludes PASSED C 0:07.578 - R 0:00.020
23:00:45 io/eofType PASSED C 0:06.170 - R 0:00.010
23:00:45 limits PASSED C 0:01.447 - R 0:00.011
23:00:45 io/io PASSED C 0:10.363 - R 0:00.020
23:00:45 linking/exception-nothreads PASSED C 0:04.526 - R 0:00.007
23:00:45 io/io-acquire PASSED C 0:11.890 - R 0:00.067
23:00:45 heap PASSED C 0:08.733 - R 0:07.696
23:00:45 io/io-acquire-in PASSED C 0:12.044 - R 0:00.008
23:00:45 io/manipulatorsInput-uchunk PASSED C 0:10.449 - R 0:00.018
23:00:45 io/io-acquire-out PASSED C 0:11.574 - R 0:00.269
23:00:45 io/away_fair PASSED C 0:13.556 - R 0:00.020
23:00:45 linking/nostdlib PASSED C 0:01.135 - R 0:00.019
23:00:45 linking/exception-withthreads PASSED C 0:06.662 - R 0:00.020
23:00:45 io/io-acquire2 PASSED C 0:12.096 - R 0:00.068
23:00:45 linkonce PASSED C 0:01.447 - R 0:00.009
23:00:45 io/manipulatorsOutput4 PASSED C 0:11.694 - R 0:00.011
23:00:45 io/comp_basic PASSED C 0:15.418 - R 0:00.187
23:00:45 io/io-acquire-no-io PASSED C 0:11.045 - R 0:03.547
23:00:45 io/comp_fair FAILED with code -6 C 0:15.330 - R 0:00.416
23:00:45starting
23:00:45100
23:00:45200
23:00:45300
23:00:45400
23:00:45500
23:00:45600
23:00:45700
23:00:45800
23:00:45900
23:00:451000
23:00:45done
23:00:45Processor (0x7fffffffd9c0) tearing down ring with 4294967295 entries allocated but not submitted, out of 256
23:00:45Cforall Runtime error (UNIX pid:187514):
23:00:45Stack back trace for: /var/lib/jenkins/workspace/Cforall_master_2@tmp/libcfa/x64-nodebug/src/.libs/libcfa.so.1
23:00:45(0) /var/lib/jenkins/workspace/Cforall_master_2@tmp/libcfa/x64-nodebug/src/.libs/libcfa.so.1 : + 0x8e96e [0x7ffff7f1996e]
23:00:45(1) /var/lib/jenkins/workspace/Cforall_master_2@tmp/libcfa/x64-nodebug/src/.libs/libcfa.so.1 : + 0x46c85 [0x7ffff7ed1c85]
23:00:45(2) /var/lib/jenkins/workspace/Cforall_master_2@tmp/libcfa/x64-nodebug/src/.libs/libcfa.so.1 : + 0x3f12f [0x7ffff7eca12f]
23:00:45(3) /var/lib/jenkins/workspace/Cforall_master_2@tmp/libcfa/x64-nodebug/src/.libs/libcfathread.so.1 : + 0x20fc6 [0x7ffff7f92fc6]
23:00:4523:00:45warning: Can't open file anon_inode:[io_uring] which was expanded to anon_inode:[io_uring] during file-backed mapping note processing
23:00:45[New LWP 187519]
23:00:45[New LWP 187518]
23:00:45[New LWP 187514]
23:00:45[Thread debugging using libthread_db enabled]
23:00:45Using host libthread_db library "/lib/x86_64-linux-gnu/libthread_db.so.1".
23:00:45Core was generated by `/var/lib/jenkins/workspace/Cforall_master_2@tmp/tests/io/comp_fair'.
23:00:45Program terminated with signal SIGABRT, Aborted.
23:00:45#0 __pthread_kill_implementation (no_tid=0, signo=6, threadid=<optimized out>) at ./nptl/pthread_kill.c:44
23:00:4523:00:45warning: 44 ./nptl/pthread_kill.c: No such file or directory
23:00:45[Current thread is 1 (Thread 0x55555562b780 (LWP 187519))]
23:00:45-----
23:00:45#0 __pthread_kill_implementation (no_tid=0, signo=6, threadid=<optimized out>) at ./nptl/pthread_kill.c:44
23:00:45#1 __pthread_kill_internal (signo=6, threadid=<optimized out>) at ./nptl/pthread_kill.c:78
23:00:45#2 __GI___pthread_kill (threadid=<optimized out>, signo=signo@entry=6) at ./nptl/pthread_kill.c:89
23:00:45#3 0x00007ffff7a4527e in __GI_raise (sig=sig@entry=6) at ../sysdeps/posix/raise.c:26
23:00:45#4 0x00007ffff7a288ff in __GI_abort () at ./stdlib/abort.c:79
23:00:45#5 0x00007ffff7f1945f in _X7__abortFv_bPKcY17__builtin_va_list__1 (_X11signalAbortb_1=_X11signalAbortb_1@entry=true, _X3fmtPKc_1=0x7ffff7f2da50 "Application interrupted by signal: %s.\n", _X4argsY17__builtin_va_list_1=_X4argsY17__builtin_va_list_1@entry=0x55555562a290) at /var/lib/jenkins/workspace/Cforall_master_2/libcfa/src/interpose.cfa:263
23:00:45#6 0x00007ffff7f1996e in _X5abortFv_bPKc__1 (_X11signalAbortb_1=_X11signalAbortb_1@entry=true, _X3fmtPKc_1=_X3fmtPKc_1@entry=0x7ffff7f2da50 "Application interrupted by signal: %s.\n") at /var/lib/jenkins/workspace/Cforall_master_2/libcfa/src/interpose.cfa:301
23:00:45#7 0x00007ffff7f19995 in _X15sigHandler_termFv_iPS21__anonymous_siginfo_tPS10ucontext_t__1 (_X3sigi_1=<optimized out>, _X3sfpPS21__anonymous_siginfo_t_1=<optimized out>, _X3cxtPS10ucontext_t_1=<optimized out>) at /var/lib/jenkins/workspace/Cforall_master_2/libcfa/src/interpose.cfa:337
23:00:45#8 <signal handler called>
23:00:45#9 __pthread_kill_implementation (no_tid=0, signo=6, threadid=<optimized out>) at ./nptl/pthread_kill.c:44
23:00:45#10 __pthread_kill_internal (signo=6, threadid=<optimized out>) at ./nptl/pthread_kill.c:78
23:00:45#11 __GI___pthread_kill (threadid=<optimized out>, signo=signo@entry=6) at ./nptl/pthread_kill.c:89
23:00:45#12 0x00007ffff7a4527e in __GI_raise (sig=sig@entry=6) at ../sysdeps/posix/raise.c:26
23:00:45#13 0x00007ffff7a288ff in __GI_abort () at ./stdlib/abort.c:79
23:00:45#14 0x00007ffff7f19501 in _X7__abortFv_bPKcY17__builtin_va_list__1 (_X11signalAbortb_1=_X11signalAbortb_1@entry=false, _X3fmtPKc_1=0x7ffff7f2c233 "%s", _X4argsY17__builtin_va_list_1=_X4argsY17__builtin_va_list_1@entry=0x55555562aa80) at /var/lib/jenkins/workspace/Cforall_master_2/libcfa/src/interpose.cfa:286
23:00:45#15 0x00007ffff7f1996e in _X5abortFv_bPKc__1 (_X11signalAbortb_1=_X11signalAbortb_1@entry=false, _X3fmtPKc_1=_X3fmtPKc_1@entry=0x7ffff7f2c233 "%s") at /var/lib/jenkins/workspace/Cforall_master_2/libcfa/src/interpose.cfa:301
23:00:45#16 0x00007ffff7ed1c85 in abort () at /var/lib/jenkins/workspace/Cforall_master_2/libcfa/src/interpose.cfa:176
23:00:45#17 0x00007ffff7eca12f in _X4endsFv_S8ofstream__1 (_X2osS8ofstream_1=0x7ffff7f4f240 <_X9abortFileS8ofstream_1>) at /var/lib/jenkins/workspace/Cforall_master_2/libcfa/src/fstream.cfa:106
23:00:45#18 0x00007ffff7f92fc6 in _X19__io_uring_teardownFv_S11io_context$__1 (_X4thisS11io_context$_1=0x55555585d040) at /var/lib/jenkins/workspace/Cforall_master_2/libcfa/src/concurrency/io/setup.cfa:288
23:00:45#19 0x00007ffff7f93df4 in _X11_destructorFv_S11io_context$__1 (_X4thisS11io_context$_1=<optimized out>) at /var/lib/jenkins/workspace/Cforall_master_2/libcfa/src/concurrency/io/setup.cfa:125
23:00:45#20 _X13__cfa_io_stopFv_PS9processor__1 (_X4procPS9processor_1=_X4procPS9processor_1@entry=0x7fffffffd9c0) at /var/lib/jenkins/workspace/Cforall_master_2/libcfa/src/concurrency/io/setup.cfa:313
23:00:45#21 0x00007ffff7f98359 in _X18__invoke_processorFPv_Pv__1 (_X3argPv_1=0x7fffffffd9c0) at /var/lib/jenkins/workspace/Cforall_master_2/libcfa/src/concurrency/kernel/startup.cfa:406
23:00:45#22 0x00007ffff7a9cb84 in start_thread (arg=<optimized out>) at ./nptl/pthread_create.c:447
23:00:45#23 0x00007ffff7b29ecc in clone3 () at ../sysdeps/unix/sysv/linux/x86_64/clone3.S:78
23:00:45-----
23:00:45 Id Target Id Frame
23:00:45* 1 Thread 0x55555562b780 (LWP 187519) __pthread_kill_implementation (no_tid=0, signo=6, threadid=<optimized out>) at ./nptl/pthread_kill.c:44
23:00:45 2 Thread 0x5555555ab5c0 (LWP 187518) 0x00007ffff7a45fc8 in __GI___sigtimedwait (set=set@entry=0x5555555aab80, info=info@entry=0x5555555aac00, timeout=timeout@entry=0x0) at ../sysdeps/unix/sysv/linux/sigtimedwait.c:31
23:00:45 3 Thread 0x7ffff7d65840 (LWP 187514) 0x00007ffff7a98e51 in __futex_abstimed_wait_common64 (private=128, cancel=true, abstime=0x0, op=265, expected=187519, futex_word=0x55555562ba50) at ./nptl/futex-internal.c:57
23:00:4523:00:45Archiving io/comp_fair (executable and core) to crashes/full-nodebug/io/comp_fair
23:00:45 maybe PASSED C 0:01.724 - R 0:00.005
23:00:45 nested-types-ERR1 PASSED C 0:00.123 - R n/a
23:00:45 nested-types-ERR2 PASSED C 0:00.194 - R n/a
23:00:45 nested-types PASSED C 0:01.145 - R 0:00.006
23:00:45 linking/mangling/anon PASSED C 0:06.658 - R 0:00.005
23:00:45 nowarn/array PASSED C 0:01.229 - R 0:00.007
23:00:45 nowarn/exception PASSED C 0:01.258 - R 0:00.007
23:00:45 nowarn/no-autogen PASSED C 0:01.068 - R 0:00.006
23:00:45 linking/io-acquire PASSED C 0:08.266 - R 0:00.007
23:00:45 nowarn/printf-sizeof PASSED C 0:01.299 - R 0:00.007
23:00:45 io/many_read PASSED C 0:15.147 - R 0:00.010
23:00:45 list/dlist-insert-remove PASSED C 0:06.090 - R 0:00.011
23:00:45 opt-params PASSED C 0:00.084 - R n/a
23:00:45 nowarn/unused PASSED C 0:01.108 - R 0:00.007
23:00:45 nowarn/zero-thunk PASSED C 0:01.118 - R 0:00.005
23:00:45 numericConstants PASSED C 0:01.116 - R 0:00.005
23:00:45 literals PASSED C 0:06.481 - R 0:00.007
23:00:45 operators PASSED C 0:01.114 - R 0:00.006
23:00:45 list/dlist2-insert-remove PASSED C 0:06.670 - R 0:00.007
23:00:45 include/includes PASSED C 0:22.532 - R 0:00.006
23:00:45 linking/nothreads PASSED C 0:07.951 - R 0:00.005
23:00:45 polybits PASSED C 0:00.228 - R n/a
23:00:45 meta/fork+exec PASSED C 0:04.984 - R 0:00.020
23:00:45 poly-bare-assn PASSED C 0:01.112 - R 0:00.016
23:00:45 poly-d-cycle PASSED C 0:01.155 - R 0:00.006
23:00:45 poly-many-arsz PASSED C 0:01.153 - R 0:00.007
23:00:45 poly-member PASSED C 0:01.140 - R 0:00.006
23:00:45 linking/weakso_nothd PASSED C 0:08.552 - R 0:00.005
23:00:45 poly-o-cycle PASSED C 0:01.176 - R 0:00.007
23:00:45 poly-selection PASSED C 0:01.169 - R 0:00.005
23:00:45 raii/ctor-autogen-ERR1 PASSED C 0:00.672 - R n/a
23:00:45 poly-self-cycle PASSED C 0:01.260 - R 0:00.006
23:00:45 quasiKeyword PASSED C 0:01.273 - R 0:00.007
23:00:45 raii/ctor-autogen PASSED C 0:01.686 - R 0:00.006
23:00:45 raii/init_once PASSED C 0:01.463 - R 0:00.005
23:00:45 raii/partial-ERR1 PASSED C 0:00.584 - R n/a
23:00:45 raii/partial PASSED C 0:01.219 - R 0:00.009
23:00:45 linking/withthreads PASSED C 0:10.364 - R 0:00.007
23:00:45 meta/dumpable PASSED C 0:08.307 - R 0:00.007
23:00:45 malloc PASSED C 0:09.261 - R 0:00.005
23:00:45 raii/typeof-member PASSED C 0:01.135 - R 0:00.007
23:00:45 result PASSED C 0:01.701 - R 0:00.005
23:00:45 raii/memberCtors-ERR1 PASSED C 0:03.711 - R n/a
23:00:45 raii/dtor-early-exit-ERR1 PASSED C 0:04.376 - R n/a
23:00:45 raii/dtor-early-exit-ERR2 PASSED C 0:04.395 - R n/a
23:00:45 simpleGenericTriple PASSED C 0:01.612 - R 0:00.005
23:00:45 quotedKeyword PASSED C 0:05.833 - R 0:00.006
23:00:45 raii/boxed-types PASSED C 0:05.930 - R 0:00.007
23:00:45 polymorphism PASSED C 0:06.193 - R 0:00.005
23:00:45 smart-pointers PASSED C 0:01.424 - R 0:00.007
23:00:45 minmax PASSED C 0:11.294 - R 0:00.006
23:00:45 raii/globals PASSED C 0:05.933 - R 0:00.007
23:00:45 switch PASSED C 0:01.119 - R 0:00.006
23:00:45 raii/memberCtors PASSED C 0:06.212 - R 0:00.005
23:00:45 tuple/tupleCast PASSED C 0:01.093 - R 0:00.007
23:00:45 tuple/tupleFunction PASSED C 0:01.238 - R 0:00.007
23:00:45 tuple/tupleMember PASSED C 0:01.173 - R 0:00.006
23:00:45 typedefRedef-ERR1 PASSED C 0:00.118 - R n/a
23:00:45 raii/dtor-early-exit PASSED C 0:08.134 - R 0:00.007
23:00:45 tuple/tuplePolymorphism PASSED C 0:01.529 - R 0:00.007
23:00:45 var-assert PASSED C 0:00.135 - R n/a
23:00:45 typedefRedef PASSED C 0:01.094 - R 0:00.005
23:00:45 references PASSED C 0:06.224 - R 0:00.006
23:00:45 shortCircuit PASSED C 0:05.883 - R 0:00.005
23:00:45 typeof PASSED C 0:01.065 - R 0:00.007
23:00:45 variableDeclarator PASSED C 0:01.072 - R 0:00.006
23:00:45 sizeof PASSED C 0:05.806 - R 0:00.005
23:00:45 strstream PASSED C 0:06.351 - R 0:00.006
23:00:45 tuple/tupleVariadic PASSED C 0:04.496 - R 0:00.006
23:00:45 searchsort PASSED C 0:08.681 - R 0:00.006
23:00:45 tuple/tupleAssign PASSED C 0:06.512 - R 0:00.006
23:00:45 tuplearray PASSED C 0:05.935 - R 0:00.005
23:00:45 sum PASSED C 0:08.444 - R 0:00.006
23:00:45 voidPtr PASSED C 0:01.077 - R 0:00.006
23:00:45 time PASSED C 0:07.912 - R 0:00.006
23:00:45 withconflict PASSED C 0:00.566 - R n/a
23:00:45 warnings/self-assignment PASSED C 0:00.988 - R 0:00.001
23:00:45 swap PASSED C 0:09.165 - R 0:00.006
23:00:45 KRfunctions PASSED C 0:00.986 - R 0:00.001
23:00:45 userLiterals PASSED C 0:06.798 - R 0:00.007
23:00:45 vector PASSED C 0:07.340 - R 0:00.006
23:00:45 ...collections/dimexpr-match-c-ERRS PASSED C 0:00.713 - R n/a
23:00:45 zero_one-ERR1 PASSED C 0:03.189 - R n/a
23:00:45 vector_math/vec2_double PASSED C 0:08.597 - R 0:00.006
23:00:45 arithmeticConversions PASSED C 0:02.587 - R 0:00.007
23:00:45 ...llections/dimexpr-match-cfa-ERRS PASSED C 0:01.280 - R n/a
23:00:45 vector_math/vec2_uint PASSED C 0:08.673 - R 0:00.006
23:00:45 attributes PASSED C 0:01.191 - R 0:00.001
23:00:45 zero_one PASSED C 0:05.945 - R 0:00.005
23:00:45 abs PASSED C 0:08.083 - R 0:00.005
23:00:45 declarationSpecifier PASSED C 0:00.922 - R 0:00.001
23:00:45 errors/completeType PASSED C 0:00.541 - R n/a
23:00:45 ...collections/array-md-sbscr-cases PASSED C 0:10.574 - R 0:00.007
23:00:45 vector_math/vec2_float PASSED C 0:16.991 - R 0:00.012
23:00:45 ato PASSED C 0:08.923 - R 0:00.007
23:00:45 vector_math/vec2_int PASSED C 0:16.985 - R 0:00.006
23:00:45 vector_math/vec3_int PASSED C 0:15.270 - R 0:00.007
23:00:45 extension PASSED C 0:01.050 - R 0:00.001
23:00:45 functions PASSED C 0:00.997 - R 0:00.001
23:00:45 gccExtensions PASSED C 0:00.980 - R 0:00.001
23:00:45 vector_math/vec4_int PASSED C 0:16.226 - R 0:00.011
23:00:45 vector_math/vec3_float PASSED C 0:17.794 - R 0:00.007
23:00:45 configs/parsenums PASSED C 0:08.988 - R 0:00.070
23:00:45 vector_math/vec4_float PASSED C 0:17.233 - R 0:00.006
23:00:45 rational PASSED C 0:26.526 - R 0:00.005
23:00:45 concurrency/pthread/bounded_buffer PASSED C 0:10.786 - R 0:00.068
23:00:45 meta/arch PASSED C 0:00.558 - R n/a
23:00:45 bitmanip1 PASSED C 0:11.820 - R 0:00.012
23:00:45 PRNG PASSED C 0:14.986 - R 0:00.469
23:00:45 bitmanip2 PASSED C 0:11.765 - R 0:00.009
23:00:45 bitmanip3 PASSED C 0:11.954 - R 0:00.017
23:00:45 exceptions/cardgame PASSED C 0:09.640 - R 0:00.009
23:00:45 io/manipulatorsInput PASSED C 0:08.552 - R 0:00.005
23:00:45 exceptions/hotpotato_checked PASSED C 0:09.935 - R 0:00.009
23:00:45 exceptions/hotpotato PASSED C 0:09.867 - R 0:00.009
23:00:45 gmp PASSED C 0:10.086 - R 0:00.009
23:00:45 random PASSED C 0:08.022 - R 0:00.005
23:00:45 vector_math/vec2_ldouble PASSED C 0:09.025 - R 0:00.005
23:00:45 io/manipulatorsOutput2 PASSED C 0:10.667 - R 0:00.005
23:00:45 nested_function PASSED C 0:10.060 - R 0:00.010
23:00:45 math PASSED C 0:11.484 - R 0:00.005
23:00:45 mathX PASSED C 0:11.802 - R 0:00.033
23:00:45 io/manipulatorsOutput1 PASSED C 0:16.381 - R 0:00.011
23:00:45 io/manipulatorsOutput3 PASSED C 0:17.297 - R 0:00.010
23:00:45377 passes, 1 failures, 0 timeouts, 0 cancelled, 0 other
23:00:45Tests took 3:31.206
23:00:45make: *** [Makefile:986: all-local] Error 1
23:00:45[Pipeline] }
23:00:45[Pipeline] // dir
23:00:45[Pipeline] }
23:00:45[Pipeline] // stage
23:00:45[Pipeline] echo
23:00:45Archiving core dumps
23:00:45[Pipeline] dir
23:00:45Running in /var/lib/jenkins/workspace/Cforall_master_2@tmp
23:00:45[Pipeline] {
23:00:45[Pipeline] fileExists
23:00:45[Pipeline] sh
23:00:45+ /var/lib/jenkins/workspace/Cforall_master_2/tools/jenkins/archive-gen.sh
23:00:45[Pipeline] archiveArtifacts
23:00:45Archiving artifacts
23:00:45Recording fingerprints
23:00:45[Pipeline] }
23:00:45[Pipeline] // dir
23:00:45[Pipeline] }
23:00:45[Pipeline] // wrap
23:00:45[Pipeline] }
23:00:45[Pipeline] // node
23:00:45[Pipeline] echo
23:00:45hudson.AbortException: script returned exit code 2
23:00:45[Pipeline] node
23:00:45Running on Brokk 5 in /var/lib/jenkins/workspace/Cforall_master_2
23:00:45[Pipeline] {
23:00:45[Pipeline] echo
23:00:45Notifying users of result
23:00:45[Pipeline] echo
23:00:45Reusing previously constructed message
23:00:45[Pipeline] echo
23:00:45Would send email to: cforall@lists.uwaterloo.ca
23:00:45[Pipeline] echo
23:00:45With title: [cforall git][BUILD# 3885 - FAILURE] - branch master
23:00:45[Pipeline] echo
23:00:45Content:
23:00:45<p>This is an automated email from the Jenkins build machine. It was
23:00:45generated because of a git hooks/post-receive script following
23:00:45a ref change which was pushed to the C∀ repository.</p>
23:00:4523:00:45<p>- Status --------------------------------------------------------------</p>
23:00:4523:00:45<p>BUILD# 3885 - FAILURE</p>
23:00:45<p>Check console output at https://cforall.uwaterloo.ca/jenkins/job/Cforall/job/master/3885/ to view the results.</p>
23:00:4523:00:45<p>- Changes -------------------------------------------------------------</p>
23:00:4523:00:45<pre>
23:00:45The branch master has been updated.
23:00:45 from e2563b2a147d3a25fbf6bfab7e5e5efc06c56824 (commit)
23:00:45</pre>
23:00:4523:00:45<p>- Log -----------------------------------------------------------------</p>
23:00:4523:00:45<pre>
23:00:4523:00:45</pre>
23:00:4523:00:45<p>-----------------------------------------------------------------------</p>
23:00:45<pre>
23:00:45Summary of changes:
23:00:4523:00:45</pre>
23:00:4523:00:45[Pipeline] }
23:00:45[Pipeline] // node
23:00:45[Pipeline] echo
23:00:45Build Completed
23:00:45[Pipeline] End of Pipeline
23:00:45ERROR: script returned exit code 2
23:00:45Finished: FAILURE
[Pipeline] error
[Pipeline] }
23:00:45Failed in branch gcc_12_x64_new
23:01:24Build Cforall » master #3886 completed: SUCCESS
[Pipeline] echo
23:01:24SUCCESS
[Pipeline] }
23:02:18Build Cforall » master #3884 completed: SUCCESS
[Pipeline] echo
23:02:18SUCCESS
[Pipeline] }
23:03:18Build Cforall » master #3883 completed: SUCCESS
[Pipeline] echo
23:03:18SUCCESS
[Pipeline] }
23:05:31Build Cforall » master #3882 completed: SUCCESS
[Pipeline] echo
23:05:31SUCCESS
[Pipeline] }
23:13:57Build Cforall » master #3888 completed: SUCCESS
[Pipeline] echo
23:13:57SUCCESS
[Pipeline] }
23:17:00Build Cforall » master #3887 completed: SUCCESS
[Pipeline] echo
23:17:00SUCCESS
[Pipeline] }
23:30:32Build Cforall » master #3889 completed: SUCCESS
[Pipeline] echo
23:30:32SUCCESS
[Pipeline] }
[Pipeline] // parallel
[Pipeline] }
[Pipeline] // stage
[Pipeline] }
[Pipeline] // wrap
[Pipeline] echo
error caught
[Pipeline] node
Running on Brokk 4 in /var/lib/jenkins/workspace/Cforall_Full_Build
[Pipeline] {
[Pipeline] echo
notifying users
[Pipeline] emailext
Sending email to: cforall@lists.uwaterloo.ca
[Pipeline] }
[Pipeline] // node
[Pipeline] }
[Pipeline] // node
[Pipeline] End of Pipeline
ERROR: FAILURE
Finished: FAILURE