Started by timer
Running as Jenkins Build User
Obtained Jenkins/FullBuild from git cforall@plg.uwaterloo.ca:software/cfa/cfa-cc
[Pipeline] Start of Pipeline
[Pipeline] node
Running on Brokk 3 in /var/lib/jenkins/workspace/Cforall_Full_Build
[Pipeline] {
[Pipeline] checkout
The recommended git tool is: NONE
using credential git_key_aug2025
Fetching changes from the remote Git repository
Checking out Revision e98b4ec769cbe797fd14db5f82f2fef821a3e1f0 (refs/remotes/origin/master)
> git rev-parse --resolve-git-dir /var/lib/jenkins/workspace/Cforall_Full_Build/.git # timeout=10
> git config remote.origin.url cforall@plg.uwaterloo.ca:software/cfa/cfa-cc # timeout=10
Fetching upstream changes from cforall@plg.uwaterloo.ca:software/cfa/cfa-cc
> git --version # timeout=10
> git --version # 'git version 2.43.0'
using GIT_SSH to set credentials Git key use to connect to the cforall git repo (August 2025)
Verifying host key using known hosts file
> git fetch --tags --force --progress -- cforall@plg.uwaterloo.ca:software/cfa/cfa-cc +refs/heads/*:refs/remotes/origin/* # timeout=10
> git rev-parse refs/remotes/origin/master^{commit} # timeout=10
> git config core.sparsecheckout # timeout=10
> git checkout -f e98b4ec769cbe797fd14db5f82f2fef821a3e1f0 # timeout=10
Commit message: "alvin thesis scratch ideas"
> git rev-list --no-walk d02a308a0ad31eef41dc7f5220a818ad6794538b # timeout=10
[Pipeline] wrap
[Pipeline] {
[Pipeline] stage
[Pipeline] { (Build)
[Pipeline] parallel
[Pipeline] { (Branch: gcc_10_x86_new)
[Pipeline] { (Branch: gcc_11_x86_new)
[Pipeline] { (Branch: gcc_12_x86_new)
[Pipeline] { (Branch: gcc_9_x64_new)
[Pipeline] { (Branch: gcc_10_x64_new)
[Pipeline] { (Branch: gcc_11_x64_new)
[Pipeline] { (Branch: gcc_12_x64_new)
[Pipeline] { (Branch: gcc_10_arm64_new)
[Pipeline] { (Branch: gcc_11_arm64_new)
[Pipeline] { (Branch: gcc_12_arm64_new)
[Pipeline] { (Branch: clang_x64_new)
[Pipeline] sleep
22:47:03Sleeping for 2 min 0 sec
[Pipeline] sleep
22:47:03Sleeping for 3 min 0 sec
[Pipeline] sleep
22:47:03Sleeping for 2 min 0 sec
[Pipeline] sleep
22:47:03No need to sleep any longer
[Pipeline] sleep
22:47:03Sleeping for 4 min 0 sec
[Pipeline] sleep
22:47:03Sleeping for 2 min 0 sec
[Pipeline] sleep
22:47:03Sleeping for 4 min 0 sec
[Pipeline] sleep
22:47:03Sleeping for 4 min 0 sec
[Pipeline] sleep
22:47:03Sleeping for 4 min 0 sec
[Pipeline] sleep
22:47:03Sleeping for 4 min 0 sec
[Pipeline] sleep
22:47:03Sleeping for 1 min 0 sec
[Pipeline] build
22:47:03Scheduling project: Cforall » master22:47:13Starting building: Cforall » master #3755[Pipeline] build
22:48:03Scheduling project: Cforall » master22:48:13Starting building: Cforall » master #3756[Pipeline] build
22:49:03Scheduling project: Cforall » master[Pipeline] build
22:49:03Scheduling project: Cforall » master[Pipeline] build
22:49:03Scheduling project: Cforall » master22:49:13Starting building: Cforall » master #375822:49:13Starting building: Cforall » master #375722:49:13Starting building: Cforall » master #3759[Pipeline] build
22:50:03Scheduling project: Cforall » master22:50:13Starting building: Cforall » master #3760[Pipeline] build
22:51:03Scheduling project: Cforall » master[Pipeline] build
22:51:03Scheduling project: Cforall » master[Pipeline] build
22:51:03Scheduling project: Cforall » master[Pipeline] build
22:51:03Scheduling project: Cforall » master[Pipeline] build
22:51:03Scheduling project: Cforall » master22:51:13Starting building: Cforall » master #376122:51:13Starting building: Cforall » master #376522:51:13Starting building: Cforall » master #376322:51:13Starting building: Cforall » master #376422:51:13Starting building: Cforall » master #376222:59:51Build Cforall » master #3763 completed: SUCCESS
[Pipeline] echo
22:59:51SUCCESS
[Pipeline] }
23:00:04Build Cforall » master #3755 completed: SUCCESS
[Pipeline] echo
23:00:04SUCCESS
[Pipeline] }
23:00:43Build Cforall » master #3756 completed: SUCCESS
[Pipeline] echo
23:00:43SUCCESS
[Pipeline] }
23:02:17Build Cforall » master #3759 completed: SUCCESS
[Pipeline] echo
23:02:17SUCCESS
[Pipeline] }
23:02:49Build Cforall » master #3757 completed: SUCCESS
[Pipeline] echo
23:02:49SUCCESS
[Pipeline] }
23:04:16Build Cforall » master #3762 completed: SUCCESS
[Pipeline] echo
23:04:16SUCCESS
[Pipeline] }
23:04:29Build Cforall » master #3761 completed: SUCCESS
[Pipeline] echo
23:04:29SUCCESS
[Pipeline] }
23:08:20Build Cforall » master #3764 completed: SUCCESS
[Pipeline] echo
23:08:20SUCCESS
[Pipeline] }
23:16:50Build Cforall » master #3765 completed: SUCCESS
[Pipeline] echo
23:16:50SUCCESS
[Pipeline] }
23:16:52Build Cforall » master #3758 completed: SUCCESS
[Pipeline] echo
23:16:52SUCCESS
[Pipeline] }
23:35:47Build Cforall » master #3760 completed: FAILURE
[Pipeline] echo
23:35:47FAILURE
[Pipeline] sh
23:35:48+ wget -q -O - https://cforall.uwaterloo.ca/jenkins/job/Cforall/job/master/3760/consoleText23:35:48Started by upstream project "Cforall_Full_Build" build number 422
23:35:48originally caused by:
23:35:48 Started by timer
23:35:48Running as Jenkins Build User
23:35:48 > git rev-parse --resolve-git-dir /var/lib/jenkins/caches/git-914b6fdde163b7e17ee75d99ca23f18a/.git # timeout=10
23:35:48Setting origin to cforall@plg.uwaterloo.ca:software/cfa/cfa-cc
23:35:48 > git config remote.origin.url cforall@plg.uwaterloo.ca:software/cfa/cfa-cc # timeout=10
23:35:48Fetching origin...
23:35:48Fetching upstream changes from origin
23:35:48 > git --version # timeout=10
23:35:48 > git --version # 'git version 2.43.0'
23:35:48 > git config --get remote.origin.url # timeout=10
23:35:48using GIT_SSH to set credentials Git key use to connect to the cforall git repo (August 2025)
23:35:48Verifying host key using known hosts file
23:35:48 > git fetch --no-tags --force --progress -- origin +refs/heads/*:refs/remotes/origin/* # timeout=10
23:35:48Seen branch in repository origin/ADT
23:35:48Seen branch in repository origin/aaron-thesis
23:35:48Seen branch in repository origin/arm-eh
23:35:48Seen branch in repository origin/ast-experimental
23:35:48Seen branch in repository origin/cleanup-dtors
23:35:48Seen branch in repository origin/ctor
23:35:48Seen branch in repository origin/deferred_resn
23:35:48Seen branch in repository origin/demangler
23:35:48Seen branch in repository origin/enum
23:35:48Seen branch in repository origin/forall-pointer-decay
23:35:48Seen branch in repository origin/gc_noraii
23:35:48Seen branch in repository origin/jacob/cs343-translation
23:35:48Seen branch in repository origin/jenkins-sandbox
23:35:48Seen branch in repository origin/master
23:35:48Seen branch in repository origin/memory
23:35:48Seen branch in repository origin/new-ast
23:35:48Seen branch in repository origin/new-ast-unique-expr
23:35:48Seen branch in repository origin/new-env
23:35:48Seen branch in repository origin/no_list
23:35:48Seen branch in repository origin/persistent-indexer
23:35:48Seen branch in repository origin/pthread-emulation
23:35:48Seen branch in repository origin/qualifiedEnum
23:35:48Seen branch in repository origin/resolv-new
23:35:48Seen branch in repository origin/string
23:35:48Seen branch in repository origin/stuck-waitfor-destruct
23:35:48Seen branch in repository origin/with_gc
23:35:48Seen 26 remote branches
23:35:48Obtained Jenkinsfile from e98b4ec769cbe797fd14db5f82f2fef821a3e1f0
23:35:48[Pipeline] Start of Pipeline
23:35:48[Pipeline] node
23:35:48Running on Algol in /var/lib/jenkins/workspace/Cforall_master
23:35:48[Pipeline] {
23:35:48[Pipeline] wrap
23:35:48[Pipeline] {
23:35:48[Pipeline] properties
23:35:48WARNING: Unknown parameter(s) found for class type 'hudson.model.ChoiceParameterDefinition': defaultValue
23:35:48WARNING: Unknown parameter(s) found for class type 'hudson.model.ChoiceParameterDefinition': defaultValue
23:35:48[Pipeline] checkout
23:35:48The recommended git tool is: NONE
23:35:48using credential git_key_aug2025
23:35:48Fetching changes from the remote Git repository
23:35:48Cleaning workspace
23:35:48Fetching without tags
23:35:48Checking out Revision e98b4ec769cbe797fd14db5f82f2fef821a3e1f0 (master)
23:35:48Commit message: "alvin thesis scratch ideas"
23:35:48[Pipeline] load
23:35:48[Pipeline] { (Jenkins/tools.groovy)
23:35:48[Pipeline] }
23:35:48[Pipeline] // load
23:35:48[Pipeline] echo
23:35:48Compiler : gcc-11 (g++-11/gcc-11)
23:35:48Architecture : x86
23:35:48Arc Flags : --host=i386
23:35:48Run All Tests : true
23:35:48Run Benchmark : true
23:35:48Build Documentation : false
23:35:48Publish : true
23:35:48Silent : true
23:35:4823:35:48[Pipeline] }
23:35:48[Pipeline] // wrap
23:35:48[Pipeline] }
23:35:48[Pipeline] // node
23:35:48[Pipeline] node
23:35:48 > git rev-parse --resolve-git-dir /var/lib/jenkins/workspace/Cforall_master/.git # timeout=10
23:35:48 > git config remote.origin.url cforall@plg.uwaterloo.ca:software/cfa/cfa-cc # timeout=10
23:35:48 > git rev-parse --verify HEAD # timeout=10
23:35:48Resetting working tree
23:35:48 > git reset --hard # timeout=10
23:35:48 > git clean -fdx # timeout=10
23:35:48Fetching upstream changes from cforall@plg.uwaterloo.ca:software/cfa/cfa-cc
23:35:48 > git --version # timeout=10
23:35:48 > git --version # 'git version 2.43.0'
23:35:48using GIT_SSH to set credentials Git key use to connect to the cforall git repo (August 2025)
23:35:48Verifying host key using known hosts file
23:35:48 > git fetch --no-tags --force --progress -- cforall@plg.uwaterloo.ca:software/cfa/cfa-cc +refs/heads/*:refs/remotes/origin/* # timeout=10
23:35:48 > git config core.sparsecheckout # timeout=10
23:35:48 > git checkout -f e98b4ec769cbe797fd14db5f82f2fef821a3e1f0 # timeout=10
23:35:48 > git rev-list --no-walk e98b4ec769cbe797fd14db5f82f2fef821a3e1f0 # timeout=10
23:35:48Still waiting to schedule task
23:35:48‘Ada’ is offline
23:35:48‘Algol’ doesn’t have label ‘x86’
23:35:48‘Brokk 1’ doesn’t have label ‘x86’
23:35:48‘Brokk 4’ doesn’t have label ‘x86’
23:35:48‘Brokk 6’ doesn’t have label ‘x86’
23:35:48‘Cobol’ is offline
23:35:48‘Python’ is offline
23:35:48‘Ruby’ is offline
23:35:48Running on Brokk 0 in /var/lib/jenkins/workspace/Cforall_master_2
23:35:48[Pipeline] {
23:35:48[Pipeline] wrap
23:35:48[Pipeline] {
23:35:48[Pipeline] pwd
23:35:48[Pipeline] pwd
23:35:48[Pipeline] echo
23:35:48 -------- Cleanup --------
23:35:48[Pipeline] stage
23:35:48[Pipeline] { (Cleanup)
23:35:48[Pipeline] dir
23:35:48Running in /var/lib/jenkins/workspace/Cforall_master_2@tmp
23:35:48[Pipeline] {
23:35:48[Pipeline] deleteDir
23:35:48[Pipeline] }
23:35:48[Pipeline] // dir
23:35:48[Pipeline] }
23:35:48[Pipeline] // stage
23:35:48[Pipeline] echo
23:35:48 -------- Checkout --------
23:35:48[Pipeline] stage
23:35:48[Pipeline] { (Checkout)
23:35:48[Pipeline] checkout
23:35:48The recommended git tool is: NONE
23:35:48using credential git_key_aug2025
23:35:48Fetching changes from the remote Git repository
23:35:48Cleaning workspace
23:35:48Fetching without tags
23:35:48 > git rev-parse --resolve-git-dir /var/lib/jenkins/workspace/Cforall_master_2/.git # timeout=10
23:35:48 > git config remote.origin.url cforall@plg.uwaterloo.ca:software/cfa/cfa-cc # timeout=10
23:35:48 > git rev-parse --verify HEAD # timeout=10
23:35:48Resetting working tree
23:35:48 > git reset --hard # timeout=10
23:35:48 > git clean -fdx # timeout=10
23:35:48Fetching upstream changes from cforall@plg.uwaterloo.ca:software/cfa/cfa-cc
23:35:48 > git --version # timeout=10
23:35:48 > git --version # 'git version 2.43.0'
23:35:48using GIT_SSH to set credentials Git key use to connect to the cforall git repo (August 2025)
23:35:48Verifying host key using known hosts file
23:35:48 > git fetch --no-tags --force --progress -- cforall@plg.uwaterloo.ca:software/cfa/cfa-cc +refs/heads/*:refs/remotes/origin/* # timeout=10
23:35:48Checking out Revision e98b4ec769cbe797fd14db5f82f2fef821a3e1f0 (master)
23:35:48Commit message: "alvin thesis scratch ideas"
23:35:48[Pipeline] echo
23:35:48Constructing new git message
23:35:48[Pipeline] sh
23:35:48+ git rev-list e98b4ec769cbe797fd14db5f82f2fef821a3e1f0..e98b4ec769cbe797fd14db5f82f2fef821a3e1f0
23:35:48[Pipeline] sh
23:35:48 > git config core.sparsecheckout # timeout=10
23:35:48 > git checkout -f e98b4ec769cbe797fd14db5f82f2fef821a3e1f0 # timeout=10
23:35:48+ git cat-file -t e98b4ec769cbe797fd14db5f82f2fef821a3e1f0
23:35:48[Pipeline] sh
23:35:48+ git rev-list --format=short e98b4ec769cbe797fd14db5f82f2fef821a3e1f0...e98b4ec769cbe797fd14db5f82f2fef821a3e1f0
23:35:48[Pipeline] sh
23:35:48+ git diff --stat --color e98b4ec769cbe797fd14db5f82f2fef821a3e1f0 e98b4ec769cbe797fd14db5f82f2fef821a3e1f0
23:35:48[Pipeline] echo
23:35:4823:35:48<p>- Changes -------------------------------------------------------------</p>
23:35:4823:35:48<pre>
23:35:48The branch master has been updated.
23:35:48 from e98b4ec769cbe797fd14db5f82f2fef821a3e1f0 (commit)
23:35:48</pre>
23:35:4823:35:48<p>- Log -----------------------------------------------------------------</p>
23:35:4823:35:48<pre>
23:35:4823:35:48</pre>
23:35:4823:35:48<p>-----------------------------------------------------------------------</p>
23:35:48<pre>
23:35:48Summary of changes:
23:35:4823:35:48</pre>
23:35:4823:35:48[Pipeline] }
23:35:48[Pipeline] // stage
23:35:48[Pipeline] echo
23:35:48 -------- Build : configure --------
23:35:48[Pipeline] stage
23:35:48[Pipeline] { (Build : configure)
23:35:48[Pipeline] dir
23:35:48Running in /var/lib/jenkins/workspace/Cforall_master_2
23:35:48[Pipeline] {
23:35:48[Pipeline] sh
23:35:48+ ./autogen.sh
23:35:48Running aclocal in root
23:35:48Running libtoolize in root
23:35:48libtoolize: putting auxiliary files in AC_CONFIG_AUX_DIR, 'automake'.
23:35:48libtoolize: linking file 'automake/ltmain.sh'
23:35:48libtoolize: putting macros in AC_CONFIG_MACRO_DIRS, 'automake'.
23:35:48libtoolize: linking file 'automake/libtool.m4'
23:35:48libtoolize: linking file 'automake/ltoptions.m4'
23:35:48libtoolize: linking file 'automake/ltsugar.m4'
23:35:48libtoolize: linking file 'automake/ltversion.m4'
23:35:48libtoolize: linking file 'automake/lt~obsolete.m4'
23:35:48Running autoconf in root
23:35:48Running automake in root
23:35:48configure.ac:223: installing 'automake/compile'
23:35:48configure.ac:138: installing 'automake/config.guess'
23:35:48configure.ac:138: installing 'automake/config.sub'
23:35:48configure.ac:17: installing 'automake/install-sh'
23:35:48benchmark/Makefile.am: installing 'automake/depcomp'
23:35:48parallel-tests: installing 'automake/test-driver'
23:35:48configure.ac: installing 'automake/ylwrap'
23:35:48Running aclocal in libcfa
23:35:48Running libtoolize in libcfa
23:35:48libtoolize: putting auxiliary files in AC_CONFIG_AUX_DIR, 'automake'.
23:35:48libtoolize: linking file 'automake/ltmain.sh'
23:35:48libtoolize: putting macros in AC_CONFIG_MACRO_DIRS, 'automake'.
23:35:48libtoolize: linking file 'automake/libtool.m4'
23:35:48libtoolize: linking file 'automake/ltoptions.m4'
23:35:48libtoolize: linking file 'automake/ltsugar.m4'
23:35:48libtoolize: linking file 'automake/ltversion.m4'
23:35:48libtoolize: linking file 'automake/lt~obsolete.m4'
23:35:48Running autoconf in libcfa
23:35:48Running automake in libcfa
23:35:48configure.ac:119: installing 'automake/compile'
23:35:48configure.ac:119: installing 'automake/config.guess'
23:35:48configure.ac:119: installing 'automake/config.sub'
23:35:48configure.ac:12: installing 'automake/install-sh'
23:35:48src/Makefile.am: installing 'automake/depcomp'
23:35:48[Pipeline] }
23:35:48[Pipeline] // dir
23:35:48[Pipeline] dir
23:35:48Running in /var/lib/jenkins/workspace/Cforall_master_2@tmp
23:35:48[Pipeline] {
23:35:48[Pipeline] sh
23:35:48+ /var/lib/jenkins/workspace/Cforall_master_2/configure CXX=g++-11 CC=gcc-11 --host=i386 AR=gcc-ar RANLIB=gcc-ranlib --with-target-hosts=host:debug,host:nodebug --quiet --prefix=/var/lib/jenkins/workspace/Cforall_master_2@tmp
23:35:48[Pipeline] sh
23:35:48+ nproc
23:35:48+ make -j 16 --no-print-directory configure-libcfa
23:35:48libcfa/x86-debug/config.data
23:35:48Configuring libcfa (/var/lib/jenkins/workspace/Cforall_master_2/libcfa/configure) with ''CXX=g++-11' 'CC=gcc-11' 'AR=gcc-ar' 'RANLIB=gcc-ranlib' '--prefix=/var/lib/jenkins/workspace/Cforall_master_2@tmp' DRIVER_DIR=/var/lib/jenkins/workspace/Cforall_master_2@tmp/driver/ ARCHITECTURE=x86 CONFIGURATION=debug CFA_VERSION=1:0:0' from /var/lib/jenkins/workspace/Cforall_master_2@tmp / libcfa/x86-debug/
23:35:48libcfa/x86-nodebug/config.data
23:35:48Configuring libcfa (/var/lib/jenkins/workspace/Cforall_master_2/libcfa/configure) with ''CXX=g++-11' 'CC=gcc-11' 'AR=gcc-ar' 'RANLIB=gcc-ranlib' '--prefix=/var/lib/jenkins/workspace/Cforall_master_2@tmp' DRIVER_DIR=/var/lib/jenkins/workspace/Cforall_master_2@tmp/driver/ ARCHITECTURE=x86 CONFIGURATION=nodebug CFA_VERSION=1:0:0' from /var/lib/jenkins/workspace/Cforall_master_2@tmp / libcfa/x86-nodebug/
23:35:48checking whether make supports nested variables... checking whether make supports nested variables... yes
23:35:48checking for a BSD-compatible install... yes
23:35:48checking for a BSD-compatible install... /usr/bin/install -c
23:35:48checking whether build environment is sane... /usr/bin/install -c
23:35:48checking whether build environment is sane... yes
23:35:48yes
23:35:48checking for a race-free mkdir -p... checking for a race-free mkdir -p... /usr/bin/mkdir -p
23:35:48checking for gawk... gawk
23:35:48checking whether make sets $(MAKE)... /usr/bin/mkdir -p
23:35:48checking for gawk... gawk
23:35:48checking whether make sets $(MAKE)... yes
23:35:48yes
23:35:48checking for distributated build... no
23:35:48checking for distributated build... no
23:35:48checking build system type... checking build system type... x86_64-pc-linux-gnu
23:35:48checking host system type... x86_64-pc-linux-gnu
23:35:48checking how to print strings... x86_64-pc-linux-gnu
23:35:48checking host system type... x86_64-pc-linux-gnu
23:35:48checking how to print strings... printf
23:35:48checking whether make supports the include directive... printf
23:35:48checking whether make supports the include directive... yes (GNU style)
23:35:48checking for gcc... gcc-11
23:35:48yes (GNU style)
23:35:48checking for gcc... gcc-11
23:35:48checking whether the C compiler works... checking whether the C compiler works... yes
23:35:48checking for C compiler default output file name... a.out
23:35:48checking for suffix of executables... yes
23:35:48checking for C compiler default output file name... a.out
23:35:48checking for suffix of executables...
23:35:48checking whether we are cross compiling...
23:35:48checking whether we are cross compiling... no
23:35:48checking for suffix of object files... no
23:35:48checking for suffix of object files... o
23:35:48checking whether the compiler supports GNU C... o
23:35:48checking whether the compiler supports GNU C... yes
23:35:48checking whether gcc-11 accepts -g... yes
23:35:48checking whether gcc-11 accepts -g... yes
23:35:48checking for gcc-11 option to enable C11 features... yes
23:35:48checking for gcc-11 option to enable C11 features... none needed
23:35:48checking whether gcc-11 understands -c and -o together... none needed
23:35:48checking whether gcc-11 understands -c and -o together... yes
23:35:48checking dependency style of gcc-11... yes
23:35:48checking dependency style of gcc-11... gcc3
23:35:48checking for a sed that does not truncate output... /usr/bin/sed
23:35:48checking for grep that handles long lines and -e... /usr/bin/grep
23:35:48checking for egrep... gcc3
23:35:48checking for a sed that does not truncate output... /usr/bin/grep -E
23:35:48checking for fgrep... /usr/bin/grep -F
23:35:48checking for ld used by gcc-11... /usr/bin/sed
23:35:48checking for grep that handles long lines and -e... /usr/bin/grep
23:35:48checking for egrep... /usr/bin/ld
23:35:48checking if the linker (/usr/bin/ld) is GNU ld... /usr/bin/grep -E
23:35:48checking for fgrep... yes
23:35:48checking for BSD- or MS-compatible name lister (nm)... /usr/bin/grep -F
23:35:48checking for ld used by gcc-11... /usr/bin/nm -B
23:35:48checking the name lister (/usr/bin/nm -B) interface... /usr/bin/ld
23:35:48checking if the linker (/usr/bin/ld) is GNU ld... yes
23:35:48checking for BSD- or MS-compatible name lister (nm)... /usr/bin/nm -B
23:35:48checking the name lister (/usr/bin/nm -B) interface... BSD nm
23:35:48checking whether ln -s works... yes
23:35:48checking the maximum length of command line arguments... 1572864
23:35:48BSD nm
23:35:48checking whether ln -s works... yes
23:35:48checking the maximum length of command line arguments... checking how to convert x86_64-pc-linux-gnu file names to x86_64-pc-linux-gnu format... func_convert_file_noop
23:35:48checking how to convert x86_64-pc-linux-gnu file names to toolchain format... func_convert_file_noop
23:35:48checking for /usr/bin/ld option to reload object files... -r
23:35:48checking for file... file
23:35:48checking for objdump... objdump
23:35:48checking how to recognize dependent libraries... pass_all
23:35:48checking for dlltool... no
23:35:48checking how to associate runtime and link libraries... printf %s\n
23:35:48checking for archiver @FILE support... 1572864
23:35:48checking how to convert x86_64-pc-linux-gnu file names to x86_64-pc-linux-gnu format... func_convert_file_noop
23:35:48checking how to convert x86_64-pc-linux-gnu file names to toolchain format... func_convert_file_noop
23:35:48checking for /usr/bin/ld option to reload object files... -r
23:35:48checking for file... file
23:35:48checking for objdump... objdump
23:35:48checking how to recognize dependent libraries... pass_all
23:35:48checking for dlltool... no
23:35:48checking how to associate runtime and link libraries... printf %s\n
23:35:48checking for archiver @FILE support... @
23:35:48checking for strip... strip
23:35:48checking for ranlib... gcc-ranlib
23:35:48checking command to parse /usr/bin/nm -B output from gcc-11 object... @
23:35:48checking for strip... strip
23:35:48checking for ranlib... gcc-ranlib
23:35:48checking command to parse /usr/bin/nm -B output from gcc-11 object... ok
23:35:48checking for sysroot... no
23:35:48checking for a working dd... /usr/bin/dd
23:35:48checking how to truncate binary pipes... /usr/bin/dd bs=4096 count=1
23:35:48ok
23:35:48checking for sysroot... no
23:35:48checking for a working dd... /usr/bin/dd
23:35:48checking how to truncate binary pipes... checking for mt... mt
23:35:48checking if mt is a manifest tool... /usr/bin/dd bs=4096 count=1
23:35:48no
23:35:48checking for stdio.h... checking for mt... mt
23:35:48checking if mt is a manifest tool... no
23:35:48checking for stdio.h... yes
23:35:48checking for stdlib.h... yes
23:35:48checking for stdlib.h... yes
23:35:48checking for string.h... yes
23:35:48checking for string.h... yes
23:35:48checking for inttypes.h... yes
23:35:48checking for inttypes.h... yes
23:35:48checking for stdint.h... yes
23:35:48checking for stdint.h... yes
23:35:48checking for strings.h... yes
23:35:48checking for strings.h... yes
23:35:48checking for sys/stat.h... yes
23:35:48checking for sys/stat.h... yes
23:35:48checking for sys/types.h... yes
23:35:48checking for sys/types.h... yes
23:35:48checking for unistd.h... yes
23:35:48checking for unistd.h... yes
23:35:48checking for dlfcn.h... yes
23:35:48checking for dlfcn.h... yes
23:35:48checking for objdir... .libs
23:35:48yes
23:35:48checking for objdir... .libs
23:35:48checking if gcc-11 supports -fno-rtti -fno-exceptions... checking if gcc-11 supports -fno-rtti -fno-exceptions... no
23:35:48checking for gcc-11 option to produce PIC... -fPIC -DPIC
23:35:48checking if gcc-11 PIC flag -fPIC -DPIC works... no
23:35:48checking for gcc-11 option to produce PIC... -fPIC -DPIC
23:35:48checking if gcc-11 PIC flag -fPIC -DPIC works... yes
23:35:48checking if gcc-11 static flag -static works... yes
23:35:48checking if gcc-11 static flag -static works... yes
23:35:48checking if gcc-11 supports -c -o file.o... yes
23:35:48checking if gcc-11 supports -c -o file.o... yes
23:35:48checking if gcc-11 supports -c -o file.o... (cached) yes
23:35:48checking whether the gcc-11 linker (/usr/bin/ld -m elf_x86_64) supports shared libraries... yes
23:35:48checking if gcc-11 supports -c -o file.o... (cached) yes
23:35:48checking whether the gcc-11 linker (/usr/bin/ld -m elf_x86_64) supports shared libraries... yes
23:35:48checking whether -lc should be explicitly linked in... yes
23:35:48checking whether -lc should be explicitly linked in... no
23:35:48checking dynamic linker characteristics... no
23:35:48checking dynamic linker characteristics... GNU/Linux ld.so
23:35:48checking how to hardcode library paths into programs... immediate
23:35:48checking whether stripping libraries is possible... yes
23:35:48checking if libtool supports shared libraries... yes
23:35:48checking whether to build shared libraries... yes
23:35:48checking whether to build static libraries... no
23:35:48GNU/Linux ld.so
23:35:48checking how to hardcode library paths into programs... immediate
23:35:48checking whether stripping libraries is possible... yes
23:35:48checking if libtool supports shared libraries... yes
23:35:48checking whether to build shared libraries... yes
23:35:48checking whether to build static libraries... no
23:35:48checking whether the compiler supports GNU C++... checking whether the compiler supports GNU C++... yes
23:35:48checking whether g++-11 accepts -g... yes
23:35:48checking whether g++-11 accepts -g... yes
23:35:48checking for g++-11 option to enable C++11 features... yes
23:35:48checking for g++-11 option to enable C++11 features... none needed
23:35:48checking dependency style of g++-11... none needed
23:35:48checking dependency style of g++-11... gcc3
23:35:48checking how to run the C++ preprocessor... gcc3
23:35:48checking how to run the C++ preprocessor... g++-11 -E
23:35:48g++-11 -E
23:35:48checking for ld used by g++-11... /usr/bin/ld -m elf_x86_64
23:35:48checking if the linker (/usr/bin/ld -m elf_x86_64) is GNU ld... yes
23:35:48checking whether the g++-11 linker (/usr/bin/ld -m elf_x86_64) supports shared libraries... checking for ld used by g++-11... yes
23:35:48/usr/bin/ld -m elf_x86_64
23:35:48checking if the linker (/usr/bin/ld -m elf_x86_64) is GNU ld... yes
23:35:48checking whether the g++-11 linker (/usr/bin/ld -m elf_x86_64) supports shared libraries... yes
23:35:48checking for g++-11 option to produce PIC... -fPIC -DPIC
23:35:48checking if g++-11 PIC flag -fPIC -DPIC works... checking for g++-11 option to produce PIC... -fPIC -DPIC
23:35:48checking if g++-11 PIC flag -fPIC -DPIC works... yes
23:35:48checking if g++-11 static flag -static works... yes
23:35:48checking if g++-11 static flag -static works... yes
23:35:48checking if g++-11 supports -c -o file.o... yes
23:35:48checking if g++-11 supports -c -o file.o... yes
23:35:48checking if g++-11 supports -c -o file.o... (cached) yes
23:35:48checking whether the g++-11 linker (/usr/bin/ld -m elf_x86_64) supports shared libraries... yes
23:35:48checking dynamic linker characteristics... (cached) GNU/Linux ld.so
23:35:48checking how to hardcode library paths into programs... immediate
23:35:48checking for gcc... (cached) gcc-11
23:35:48yes
23:35:48checking if g++-11 supports -c -o file.o... (cached) yes
23:35:48checking whether the g++-11 linker (/usr/bin/ld -m elf_x86_64) supports shared libraries... yes
23:35:48checking dynamic linker characteristics... (cached) GNU/Linux ld.so
23:35:48checking how to hardcode library paths into programs... immediate
23:35:48checking for gcc... (cached) gcc-11
23:35:48checking whether the compiler supports GNU C... (cached) yes
23:35:48checking whether gcc-11 accepts -g... (cached) yes
23:35:48checking for gcc-11 option to enable C11 features... (cached) none needed
23:35:48checking whether gcc-11 understands -c and -o together... (cached) yes
23:35:48checking dependency style of gcc-11... (cached) gcc3
23:35:48checking dependency style of gcc-11... checking whether the compiler supports GNU C... (cached) yes
23:35:48checking whether gcc-11 accepts -g... (cached) yes
23:35:48checking for gcc-11 option to enable C11 features... (cached) none needed
23:35:48checking whether gcc-11 understands -c and -o together... (cached) yes
23:35:48checking dependency style of gcc-11... (cached) gcc3
23:35:48checking dependency style of gcc-11... gcc3
23:35:48checking whether make sets $(MAKE)... (cached) yes
23:35:48checking for linux/rseq.h... gcc3
23:35:48checking whether make sets $(MAKE)... (cached) yes
23:35:48checking for linux/rseq.h... yes
23:35:48checking for rseq_available in -lrseq... yes
23:35:48checking for rseq_available in -lrseq... no
23:35:48checking for gcc-11 options needed to detect all undeclared functions... no
23:35:48checking for gcc-11 options needed to detect all undeclared functions... none needed
23:35:48checking for linux/io_uring.h... yes
23:35:48checking for liburing.h... none needed
23:35:48checking for linux/io_uring.h... yes
23:35:48checking for liburing.h... no
23:35:48checking whether IORING_OP_NOP is declared... yes
23:35:48checking whether IORING_OP_READV is declared... no
23:35:48checking whether IORING_OP_NOP is declared... yes
23:35:48checking whether IORING_OP_WRITEV is declared... yes
23:35:48checking whether IORING_OP_READV is declared... yes
23:35:48checking whether IORING_OP_FSYNC is declared... yes
23:35:48checking whether IORING_OP_WRITEV is declared... yes
23:35:48checking whether IORING_OP_READ_FIXED is declared... yes
23:35:48checking whether IORING_OP_FSYNC is declared... yes
23:35:48checking whether IORING_OP_WRITE_FIXED is declared... yes
23:35:48checking whether IORING_OP_READ_FIXED is declared... yes
23:35:48checking whether IORING_OP_POLL_ADD is declared... yes
23:35:48checking whether IORING_OP_WRITE_FIXED is declared... yes
23:35:48checking whether IORING_OP_POLL_REMOVE is declared... yes
23:35:48checking whether IORING_OP_POLL_ADD is declared... yes
23:35:48checking whether IORING_OP_SYNC_FILE_RANGE is declared... yes
23:35:48checking whether IORING_OP_POLL_REMOVE is declared... yes
23:35:48checking whether IORING_OP_SENDMSG is declared... yes
23:35:48checking whether IORING_OP_SYNC_FILE_RANGE is declared... yes
23:35:48checking whether IORING_OP_RECVMSG is declared... yes
23:35:48checking whether IORING_OP_SENDMSG is declared... yes
23:35:48checking whether IORING_OP_TIMEOUT is declared... yes
23:35:48checking whether IORING_OP_RECVMSG is declared... yes
23:35:48checking whether IORING_OP_TIMEOUT_REMOVE is declared... yes
23:35:48checking whether IORING_OP_TIMEOUT is declared... yes
23:35:48checking whether IORING_OP_ACCEPT is declared... yes
23:35:48checking whether IORING_OP_TIMEOUT_REMOVE is declared... yes
23:35:48checking whether IORING_OP_ASYNC_CANCEL is declared... yes
23:35:48checking whether IORING_OP_ACCEPT is declared... yes
23:35:48checking whether IORING_OP_LINK_TIMEOUT is declared... yes
23:35:48checking whether IORING_OP_ASYNC_CANCEL is declared... yes
23:35:48checking whether IORING_OP_CONNECT is declared... yes
23:35:48checking whether IORING_OP_LINK_TIMEOUT is declared... yes
23:35:48checking whether IORING_OP_FALLOCATE is declared... yes
23:35:48checking whether IORING_OP_CONNECT is declared... yes
23:35:48checking whether IORING_OP_OPENAT is declared... yes
23:35:48checking whether IORING_OP_FALLOCATE is declared... yes
23:35:48checking whether IORING_OP_CLOSE is declared... yes
23:35:48checking whether IORING_OP_OPENAT is declared... yes
23:35:48checking whether IORING_OP_FILES_UPDATE is declared... yes
23:35:48checking whether IORING_OP_CLOSE is declared... yes
23:35:48checking whether IORING_OP_STATX is declared... yes
23:35:48checking whether IORING_OP_FILES_UPDATE is declared... yes
23:35:48checking whether IORING_OP_READ is declared... yes
23:35:48checking whether IORING_OP_STATX is declared... yes
23:35:48checking whether IORING_OP_WRITE is declared... yes
23:35:48checking whether IORING_OP_READ is declared... yes
23:35:48checking whether IORING_OP_FADVISE is declared... yes
23:35:48checking whether IORING_OP_WRITE is declared... yes
23:35:48checking whether IORING_OP_MADVISE is declared... yes
23:35:48checking whether IORING_OP_FADVISE is declared... yes
23:35:48checking whether IORING_OP_SEND is declared... yes
23:35:48checking whether IORING_OP_MADVISE is declared... yes
23:35:48checking whether IORING_OP_RECV is declared... yes
23:35:48checking whether IORING_OP_SEND is declared... yes
23:35:48checking whether IORING_OP_OPENAT2 is declared... yes
23:35:48checking whether IORING_OP_RECV is declared... yes
23:35:48checking whether IORING_OP_EPOLL_CTL is declared... yes
23:35:48checking whether IORING_OP_OPENAT2 is declared... yes
23:35:48checking whether IORING_OP_SPLICE is declared... yes
23:35:48checking whether IORING_OP_EPOLL_CTL is declared... yes
23:35:48checking whether IORING_OP_PROVIDE_BUFFERS is declared... yes
23:35:48checking whether IORING_OP_SPLICE is declared... yes
23:35:48checking whether IORING_OP_REMOVE_BUFFER is declared... yes
23:35:48checking whether IORING_OP_PROVIDE_BUFFERS is declared... no
23:35:48checking whether IORING_OP_TEE is declared... yes
23:35:48checking whether IORING_OP_REMOVE_BUFFER is declared... yes
23:35:48checking whether IOSQE_FIXED_FILE is declared... no
23:35:48checking whether IORING_OP_TEE is declared... yes
23:35:48checking whether IOSQE_IO_DRAIN is declared... yes
23:35:48checking whether IOSQE_FIXED_FILE is declared... yes
23:35:48checking whether IOSQE_IO_LINK is declared... yes
23:35:48checking whether IOSQE_IO_DRAIN is declared... yes
23:35:48checking whether IOSQE_IO_HARDLINK is declared... yes
23:35:48checking whether IOSQE_IO_LINK is declared... yes
23:35:48checking whether IOSQE_ASYNC is declared... yes
23:35:48checking whether IOSQE_IO_HARDLINK is declared... yes
23:35:48checking whether IOSQE_BUFFER_SELECT is declared... yes
23:35:48checking whether IOSQE_ASYNC is declared... yes
23:35:48checking whether SPLICE_F_FD_IN_FIXED is declared... yes
23:35:48checking whether IOSQE_BUFFER_SELECT is declared... yes
23:35:48checking whether IORING_SETUP_ATTACH_WQ is declared... yes
23:35:48checking whether SPLICE_F_FD_IN_FIXED is declared... yes
23:35:48checking whether IORING_REGISTER_IOWQ_MAX_WORKERS is declared... yes
23:35:48checking whether IORING_SETUP_ATTACH_WQ is declared... yes
23:35:48checking for preadv2... yes
23:35:48checking whether IORING_REGISTER_IOWQ_MAX_WORKERS is declared... yes
23:35:48checking for pwritev2... yes
23:35:48checking for preadv2... yes
23:35:48yes
23:35:48checking for pwritev2... checking that generated files are newer than configure... done
23:35:48configure: creating ./config.status
23:35:48yes
23:35:48checking that generated files are newer than configure... done
23:35:48configure: creating ./config.status
23:35:48config.status: creating Makefile
23:35:48config.status: creating src/Makefile
23:35:48config.status: creating prelude/Makefile
23:35:48config.status: creating src/concurrency/io/call.cfa
23:35:48config.status: creating Makefile
23:35:48config.status: creating src/Makefile
23:35:48/var/lib/jenkins/workspace/Cforall_master_2/libcfa/src/concurrency/io/call.cfa.in:144: SyntaxWarning: invalid escape sequence '\('
23:35:48 sig = re.search("(.*) (.*)\((.*)\)", signature)
23:35:48config.status: creating prelude/defines.hfa
23:35:48config.status: creating prelude/Makefile
23:35:48config.status: executing depfiles commands
23:35:48config.status: creating src/concurrency/io/call.cfa
23:35:48/var/lib/jenkins/workspace/Cforall_master_2/libcfa/src/concurrency/io/call.cfa.in:144: SyntaxWarning: invalid escape sequence '\('
23:35:48 sig = re.search("(.*) (.*)\((.*)\)", signature)
23:35:48config.status: creating prelude/defines.hfa
23:35:48config.status: executing libtool commands
23:35:48Cforall library configuraton completed. Type "make -j 8 install".
23:35:48config.status: executing depfiles commands
23:35:48config.status: executing libtool commands
23:35:48Cforall library configuraton completed. Type "make -j 8 install".
23:35:48[Pipeline] }
23:35:48[Pipeline] // dir
23:35:48[Pipeline] }
23:35:48[Pipeline] // stage
23:35:48[Pipeline] echo
23:35:48 -------- Build : cfa-cpp --------
23:35:48[Pipeline] stage
23:35:48[Pipeline] { (Build : cfa-cpp)
23:35:48[Pipeline] dir
23:35:48Running in /var/lib/jenkins/workspace/Cforall_master_2@tmp
23:35:48[Pipeline] {
23:35:48[Pipeline] sh
23:35:48+ nproc
23:35:48+ make -j 16 --no-print-directory -C driver
23:35:48 CXX as.o
23:35:48 CXX cc1.o
23:35:48 CXX cfa.o
23:35:48 CXXLD as
23:35:48 CXXLD cc1
23:35:48 CXXLD cfa
23:35:48[Pipeline] sh
23:35:48+ nproc
23:35:48+ make -j 16 --no-print-directory -C src
23:35:48 YACC Parser/parser.cc
23:35:48updating Parser/parser.output
23:35:48updating Parser/parser.hh
23:35:48make all-am
23:35:48 CXX main.o
23:35:48 CXX CompilationState.o
23:35:48 CXX MakeLibCfa.o
23:35:48 LEX Parser/lex.cc
23:35:48 CXX AST/Attribute.o
23:35:48 CXX AST/Copy.o
23:35:48 CXX AST/Create.o
23:35:48 CXX AST/Decl.o
23:35:48 CXX AST/DeclReplacer.o
23:35:48 CXX AST/Expr.o
23:35:48 CXX AST/GenericSubstitution.o
23:35:48 CXX AST/Init.o
23:35:48 CXX AST/Inspect.o
23:35:48 CXX AST/LinkageSpec.o
23:35:48 CXX AST/Node.o
23:35:48 CXX AST/Pass.o
23:35:48 CXX AST/Print.o
23:35:48 CXX AST/Stmt.o
23:35:48 CXX AST/SymbolTable.o
23:35:48 CXX AST/Type.o
23:35:48 CXX AST/TypeEnvironment.o
23:35:48 CXX AST/TypeSubstitution.o
23:35:48 CXX AST/Util.o
23:35:48 CXX CodeGen/CodeGenerator.o
23:35:48 CXX CodeGen/GenType.o
23:35:48 CXX CodeGen/OperatorTable.o
23:35:48 CXX CodeGen/FixMain.o
23:35:48 CXX CodeGen/FixNames.o
23:35:48 CXX CodeGen/Generate.o
23:35:48 CXX CodeGen/LinkOnce.o
23:35:48 CXX Concurrency/Actors.o
23:35:48 CXX Concurrency/Corun.o
23:35:48 CXX Concurrency/Keywords.o
23:35:48 CXX Concurrency/Waitfor.o
23:35:48 CXX Concurrency/Waituntil.o
23:35:48 CXX Common/Assert.o
23:35:48 CXX Common/CodeLocationTools.o
23:35:48 CXX Common/DeclStats.o
23:35:48 CXX Common/Eval.o
23:35:48 CXX Common/Examine.o
23:35:48 CXX Common/Indenter.o
23:35:48 CXX Common/ResolvProtoDump.o
23:35:48 CXX Common/SemanticError.o
23:35:48 CXX Common/Stats/Counter.o
23:35:48 CXX Common/Stats/Heap.o
23:35:48 CXX Common/Stats/ResolveTime.o
23:35:48 CXX Common/Stats/Stats.o
23:35:48 CXX Common/Stats/Time.o
23:35:48 CXX Common/Symbol.o
23:35:48 CXX Common/UniqueName.o
23:35:48 CXX Common/DebugMalloc.o
23:35:48 CXX ControlStruct/ExceptDecl.o
23:35:48 CXX ControlStruct/ExceptTranslate.o
23:35:48 CXX ControlStruct/FixLabels.o
23:35:48 CXX ControlStruct/HoistControlDecls.o
23:35:48 CXX ControlStruct/LabelGenerator.o
23:35:48 CXX ControlStruct/MultiLevelExit.o
23:35:48 CXX ControlStruct/TranslateEnumRange.o
23:35:48 CXX GenPoly/GenPoly.o
23:35:48 CXX GenPoly/Lvalue2.o
23:35:48 CXX GenPoly/Box.o
23:35:48 CXX GenPoly/FindFunction.o
23:35:48 CXX GenPoly/InstantiateGeneric.o
23:35:48 CXX GenPoly/Lvalue.o
23:35:48 CXX GenPoly/ScrubTypeVars.o
23:35:48 CXX GenPoly/Specialize.o
23:35:48 CXX InitTweak/GenInit.o
23:35:48 CXX InitTweak/InitTweak.o
23:35:48 CXX InitTweak/FixGlobalInit.o
23:35:48 CXX InitTweak/FixInit.o
23:35:48 CXX Parser/DeclarationNode.o
23:35:48 CXX Parser/ExpressionNode.o
23:35:48 CXX Parser/InitializerNode.o
23:35:48 CXX Parser/lex.o
23:35:48 CXX Parser/ParseNode.o
23:35:48 CXX Parser/parser.o
23:35:48 CXX Parser/RunParser.o
23:35:48In file included from /usr/include/x86_64-linux-gnu/c++/11/32/bits/os_defines.h:39,
23:35:48 from /usr/include/x86_64-linux-gnu/c++/11/32/bits/c++config.h:586,
23:35:48 from /usr/include/c++/11/cstdio:41,
23:35:48 from /var/lib/jenkins/workspace/Cforall_master_2/src/Parser/parser.yy:41:
23:35:48/usr/include/features.h:415:4: warning: #warning _FORTIFY_SOURCE requires GCC 4.1 or later [-Wcpp]
23:35:48 415 | # warning _FORTIFY_SOURCE requires GCC 4.1 or later
23:35:48 | ^~~~~~~
23:35:48 CXX Parser/StatementNode.o
23:35:48 CXX Parser/TypeData.o
23:35:48 CXX Parser/TypedefTable.o
23:35:48 CXX ResolvExpr/AdjustExprType.o
23:35:48 CXX ResolvExpr/Candidate.o
23:35:48 CXX ResolvExpr/CandidateFinder.o
23:35:48 CXX ResolvExpr/CastCost.o
23:35:48 CXX ResolvExpr/CommonType.o
23:35:48 CXX ResolvExpr/ConversionCost.o
23:35:48 CXX ResolvExpr/CurrentObject.o
23:35:48 CXX ResolvExpr/ExplodedArg.o
23:35:48 CXX ResolvExpr/FindOpenVars.o
23:35:48 CXX ResolvExpr/PolyCost.o
23:35:48 CXX ResolvExpr/PtrsAssignable.o
23:35:48 CXX ResolvExpr/PtrsCastable.o
23:35:48 CXX ResolvExpr/RenameVars.o
23:35:48 CXX ResolvExpr/Resolver.o
23:35:48 CXX ResolvExpr/ResolveTypeof.o
23:35:48 CXX ResolvExpr/SatisfyAssertions.o
23:35:48 CXX ResolvExpr/SpecCost.o
23:35:48 CXX ResolvExpr/Unify.o
23:35:48 CXX ResolvExpr/CandidatePrinter.o
23:35:48 CXX ResolvExpr/EraseWith.o
23:35:48 CXX SymTab/FixFunction.o
23:35:48 CXX SymTab/GenImplicitCall.o
23:35:48 CXX SymTab/Mangler.o
23:35:48 CXX SymTab/ManglerCommon.o
23:35:48 CXX Tuples/Explode.o
23:35:48 CXX Tuples/TupleAssignment.o
23:35:48 CXX Tuples/TupleExpansion.o
23:35:48 CXX Tuples/Tuples.o
23:35:48 CXX Validate/Autogen.o
23:35:48 CXX Validate/CheckAssertions.o
23:35:48 CXX Validate/CompoundLiteral.o
23:35:48 CXX Validate/EliminateTypedef.o
23:35:48 CXX Validate/EnumAndPointerDecay.o
23:35:48 CXX Validate/FindSpecialDecls.o
23:35:48 CXX Validate/FixQualifiedTypes.o
23:35:48 CXX Validate/FixReturnTypes.o
23:35:48 CXX Validate/ForallPointerDecay.o
23:35:48 CXX Validate/GenericParameter.o
23:35:48 CXX Validate/HoistStruct.o
23:35:48 CXX Validate/HoistTypeDecls.o
23:35:48 CXX Validate/ImplementEnumFunc.o
23:35:48 CXX Validate/InitializerLength.o
23:35:48 CXX Validate/LabelAddressFixer.o
23:35:48 CXX Validate/LinkInstanceTypes.o
23:35:48 CXX Validate/ReplaceTypedef.o
23:35:48 CXX Validate/ReturnCheck.o
23:35:48 CXX Validate/VerifyCtorDtorAssign.o
23:35:48 CXX Virtual/ExpandCasts.o
23:35:48 CXX Virtual/Tables.o
23:35:48 CXX Virtual/VirtualDtor.o
23:35:48 CXXLD ../driver/cfa-cpp
23:35:48[Pipeline] }
23:35:48[Pipeline] // dir
23:35:48[Pipeline] }
23:35:48[Pipeline] // stage
23:35:48[Pipeline] echo
23:35:48 -------- Build : libcfa(debug) --------
23:35:48[Pipeline] stage
23:35:48[Pipeline] { (Build : libcfa(debug))
23:35:48[Pipeline] dir
23:35:48Running in /var/lib/jenkins/workspace/Cforall_master_2@tmp
23:35:48[Pipeline] {
23:35:48[Pipeline] sh
23:35:48+ nproc
23:35:48+ make -j 16 --no-print-directory -C libcfa/x86-debug
23:35:48Making all in prelude
23:35:48mkdir .deps
23:35:48touch .deps/builtins.Po
23:35:48(CDPATH="${ZSH_VERSION+.}:" && cd /var/lib/jenkins/workspace/Cforall_master_2/libcfa && /bin/bash '/var/lib/jenkins/workspace/Cforall_master_2/libcfa/automake/missing' autoheader)
23:35:48rm -f stamp-h1
23:35:48touch /var/lib/jenkins/workspace/Cforall_master_2/libcfa/prelude/defines.hfa.in
23:35:48cd .. && /bin/bash ./config.status prelude/defines.hfa
23:35:48config.status: creating prelude/defines.hfa
23:35:48config.status: prelude/defines.hfa is unchanged
23:35:48make all-am
23:35:48 GEN builtins.cfa
23:35:48 GEN gcc-builtins.c
23:35:48 GEN prelude.cfa
23:35:48 GEN extras.cfa
23:35:48 GEN extras.cfa
23:35:48 GEN gcc-builtins.cfa
23:35:48 GEN bootloader.c
23:35:48Making all in src
23:35:48 CFA common.lo
23:35:48 CFA fstream.lo
23:35:48 CFA heap.lo
23:35:48 CFA iostream.lo
23:35:48 CFA limits.lo
23:35:48 CFA iterator.lo
23:35:48 CFA memory.lo
23:35:48 CFA math.lo
23:35:48 CFA parseargs.lo
23:35:48 CFA parseconfig.lo
23:35:48 CFA rational.lo
23:35:48 CFA stdlib.lo
23:35:48 CFA strstream.lo
23:35:48 CFA time.lo
23:35:48 CFA assert.lo
23:35:48 CFA bits/debug.lo
23:35:48 CC exception.lo
23:35:48 CFA interpose.lo
23:35:48 CFA prelude-inline.lo
23:35:48 CFA startup.lo
23:35:48 CC virtual.lo
23:35:48 GEN prelude.lo
23:35:48 CFA concurrency/locks.lo
23:35:48 CFA concurrency/monitor.lo
23:35:48 CFA concurrency/mutex.lo
23:35:48 CFA concurrency/select.lo
23:35:48 CFA concurrency/thread.lo
23:35:48 CFA concurrency/cofor.lo
23:35:48 CFA interpose_thread.lo
23:35:48 CPPAS concurrency/CtxSwitch-x86.lo
23:35:48 CC concurrency/invoke.lo
23:35:48 CFA concurrency/io.lo
23:35:48 CFA concurrency/kernel/startup.lo
23:35:48 CFA concurrency/preemption.lo
23:35:48 CFA concurrency/ready_queue.lo
23:35:48 CFA concurrency/stats.lo
23:35:48 CFA concurrency/pthread.lo
23:35:48 CFA bits/weakso_locks.lo
23:35:48 CFA algorithms/range_iterator.lo
23:35:48 CFA collections/maybe.lo
23:35:48 CFA collections/pair.lo
23:35:48 CFA collections/result.lo
23:35:48 CFA collections/string.lo
23:35:48 CFA collections/string_res.lo
23:35:48 CFA collections/vector.lo
23:35:48 CFA device/cpu.lo
23:35:48 CFA concurrency/alarm.lo
23:35:48 CFA concurrency/coroutine.lo
23:35:48 CFA concurrency/exception.lo
23:35:48 CFA concurrency/kernel.lo
23:35:48 CFA concurrency/kernel/cluster.lo
23:35:48 CFA concurrency/clib/cfathread.lo
23:35:48 CFA concurrency/io/setup.lo
23:35:48 CFA concurrency/io/call.lo
23:35:48/usr/include/linux/io_uring.h:83:43: warning: 'packed' attribute ignored for field of type 'union __io_uring_sqe____anonymous56' [-Wattributes]
23:35:48 83 | } __attribute__((packed));
23:35:48 | ^
23:35:48/usr/include/linux/io_uring.h:83:43: warning: 'packed' attribute ignored for field of type 'union __io_uring_sqe____anonymous132' [-Wattributes]
23:35:48 83 | } __attribute__((packed));
23:35:48 | ^
23:35:48 CCLD libcfa.la
23:35:48/usr/bin/ld: warning: .libs/common.o: requires executable stack (because the .note.GNU-stack section is executable)
23:35:48/usr/bin/ld: .libs/exception.o: warning: relocation against `__gcfa_personality_v0' in read-only section `.rodata'
23:35:48/usr/bin/ld: warning: creating DT_TEXTREL in a shared object
23:35:48/usr/include/linux/io_uring.h:83:43: warning: 'packed' attribute ignored for field of type 'union __io_uring_sqe____anonymous67' [-Wattributes]
23:35:48 83 | } __attribute__((packed));
23:35:48 | ^
23:35:48concurrency/io/call.cfa: In function '_X15async_epoll_ctlFv_S11io_future_tiiiPS11epoll_eventy__1':
23:35:48concurrency/io/call.cfa:381:87: warning: cast from pointer to integer of different size [-Wpointer-to-int-cast]
23:35:48 381 | sqe->off = (typeof(sqe->off))event;
23:35:48 | ^
23:35:48concurrency/io/call.cfa: In function '_X13async_accept4Fv_S11io_future_tiU26__anonymous___SOCKADDR_ARGPjiy__1':
23:35:48concurrency/io/call.cfa:710:89: warning: cast from pointer to integer of different size [-Wpointer-to-int-cast]
23:35:48 710 | sqe->addr2 = (typeof(sqe->addr2))addrlen;
23:35:48 | ^
23:35:48/usr/include/linux/io_uring.h:83:43: warning: 'packed' attribute ignored for field of type 'union __io_uring_sqe____anonymous122' [-Wattributes]
23:35:48 83 | } __attribute__((packed));
23:35:48 | ^
23:35:48/usr/include/linux/io_uring.h:83:43: warning: 'packed' attribute ignored for field of type 'union __io_uring_sqe____anonymous122' [-Wattributes]
23:35:48 83 | } __attribute__((packed));
23:35:48 | ^
23:35:48/usr/include/linux/io_uring.h:83:43: warning: 'packed' attribute ignored for field of type 'union __io_uring_sqe____anonymous34' [-Wattributes]
23:35:48 83 | } __attribute__((packed));
23:35:48 | ^
23:35:48/usr/include/linux/io_uring.h:83:43: warning: 'packed' attribute ignored for field of type 'union __io_uring_sqe____anonymous99' [-Wattributes]
23:35:48 83 | } __attribute__((packed));
23:35:48 | ^
23:35:48 CCLD libcfathread.la
23:35:48/usr/bin/ld: warning: concurrency/.libs/alarm.o: requires executable stack (because the .note.GNU-stack section is executable)
23:35:48make[1]: Nothing to be done for 'all-am'.
23:35:48[Pipeline] }
23:35:48[Pipeline] // dir
23:35:48[Pipeline] }
23:35:48[Pipeline] // stage
23:35:48[Pipeline] echo
23:35:48 -------- Build : libcfa(nodebug) --------
23:35:48[Pipeline] stage
23:35:48[Pipeline] { (Build : libcfa(nodebug))
23:35:48[Pipeline] dir
23:35:48Running in /var/lib/jenkins/workspace/Cforall_master_2@tmp
23:35:48[Pipeline] {
23:35:48[Pipeline] sh
23:35:48+ nproc
23:35:48+ make -j 16 --no-print-directory -C libcfa/x86-nodebug
23:35:48Making all in prelude
23:35:48mkdir .deps
23:35:48touch .deps/builtins.Po
23:35:48cd .. && /bin/bash ./config.status prelude/defines.hfa
23:35:48config.status: creating prelude/defines.hfa
23:35:48config.status: prelude/defines.hfa is unchanged
23:35:48make all-am
23:35:48 GEN gcc-builtins.c
23:35:48 GEN builtins.cfa
23:35:48 GEN prelude.cfa
23:35:48 GEN extras.cfa
23:35:48 GEN extras.cfa
23:35:48 GEN gcc-builtins.cfa
23:35:48 GEN bootloader.c
23:35:48Making all in src
23:35:48 CFA common.lo
23:35:48 CFA fstream.lo
23:35:48 CFA heap.lo
23:35:48 CFA iostream.lo
23:35:48 CFA iterator.lo
23:35:48 CFA limits.lo
23:35:48 CFA math.lo
23:35:48 CFA memory.lo
23:35:48 CFA parseargs.lo
23:35:48 CFA parseconfig.lo
23:35:48 CFA rational.lo
23:35:48 CFA stdlib.lo
23:35:48 CFA time.lo
23:35:48 CFA strstream.lo
23:35:48 CFA assert.lo
23:35:48 CFA bits/debug.lo
23:35:48 CC exception.lo
23:35:48/var/lib/jenkins/workspace/Cforall_master_2/libcfa/src/exception.c: In function '__cfaehm_allocate_exception':
23:35:48/var/lib/jenkins/workspace/Cforall_master_2/libcfa/src/exception.c:142:17: warning: ignoring return value of 'write' declared with attribute 'warn_unused_result' [-Wunused-result]
23:35:48 142 | write( 2, "abort2\n", 7 );
23:35:48 | ^~~~~~~~~~~~~~~~~~~~~~~~~
23:35:48/var/lib/jenkins/workspace/Cforall_master_2/libcfa/src/exception.c: In function '__cfaehm_exception_cleanup':
23:35:48/var/lib/jenkins/workspace/Cforall_master_2/libcfa/src/exception.c:127:17: warning: ignoring return value of 'write' declared with attribute 'warn_unused_result' [-Wunused-result]
23:35:48 127 | write( 2, "abort1\n", 7 );
23:35:48 | ^~~~~~~~~~~~~~~~~~~~~~~~~
23:35:48/var/lib/jenkins/workspace/Cforall_master_2/libcfa/src/exception.c: In function '__cfaehm_cancel_stack':
23:35:48/var/lib/jenkins/workspace/Cforall_master_2/libcfa/src/exception.c:230:9: warning: ignoring return value of 'write' declared with attribute 'warn_unused_result' [-Wunused-result]
23:35:48 230 | write( 2, "abort3\n", 7 );
23:35:48 | ^~~~~~~~~~~~~~~~~~~~~~~~~
23:35:48/var/lib/jenkins/workspace/Cforall_master_2/libcfa/src/exception.c: In function '__cfaehm_begin_unwind':
23:35:48/var/lib/jenkins/workspace/Cforall_master_2/libcfa/src/exception.c:252:17: warning: ignoring return value of 'write' declared with attribute 'warn_unused_result' [-Wunused-result]
23:35:48 252 | write( 2, "abort4\n", 7 );
23:35:48 | ^~~~~~~~~~~~~~~~~~~~~~~~~
23:35:48/var/lib/jenkins/workspace/Cforall_master_2/libcfa/src/exception.c:278:17: warning: ignoring return value of 'write' declared with attribute 'warn_unused_result' [-Wunused-result]
23:35:48 278 | write( 2, "abort5\n", 7 );
23:35:48 | ^~~~~~~~~~~~~~~~~~~~~~~~~
23:35:48/var/lib/jenkins/workspace/Cforall_master_2/libcfa/src/exception.c: In function '__cfaehm_rethrow_terminate':
23:35:48/var/lib/jenkins/workspace/Cforall_master_2/libcfa/src/exception.c:308:9: warning: ignoring return value of 'write' declared with attribute 'warn_unused_result' [-Wunused-result]
23:35:48 308 | write( 2, "abort7\n", 7 );
23:35:48 | ^~~~~~~~~~~~~~~~~~~~~~~~~
23:35:48/var/lib/jenkins/workspace/Cforall_master_2/libcfa/src/exception.c: In function '__cfaehm_rethrow_adapter':
23:35:48/var/lib/jenkins/workspace/Cforall_master_2/libcfa/src/exception.c:300:9: warning: ignoring return value of 'write' declared with attribute 'warn_unused_result' [-Wunused-result]
23:35:48 300 | write( 2, "abort6\n", 7 );
23:35:48 | ^~~~~~~~~~~~~~~~~~~~~~~~~
23:35:48 CFA interpose.lo
23:35:48 CFA prelude-inline.lo
23:35:48 CFA startup.lo
23:35:48 CC virtual.lo
23:35:48 GEN prelude.lo
23:35:48 CFA concurrency/locks.lo
23:35:48 CFA concurrency/monitor.lo
23:35:48 CFA concurrency/mutex.lo
23:35:48 CFA concurrency/select.lo
23:35:48 CFA concurrency/thread.lo
23:35:48 CFA concurrency/cofor.lo
23:35:48 CFA interpose_thread.lo
23:35:48 CPPAS concurrency/CtxSwitch-x86.lo
23:35:48 CC concurrency/invoke.lo
23:35:48 CFA concurrency/io.lo
23:35:48 CFA concurrency/kernel/startup.lo
23:35:48 CFA concurrency/preemption.lo
23:35:48 CFA concurrency/ready_queue.lo
23:35:48 CFA concurrency/stats.lo
23:35:48 CFA concurrency/pthread.lo
23:35:48 CFA bits/weakso_locks.lo
23:35:48 CFA algorithms/range_iterator.lo
23:35:48 CFA collections/maybe.lo
23:35:48 CFA collections/pair.lo
23:35:48 CFA collections/result.lo
23:35:48 CFA collections/string.lo
23:35:48 CFA collections/string_res.lo
23:35:48 CFA collections/vector.lo
23:35:48 CFA device/cpu.lo
23:35:48 CFA concurrency/alarm.lo
23:35:48 CFA concurrency/coroutine.lo
23:35:48 CFA concurrency/exception.lo
23:35:48 CFA concurrency/kernel.lo
23:35:48 CFA concurrency/kernel/cluster.lo
23:35:48 CFA concurrency/clib/cfathread.lo
23:35:48 CFA concurrency/io/setup.lo
23:35:48 CFA concurrency/io/call.lo
23:35:48/usr/include/linux/io_uring.h:83:43: warning: 'packed' attribute ignored for field of type 'union __io_uring_sqe____anonymous132' [-Wattributes]
23:35:48 83 | } __attribute__((packed));
23:35:48 | ^
23:35:48/usr/include/bits/socket2.h:70:95: warning: '_X12_constructorFv_U26__anonymous___SOCKADDR_ARGU26__anonymous___SOCKADDR_ARG_autogen___1' is static but used in inline function 'recvfrom' which is not static
23:35:48 70 | return __recvfrom_chk (__fd, __buf, __n, sz, __flags, __addr, __addr_len);
23:35:48 | ^
23:35:48/usr/include/bits/socket2.h:70:125: warning: '_X11_destructorFv_U26__anonymous___SOCKADDR_ARG_autogen___1' is static but used in inline function 'recvfrom' which is not static
23:35:48 70 | return __recvfrom_chk (__fd, __buf, __n, sz, __flags, __addr, __addr_len);
23:35:48 | ^
23:35:48/usr/include/bits/socket2.h:68:104: warning: '_X12_constructorFv_U26__anonymous___SOCKADDR_ARGU26__anonymous___SOCKADDR_ARG_autogen___1' is static but used in inline function 'recvfrom' which is not static
23:35:48 68 | return __recvfrom_chk_warn (__fd, __buf, __n, sz, __flags, __addr,
23:35:48 | ^
23:35:48/usr/include/bits/socket2.h:68:129: warning: '_X11_destructorFv_U26__anonymous___SOCKADDR_ARG_autogen___1' is static but used in inline function 'recvfrom' which is not static
23:35:48 68 | return __recvfrom_chk_warn (__fd, __buf, __n, sz, __flags, __addr,
23:35:48 | ^
23:35:48/usr/include/bits/socket2.h:66:97: warning: '_X12_constructorFv_U26__anonymous___SOCKADDR_ARGU26__anonymous___SOCKADDR_ARG_autogen___1' is static but used in inline function 'recvfrom' which is not static
23:35:48 66 | return __recvfrom_alias (__fd, __buf, __n, __flags, __addr, __addr_len);
23:35:48 | ^
23:35:48/usr/include/bits/socket2.h:66:129: warning: '_X11_destructorFv_U26__anonymous___SOCKADDR_ARG_autogen___1' is static but used in inline function 'recvfrom' which is not static
23:35:48 66 | return __recvfrom_alias (__fd, __buf, __n, __flags, __addr, __addr_len);
23:35:48 | ^
23:35:48/usr/include/linux/io_uring.h:83:43: warning: 'packed' attribute ignored for field of type 'union __io_uring_sqe____anonymous56' [-Wattributes]
23:35:48 83 | } __attribute__((packed));
23:35:48 | ^
23:35:48/usr/include/bits/socket2.h:70:95: warning: '_X12_constructorFv_U26__anonymous___SOCKADDR_ARGU26__anonymous___SOCKADDR_ARG_autogen___1' is static but used in inline function 'recvfrom' which is not static
23:35:48 70 | return __recvfrom_chk (__fd, __buf, __n, sz, __flags, __addr, __addr_len);
23:35:48 | ^
23:35:48/usr/include/bits/socket2.h:70:125: warning: '_X11_destructorFv_U26__anonymous___SOCKADDR_ARG_autogen___1' is static but used in inline function 'recvfrom' which is not static
23:35:48 70 | return __recvfrom_chk (__fd, __buf, __n, sz, __flags, __addr, __addr_len);
23:35:48 | ^
23:35:48/usr/include/bits/socket2.h:68:104: warning: '_X12_constructorFv_U26__anonymous___SOCKADDR_ARGU26__anonymous___SOCKADDR_ARG_autogen___1' is static but used in inline function 'recvfrom' which is not static
23:35:48 68 | return __recvfrom_chk_warn (__fd, __buf, __n, sz, __flags, __addr,
23:35:48 | ^
23:35:48/usr/include/bits/socket2.h:68:129: warning: '_X11_destructorFv_U26__anonymous___SOCKADDR_ARG_autogen___1' is static but used in inline function 'recvfrom' which is not static
23:35:48 68 | return __recvfrom_chk_warn (__fd, __buf, __n, sz, __flags, __addr,
23:35:48 | ^
23:35:48/usr/include/bits/socket2.h:66:97: warning: '_X12_constructorFv_U26__anonymous___SOCKADDR_ARGU26__anonymous___SOCKADDR_ARG_autogen___1' is static but used in inline function 'recvfrom' which is not static
23:35:48 66 | return __recvfrom_alias (__fd, __buf, __n, __flags, __addr, __addr_len);
23:35:48 | ^
23:35:48/usr/include/bits/socket2.h:66:129: warning: '_X11_destructorFv_U26__anonymous___SOCKADDR_ARG_autogen___1' is static but used in inline function 'recvfrom' which is not static
23:35:48 66 | return __recvfrom_alias (__fd, __buf, __n, __flags, __addr, __addr_len);
23:35:48 | ^
23:35:48 CCLD libcfa.la
23:35:48/usr/bin/ld: warning: .libs/common.o: requires executable stack (because the .note.GNU-stack section is executable)
23:35:48/usr/bin/ld: .libs/exception.o: warning: relocation against `__gcfa_personality_v0' in read-only section `.text'
23:35:48/usr/bin/ld: warning: creating DT_TEXTREL in a shared object
23:35:48/usr/include/linux/io_uring.h:83:43: warning: 'packed' attribute ignored for field of type 'union __io_uring_sqe____anonymous67' [-Wattributes]
23:35:48 83 | } __attribute__((packed));
23:35:48 | ^
23:35:48concurrency/io/call.cfa: In function '_X15async_epoll_ctlFv_S11io_future_tiiiPS11epoll_eventy__1':
23:35:48concurrency/io/call.cfa:381:87: warning: cast from pointer to integer of different size [-Wpointer-to-int-cast]
23:35:48 381 | sqe->off = (typeof(sqe->off))event;
23:35:48 | ^
23:35:48concurrency/io/call.cfa: In function '_X13async_accept4Fv_S11io_future_tiU26__anonymous___SOCKADDR_ARGPjiy__1':
23:35:48concurrency/io/call.cfa:710:89: warning: cast from pointer to integer of different size [-Wpointer-to-int-cast]
23:35:48 710 | sqe->addr2 = (typeof(sqe->addr2))addrlen;
23:35:48 | ^
23:35:48concurrency/io/call.cfa: At top level:
23:35:48/usr/include/bits/socket2.h:70:94: warning: '_X12_constructorFv_U26__anonymous___SOCKADDR_ARGU26__anonymous___SOCKADDR_ARG_autogen___1' is static but used in inline function 'recvfrom' which is not static
23:35:48 70 | return __recvfrom_chk (__fd, __buf, __n, sz, __flags, __addr, __addr_len);
23:35:48 | ^
23:35:48/usr/include/bits/socket2.h:70:124: warning: '_X11_destructorFv_U26__anonymous___SOCKADDR_ARG_autogen___1' is static but used in inline function 'recvfrom' which is not static
23:35:48 70 | return __recvfrom_chk (__fd, __buf, __n, sz, __flags, __addr, __addr_len);
23:35:48 | ^
23:35:48/usr/include/bits/socket2.h:68:103: warning: '_X12_constructorFv_U26__anonymous___SOCKADDR_ARGU26__anonymous___SOCKADDR_ARG_autogen___1' is static but used in inline function 'recvfrom' which is not static
23:35:48 68 | return __recvfrom_chk_warn (__fd, __buf, __n, sz, __flags, __addr,
23:35:48 | ^
23:35:48/usr/include/bits/socket2.h:68:128: warning: '_X11_destructorFv_U26__anonymous___SOCKADDR_ARG_autogen___1' is static but used in inline function 'recvfrom' which is not static
23:35:48 68 | return __recvfrom_chk_warn (__fd, __buf, __n, sz, __flags, __addr,
23:35:48 | ^
23:35:48/usr/include/bits/socket2.h:66:96: warning: '_X12_constructorFv_U26__anonymous___SOCKADDR_ARGU26__anonymous___SOCKADDR_ARG_autogen___1' is static but used in inline function 'recvfrom' which is not static
23:35:48 66 | return __recvfrom_alias (__fd, __buf, __n, __flags, __addr, __addr_len);
23:35:48 | ^
23:35:48/usr/include/bits/socket2.h:66:128: warning: '_X11_destructorFv_U26__anonymous___SOCKADDR_ARG_autogen___1' is static but used in inline function 'recvfrom' which is not static
23:35:48 66 | return __recvfrom_alias (__fd, __buf, __n, __flags, __addr, __addr_len);
23:35:48 | ^
23:35:48/usr/include/linux/io_uring.h:83:43: warning: 'packed' attribute ignored for field of type 'union __io_uring_sqe____anonymous122' [-Wattributes]
23:35:48 83 | } __attribute__((packed));
23:35:48 | ^
23:35:48/usr/include/bits/socket2.h:70:95: warning: '_X12_constructorFv_U26__anonymous___SOCKADDR_ARGU26__anonymous___SOCKADDR_ARG_autogen___1' is static but used in inline function 'recvfrom' which is not static
23:35:48 70 | return __recvfrom_chk (__fd, __buf, __n, sz, __flags, __addr, __addr_len);
23:35:48 | ^
23:35:48/usr/include/bits/socket2.h:70:125: warning: '_X11_destructorFv_U26__anonymous___SOCKADDR_ARG_autogen___1' is static but used in inline function 'recvfrom' which is not static
23:35:48 70 | return __recvfrom_chk (__fd, __buf, __n, sz, __flags, __addr, __addr_len);
23:35:48 | ^
23:35:48/usr/include/bits/socket2.h:68:104: warning: '_X12_constructorFv_U26__anonymous___SOCKADDR_ARGU26__anonymous___SOCKADDR_ARG_autogen___1' is static but used in inline function 'recvfrom' which is not static
23:35:48 68 | return __recvfrom_chk_warn (__fd, __buf, __n, sz, __flags, __addr,
23:35:48 | ^
23:35:48/usr/include/bits/socket2.h:68:129: warning: '_X11_destructorFv_U26__anonymous___SOCKADDR_ARG_autogen___1' is static but used in inline function 'recvfrom' which is not static
23:35:48 68 | return __recvfrom_chk_warn (__fd, __buf, __n, sz, __flags, __addr,
23:35:48 | ^
23:35:48/usr/include/bits/socket2.h:66:97: warning: '_X12_constructorFv_U26__anonymous___SOCKADDR_ARGU26__anonymous___SOCKADDR_ARG_autogen___1' is static but used in inline function 'recvfrom' which is not static
23:35:48 66 | return __recvfrom_alias (__fd, __buf, __n, __flags, __addr, __addr_len);
23:35:48 | ^
23:35:48/usr/include/bits/socket2.h:66:129: warning: '_X11_destructorFv_U26__anonymous___SOCKADDR_ARG_autogen___1' is static but used in inline function 'recvfrom' which is not static
23:35:48 66 | return __recvfrom_alias (__fd, __buf, __n, __flags, __addr, __addr_len);
23:35:48 | ^
23:35:48/usr/include/linux/io_uring.h:83:43: warning: 'packed' attribute ignored for field of type 'union __io_uring_sqe____anonymous122' [-Wattributes]
23:35:48 83 | } __attribute__((packed));
23:35:48 | ^
23:35:48/usr/include/bits/socket2.h:70:95: warning: '_X12_constructorFv_U26__anonymous___SOCKADDR_ARGU26__anonymous___SOCKADDR_ARG_autogen___1' is static but used in inline function 'recvfrom' which is not static
23:35:48 70 | return __recvfrom_chk (__fd, __buf, __n, sz, __flags, __addr, __addr_len);
23:35:48 | ^
23:35:48/usr/include/bits/socket2.h:70:125: warning: '_X11_destructorFv_U26__anonymous___SOCKADDR_ARG_autogen___1' is static but used in inline function 'recvfrom' which is not static
23:35:48 70 | return __recvfrom_chk (__fd, __buf, __n, sz, __flags, __addr, __addr_len);
23:35:48 | ^
23:35:48/usr/include/bits/socket2.h:68:104: warning: '_X12_constructorFv_U26__anonymous___SOCKADDR_ARGU26__anonymous___SOCKADDR_ARG_autogen___1' is static but used in inline function 'recvfrom' which is not static
23:35:48 68 | return __recvfrom_chk_warn (__fd, __buf, __n, sz, __flags, __addr,
23:35:48 | ^
23:35:48/usr/include/bits/socket2.h:68:129: warning: '_X11_destructorFv_U26__anonymous___SOCKADDR_ARG_autogen___1' is static but used in inline function 'recvfrom' which is not static
23:35:48 68 | return __recvfrom_chk_warn (__fd, __buf, __n, sz, __flags, __addr,
23:35:48 | ^
23:35:48/usr/include/bits/socket2.h:66:97: warning: '_X12_constructorFv_U26__anonymous___SOCKADDR_ARGU26__anonymous___SOCKADDR_ARG_autogen___1' is static but used in inline function 'recvfrom' which is not static
23:35:48 66 | return __recvfrom_alias (__fd, __buf, __n, __flags, __addr, __addr_len);
23:35:48 | ^
23:35:48/usr/include/bits/socket2.h:66:129: warning: '_X11_destructorFv_U26__anonymous___SOCKADDR_ARG_autogen___1' is static but used in inline function 'recvfrom' which is not static
23:35:48 66 | return __recvfrom_alias (__fd, __buf, __n, __flags, __addr, __addr_len);
23:35:48 | ^
23:35:48/usr/include/linux/io_uring.h:83:43: warning: 'packed' attribute ignored for field of type 'union __io_uring_sqe____anonymous34' [-Wattributes]
23:35:48 83 | } __attribute__((packed));
23:35:48 | ^
23:35:48/usr/include/bits/socket2.h:70:94: warning: '_X12_constructorFv_U26__anonymous___SOCKADDR_ARGU26__anonymous___SOCKADDR_ARG_autogen___1' is static but used in inline function 'recvfrom' which is not static
23:35:48 70 | return __recvfrom_chk (__fd, __buf, __n, sz, __flags, __addr, __addr_len);
23:35:48 | ^
23:35:48/usr/include/bits/socket2.h:70:124: warning: '_X11_destructorFv_U26__anonymous___SOCKADDR_ARG_autogen___1' is static but used in inline function 'recvfrom' which is not static
23:35:48 70 | return __recvfrom_chk (__fd, __buf, __n, sz, __flags, __addr, __addr_len);
23:35:48 | ^
23:35:48/usr/include/bits/socket2.h:68:103: warning: '_X12_constructorFv_U26__anonymous___SOCKADDR_ARGU26__anonymous___SOCKADDR_ARG_autogen___1' is static but used in inline function 'recvfrom' which is not static
23:35:48 68 | return __recvfrom_chk_warn (__fd, __buf, __n, sz, __flags, __addr,
23:35:48 | ^
23:35:48/usr/include/bits/socket2.h:68:128: warning: '_X11_destructorFv_U26__anonymous___SOCKADDR_ARG_autogen___1' is static but used in inline function 'recvfrom' which is not static
23:35:48 68 | return __recvfrom_chk_warn (__fd, __buf, __n, sz, __flags, __addr,
23:35:48 | ^
23:35:48/usr/include/bits/socket2.h:66:96: warning: '_X12_constructorFv_U26__anonymous___SOCKADDR_ARGU26__anonymous___SOCKADDR_ARG_autogen___1' is static but used in inline function 'recvfrom' which is not static
23:35:48 66 | return __recvfrom_alias (__fd, __buf, __n, __flags, __addr, __addr_len);
23:35:48 | ^
23:35:48/usr/include/bits/socket2.h:66:128: warning: '_X11_destructorFv_U26__anonymous___SOCKADDR_ARG_autogen___1' is static but used in inline function 'recvfrom' which is not static
23:35:48 66 | return __recvfrom_alias (__fd, __buf, __n, __flags, __addr, __addr_len);
23:35:48 | ^
23:35:48/usr/include/linux/io_uring.h:83:43: warning: 'packed' attribute ignored for field of type 'union __io_uring_sqe____anonymous99' [-Wattributes]
23:35:48 83 | } __attribute__((packed));
23:35:48 | ^
23:35:48/usr/include/bits/socket2.h:70:95: warning: '_X12_constructorFv_U26__anonymous___SOCKADDR_ARGU26__anonymous___SOCKADDR_ARG_autogen___1' is static but used in inline function 'recvfrom' which is not static
23:35:48 70 | return __recvfrom_chk (__fd, __buf, __n, sz, __flags, __addr, __addr_len);
23:35:48 | ^
23:35:48/usr/include/bits/socket2.h:70:125: warning: '_X11_destructorFv_U26__anonymous___SOCKADDR_ARG_autogen___1' is static but used in inline function 'recvfrom' which is not static
23:35:48 70 | return __recvfrom_chk (__fd, __buf, __n, sz, __flags, __addr, __addr_len);
23:35:48 | ^
23:35:48/usr/include/bits/socket2.h:68:104: warning: '_X12_constructorFv_U26__anonymous___SOCKADDR_ARGU26__anonymous___SOCKADDR_ARG_autogen___1' is static but used in inline function 'recvfrom' which is not static
23:35:48 68 | return __recvfrom_chk_warn (__fd, __buf, __n, sz, __flags, __addr,
23:35:48 | ^
23:35:48/usr/include/bits/socket2.h:68:129: warning: '_X11_destructorFv_U26__anonymous___SOCKADDR_ARG_autogen___1' is static but used in inline function 'recvfrom' which is not static
23:35:48 68 | return __recvfrom_chk_warn (__fd, __buf, __n, sz, __flags, __addr,
23:35:48 | ^
23:35:48/usr/include/bits/socket2.h:66:97: warning: '_X12_constructorFv_U26__anonymous___SOCKADDR_ARGU26__anonymous___SOCKADDR_ARG_autogen___1' is static but used in inline function 'recvfrom' which is not static
23:35:48 66 | return __recvfrom_alias (__fd, __buf, __n, __flags, __addr, __addr_len);
23:35:48 | ^
23:35:48/usr/include/bits/socket2.h:66:129: warning: '_X11_destructorFv_U26__anonymous___SOCKADDR_ARG_autogen___1' is static but used in inline function 'recvfrom' which is not static
23:35:48 66 | return __recvfrom_alias (__fd, __buf, __n, __flags, __addr, __addr_len);
23:35:48 | ^
23:35:48 CCLD libcfathread.la
23:35:48/usr/bin/ld: warning: concurrency/.libs/coroutine.o: requires executable stack (because the .note.GNU-stack section is executable)
23:35:48make[1]: Nothing to be done for 'all-am'.
23:35:48[Pipeline] }
23:35:48[Pipeline] // dir
23:35:48[Pipeline] }
23:35:48[Pipeline] // stage
23:35:48[Pipeline] echo
23:35:48 -------- Build : install --------
23:35:48[Pipeline] stage
23:35:48[Pipeline] { (Build : install)
23:35:48[Pipeline] dir
23:35:48Running in /var/lib/jenkins/workspace/Cforall_master_2@tmp
23:35:48[Pipeline] {
23:35:48[Pipeline] sh
23:35:48+ nproc
23:35:48+ make -j 16 --no-print-directory install
23:35:48Making install in driver
23:35:48make install-exec-hook
23:35:48 /usr/bin/mkdir -p '/var/lib/jenkins/workspace/Cforall_master_2@tmp/lib/cfa/'
23:35:48 /usr/bin/install -c cfa '/var/lib/jenkins/workspace/Cforall_master_2@tmp/bin//cfa'
23:35:48 /bin/bash ../libtool --mode=install /usr/bin/install -c as cc1 '/var/lib/jenkins/workspace/Cforall_master_2@tmp/lib/cfa/'
23:35:48libtool: install: /usr/bin/install -c as /var/lib/jenkins/workspace/Cforall_master_2@tmp/lib/cfa/as
23:35:48libtool: install: /usr/bin/install -c cc1 /var/lib/jenkins/workspace/Cforall_master_2@tmp/lib/cfa/cc1
23:35:48Making install in src
23:35:48make install-am
23:35:48make[3]: Nothing to be done for 'install-exec-am'.
23:35:48 /usr/bin/mkdir -p '/var/lib/jenkins/workspace/Cforall_master_2@tmp/lib/cfa/'
23:35:48 /bin/bash ../libtool --mode=install /usr/bin/install -c ../driver/cfa-cpp '/var/lib/jenkins/workspace/Cforall_master_2@tmp/lib/cfa/'
23:35:48libtool: install: /usr/bin/install -c ../driver/cfa-cpp /var/lib/jenkins/workspace/Cforall_master_2@tmp/lib/cfa/cfa-cpp
23:35:48Making install in .
23:35:48(CDPATH="${ZSH_VERSION+.}:" && cd /var/lib/jenkins/workspace/Cforall_master_2 && /bin/bash '/var/lib/jenkins/workspace/Cforall_master_2/automake/missing' autoheader)
23:35:48rm -f stamp-h1
23:35:48touch /var/lib/jenkins/workspace/Cforall_master_2/src/config.h.in
23:35:48cd . && /bin/bash ./config.status config.h
23:35:48config.status: creating config.h
23:35:48config.status: config.h is unchanged
23:35:48make[2]: Nothing to be done for 'install-exec-am'.
23:35:48 /usr/bin/mkdir -p '/var/lib/jenkins/workspace/Cforall_master_2@tmp/share/man/man1'
23:35:48 /usr/bin/install -c -m 644 /var/lib/jenkins/workspace/Cforall_master_2/doc/man/cfa.1 '/var/lib/jenkins/workspace/Cforall_master_2@tmp/share/man/man1'
23:35:48Making install in libcfa/x86-debug
23:35:48Making install in prelude
23:35:48make[3]: Nothing to be done for 'install-exec-am'.
23:35:48 /usr/bin/mkdir -p '/var/lib/jenkins/workspace/Cforall_master_2@tmp/lib/cfa/x86-debug/'
23:35:48 /usr/bin/install -c -m 644 gcc-builtins.cfa builtins.cfa extras.cfa prelude.cfa bootloader.c defines.hfa '/var/lib/jenkins/workspace/Cforall_master_2@tmp/lib/cfa/x86-debug/'
23:35:48Making install in src
23:35:48 /usr/bin/mkdir -p '/var/lib/jenkins/workspace/Cforall_master_2@tmp/lib/cfa/x86-debug/'
23:35:48 /bin/bash ../libtool --mode=install /usr/bin/install -c libcfa.la libcfathread.la '/var/lib/jenkins/workspace/Cforall_master_2@tmp/lib/cfa/x86-debug/'
23:35:48 /usr/bin/mkdir -p '/var/lib/jenkins/workspace/Cforall_master_2@tmp/include/cfa/'
23:35:48 /usr/bin/mkdir -p '/var/lib/jenkins/workspace/Cforall_master_2@tmp/include/cfa//stdhdr/sys'
23:35:48 /usr/bin/install -c -m 644 /var/lib/jenkins/workspace/Cforall_master_2/libcfa/src/stdhdr/sys/socket.h /var/lib/jenkins/workspace/Cforall_master_2/libcfa/src/stdhdr/sys/time.h /var/lib/jenkins/workspace/Cforall_master_2/libcfa/src/stdhdr/sys/mman.h '/var/lib/jenkins/workspace/Cforall_master_2@tmp/include/cfa//stdhdr/sys'
23:35:48 /usr/bin/mkdir -p '/var/lib/jenkins/workspace/Cforall_master_2@tmp/include/cfa//algorithms'
23:35:48 /usr/bin/install -c -m 644 /var/lib/jenkins/workspace/Cforall_master_2/libcfa/src/algorithms/range_iterator.hfa '/var/lib/jenkins/workspace/Cforall_master_2@tmp/include/cfa//algorithms'
23:35:48 /usr/bin/mkdir -p '/var/lib/jenkins/workspace/Cforall_master_2@tmp/include/cfa//concurrency/kernel'
23:35:48 /usr/bin/install -c -m 644 /var/lib/jenkins/workspace/Cforall_master_2/libcfa/src/concurrency/kernel/cluster.hfa /var/lib/jenkins/workspace/Cforall_master_2/libcfa/src/concurrency/kernel/fwd.hfa '/var/lib/jenkins/workspace/Cforall_master_2@tmp/include/cfa//concurrency/kernel'
23:35:48 /usr/bin/install -c -m 644 /var/lib/jenkins/workspace/Cforall_master_2/libcfa/src/common.hfa /var/lib/jenkins/workspace/Cforall_master_2/libcfa/src/fstream.hfa /var/lib/jenkins/workspace/Cforall_master_2/libcfa/src/heap.hfa /var/lib/jenkins/workspace/Cforall_master_2/libcfa/src/iostream.hfa /var/lib/jenkins/workspace/Cforall_master_2/libcfa/src/iterator.hfa /var/lib/jenkins/workspace/Cforall_master_2/libcfa/src/limits.hfa /var/lib/jenkins/workspace/Cforall_master_2/libcfa/src/math.hfa /var/lib/jenkins/workspace/Cforall_master_2/libcfa/src/memory.hfa /var/lib/jenkins/workspace/Cforall_master_2/libcfa/src/parseargs.hfa /var/lib/jenkins/workspace/Cforall_master_2/libcfa/src/parseconfig.hfa /var/lib/jenkins/workspace/Cforall_master_2/libcfa/src/rational.hfa /var/lib/jenkins/workspace/Cforall_master_2/libcfa/src/stdlib.hfa /var/lib/jenkins/workspace/Cforall_master_2/libcfa/src/strstream.hfa /var/lib/jenkins/workspace/Cforall_master_2/libcfa/src/time.hfa /var/lib/jenkins/workspace/Cforall_master_2/libcfa/src/Exception.hfa /var/lib/jenkins/workspace/Cforall_master_2/libcfa/src/bitmanip.hfa /var/lib/jenkins/workspace/Cforall_master_2/libcfa/src/clock.hfa /var/lib/jenkins/workspace/Cforall_master_2/libcfa/src/exception.hfa /var/lib/jenkins/workspace/Cforall_master_2/libcfa/src/exception.h /var/lib/jenkins/workspace/Cforall_master_2/libcfa/src/gmp.hfa /var/lib/jenkins/workspace/Cforall_master_2/libcfa/src/math.trait.hfa /var/lib/jenkins/workspace/Cforall_master_2/libcfa/src/raii.hfa /var/lib/jenkins/workspace/Cforall_master_2/libcfa/src/time_t.hfa /var/lib/jenkins/workspace/Cforall_master_2/libcfa/src/virtual_dtor.hfa '/var/lib/jenkins/workspace/Cforall_master_2@tmp/include/cfa//.'
23:35:48 /usr/bin/mkdir -p '/var/lib/jenkins/workspace/Cforall_master_2@tmp/include/cfa//concurrency'
23:35:48 /usr/bin/install -c -m 644 /var/lib/jenkins/workspace/Cforall_master_2/libcfa/src/concurrency/iofwd.hfa /var/lib/jenkins/workspace/Cforall_master_2/libcfa/src/concurrency/barrier.hfa /var/lib/jenkins/workspace/Cforall_master_2/libcfa/src/concurrency/alarm.hfa /var/lib/jenkins/workspace/Cforall_master_2/libcfa/src/concurrency/coroutine.hfa /var/lib/jenkins/workspace/Cforall_master_2/libcfa/src/concurrency/exception.hfa /var/lib/jenkins/workspace/Cforall_master_2/libcfa/src/concurrency/kernel.hfa /var/lib/jenkins/workspace/Cforall_master_2/libcfa/src/concurrency/locks.hfa /var/lib/jenkins/workspace/Cforall_master_2/libcfa/src/concurrency/monitor.hfa /var/lib/jenkins/workspace/Cforall_master_2/libcfa/src/concurrency/mutex.hfa /var/lib/jenkins/workspace/Cforall_master_2/libcfa/src/concurrency/select.hfa /var/lib/jenkins/workspace/Cforall_master_2/libcfa/src/concurrency/thread.hfa /var/lib/jenkins/workspace/Cforall_master_2/libcfa/src/concurrency/cofor.hfa /var/lib/jenkins/workspace/Cforall_master_2/libcfa/src/concurrency/invoke.h /var/lib/jenkins/workspace/Cforall_master_2/libcfa/src/concurrency/future.hfa /var/lib/jenkins/workspace/Cforall_master_2/libcfa/src/concurrency/once.hfa /var/lib/jenkins/workspace/Cforall_master_2/libcfa/src/concurrency/mutex_stmt.hfa /var/lib/jenkins/workspace/Cforall_master_2/libcfa/src/concurrency/channel.hfa /var/lib/jenkins/workspace/Cforall_master_2/libcfa/src/concurrency/actor.hfa '/var/lib/jenkins/workspace/Cforall_master_2@tmp/include/cfa//concurrency'
23:35:48 /usr/bin/mkdir -p '/var/lib/jenkins/workspace/Cforall_master_2@tmp/include/cfa//concurrency/clib'
23:35:48 /usr/bin/install -c -m 644 /var/lib/jenkins/workspace/Cforall_master_2/libcfa/src/concurrency/clib/cfathread.h '/var/lib/jenkins/workspace/Cforall_master_2@tmp/include/cfa//concurrency/clib'
23:35:48 /usr/bin/mkdir -p '/var/lib/jenkins/workspace/Cforall_master_2@tmp/include/cfa//device'
23:35:48 /usr/bin/install -c -m 644 /var/lib/jenkins/workspace/Cforall_master_2/libcfa/src/device/cpu.hfa '/var/lib/jenkins/workspace/Cforall_master_2@tmp/include/cfa//device'
23:35:48 /usr/bin/mkdir -p '/var/lib/jenkins/workspace/Cforall_master_2@tmp/include/cfa//stdhdr/libltdl'
23:35:48libtool: install: /usr/bin/install -c .libs/libcfa.so.1.0.0 /var/lib/jenkins/workspace/Cforall_master_2@tmp/lib/cfa/x86-debug/libcfa.so.1.0.0
23:35:48 /usr/bin/install -c -m 644 /var/lib/jenkins/workspace/Cforall_master_2/libcfa/src/stdhdr/libltdl/lt_dlloader.h '/var/lib/jenkins/workspace/Cforall_master_2@tmp/include/cfa//stdhdr/libltdl'
23:35:48 /usr/bin/mkdir -p '/var/lib/jenkins/workspace/Cforall_master_2@tmp/include/cfa//vec'
23:35:48 /usr/bin/install -c -m 644 /var/lib/jenkins/workspace/Cforall_master_2/libcfa/src/vec/vec.hfa /var/lib/jenkins/workspace/Cforall_master_2/libcfa/src/vec/vec2.hfa /var/lib/jenkins/workspace/Cforall_master_2/libcfa/src/vec/vec3.hfa /var/lib/jenkins/workspace/Cforall_master_2/libcfa/src/vec/vec4.hfa '/var/lib/jenkins/workspace/Cforall_master_2@tmp/include/cfa//vec'
23:35:48 /usr/bin/mkdir -p '/var/lib/jenkins/workspace/Cforall_master_2@tmp/include/cfa//bits'
23:35:48libtool: install: (cd /var/lib/jenkins/workspace/Cforall_master_2@tmp/lib/cfa/x86-debug && { ln -s -f libcfa.so.1.0.0 libcfa.so.1 || { rm -f libcfa.so.1 && ln -s libcfa.so.1.0.0 libcfa.so.1; }; })
23:35:48 /usr/bin/install -c -m 644 /var/lib/jenkins/workspace/Cforall_master_2/libcfa/src/bits/weakso_locks.hfa /var/lib/jenkins/workspace/Cforall_master_2/libcfa/src/bits/algorithm.hfa /var/lib/jenkins/workspace/Cforall_master_2/libcfa/src/bits/align.hfa /var/lib/jenkins/workspace/Cforall_master_2/libcfa/src/bits/collections.hfa /var/lib/jenkins/workspace/Cforall_master_2/libcfa/src/bits/debug.hfa /var/lib/jenkins/workspace/Cforall_master_2/libcfa/src/bits/defs.hfa /var/lib/jenkins/workspace/Cforall_master_2/libcfa/src/bits/locks.hfa /var/lib/jenkins/workspace/Cforall_master_2/libcfa/src/bits/collection.hfa /var/lib/jenkins/workspace/Cforall_master_2/libcfa/src/bits/stack.hfa /var/lib/jenkins/workspace/Cforall_master_2/libcfa/src/bits/queue.hfa /var/lib/jenkins/workspace/Cforall_master_2/libcfa/src/bits/sequence.hfa /var/lib/jenkins/workspace/Cforall_master_2/libcfa/src/bits/atomic.hfa /var/lib/jenkins/workspace/Cforall_master_2/libcfa/src/bits/random.hfa '/var/lib/jenkins/workspace/Cforall_master_2@tmp/include/cfa//bits'
23:35:48libtool: install: (cd /var/lib/jenkins/workspace/Cforall_master_2@tmp/lib/cfa/x86-debug && { ln -s -f libcfa.so.1.0.0 libcfa.so || { rm -f libcfa.so && ln -s libcfa.so.1.0.0 libcfa.so; }; })
23:35:48 /usr/bin/mkdir -p '/var/lib/jenkins/workspace/Cforall_master_2@tmp/include/cfa//stdhdr'
23:35:48 /usr/bin/install -c -m 644 /var/lib/jenkins/workspace/Cforall_master_2/libcfa/src/stdhdr/signal.h /var/lib/jenkins/workspace/Cforall_master_2/libcfa/src/stdhdr/wchar.h /var/lib/jenkins/workspace/Cforall_master_2/libcfa/src/stdhdr/stdatomic.h /var/lib/jenkins/workspace/Cforall_master_2/libcfa/src/stdhdr/stdalign.h /var/lib/jenkins/workspace/Cforall_master_2/libcfa/src/stdhdr/stdlib.h /var/lib/jenkins/workspace/Cforall_master_2/libcfa/src/stdhdr/assert.h /var/lib/jenkins/workspace/Cforall_master_2/libcfa/src/stdhdr/complex.h /var/lib/jenkins/workspace/Cforall_master_2/libcfa/src/stdhdr/tgmath.h /var/lib/jenkins/workspace/Cforall_master_2/libcfa/src/stdhdr/unwind.h /var/lib/jenkins/workspace/Cforall_master_2/libcfa/src/stdhdr/setjmp.h /var/lib/jenkins/workspace/Cforall_master_2/libcfa/src/stdhdr/stdint.h /var/lib/jenkins/workspace/Cforall_master_2/libcfa/src/stdhdr/gmp.h /var/lib/jenkins/workspace/Cforall_master_2/libcfa/src/stdhdr/fenv.h /var/lib/jenkins/workspace/Cforall_master_2/libcfa/src/stdhdr/locale.h /var/lib/jenkins/workspace/Cforall_master_2/libcfa/src/stdhdr/ctype.h /var/lib/jenkins/workspace/Cforall_master_2/libcfa/src/stdhdr/inttypes.h /var/lib/jenkins/workspace/Cforall_master_2/libcfa/src/stdhdr/unistd.h /var/lib/jenkins/workspace/Cforall_master_2/libcfa/src/stdhdr/malloc.h /var/lib/jenkins/workspace/Cforall_master_2/libcfa/src/stdhdr/time.h /var/lib/jenkins/workspace/Cforall_master_2/libcfa/src/stdhdr/threads.h /var/lib/jenkins/workspace/Cforall_master_2/libcfa/src/stdhdr/wctype.h /var/lib/jenkins/workspace/Cforall_master_2/libcfa/src/stdhdr/limits.h /var/lib/jenkins/workspace/Cforall_master_2/libcfa/src/stdhdr/stdio.h /var/lib/jenkins/workspace/Cforall_master_2/libcfa/src/stdhdr/pthread.h /var/lib/jenkins/workspace/Cforall_master_2/libcfa/src/stdhdr/stdarg.h /var/lib/jenkins/workspace/Cforall_master_2/libcfa/src/stdhdr/stdbool.h /var/lib/jenkins/workspace/Cforall_master_2/libcfa/src/stdhdr/iso646.h /var/lib/jenkins/workspace/Cforall_master_2/libcfa/src/stdhdr/string.h /var/lib/jenkins/workspace/Cforall_master_2/libcfa/src/stdhdr/float.h /var/lib/jenkins/workspace/Cforall_master_2/libcfa/src/stdhdr/math.h /var/lib/jenkins/workspace/Cforall_master_2/libcfa/src/stdhdr/errno.h /var/lib/jenkins/workspace/Cforall_master_2/libcfa/src/stdhdr/stddef.h /var/lib/jenkins/workspace/Cforall_master_2/libcfa/src/stdhdr/stdnoreturn.h /var/lib/jenkins/workspace/Cforall_master_2/libcfa/src/stdhdr/uchar.h '/var/lib/jenkins/workspace/Cforall_master_2@tmp/include/cfa//stdhdr'
23:35:48 /usr/bin/mkdir -p '/var/lib/jenkins/workspace/Cforall_master_2@tmp/include/cfa//collections'
23:35:48libtool: install: /usr/bin/install -c .libs/libcfa.lai /var/lib/jenkins/workspace/Cforall_master_2@tmp/lib/cfa/x86-debug/libcfa.la
23:35:48 /usr/bin/install -c -m 644 /var/lib/jenkins/workspace/Cforall_master_2/libcfa/src/collections/maybe.hfa /var/lib/jenkins/workspace/Cforall_master_2/libcfa/src/collections/pair.hfa /var/lib/jenkins/workspace/Cforall_master_2/libcfa/src/collections/result.hfa /var/lib/jenkins/workspace/Cforall_master_2/libcfa/src/collections/string.hfa /var/lib/jenkins/workspace/Cforall_master_2/libcfa/src/collections/string_res.hfa /var/lib/jenkins/workspace/Cforall_master_2/libcfa/src/collections/vector.hfa /var/lib/jenkins/workspace/Cforall_master_2/libcfa/src/collections/array.hfa /var/lib/jenkins/workspace/Cforall_master_2/libcfa/src/collections/list.hfa /var/lib/jenkins/workspace/Cforall_master_2/libcfa/src/collections/list2.hfa /var/lib/jenkins/workspace/Cforall_master_2/libcfa/src/collections/lockfree.hfa /var/lib/jenkins/workspace/Cforall_master_2/libcfa/src/collections/string_sharectx.hfa /var/lib/jenkins/workspace/Cforall_master_2/libcfa/src/collections/vector2.hfa '/var/lib/jenkins/workspace/Cforall_master_2@tmp/include/cfa//collections'
23:35:48libtool: install: /usr/bin/install -c .libs/libcfathread.so.1.0.0 /var/lib/jenkins/workspace/Cforall_master_2@tmp/lib/cfa/x86-debug/libcfathread.so.1.0.0
23:35:48libtool: install: (cd /var/lib/jenkins/workspace/Cforall_master_2@tmp/lib/cfa/x86-debug && { ln -s -f libcfathread.so.1.0.0 libcfathread.so.1 || { rm -f libcfathread.so.1 && ln -s libcfathread.so.1.0.0 libcfathread.so.1; }; })
23:35:48libtool: install: (cd /var/lib/jenkins/workspace/Cforall_master_2@tmp/lib/cfa/x86-debug && { ln -s -f libcfathread.so.1.0.0 libcfathread.so || { rm -f libcfathread.so && ln -s libcfathread.so.1.0.0 libcfathread.so; }; })
23:35:48libtool: install: /usr/bin/install -c .libs/libcfathread.lai /var/lib/jenkins/workspace/Cforall_master_2@tmp/lib/cfa/x86-debug/libcfathread.la
23:35:48libtool: warning: remember to run 'libtool --finish /var/lib/jenkins/workspace/Cforall_master_2@tmp/lib/cfa/x86-debug/'
23:35:48make[3]: Nothing to be done for 'install-exec-am'.
23:35:48make[3]: Nothing to be done for 'install-data-am'.
23:35:48Making install in libcfa/x86-nodebug
23:35:48Making install in prelude
23:35:48touch .deps/builtins.Po
23:35:48make[3]: Nothing to be done for 'install-exec-am'.
23:35:48 /usr/bin/mkdir -p '/var/lib/jenkins/workspace/Cforall_master_2@tmp/lib/cfa/x86-nodebug/'
23:35:48 /usr/bin/install -c -m 644 gcc-builtins.cfa builtins.cfa extras.cfa prelude.cfa bootloader.c defines.hfa '/var/lib/jenkins/workspace/Cforall_master_2@tmp/lib/cfa/x86-nodebug/'
23:35:48Making install in src
23:35:48 /usr/bin/mkdir -p '/var/lib/jenkins/workspace/Cforall_master_2@tmp/lib/cfa/x86-nodebug/'
23:35:48 /bin/bash ../libtool --mode=install /usr/bin/install -c libcfa.la libcfathread.la '/var/lib/jenkins/workspace/Cforall_master_2@tmp/lib/cfa/x86-nodebug/'
23:35:48 /usr/bin/mkdir -p '/var/lib/jenkins/workspace/Cforall_master_2@tmp/include/cfa/'
23:35:48 /usr/bin/mkdir -p '/var/lib/jenkins/workspace/Cforall_master_2@tmp/include/cfa//stdhdr/sys'
23:35:48 /usr/bin/install -c -m 644 /var/lib/jenkins/workspace/Cforall_master_2/libcfa/src/stdhdr/sys/socket.h /var/lib/jenkins/workspace/Cforall_master_2/libcfa/src/stdhdr/sys/time.h /var/lib/jenkins/workspace/Cforall_master_2/libcfa/src/stdhdr/sys/mman.h '/var/lib/jenkins/workspace/Cforall_master_2@tmp/include/cfa//stdhdr/sys'
23:35:48 /usr/bin/mkdir -p '/var/lib/jenkins/workspace/Cforall_master_2@tmp/include/cfa//algorithms'
23:35:48 /usr/bin/install -c -m 644 /var/lib/jenkins/workspace/Cforall_master_2/libcfa/src/algorithms/range_iterator.hfa '/var/lib/jenkins/workspace/Cforall_master_2@tmp/include/cfa//algorithms'
23:35:48 /usr/bin/mkdir -p '/var/lib/jenkins/workspace/Cforall_master_2@tmp/include/cfa//concurrency/kernel'
23:35:48 /usr/bin/install -c -m 644 /var/lib/jenkins/workspace/Cforall_master_2/libcfa/src/concurrency/kernel/cluster.hfa /var/lib/jenkins/workspace/Cforall_master_2/libcfa/src/concurrency/kernel/fwd.hfa '/var/lib/jenkins/workspace/Cforall_master_2@tmp/include/cfa//concurrency/kernel'
23:35:48 /usr/bin/install -c -m 644 /var/lib/jenkins/workspace/Cforall_master_2/libcfa/src/common.hfa /var/lib/jenkins/workspace/Cforall_master_2/libcfa/src/fstream.hfa /var/lib/jenkins/workspace/Cforall_master_2/libcfa/src/heap.hfa /var/lib/jenkins/workspace/Cforall_master_2/libcfa/src/iostream.hfa /var/lib/jenkins/workspace/Cforall_master_2/libcfa/src/iterator.hfa /var/lib/jenkins/workspace/Cforall_master_2/libcfa/src/limits.hfa /var/lib/jenkins/workspace/Cforall_master_2/libcfa/src/math.hfa /var/lib/jenkins/workspace/Cforall_master_2/libcfa/src/memory.hfa /var/lib/jenkins/workspace/Cforall_master_2/libcfa/src/parseargs.hfa /var/lib/jenkins/workspace/Cforall_master_2/libcfa/src/parseconfig.hfa /var/lib/jenkins/workspace/Cforall_master_2/libcfa/src/rational.hfa /var/lib/jenkins/workspace/Cforall_master_2/libcfa/src/stdlib.hfa /var/lib/jenkins/workspace/Cforall_master_2/libcfa/src/strstream.hfa /var/lib/jenkins/workspace/Cforall_master_2/libcfa/src/time.hfa /var/lib/jenkins/workspace/Cforall_master_2/libcfa/src/Exception.hfa /var/lib/jenkins/workspace/Cforall_master_2/libcfa/src/bitmanip.hfa /var/lib/jenkins/workspace/Cforall_master_2/libcfa/src/clock.hfa /var/lib/jenkins/workspace/Cforall_master_2/libcfa/src/exception.hfa /var/lib/jenkins/workspace/Cforall_master_2/libcfa/src/exception.h /var/lib/jenkins/workspace/Cforall_master_2/libcfa/src/gmp.hfa /var/lib/jenkins/workspace/Cforall_master_2/libcfa/src/math.trait.hfa /var/lib/jenkins/workspace/Cforall_master_2/libcfa/src/raii.hfa /var/lib/jenkins/workspace/Cforall_master_2/libcfa/src/time_t.hfa /var/lib/jenkins/workspace/Cforall_master_2/libcfa/src/virtual_dtor.hfa '/var/lib/jenkins/workspace/Cforall_master_2@tmp/include/cfa//.'
23:35:48 /usr/bin/mkdir -p '/var/lib/jenkins/workspace/Cforall_master_2@tmp/include/cfa//concurrency'
23:35:48 /usr/bin/install -c -m 644 /var/lib/jenkins/workspace/Cforall_master_2/libcfa/src/concurrency/iofwd.hfa /var/lib/jenkins/workspace/Cforall_master_2/libcfa/src/concurrency/barrier.hfa /var/lib/jenkins/workspace/Cforall_master_2/libcfa/src/concurrency/alarm.hfa /var/lib/jenkins/workspace/Cforall_master_2/libcfa/src/concurrency/coroutine.hfa /var/lib/jenkins/workspace/Cforall_master_2/libcfa/src/concurrency/exception.hfa /var/lib/jenkins/workspace/Cforall_master_2/libcfa/src/concurrency/kernel.hfa /var/lib/jenkins/workspace/Cforall_master_2/libcfa/src/concurrency/locks.hfa /var/lib/jenkins/workspace/Cforall_master_2/libcfa/src/concurrency/monitor.hfa /var/lib/jenkins/workspace/Cforall_master_2/libcfa/src/concurrency/mutex.hfa /var/lib/jenkins/workspace/Cforall_master_2/libcfa/src/concurrency/select.hfa /var/lib/jenkins/workspace/Cforall_master_2/libcfa/src/concurrency/thread.hfa /var/lib/jenkins/workspace/Cforall_master_2/libcfa/src/concurrency/cofor.hfa /var/lib/jenkins/workspace/Cforall_master_2/libcfa/src/concurrency/invoke.h /var/lib/jenkins/workspace/Cforall_master_2/libcfa/src/concurrency/future.hfa /var/lib/jenkins/workspace/Cforall_master_2/libcfa/src/concurrency/once.hfa /var/lib/jenkins/workspace/Cforall_master_2/libcfa/src/concurrency/mutex_stmt.hfa /var/lib/jenkins/workspace/Cforall_master_2/libcfa/src/concurrency/channel.hfa /var/lib/jenkins/workspace/Cforall_master_2/libcfa/src/concurrency/actor.hfa '/var/lib/jenkins/workspace/Cforall_master_2@tmp/include/cfa//concurrency'
23:35:48 /usr/bin/mkdir -p '/var/lib/jenkins/workspace/Cforall_master_2@tmp/include/cfa//concurrency/clib'
23:35:48 /usr/bin/install -c -m 644 /var/lib/jenkins/workspace/Cforall_master_2/libcfa/src/concurrency/clib/cfathread.h '/var/lib/jenkins/workspace/Cforall_master_2@tmp/include/cfa//concurrency/clib'
23:35:48 /usr/bin/mkdir -p '/var/lib/jenkins/workspace/Cforall_master_2@tmp/include/cfa//device'
23:35:48 /usr/bin/install -c -m 644 /var/lib/jenkins/workspace/Cforall_master_2/libcfa/src/device/cpu.hfa '/var/lib/jenkins/workspace/Cforall_master_2@tmp/include/cfa//device'
23:35:48 /usr/bin/mkdir -p '/var/lib/jenkins/workspace/Cforall_master_2@tmp/include/cfa//stdhdr/libltdl'
23:35:48 /usr/bin/install -c -m 644 /var/lib/jenkins/workspace/Cforall_master_2/libcfa/src/stdhdr/libltdl/lt_dlloader.h '/var/lib/jenkins/workspace/Cforall_master_2@tmp/include/cfa//stdhdr/libltdl'
23:35:48 /usr/bin/mkdir -p '/var/lib/jenkins/workspace/Cforall_master_2@tmp/include/cfa//vec'
23:35:48 /usr/bin/install -c -m 644 /var/lib/jenkins/workspace/Cforall_master_2/libcfa/src/vec/vec.hfa /var/lib/jenkins/workspace/Cforall_master_2/libcfa/src/vec/vec2.hfa /var/lib/jenkins/workspace/Cforall_master_2/libcfa/src/vec/vec3.hfa /var/lib/jenkins/workspace/Cforall_master_2/libcfa/src/vec/vec4.hfa '/var/lib/jenkins/workspace/Cforall_master_2@tmp/include/cfa//vec'
23:35:48libtool: install: /usr/bin/install -c .libs/libcfa.so.1.0.0 /var/lib/jenkins/workspace/Cforall_master_2@tmp/lib/cfa/x86-nodebug/libcfa.so.1.0.0
23:35:48 /usr/bin/mkdir -p '/var/lib/jenkins/workspace/Cforall_master_2@tmp/include/cfa//bits'
23:35:48 /usr/bin/install -c -m 644 /var/lib/jenkins/workspace/Cforall_master_2/libcfa/src/bits/weakso_locks.hfa /var/lib/jenkins/workspace/Cforall_master_2/libcfa/src/bits/algorithm.hfa /var/lib/jenkins/workspace/Cforall_master_2/libcfa/src/bits/align.hfa /var/lib/jenkins/workspace/Cforall_master_2/libcfa/src/bits/collections.hfa /var/lib/jenkins/workspace/Cforall_master_2/libcfa/src/bits/debug.hfa /var/lib/jenkins/workspace/Cforall_master_2/libcfa/src/bits/defs.hfa /var/lib/jenkins/workspace/Cforall_master_2/libcfa/src/bits/locks.hfa /var/lib/jenkins/workspace/Cforall_master_2/libcfa/src/bits/collection.hfa /var/lib/jenkins/workspace/Cforall_master_2/libcfa/src/bits/stack.hfa /var/lib/jenkins/workspace/Cforall_master_2/libcfa/src/bits/queue.hfa /var/lib/jenkins/workspace/Cforall_master_2/libcfa/src/bits/sequence.hfa /var/lib/jenkins/workspace/Cforall_master_2/libcfa/src/bits/atomic.hfa /var/lib/jenkins/workspace/Cforall_master_2/libcfa/src/bits/random.hfa '/var/lib/jenkins/workspace/Cforall_master_2@tmp/include/cfa//bits'
23:35:48 /usr/bin/mkdir -p '/var/lib/jenkins/workspace/Cforall_master_2@tmp/include/cfa//stdhdr'
23:35:48libtool: install: (cd /var/lib/jenkins/workspace/Cforall_master_2@tmp/lib/cfa/x86-nodebug && { ln -s -f libcfa.so.1.0.0 libcfa.so.1 || { rm -f libcfa.so.1 && ln -s libcfa.so.1.0.0 libcfa.so.1; }; })
23:35:48 /usr/bin/install -c -m 644 /var/lib/jenkins/workspace/Cforall_master_2/libcfa/src/stdhdr/signal.h /var/lib/jenkins/workspace/Cforall_master_2/libcfa/src/stdhdr/wchar.h /var/lib/jenkins/workspace/Cforall_master_2/libcfa/src/stdhdr/stdatomic.h /var/lib/jenkins/workspace/Cforall_master_2/libcfa/src/stdhdr/stdalign.h /var/lib/jenkins/workspace/Cforall_master_2/libcfa/src/stdhdr/stdlib.h /var/lib/jenkins/workspace/Cforall_master_2/libcfa/src/stdhdr/assert.h /var/lib/jenkins/workspace/Cforall_master_2/libcfa/src/stdhdr/complex.h /var/lib/jenkins/workspace/Cforall_master_2/libcfa/src/stdhdr/tgmath.h /var/lib/jenkins/workspace/Cforall_master_2/libcfa/src/stdhdr/unwind.h /var/lib/jenkins/workspace/Cforall_master_2/libcfa/src/stdhdr/setjmp.h /var/lib/jenkins/workspace/Cforall_master_2/libcfa/src/stdhdr/stdint.h /var/lib/jenkins/workspace/Cforall_master_2/libcfa/src/stdhdr/gmp.h /var/lib/jenkins/workspace/Cforall_master_2/libcfa/src/stdhdr/fenv.h /var/lib/jenkins/workspace/Cforall_master_2/libcfa/src/stdhdr/locale.h /var/lib/jenkins/workspace/Cforall_master_2/libcfa/src/stdhdr/ctype.h /var/lib/jenkins/workspace/Cforall_master_2/libcfa/src/stdhdr/inttypes.h /var/lib/jenkins/workspace/Cforall_master_2/libcfa/src/stdhdr/unistd.h /var/lib/jenkins/workspace/Cforall_master_2/libcfa/src/stdhdr/malloc.h /var/lib/jenkins/workspace/Cforall_master_2/libcfa/src/stdhdr/time.h /var/lib/jenkins/workspace/Cforall_master_2/libcfa/src/stdhdr/threads.h /var/lib/jenkins/workspace/Cforall_master_2/libcfa/src/stdhdr/wctype.h /var/lib/jenkins/workspace/Cforall_master_2/libcfa/src/stdhdr/limits.h /var/lib/jenkins/workspace/Cforall_master_2/libcfa/src/stdhdr/stdio.h /var/lib/jenkins/workspace/Cforall_master_2/libcfa/src/stdhdr/pthread.h /var/lib/jenkins/workspace/Cforall_master_2/libcfa/src/stdhdr/stdarg.h /var/lib/jenkins/workspace/Cforall_master_2/libcfa/src/stdhdr/stdbool.h /var/lib/jenkins/workspace/Cforall_master_2/libcfa/src/stdhdr/iso646.h /var/lib/jenkins/workspace/Cforall_master_2/libcfa/src/stdhdr/string.h /var/lib/jenkins/workspace/Cforall_master_2/libcfa/src/stdhdr/float.h /var/lib/jenkins/workspace/Cforall_master_2/libcfa/src/stdhdr/math.h /var/lib/jenkins/workspace/Cforall_master_2/libcfa/src/stdhdr/errno.h /var/lib/jenkins/workspace/Cforall_master_2/libcfa/src/stdhdr/stddef.h /var/lib/jenkins/workspace/Cforall_master_2/libcfa/src/stdhdr/stdnoreturn.h /var/lib/jenkins/workspace/Cforall_master_2/libcfa/src/stdhdr/uchar.h '/var/lib/jenkins/workspace/Cforall_master_2@tmp/include/cfa//stdhdr'
23:35:48libtool: install: (cd /var/lib/jenkins/workspace/Cforall_master_2@tmp/lib/cfa/x86-nodebug && { ln -s -f libcfa.so.1.0.0 libcfa.so || { rm -f libcfa.so && ln -s libcfa.so.1.0.0 libcfa.so; }; })
23:35:48 /usr/bin/mkdir -p '/var/lib/jenkins/workspace/Cforall_master_2@tmp/include/cfa//collections'
23:35:48 /usr/bin/install -c -m 644 /var/lib/jenkins/workspace/Cforall_master_2/libcfa/src/collections/maybe.hfa /var/lib/jenkins/workspace/Cforall_master_2/libcfa/src/collections/pair.hfa /var/lib/jenkins/workspace/Cforall_master_2/libcfa/src/collections/result.hfa /var/lib/jenkins/workspace/Cforall_master_2/libcfa/src/collections/string.hfa /var/lib/jenkins/workspace/Cforall_master_2/libcfa/src/collections/string_res.hfa /var/lib/jenkins/workspace/Cforall_master_2/libcfa/src/collections/vector.hfa /var/lib/jenkins/workspace/Cforall_master_2/libcfa/src/collections/array.hfa /var/lib/jenkins/workspace/Cforall_master_2/libcfa/src/collections/list.hfa /var/lib/jenkins/workspace/Cforall_master_2/libcfa/src/collections/list2.hfa /var/lib/jenkins/workspace/Cforall_master_2/libcfa/src/collections/lockfree.hfa /var/lib/jenkins/workspace/Cforall_master_2/libcfa/src/collections/string_sharectx.hfa /var/lib/jenkins/workspace/Cforall_master_2/libcfa/src/collections/vector2.hfa '/var/lib/jenkins/workspace/Cforall_master_2@tmp/include/cfa//collections'
23:35:48libtool: install: /usr/bin/install -c .libs/libcfa.lai /var/lib/jenkins/workspace/Cforall_master_2@tmp/lib/cfa/x86-nodebug/libcfa.la
23:35:48libtool: install: /usr/bin/install -c .libs/libcfathread.so.1.0.0 /var/lib/jenkins/workspace/Cforall_master_2@tmp/lib/cfa/x86-nodebug/libcfathread.so.1.0.0
23:35:48libtool: install: (cd /var/lib/jenkins/workspace/Cforall_master_2@tmp/lib/cfa/x86-nodebug && { ln -s -f libcfathread.so.1.0.0 libcfathread.so.1 || { rm -f libcfathread.so.1 && ln -s libcfathread.so.1.0.0 libcfathread.so.1; }; })
23:35:48libtool: install: (cd /var/lib/jenkins/workspace/Cforall_master_2@tmp/lib/cfa/x86-nodebug && { ln -s -f libcfathread.so.1.0.0 libcfathread.so || { rm -f libcfathread.so && ln -s libcfathread.so.1.0.0 libcfathread.so; }; })
23:35:48libtool: install: /usr/bin/install -c .libs/libcfathread.lai /var/lib/jenkins/workspace/Cforall_master_2@tmp/lib/cfa/x86-nodebug/libcfathread.la
23:35:48libtool: warning: remember to run 'libtool --finish /var/lib/jenkins/workspace/Cforall_master_2@tmp/lib/cfa/x86-nodebug/'
23:35:48make[3]: Nothing to be done for 'install-exec-am'.
23:35:48make[3]: Nothing to be done for 'install-data-am'.
23:35:48[Pipeline] }
23:35:48[Pipeline] // dir
23:35:48[Pipeline] }
23:35:48[Pipeline] // stage
23:35:48[Pipeline] sh
23:35:48+ free -h
23:35:48 total used free shared buff/cache available
23:35:48Mem: 62Gi 1.9Gi 58Gi 4.9Mi 3.5Gi 60Gi
23:35:48Swap: 8.0Gi 0B 8.0Gi
23:35:48[Pipeline] sh
23:35:48+ ulimit -a
23:35:48time(seconds) unlimited
23:35:48file(blocks) unlimited
23:35:48data(kbytes) unlimited
23:35:48stack(kbytes) 8192
23:35:48coredump(blocks) 0
23:35:48memory(kbytes) unlimited
23:35:48locked memory(kbytes) 8238436
23:35:48process 257124
23:35:48nofiles 1048576
23:35:48vmemory(kbytes) unlimited
23:35:48locks unlimited
23:35:48rtprio 0
23:35:48[Pipeline] echo
23:35:48 -------- Test: Debug --------
23:35:48[Pipeline] stage
23:35:48[Pipeline] { (Test: Debug)
23:35:48[Pipeline] dir
23:35:48Running in /var/lib/jenkins/workspace/Cforall_master_2@tmp
23:35:48[Pipeline] {
23:35:48[Pipeline] sh
23:35:48+ nproc
23:35:48+ make -j 16 --no-print-directory -C tests timeout=600 global-timeout=14400 tests debug=yes archive-errors=/var/lib/jenkins/workspace/Cforall_master_2@tmp/tests/crashes/full-debug
23:35:48Running 375 tests on 16 cores (x86 - debug)
23:35:48 array-ERR3 PASSED C 0:00.063 - R n/a
23:35:48 array-ERR2 PASSED C 0:00.070 - R n/a
23:35:48 ...ollections/language-dim-mismatch PASSED C 0:00.262 - R n/a
23:35:48 array-ERR1 PASSED C 0:01.071 - R n/a
23:35:48 array-collections/safety-summary PASSED C 0:00.707 - R n/a
23:35:48 array PASSED C 0:01.127 - R 0:00.021
23:35:48 array-collections/c-dependent PASSED C 0:01.480 - R 0:00.022
23:35:48 array-collections/array-raii-c PASSED C 0:01.680 - R 0:00.013
23:35:48 array-collections/symtab-collision PASSED C 0:00.612 - R n/a
23:35:48 array-collections/dimexpr-match-c PASSED C 0:02.084 - R 0:00.013
23:35:48 array-collections/array-sbscr-types PASSED C 0:02.137 - R 0:00.020
23:35:48 array-collections/boxed PASSED C 0:02.566 - R 0:00.010
23:35:48 array-collections/array-basic PASSED C 0:02.619 - R 0:00.019
23:35:48 castError PASSED C 0:00.949 - R n/a
23:35:48 attr-priority PASSED C 0:01.672 - R 0:00.003
23:35:48 cast PASSED C 0:01.449 - R 0:00.022
23:35:48 builtins/sync PASSED C 0:01.651 - R 0:00.010
23:35:48 array-collections/dimexpr-match-cfa PASSED C 0:03.247 - R 0:00.020
23:35:48 castReturn PASSED C 0:01.440 - R 0:00.007
23:35:48 alloc-ERROR PASSED C 0:06.538 - R n/a
23:35:48 avl_test PASSED C 0:05.710 - R 0:00.011
23:35:48 array-collections/accordion PASSED C 0:07.035 - R 0:00.006
23:35:48 algorithms/range_test PASSED C 0:07.471 - R 0:00.006
23:35:48 array-collections/array-raii-cfa PASSED C 0:08.294 - R 0:00.007
23:35:48 collections/stack PASSED C 0:08.918 - R 0:00.006
23:35:48 collections/multi_list PASSED C 0:09.377 - R 0:00.006
23:35:48 alloc PASSED C 0:12.209 - R 0:00.010
23:35:48 collections/queue PASSED C 0:10.085 - R 0:00.007
23:35:48 collections/string-gc PASSED C 0:06.758 - R 0:00.008
23:35:48 collections/sequence PASSED C 0:10.689 - R 0:00.007
23:35:48 collections/string-operator-ERR09 PASSED C 0:05.298 - R n/a
23:35:48 collections/string-compare PASSED C 0:10.433 - R 0:00.006
23:35:48 collections/string-ctx-manage PASSED C 0:10.487 - R 0:00.007
23:35:48 collections/string-istream PASSED C 0:07.522 - R 0:00.006
23:35:48 alloc2 PASSED C 0:16.237 - R 0:00.007
23:35:48 collections/string-operator-ERR11 PASSED C 0:05.286 - R n/a
23:35:48 ...ns/vector-err-retn-perm-it-byval PASSED C 0:02.618 - R n/a
23:35:48 ...ns/vector-err-pass-perm-it-byval PASSED C 0:03.053 - R n/a
23:35:48 ...ions/string-api-coverage-noshare PASSED C 0:13.966 - R 0:00.006
23:35:48 collections/string-operator PASSED C 0:09.704 - R 0:00.009
23:35:48 collections/string-operator-ERR13 PASSED C 0:05.297 - R n/a
23:35:48 collections/string-istream-manip PASSED C 0:10.364 - R 0:00.012
23:35:48 collections/string-operator-ERR15 PASSED C 0:05.298 - R n/a
23:35:48 collections/string-api-coverage PASSED C 0:14.672 - R 0:00.010
23:35:48 collections/string-operator-ERR16 PASSED C 0:05.305 - R n/a
23:35:48 collections/vector-demo PASSED C 0:05.537 - R 0:00.006
23:35:48 complex PASSED C 0:06.344 - R 0:00.020
23:35:48 collections/string-ostream PASSED C 0:09.440 - R 0:00.006
23:35:48 collections/atomic_mpsc PASSED C 0:11.651 - R 0:09.947
23:35:48 collections/string-overwrite PASSED C 0:11.803 - R 0:00.009
23:35:48 ...ections/string-overwrite-noshare PASSED C 0:11.939 - R 0:00.011
23:35:48 concurrency/barrier/generation PASSED C 0:13.126 - R 0:00.424
23:35:48 concurrency/barrier/last PASSED C 0:13.520 - R 0:00.104
23:35:48 concurrency/actors/inline PASSED C 0:17.218 - R 0:00.037
23:35:48 concurrency/actors/executor PASSED C 0:17.741 - R 0:00.038
23:35:48 concurrency/actors/poison PASSED C 0:17.412 - R 0:00.074
23:35:48 concurrency/actors/pingpong PASSED C 0:17.726 - R 0:00.068
23:35:48 concurrency/actors/static PASSED C 0:17.345 - R 0:00.226
23:35:48 concurrency/actors/inherit PASSED C 0:17.905 - R 0:00.068
23:35:48 concurrency/actors/matrixMultiply PASSED C 0:17.632 - R 0:00.718
23:35:48 concurrency/actors/types PASSED C 0:17.836 - R 0:00.120
23:35:48 concurrency/barrier/order PASSED C 0:13.809 - R 0:00.071
23:35:48 concurrency/ctor-check PASSED C 0:00.882 - R n/a
23:35:48 concurrency/clib_tls PASSED C 0:02.445 - R 0:00.014
23:35:48 concurrency/clib PASSED C 0:02.443 - R 0:00.221
23:35:48 concurrency/actors/dynamic PASSED C 0:17.560 - R 0:03.632
23:35:48 concurrency/cluster PASSED C 0:07.722 - R 0:00.017
23:35:48 concurrency/cofor PASSED C 0:09.856 - R 0:00.009
23:35:48 concurrency/coroutineYield PASSED C 0:11.218 - R 0:00.035
23:35:48 concurrency/examples/gortn PASSED C 0:10.908 - R 0:00.012
23:35:48 concurrency/channels/big_elems PASSED C 0:15.132 - R 0:10.628
23:35:48 concurrency/examples/datingService PASSED C 0:11.166 - R 0:00.019
23:35:48 concurrency/channels/churn PASSED C 0:14.970 - R 0:10.075
23:35:48 concurrency/examples/matrixSum PASSED C 0:10.766 - R 0:00.010
23:35:48 concurrency/keywordErrors PASSED C 0:00.368 - R n/a
23:35:48 concurrency/channels/contend PASSED C 0:14.795 - R 0:10.065
23:35:48 concurrency/channels/daisy_chain PASSED C 0:14.589 - R 0:10.058
23:35:48 concurrency/mainError PASSED C 0:00.288 - R n/a
23:35:48 concurrency/futures/abandon PASSED C 0:08.252 - R 0:00.118
23:35:48 concurrency/futures/basic PASSED C 0:07.757 - R 0:00.069
23:35:48 ...rrency/examples/boundedBufferINT PASSED C 0:11.355 - R 0:07.090
23:35:48 ...rrency/examples/boundedBufferEXT PASSED C 0:11.521 - R 0:07.288
23:35:48 concurrency/examples/quickSort PASSED C 0:13.016 - R 0:00.016
23:35:48 concurrency/channels/hot_potato PASSED C 0:14.666 - R 0:10.045
23:35:48 concurrency/channels/ping_pong PASSED C 0:15.819 - R 0:10.041
23:35:48 concurrency/channels/pub_sub PASSED C 0:15.183 - R 0:10.058
23:35:48 concurrency/channels/zero_size PASSED C 0:14.853 - R 0:10.047
23:35:48 concurrency/join PASSED C 0:11.029 - R 0:00.018
23:35:48 concurrency/migrate PASSED C 0:11.409 - R 0:00.069
23:35:48 concurrency/lockfree_stack PASSED C 0:10.775 - R 0:02.030
23:35:48 concurrency/futures/wait_any PASSED C 0:14.391 - R 0:00.019
23:35:48 concurrency/park/contention PASSED C 0:07.920 - R 0:00.168
23:35:48 concurrency/futures/typed PASSED C 0:17.560 - R 0:00.172
23:35:48 concurrency/mutexstmt/monitors PASSED C 0:08.950 - R 0:02.974
23:35:48 concurrency/park/start_parked PASSED C 0:08.206 - R 0:00.036
23:35:48 concurrency/mutexstmt/tuple PASSED C 0:13.445 - R 0:00.013
23:35:48 concurrency/once PASSED C 0:13.456 - R 0:00.121
23:35:48 ...urrency/pthread/pthread_key_test PASSED C 0:03.399 - R 0:00.014
23:35:48 concurrency/park/force_preempt PASSED C 0:11.837 - R 0:00.318
23:35:48 ...rrency/pthread/pthread_attr_test PASSED C 0:11.114 - R 0:00.011
23:35:48 ...rrency/pthread/pthread_cond_test PASSED C 0:10.904 - R 0:00.011
23:35:48 ...pthread/pthread_demo_create_join PASSED C 0:11.750 - R 0:00.023
23:35:48 concurrency/monitor PASSED C 0:10.886 - R 0:14.263
23:35:48 concurrency/futures/future_except PASSED C 0:27.231 - R 0:00.023
23:35:48 ...rrency/pthread/pthread_once_test PASSED C 0:11.102 - R 0:00.034
23:35:48 concurrency/readyQ/barrier_sleeper PASSED C 0:13.547 - R 0:00.483
23:35:48 concurrency/readyQ/leader_spin PASSED C 0:11.639 - R 0:01.633
23:35:48 concurrency/multi-monitor PASSED C 0:10.958 - R 0:17.931
23:35:48 concurrency/signal/block PASSED C 0:11.636 - R 0:01.376
23:35:48 ...rrency/pthread/pthread_demo_lock PASSED C 0:11.110 - R 0:07.289
23:35:48 concurrency/signal/wait PASSED C 0:11.982 - R 0:00.219
23:35:48 concurrency/signal/disjoint PASSED C 0:11.518 - R 0:02.124
23:35:48 concurrency/preempt PASSED C 0:13.023 - R 0:11.800
23:35:48 concurrency/suspend_then PASSED C 0:11.469 - R 0:00.035
23:35:48 concurrency/sleep PASSED C 0:11.468 - R 0:01.171
23:35:48 concurrency/thread PASSED C 0:13.740 - R 0:00.019
23:35:48 ...ency/unified_locking/exp_backoff PASSED C 0:12.935 - R 0:00.037
23:35:48 .../unified_locking/block_spin_lock PASSED C 0:12.924 - R 0:00.420
23:35:48 concurrency/preempt2 PASSED C 0:11.462 - R 0:20.625
23:35:48 .../unified_locking/fast_block_lock PASSED C 0:13.817 - R 0:00.035
23:35:48 ...cy/unified_locking/pthread_locks PASSED C 0:10.154 - R 0:00.423
23:35:48 ...ncy/unified_locking/timeout_lock PASSED C 0:09.951 - R 0:01.123
23:35:48 ...fied_locking/mcs_block_spin_lock PASSED C 0:13.724 - R 0:00.117
23:35:48 ...nified_locking/simple_owner_lock PASSED C 0:13.318 - R 0:00.036
23:35:48 concurrency/waitfor/barge PASSED C 0:11.603 - R 0:00.422
23:35:48 concurrency/waitfor/else PASSED C 0:09.571 - R 0:00.007
23:35:48 concurrency/waitfor/parse PASSED C 0:07.318 - R 0:00.022
23:35:48 ...urrency/waitfor/lexical_priority PASSED C 0:11.107 - R 0:00.009
23:35:48 concurrency/waitfor/dtor PASSED C 0:10.983 - R 0:01.374
23:35:48 concurrency/waitfor/recurse PASSED C 0:11.267 - R 0:01.474
23:35:48 concurrency/waitfor/statment PASSED C 0:11.565 - R 0:00.035
23:35:48 concurrency/unified_locking/mcs PASSED C 0:13.116 - R 0:11.701
23:35:48 concurrency/waitfor/when PASSED C 0:11.535 - R 0:00.272
23:35:48 concurrency/waituntil/basic_else PASSED C 0:19.204 - R 0:00.013
23:35:48 ...ency/waituntil/channel_zero_size PASSED C 0:12.193 - R 0:05.479
23:35:48 configs/parsebools PASSED C 0:08.883 - R 0:00.035
23:35:48 concurrency/waituntil/timeout PASSED C 0:07.055 - R 0:03.123
23:35:48 concurrency/waituntil/one_chan PASSED C 0:11.236 - R 0:01.219
23:35:48 const-init PASSED C 0:01.083 - R 0:00.010
23:35:48 const-ref PASSED C 0:01.126 - R 0:00.005
23:35:48 copyfile PASSED C 0:06.022 - R 0:00.007
23:35:48 concurrency/waituntil/channel_close PASSED C 0:16.321 - R 0:10.045
23:35:48 configs/parseconfig PASSED C 0:08.629 - R 0:00.008
23:35:48 configs/usage PASSED C 0:08.710 - R 0:00.033
23:35:48 coroutine/devicedriver PASSED C 0:07.521 - R 0:00.036
23:35:48 concurrency/waituntil/channels PASSED C 0:12.025 - R 0:14.707
23:35:48 coroutine/fibonacci PASSED C 0:07.833 - R 0:00.033
23:35:48 concurrency/waituntil/futures PASSED C 0:27.691 - R 0:00.037
23:35:48 coroutine/fmtLines PASSED C 0:07.419 - R 0:00.023
23:35:48 coroutine/pingpong PASSED C 0:08.242 - R 0:00.007
23:35:48 ...ency/unified_locking/futex_mutex PASSED C 0:12.813 - R 0:37.416
23:35:48 counter PASSED C 0:06.160 - R 0:00.035
23:35:48 coroutine/raii PASSED C 0:07.562 - R 0:00.018
23:35:48 coroutine/runningTotal PASSED C 0:07.647 - R 0:00.019
23:35:48 ctrl-flow/break-misc PASSED C 0:06.747 - R 0:00.012
23:35:48 ctrl-flow/labelledExit PASSED C 0:01.097 - R 0:00.011
23:35:48 ctrl-flow/loop-inc PASSED C 0:01.498 - R 0:00.010
23:35:48 ctrl-flow/fallthrough PASSED C 0:06.437 - R 0:00.020
23:35:48 coroutine/prodcons PASSED C 0:09.968 - R 0:00.036
23:35:48 designations PASSED C 0:02.253 - R 0:00.010
23:35:48 enum PASSED C 0:01.140 - R 0:00.020
23:35:48 ctrl-flow/goto PASSED C 0:06.368 - R 0:00.019
23:35:48 ctrl-flow/ifwhileCtl PASSED C 0:06.458 - R 0:00.018
23:35:48 concurrency/waituntil/all_types PASSED C 0:34.150 - R 0:08.247
23:35:48 ctrl-flow/loop_else PASSED C 0:06.584 - R 0:00.022
23:35:48 enum_tests/funcEnum PASSED C 0:01.981 - R 0:00.006
23:35:48 enum_tests/lvalue PASSED C 0:00.841 - R n/a
23:35:48 enum_tests/inc-dec PASSED C 0:01.735 - R 0:00.020
23:35:48 ctrl-flow/loopctrl PASSED C 0:07.618 - R 0:00.013
23:35:48 ctrl-flow/loop_else-WRN1 PASSED C 0:08.218 - R 0:00.001
23:35:48 enum_tests/anonymous PASSED C 0:05.921 - R 0:00.007
23:35:48 ...urrency/unified_locking/mcs_spin PASSED C 0:12.831 - R 0:46.250
23:35:48 errors/declaration PASSED C 0:00.148 - R n/a
23:35:48 errors/scope PASSED C 0:00.660 - R n/a
23:35:48 div PASSED C 0:08.595 - R 0:00.005
23:35:48 errors/signature PASSED C 0:00.096 - R n/a
23:35:48 errors/scope-type PASSED C 0:00.143 - R n/a
23:35:48 enum_tests/structEnum PASSED C 0:02.237 - R 0:00.005
23:35:48 enum_tests/enumInlineValue PASSED C 0:07.539 - R 0:00.021
23:35:48 device/cpu PASSED C 0:09.849 - R 0:00.019
23:35:48 .../unified_locking/spin_queue_lock PASSED C 0:12.920 - R 0:46.288
23:35:48 eval PASSED C 0:01.139 - R 0:00.005
23:35:48 enum_tests/input PASSED C 0:07.176 - R 0:00.007
23:35:48 enum_tests/stringEnum PASSED C 0:06.072 - R 0:00.017
23:35:48 enum_tests/planet PASSED C 0:07.949 - R 0:00.007
23:35:48 enum_tests/typedIntEnum PASSED C 0:06.233 - R 0:00.020
23:35:48 enum_tests/voidEnum PASSED C 0:05.819 - R 0:00.006
23:35:48 concurrency/waituntil/repeat_close PASSED C 0:12.924 - R 0:30.047
23:35:48 enum_tests/position PASSED C 0:08.643 - R 0:00.006
23:35:48 exceptions/conditional PASSED C 0:06.296 - R 0:00.006
23:35:48 exceptions/data-except PASSED C 0:06.607 - R 0:00.019
23:35:48 exceptions/message PASSED C 0:02.427 - R 0:00.006
23:35:48 exceptions/cancel/coroutine PASSED C 0:08.103 - R 0:00.010
23:35:48 exceptions/conditional-threads PASSED C 0:07.632 - R 0:00.009
23:35:48 exceptions/defaults PASSED C 0:06.620 - R 0:00.005
23:35:48 exceptions/finally PASSED C 0:06.242 - R 0:00.007
23:35:48 exceptions/cancel/thread PASSED C 0:11.107 - R 0:00.008
23:35:48 exceptions/try-ctrl-flow PASSED C 0:00.335 - R n/a
23:35:48 exceptions/cor_resumer PASSED C 0:10.881 - R 0:00.007
23:35:48 exceptions/defaults-threads PASSED C 0:08.121 - R 0:00.011
23:35:48 exceptions/interact PASSED C 0:06.373 - R 0:00.009
23:35:48 exceptions/finally-threads PASSED C 0:07.634 - R 0:00.010
23:35:48 exceptions/type-check PASSED C 0:00.435 - R n/a
23:35:48 exceptions/try-leave-catch PASSED C 0:01.178 - R 0:00.007
23:35:48 expression PASSED C 0:01.159 - R 0:00.007
23:35:48 exceptions/fibonacci_nonlocal PASSED C 0:09.210 - R 0:00.008
23:35:48 exceptions/polymorphic PASSED C 0:06.276 - R 0:00.005
23:35:48 exceptions/resume PASSED C 0:06.499 - R 0:00.006
23:35:48 concurrency/mutexstmt/locks PASSED C 0:11.018 - R 1:31.881
23:35:48 concurrency/waituntil/locks PASSED C 0:13.809 - R 0:42.654
23:35:48 exceptions/terminate PASSED C 0:06.497 - R 0:00.006
23:35:48 global-monomorph PASSED C 0:01.110 - R 0:00.006
23:35:48 exceptions/resume-threads PASSED C 0:08.326 - R 0:00.011
23:35:48 exceptions/trash PASSED C 0:06.254 - R 0:00.006
23:35:48 identFuncDeclarator PASSED C 0:01.082 - R 0:00.007
23:35:48 exceptions/terminate-threads PASSED C 0:08.333 - R 0:00.012
23:35:48 identParamDeclarator PASSED C 0:01.113 - R 0:00.006
23:35:48 exceptions/virtual-poly PASSED C 0:06.325 - R 0:00.006
23:35:48 exceptions/pingpong_nonlocal PASSED C 0:11.650 - R 0:00.019
23:35:48 fstream_test PASSED C 0:06.185 - R 0:00.007
23:35:48 forall PASSED C 0:06.968 - R 0:00.006
23:35:48 generator/fibonacci PASSED C 0:06.025 - R 0:00.019
23:35:48 exceptions/virtual-cast PASSED C 0:07.959 - R 0:00.007
23:35:48 generator/fmtLines PASSED C 0:06.036 - R 0:00.008
23:35:48 init1-ERROR PASSED C 0:00.620 - R n/a
23:35:48 init1 PASSED C 0:01.124 - R 0:00.019
23:35:48 generator/suspend_then PASSED C 0:06.106 - R 0:00.020
23:35:48 include/vector-sequence PASSED C 0:01.818 - R 0:00.005
23:35:48 genericUnion PASSED C 0:06.221 - R 0:00.036
23:35:48 include/vector-collections PASSED C 0:02.710 - R 0:00.035
23:35:48 function-operator PASSED C 0:08.692 - R 0:00.006
23:35:48 hello PASSED C 0:06.574 - R 0:00.021
23:35:48 identity PASSED C 0:06.946 - R 0:00.020
23:35:48 include/stdincludes PASSED C 0:06.549 - R 0:00.007
23:35:48 include/vector-fstream PASSED C 0:06.391 - R 0:00.019
23:35:48 io/eofType PASSED C 0:06.447 - R 0:00.019
23:35:48 limits PASSED C 0:01.600 - R 0:00.021
23:35:48 io/io PASSED C 0:10.175 - R 0:00.034
23:35:48 linking/exception-nothreads PASSED C 0:04.466 - R 0:00.020
23:35:48 io/manipulatorsOutput4 PASSED C 0:08.643 - R 0:00.024
23:35:48 io/io-acquire-in PASSED C 0:12.460 - R 0:00.036
23:35:48 io/io-acquire PASSED C 0:12.581 - R 0:00.221
23:35:48 io/manipulatorsInput-uchunk PASSED C 0:09.395 - R 0:00.118
23:35:48 io/away_fair PASSED C 0:14.404 - R 0:00.167
23:35:48 io/io-acquire-out PASSED C 0:12.319 - R 0:00.066
23:35:48 io/io-acquire2 PASSED C 0:12.007 - R 0:00.069
23:35:48 linking/nostdlib PASSED C 0:01.296 - R 0:00.020
23:35:48 io/io-acquire-no-io PASSED C 0:11.448 - R 0:02.373
23:35:48 linkonce PASSED C 0:01.422 - R 0:00.021
23:35:48 io/comp_fair PASSED C 0:15.697 - R 0:00.522
23:35:48 io/comp_basic PASSED C 0:16.314 - R 0:00.222
23:35:48 linking/exception-withthreads PASSED C 0:06.672 - R 0:00.010
23:35:48 maybe PASSED C 0:01.388 - R 0:00.019
23:35:48 io/many_read PASSED C 0:14.934 - R 0:00.022
23:35:48 linking/mangling/anon PASSED C 0:06.543 - R 0:00.027
23:35:48 nested-types-ERR1 PASSED C 0:00.128 - R n/a
23:35:48 nested-types-ERR2 PASSED C 0:00.181 - R n/a
23:35:48 include/includes PASSED C 0:22.803 - R 0:00.006
23:35:48 nested-types PASSED C 0:01.123 - R 0:00.006
23:35:48 list/dlist-insert-remove PASSED C 0:06.575 - R 0:00.009
23:35:48 linking/io-acquire PASSED C 0:08.662 - R 0:00.006
23:35:48 literals PASSED C 0:06.819 - R 0:00.014
23:35:48 nowarn/array PASSED C 0:01.582 - R 0:00.019
23:35:48 list/dlist2-insert-remove PASSED C 0:07.154 - R 0:00.035
23:35:48 linking/nothreads PASSED C 0:08.443 - R 0:00.007
23:35:48 nowarn/exception PASSED C 0:01.324 - R 0:00.018
23:35:48 opt-params PASSED C 0:00.129 - R n/a
23:35:48 nowarn/no-autogen PASSED C 0:01.220 - R 0:00.018
23:35:48 nowarn/printf-sizeof PASSED C 0:01.364 - R 0:00.009
23:35:48 meta/fork+exec PASSED C 0:04.760 - R 0:00.069
23:35:48 nowarn/unused PASSED C 0:01.173 - R 0:00.022
23:35:48 nowarn/zero-thunk PASSED C 0:01.266 - R 0:00.014
23:35:48 linking/weakso_nothd PASSED C 0:08.973 - R 0:00.007
23:35:48 numericConstants PASSED C 0:01.279 - R 0:00.021
23:35:48 operators PASSED C 0:01.243 - R 0:00.009
23:35:48 polybits PASSED C 0:00.235 - R n/a
23:35:48 poly-bare-assn PASSED C 0:01.202 - R 0:00.023
23:35:48 poly-d-cycle PASSED C 0:01.336 - R 0:00.006
23:35:48 poly-many-arsz PASSED C 0:01.314 - R 0:00.022
23:35:48 poly-member PASSED C 0:01.261 - R 0:00.039
23:35:48 poly-o-cycle PASSED C 0:01.295 - R 0:00.020
23:35:48 poly-selection PASSED C 0:01.067 - R 0:00.011
23:35:48 poly-self-cycle PASSED C 0:01.365 - R 0:00.018
23:35:48 raii/ctor-autogen-ERR1 PASSED C 0:00.817 - R n/a
23:35:48 quasiKeyword PASSED C 0:01.431 - R 0:00.023
23:35:48 meta/dumpable PASSED C 0:08.554 - R 0:00.011
23:35:48 linking/withthreads PASSED C 0:11.191 - R 0:00.008
23:35:48 malloc PASSED C 0:09.656 - R 0:00.017
23:35:48 raii/ctor-autogen PASSED C 0:01.998 - R 0:00.021
23:35:48 raii/init_once PASSED C 0:01.593 - R 0:00.007
23:35:48 heap PASSED C 0:08.747 - R 0:22.642
23:35:48 raii/partial-ERR1 PASSED C 0:00.791 - R n/a
23:35:48 raii/typeof-member PASSED C 0:01.053 - R 0:00.012
23:35:48 raii/partial PASSED C 0:01.160 - R 0:00.006
23:35:48 result PASSED C 0:01.456 - R 0:00.007
23:35:48 raii/dtor-early-exit-ERR2 PASSED C 0:04.666 - R n/a
23:35:48 raii/dtor-early-exit-ERR1 PASSED C 0:04.782 - R n/a
23:35:48 minmax PASSED C 0:10.782 - R 0:00.005
23:35:48 simpleGenericTriple PASSED C 0:01.236 - R 0:00.006
23:35:48 raii/memberCtors-ERR1 PASSED C 0:04.018 - R n/a
23:35:48 polymorphism PASSED C 0:06.462 - R 0:00.007
23:35:48 quotedKeyword PASSED C 0:06.386 - R 0:00.005
23:35:48 smart-pointers PASSED C 0:01.316 - R 0:00.005
23:35:48 raii/boxed-types PASSED C 0:06.948 - R 0:00.007
23:35:48 raii/globals PASSED C 0:06.428 - R 0:00.007
23:35:48 switch PASSED C 0:01.195 - R 0:00.007
23:35:48 raii/memberCtors PASSED C 0:06.661 - R 0:00.006
23:35:48 tuple/tupleCast PASSED C 0:01.099 - R 0:00.005
23:35:48 tuple/tupleFunction PASSED C 0:01.264 - R 0:00.011
23:35:48 tuple/tupleMember PASSED C 0:01.232 - R 0:00.005
23:35:48 raii/dtor-early-exit PASSED C 0:08.680 - R 0:00.007
23:35:48 typedefRedef-ERR1 PASSED C 0:00.113 - R n/a
23:35:48 tuple/tuplePolymorphism PASSED C 0:01.348 - R 0:00.005
23:35:48 shortCircuit PASSED C 0:06.114 - R 0:00.007
23:35:48 references PASSED C 0:06.488 - R 0:00.006
23:35:48 var-assert PASSED C 0:00.134 - R n/a
23:35:48 typedefRedef PASSED C 0:01.054 - R 0:00.011
23:35:48 typeof PASSED C 0:01.064 - R 0:00.007
23:35:48 variableDeclarator PASSED C 0:01.088 - R 0:00.006
23:35:48 sizeof PASSED C 0:06.539 - R 0:00.006
23:35:48 searchsort PASSED C 0:08.581 - R 0:00.009
23:35:48 strstream PASSED C 0:06.600 - R 0:00.012
23:35:48 tuple/tupleVariadic PASSED C 0:04.155 - R 0:00.007
23:35:48 tuple/tupleAssign PASSED C 0:07.002 - R 0:00.007
23:35:48 sum PASSED C 0:08.575 - R 0:00.009
23:35:48 time PASSED C 0:08.208 - R 0:00.007
23:35:48 swap PASSED C 0:08.855 - R 0:00.007
23:35:48 tuplearray PASSED C 0:06.453 - R 0:00.021
23:35:48 withconflict PASSED C 0:00.588 - R n/a
23:35:48 voidPtr PASSED C 0:01.098 - R 0:00.006
23:35:48 warnings/self-assignment PASSED C 0:01.044 - R 0:00.003
23:35:48 userLiterals PASSED C 0:06.687 - R 0:00.005
23:35:48 KRfunctions PASSED C 0:01.037 - R 0:00.003
23:35:48 vector PASSED C 0:08.039 - R 0:00.009
23:35:48 ...collections/dimexpr-match-c-ERRS PASSED C 0:00.763 - R n/a
23:35:48 vector_math/vec2_double PASSED C 0:08.854 - R 0:00.007
23:35:48 zero_one-ERR1 PASSED C 0:03.379 - R n/a
23:35:48 arithmeticConversions PASSED C 0:02.598 - R 0:00.018
23:35:48 ...llections/dimexpr-match-cfa-ERRS PASSED C 0:01.400 - R n/a
23:35:48 attributes PASSED C 0:01.412 - R 0:00.001
23:35:48 vector_math/vec2_uint PASSED C 0:08.904 - R 0:00.010
23:35:48 zero_one PASSED C 0:06.181 - R 0:00.021
23:35:48 vector_math/vec2_float PASSED C 0:12.973 - R 0:00.007
23:35:48 vector_math/vec2_int PASSED C 0:12.691 - R 0:00.006
23:35:48 vector_math/vec3_int PASSED C 0:11.353 - R 0:00.007
23:35:48 errors/completeType PASSED C 0:00.611 - R n/a
23:35:48 declarationSpecifier PASSED C 0:01.073 - R 0:00.003
23:35:48 abs PASSED C 0:08.393 - R 0:00.019
23:35:48 vector_math/vec3_float PASSED C 0:13.254 - R 0:00.014
23:35:48 vector_math/vec4_float PASSED C 0:13.009 - R 0:00.036
23:35:48 vector_math/vec4_int PASSED C 0:11.803 - R 0:00.006
23:35:48 extension PASSED C 0:01.042 - R 0:00.003
23:35:48 functions PASSED C 0:01.081 - R 0:00.002
23:35:48 gccExtensions PASSED C 0:01.054 - R 0:00.001
23:35:48 ato PASSED C 0:09.116 - R 0:00.019
23:35:48 bitmanip1 PASSED C 0:10.548 - R 0:00.011
23:35:48 bitmanip2 PASSED C 0:09.870 - R 0:00.018
23:35:48 meta/arch PASSED C 0:00.588 - R n/a
23:35:48 rational PASSED C 0:27.746 - R 0:00.007
23:35:48 configs/parsenums PASSED C 0:08.965 - R 0:00.067
23:35:48 bitmanip3 PASSED C 0:11.412 - R 0:00.012
23:35:48 concurrency/pthread/bounded_buffer PASSED C 0:11.178 - R 0:00.017
23:35:48 exceptions/cardgame PASSED C 0:09.860 - R 0:00.017
23:35:48 concurrency/unified_locking/locks PASSED C 0:14.029 - R 2:03.416
23:35:48 io/manipulatorsInput PASSED C 0:07.794 - R 0:00.009
23:35:48 PRNG PASSED C 0:16.298 - R 0:01.822
23:35:48 exceptions/hotpotato_checked PASSED C 0:10.091 - R 0:00.009
23:35:48 exceptions/hotpotato PASSED C 0:10.137 - R 0:00.009
23:35:48 io/manipulatorsOutput2 PASSED C 0:09.242 - R 0:00.009
23:35:48 random PASSED C 0:07.973 - R 0:00.005
23:35:48 io/manipulatorsOutput1 PASSED C 0:12.883 - R 0:00.009
23:35:48 mathX PASSED C 0:12.237 - R 0:00.017
23:35:48 vector_math/vec2_ldouble PASSED C 0:08.600 - R 0:00.009
23:35:48 math PASSED C 0:11.710 - R 0:00.010
23:35:48 nested_function PASSED C 0:10.766 - R 0:00.019
23:35:48375 passes, 0 failures, 0 timeouts, 0 cancelled, 0 other
23:35:48Tests took 3:47.700
23:35:48[Pipeline] }
23:35:48[Pipeline] // dir
23:35:48[Pipeline] }
23:35:48[Pipeline] // stage
23:35:48[Pipeline] echo
23:35:48 -------- Test: Release --------
23:35:48[Pipeline] stage
23:35:48[Pipeline] { (Test: Release)
23:35:48[Pipeline] dir
23:35:48Running in /var/lib/jenkins/workspace/Cforall_master_2@tmp
23:35:48[Pipeline] {
23:35:48[Pipeline] sh
23:35:48+ nproc
23:35:48+ make -j 16 --no-print-directory -C tests timeout=600 global-timeout=14400 tests debug=no archive-errors=/var/lib/jenkins/workspace/Cforall_master_2@tmp/tests/crashes/full-nodebug
23:35:48Running 375 tests on 16 cores (x86 - no debug)
23:35:48 array-ERR3 PASSED C 0:00.076 - R n/a
23:35:48 array-ERR2 PASSED C 0:00.098 - R n/a
23:35:48 ...ollections/language-dim-mismatch PASSED C 0:00.456 - R n/a
23:35:48 array-ERR1 PASSED C 0:01.074 - R n/a
23:35:48 array PASSED C 0:01.204 - R 0:00.011
23:35:48 array-collections/c-dependent PASSED C 0:01.321 - R 0:00.025
23:35:48 array-collections/array-raii-c PASSED C 0:01.554 - R 0:00.022
23:35:48 array-collections/safety-summary PASSED C 0:01.136 - R n/a
23:35:48 array-collections/symtab-collision PASSED C 0:00.740 - R n/a
23:35:48 attr-priority PASSED C 0:01.076 - R 0:00.001
23:35:48 array-collections/array-sbscr-types PASSED C 0:02.371 - R 0:00.020
23:35:48 castError PASSED C 0:00.842 - R n/a
23:35:48 array-collections/dimexpr-match-c PASSED C 0:02.949 - R 0:00.019
23:35:48 cast PASSED C 0:01.391 - R 0:00.022
23:35:48 array-collections/array-basic PASSED C 0:03.385 - R 0:00.005
23:35:48 builtins/sync PASSED C 0:01.837 - R 0:00.021
23:35:48 array-collections/dimexpr-match-cfa PASSED C 0:03.561 - R 0:00.007
23:35:48 castReturn PASSED C 0:01.362 - R 0:00.009
23:35:48 array-collections/boxed PASSED C 0:03.740 - R 0:00.020
23:35:48 alloc-ERROR PASSED C 0:06.726 - R n/a
23:35:48 array-collections/accordion PASSED C 0:07.088 - R 0:00.017
23:35:48 avl_test PASSED C 0:06.387 - R 0:00.007
23:35:48 algorithms/range_test PASSED C 0:08.028 - R 0:00.006
23:35:48 array-collections/array-raii-cfa PASSED C 0:08.946 - R 0:00.005
23:35:48 collections/multi_list PASSED C 0:09.845 - R 0:00.011
23:35:48 collections/stack PASSED C 0:09.445 - R 0:00.005
23:35:48 collections/queue PASSED C 0:10.515 - R 0:00.007
23:35:48 collections/string-gc PASSED C 0:06.786 - R 0:00.010
23:35:48 collections/string-operator-ERR09 PASSED C 0:05.339 - R n/a
23:35:48 collections/sequence PASSED C 0:11.548 - R 0:00.019
23:35:48 collections/string-ctx-manage PASSED C 0:11.164 - R 0:00.006
23:35:48 collections/string-istream PASSED C 0:07.970 - R 0:00.020
23:35:48 collections/atomic_mpsc PASSED C 0:11.995 - R 0:01.222
23:35:48 alloc PASSED C 0:16.872 - R 0:00.008
23:35:48 collections/string-compare PASSED C 0:13.415 - R 0:00.005
23:35:48 collections/string-operator-ERR11 PASSED C 0:05.399 - R n/a
23:35:48 collections/string-operator-ERR13 PASSED C 0:05.665 - R n/a
23:35:48 ...ns/vector-err-pass-perm-it-byval PASSED C 0:03.266 - R n/a
23:35:48 collections/string-operator-ERR16 PASSED C 0:05.371 - R n/a
23:35:48 collections/string-operator-ERR15 PASSED C 0:05.492 - R n/a
23:35:48 collections/string-istream-manip PASSED C 0:11.793 - R 0:00.007
23:35:48 ...ns/vector-err-retn-perm-it-byval PASSED C 0:02.782 - R n/a
23:35:48 collections/vector-demo PASSED C 0:06.858 - R 0:00.005
23:35:48 collections/string-api-coverage PASSED C 0:18.625 - R 0:00.006
23:35:48 ...ions/string-api-coverage-noshare PASSED C 0:19.172 - R 0:00.006
23:35:48 complex PASSED C 0:06.257 - R 0:00.005
23:35:48 collections/string-operator PASSED C 0:16.021 - R 0:00.006
23:35:48 collections/string-ostream PASSED C 0:10.099 - R 0:00.006
23:35:48 collections/string-overwrite PASSED C 0:12.988 - R 0:00.007
23:35:48 alloc2 PASSED C 0:27.831 - R 0:00.006
23:35:48 ...ections/string-overwrite-noshare PASSED C 0:12.869 - R 0:00.010
23:35:48 concurrency/actors/dynamic PASSED C 0:16.884 - R 0:00.318
23:35:48 concurrency/actors/executor PASSED C 0:16.988 - R 0:00.018
23:35:48 concurrency/actors/inline PASSED C 0:16.901 - R 0:00.036
23:35:48 concurrency/actors/matrixMultiply PASSED C 0:16.980 - R 0:00.268
23:35:48 concurrency/barrier/generation PASSED C 0:13.523 - R 0:00.068
23:35:48 concurrency/actors/inherit PASSED C 0:17.513 - R 0:00.118
23:35:48 concurrency/actors/poison PASSED C 0:16.926 - R 0:00.119
23:35:48 concurrency/actors/pingpong PASSED C 0:17.543 - R 0:00.068
23:35:48 concurrency/barrier/order PASSED C 0:13.564 - R 0:00.017
23:35:48 concurrency/clib_tls PASSED C 0:03.105 - R 0:00.009
23:35:48 concurrency/clib PASSED C 0:03.143 - R 0:00.066
23:35:48 concurrency/actors/types PASSED C 0:17.707 - R 0:00.066
23:35:48 concurrency/actors/static PASSED C 0:17.907 - R 0:00.069
23:35:48 concurrency/ctor-check PASSED C 0:00.836 - R n/a
23:35:48 concurrency/cluster PASSED C 0:07.877 - R 0:00.009
23:35:48 concurrency/cofor PASSED C 0:10.513 - R 0:00.009
23:35:48 concurrency/coroutineYield PASSED C 0:12.529 - R 0:00.017
23:35:48 concurrency/channels/big_elems PASSED C 0:15.572 - R 0:10.565
23:35:48 concurrency/examples/gortn PASSED C 0:10.984 - R 0:00.009
23:35:48 concurrency/examples/datingService PASSED C 0:11.775 - R 0:00.009
23:35:48 ...rrency/examples/boundedBufferEXT PASSED C 0:11.886 - R 0:01.218
23:35:48 ...rrency/examples/boundedBufferINT PASSED C 0:11.995 - R 0:01.323
23:35:48 concurrency/channels/churn PASSED C 0:15.786 - R 0:10.013
23:35:48 concurrency/channels/daisy_chain PASSED C 0:15.690 - R 0:10.049
23:35:48 concurrency/channels/contend PASSED C 0:15.739 - R 0:10.051
23:35:48 concurrency/mainError PASSED C 0:00.279 - R n/a
23:35:48 concurrency/keywordErrors PASSED C 0:00.381 - R n/a
23:35:48 concurrency/examples/matrixSum PASSED C 0:11.046 - R 0:00.007
23:35:48 concurrency/futures/abandon PASSED C 0:08.078 - R 0:00.018
23:35:48 concurrency/futures/basic PASSED C 0:07.892 - R 0:00.065
23:35:48 concurrency/channels/hot_potato PASSED C 0:15.386 - R 0:10.041
23:35:48 concurrency/channels/ping_pong PASSED C 0:15.489 - R 0:10.041
23:35:48 concurrency/examples/quickSort PASSED C 0:13.417 - R 0:00.008
23:35:48 concurrency/channels/zero_size PASSED C 0:15.474 - R 0:10.052
23:35:48 concurrency/channels/pub_sub PASSED C 0:15.997 - R 0:10.045
23:35:48 concurrency/join PASSED C 0:11.078 - R 0:00.009
23:35:48 concurrency/migrate PASSED C 0:11.278 - R 0:00.036
23:35:48 concurrency/lockfree_stack PASSED C 0:11.118 - R 0:02.379
23:35:48 concurrency/futures/wait_any PASSED C 0:14.419 - R 0:00.012
23:35:48 concurrency/monitor PASSED C 0:11.099 - R 0:02.279
23:35:48 concurrency/mutexstmt/monitors PASSED C 0:09.239 - R 0:00.466
23:35:48 concurrency/park/contention PASSED C 0:07.991 - R 0:00.068
23:35:48 concurrency/futures/typed PASSED C 0:17.493 - R 0:00.019
23:35:48 concurrency/park/start_parked PASSED C 0:07.995 - R 0:00.009
23:35:48 concurrency/multi-monitor PASSED C 0:11.198 - R 0:03.483
23:35:48 ...urrency/pthread/pthread_key_test PASSED C 0:03.910 - R 0:00.005
23:35:48 concurrency/park/force_preempt PASSED C 0:11.205 - R 0:00.267
23:35:48 concurrency/mutexstmt/tuple PASSED C 0:13.801 - R 0:00.005
23:35:48 concurrency/once PASSED C 0:13.343 - R 0:00.018
23:35:48 concurrency/mutexstmt/locks PASSED C 0:12.126 - R 0:05.990
23:35:48 ...rrency/pthread/pthread_attr_test PASSED C 0:10.891 - R 0:00.008
23:35:48 ...rrency/pthread/pthread_cond_test PASSED C 0:10.932 - R 0:00.011
23:35:48 ...pthread/pthread_demo_create_join PASSED C 0:10.867 - R 0:00.006
23:35:48 concurrency/futures/future_except PASSED C 0:26.866 - R 0:00.009
23:35:48 ...rrency/pthread/pthread_once_test PASSED C 0:10.855 - R 0:00.020
23:35:48 concurrency/readyQ/leader_spin PASSED C 0:11.109 - R 0:00.770
23:35:48 concurrency/readyQ/barrier_sleeper PASSED C 0:13.206 - R 0:00.221
23:35:48 ...rrency/pthread/pthread_demo_lock PASSED C 0:11.048 - R 0:04.977
23:35:48 concurrency/signal/block PASSED C 0:12.260 - R 0:00.217
23:35:48 concurrency/signal/disjoint PASSED C 0:12.141 - R 0:00.366
23:35:48 concurrency/signal/wait PASSED C 0:12.033 - R 0:00.065
23:35:48 concurrency/sleep PASSED C 0:11.644 - R 0:01.122
23:35:48 concurrency/suspend_then PASSED C 0:11.943 - R 0:00.019
23:35:48 concurrency/thread PASSED C 0:13.056 - R 0:00.008
23:35:48 .../unified_locking/block_spin_lock PASSED C 0:13.199 - R 0:00.020
23:35:48 ...ency/unified_locking/exp_backoff PASSED C 0:13.229 - R 0:00.011
23:35:48 .../unified_locking/fast_block_lock PASSED C 0:13.192 - R 0:00.019
23:35:48 concurrency/preempt PASSED C 0:13.123 - R 0:16.260
23:35:48 ...cy/unified_locking/pthread_locks PASSED C 0:10.377 - R 0:00.020
23:35:48 concurrency/preempt2 PASSED C 0:11.954 - R 0:19.968
23:35:48 ...fied_locking/mcs_block_spin_lock PASSED C 0:13.251 - R 0:00.017
23:35:48 concurrency/unified_locking/mcs PASSED C 0:13.970 - R 0:01.778
23:35:48 ...nified_locking/simple_owner_lock PASSED C 0:13.496 - R 0:00.012
23:35:48 ...ncy/unified_locking/timeout_lock PASSED C 0:10.838 - R 0:01.124
23:35:48 concurrency/waitfor/parse PASSED C 0:06.992 - R 0:00.007
23:35:48 concurrency/waitfor/else PASSED C 0:09.298 - R 0:00.017
23:35:48 concurrency/waitfor/barge PASSED C 0:11.308 - R 0:00.069
23:35:48 concurrency/waitfor/dtor PASSED C 0:11.153 - R 0:00.217
23:35:48 ...urrency/waitfor/lexical_priority PASSED C 0:11.480 - R 0:00.018
23:35:48 concurrency/waitfor/recurse PASSED C 0:11.369 - R 0:00.167
23:35:48 concurrency/waitfor/statment PASSED C 0:11.388 - R 0:00.011
23:35:48 concurrency/waitfor/when PASSED C 0:11.351 - R 0:00.033
23:35:48 ...ency/waituntil/channel_zero_size PASSED C 0:12.613 - R 0:00.519
23:35:48 concurrency/waituntil/channels PASSED C 0:13.965 - R 0:00.972
23:35:48 concurrency/waituntil/one_chan PASSED C 0:12.565 - R 0:00.270
23:35:48 const-init PASSED C 0:01.180 - R 0:00.006
23:35:48 concurrency/waituntil/basic_else PASSED C 0:17.956 - R 0:00.006
23:35:48 const-ref PASSED C 0:01.087 - R 0:00.011
23:35:48 concurrency/waituntil/timeout PASSED C 0:06.900 - R 0:03.025
23:35:48 configs/parsebools PASSED C 0:09.760 - R 0:00.067
23:35:48 concurrency/unified_locking/locks PASSED C 0:14.862 - R 0:24.584
23:35:48 configs/parseconfig PASSED C 0:09.104 - R 0:00.007
23:35:48 copyfile PASSED C 0:06.042 - R 0:00.012
23:35:48 configs/usage PASSED C 0:09.733 - R 0:00.011
23:35:48 coroutine/fmtLines PASSED C 0:07.392 - R 0:00.007
23:35:48 coroutine/fibonacci PASSED C 0:07.710 - R 0:00.006
23:35:48 coroutine/devicedriver PASSED C 0:08.092 - R 0:00.033
23:35:48 concurrency/waituntil/channel_close PASSED C 0:16.794 - R 0:10.044
23:35:48 coroutine/pingpong PASSED C 0:07.314 - R 0:00.007
23:35:48 ...ency/unified_locking/futex_mutex PASSED C 0:13.143 - R 0:36.559
23:35:48 ctrl-flow/labelledExit PASSED C 0:01.162 - R 0:00.006
23:35:48 coroutine/raii PASSED C 0:07.484 - R 0:00.039
23:35:48 ctrl-flow/loop-inc PASSED C 0:01.064 - R 0:00.005
23:35:48 concurrency/waituntil/futures PASSED C 0:29.741 - R 0:00.010
23:35:48 counter PASSED C 0:05.997 - R 0:00.017
23:35:48 ctrl-flow/break-misc PASSED C 0:06.367 - R 0:00.014
23:35:48 ctrl-flow/fallthrough PASSED C 0:06.278 - R 0:00.019
23:35:48 coroutine/runningTotal PASSED C 0:07.586 - R 0:00.014
23:35:48 coroutine/prodcons PASSED C 0:10.153 - R 0:00.019
23:35:48 ctrl-flow/goto PASSED C 0:06.011 - R 0:00.006
23:35:48 enum PASSED C 0:01.368 - R 0:00.035
23:35:48 concurrency/waituntil/all_types PASSED C 0:35.012 - R 0:00.921
23:35:48 designations PASSED C 0:03.140 - R 0:00.011
23:35:48 ctrl-flow/ifwhileCtl PASSED C 0:06.786 - R 0:00.005
23:35:48 enum_tests/inc-dec PASSED C 0:01.316 - R 0:00.020
23:35:48 enum_tests/lvalue PASSED C 0:00.700 - R n/a
23:35:48 enum_tests/funcEnum PASSED C 0:02.256 - R 0:00.014
23:35:48 concurrency/waituntil/locks PASSED C 0:15.500 - R 0:19.061
23:35:48 ctrl-flow/loop_else PASSED C 0:07.212 - R 0:00.011
23:35:48 ctrl-flow/loop_else-WRN1 PASSED C 0:07.215 - R 0:00.001
23:35:48 enum_tests/structEnum PASSED C 0:02.535 - R 0:00.017
23:35:48 enum_tests/anonymous PASSED C 0:06.776 - R 0:00.019
23:35:48 errors/declaration PASSED C 0:00.105 - R n/a
23:35:48 enum_tests/enumInlineValue PASSED C 0:06.860 - R 0:00.006
23:35:48 errors/scope-type PASSED C 0:00.145 - R n/a
23:35:48 errors/signature PASSED C 0:00.102 - R n/a
23:35:48 errors/scope PASSED C 0:00.670 - R n/a
23:35:48 eval PASSED C 0:01.089 - R 0:00.005
23:35:48 div PASSED C 0:08.722 - R 0:00.020
23:35:48 ctrl-flow/loopctrl PASSED C 0:09.898 - R 0:00.007
23:35:48 enum_tests/input PASSED C 0:06.895 - R 0:00.010
23:35:48 enum_tests/stringEnum PASSED C 0:06.559 - R 0:00.017
23:35:48 device/cpu PASSED C 0:11.618 - R 0:00.009
23:35:48 enum_tests/typedIntEnum PASSED C 0:06.134 - R 0:00.006
23:35:48 enum_tests/position PASSED C 0:08.588 - R 0:00.019
23:35:48 enum_tests/planet PASSED C 0:08.747 - R 0:00.009
23:35:48 enum_tests/voidEnum PASSED C 0:06.280 - R 0:00.005
23:35:48 exceptions/conditional PASSED C 0:06.277 - R 0:00.019
23:35:48 exceptions/cancel/coroutine PASSED C 0:07.575 - R 0:00.020
23:35:48 exceptions/data-except PASSED C 0:06.755 - R 0:00.020
23:35:48 exceptions/conditional-threads PASSED C 0:07.702 - R 0:00.009
23:35:48 exceptions/message PASSED C 0:02.782 - R 0:00.005
23:35:48 exceptions/defaults PASSED C 0:06.960 - R 0:00.006
23:35:48 .../unified_locking/spin_queue_lock PASSED C 0:13.277 - R 0:50.407
23:35:48 ...urrency/unified_locking/mcs_spin PASSED C 0:14.243 - R 0:51.690
23:35:48 exceptions/finally PASSED C 0:06.414 - R 0:00.005
23:35:48 concurrency/waituntil/repeat_close PASSED C 0:14.011 - R 0:30.077
23:35:48 exceptions/cancel/thread PASSED C 0:11.170 - R 0:00.009
23:35:48 exceptions/try-ctrl-flow PASSED C 0:00.338 - R n/a
23:35:48 exceptions/defaults-threads PASSED C 0:07.992 - R 0:00.009
23:35:48 exceptions/interact PASSED C 0:06.619 - R 0:00.005
23:35:48 exceptions/type-check PASSED C 0:00.473 - R n/a
23:35:48 exceptions/finally-threads PASSED C 0:07.819 - R 0:00.009
23:35:48 exceptions/try-leave-catch PASSED C 0:01.223 - R 0:00.005
23:35:48 exceptions/cor_resumer PASSED C 0:11.139 - R 0:00.009
23:35:48 expression PASSED C 0:01.124 - R 0:00.005
23:35:48 exceptions/fibonacci_nonlocal PASSED C 0:09.781 - R 0:00.009
23:35:48 exceptions/polymorphic PASSED C 0:06.774 - R 0:00.007
23:35:48 exceptions/resume PASSED C 0:06.676 - R 0:00.005
23:35:48 global-monomorph PASSED C 0:01.094 - R 0:00.005
23:35:48 exceptions/terminate PASSED C 0:06.701 - R 0:00.005
23:35:48 exceptions/trash PASSED C 0:06.261 - R 0:00.005
23:35:48 exceptions/resume-threads PASSED C 0:07.852 - R 0:00.009
23:35:48 exceptions/virtual-poly PASSED C 0:06.311 - R 0:00.005
23:35:48 exceptions/terminate-threads PASSED C 0:07.932 - R 0:00.009
23:35:48 identFuncDeclarator PASSED C 0:01.115 - R 0:00.005
23:35:48 fstream_test PASSED C 0:06.203 - R 0:00.005
23:35:48 exceptions/pingpong_nonlocal PASSED C 0:11.497 - R 0:00.007
23:35:48 generator/fibonacci PASSED C 0:06.098 - R 0:00.009
23:35:48 identParamDeclarator PASSED C 0:01.109 - R 0:00.005
23:35:48 generator/fmtLines PASSED C 0:06.144 - R 0:00.009
23:35:48 forall PASSED C 0:07.392 - R 0:00.007
23:35:48 exceptions/virtual-cast PASSED C 0:08.216 - R 0:00.005
23:35:48 init1-ERROR PASSED C 0:00.615 - R n/a
23:35:48 init1 PASSED C 0:01.120 - R 0:00.005
23:35:48 generator/suspend_then PASSED C 0:06.112 - R 0:00.005
23:35:48 include/vector-sequence PASSED C 0:01.708 - R 0:00.005
23:35:48 include/vector-collections PASSED C 0:02.892 - R 0:00.005
23:35:48 genericUnion PASSED C 0:06.369 - R 0:00.006
23:35:48 function-operator PASSED C 0:09.568 - R 0:00.005
23:35:48 hello PASSED C 0:06.169 - R 0:00.006
23:35:48 identity PASSED C 0:06.331 - R 0:00.004
23:35:48 include/vector-fstream PASSED C 0:06.234 - R 0:00.005
23:35:48 include/stdincludes PASSED C 0:07.871 - R 0:00.018
23:35:48 io/eofType PASSED C 0:06.342 - R 0:00.013
23:35:48 limits PASSED C 0:01.457 - R 0:00.006
23:35:48 io/io PASSED C 0:10.587 - R 0:00.007
23:35:48 heap PASSED C 0:08.782 - R 0:06.539
23:35:48 linking/exception-nothreads PASSED C 0:04.578 - R 0:00.005
23:35:48 io/io-acquire PASSED C 0:12.326 - R 0:00.034
23:35:48 io/io-acquire-in PASSED C 0:11.735 - R 0:00.169
23:35:48 io/away_fair PASSED C 0:14.360 - R 0:00.012
23:35:48 io/io-acquire-out PASSED C 0:11.768 - R 0:00.018
23:35:48 linking/nostdlib PASSED C 0:01.123 - R 0:00.006
23:35:48 io/manipulatorsInput-uchunk PASSED C 0:10.134 - R 0:00.021
23:35:48 linkonce PASSED C 0:01.248 - R 0:00.005
23:35:48 io/comp_basic PASSED C 0:15.785 - R 0:00.068
23:35:48 io/comp_fair PASSED C 0:15.860 - R 0:00.117
23:35:48 io/io-acquire2 PASSED C 0:12.907 - R 0:00.117
23:35:48 maybe PASSED C 0:01.569 - R 0:00.006
23:35:48 linking/exception-withthreads PASSED C 0:06.378 - R 0:00.007
23:35:48 io/manipulatorsOutput4 PASSED C 0:12.573 - R 0:00.019
23:35:48 io/io-acquire-no-io PASSED C 0:11.542 - R 0:05.238
23:35:48 linking/mangling/anon PASSED C 0:06.439 - R 0:00.005
23:35:48 nested-types-ERR1 PASSED C 0:00.108 - R n/a
23:35:48 nested-types-ERR2 PASSED C 0:00.186 - R n/a
23:35:48 nested-types PASSED C 0:01.118 - R 0:00.005
23:35:48 nowarn/array PASSED C 0:01.245 - R 0:00.006
23:35:48 linking/io-acquire PASSED C 0:08.701 - R 0:00.006
23:35:48 list/dlist-insert-remove PASSED C 0:06.310 - R 0:00.005
23:35:48 nowarn/exception PASSED C 0:01.288 - R 0:00.005
23:35:48 nowarn/no-autogen PASSED C 0:01.079 - R 0:00.005
23:35:48 linking/nothreads PASSED C 0:08.043 - R 0:00.009
23:35:48 io/many_read PASSED C 0:15.296 - R 0:00.012
23:35:48 opt-params PASSED C 0:00.077 - R n/a
23:35:48 linking/weakso_nothd PASSED C 0:08.183 - R 0:00.010
23:35:48 nowarn/printf-sizeof PASSED C 0:01.314 - R 0:00.014
23:35:48 literals PASSED C 0:06.489 - R 0:00.005
23:35:48 nowarn/unused PASSED C 0:01.129 - R 0:00.005
23:35:48 nowarn/zero-thunk PASSED C 0:01.095 - R 0:00.006
23:35:48 list/dlist2-insert-remove PASSED C 0:06.807 - R 0:00.005
23:35:48 numericConstants PASSED C 0:01.089 - R 0:00.005
23:35:48 operators PASSED C 0:01.090 - R 0:00.005
23:35:48 include/includes PASSED C 0:24.383 - R 0:00.007
23:35:48 meta/fork+exec PASSED C 0:05.407 - R 0:00.018
23:35:48 poly-bare-assn PASSED C 0:01.128 - R 0:00.006
23:35:48 polybits PASSED C 0:00.223 - R n/a
23:35:48 poly-d-cycle PASSED C 0:01.224 - R 0:00.005
23:35:48 poly-many-arsz PASSED C 0:01.162 - R 0:00.005
23:35:48 poly-member PASSED C 0:01.136 - R 0:00.005
23:35:48 poly-selection PASSED C 0:01.102 - R 0:00.006
23:35:48 poly-o-cycle PASSED C 0:01.164 - R 0:00.006
23:35:48 poly-self-cycle PASSED C 0:01.245 - R 0:00.006
23:35:48 raii/ctor-autogen-ERR1 PASSED C 0:00.681 - R n/a
23:35:48 quasiKeyword PASSED C 0:01.255 - R 0:00.006
23:35:48 raii/ctor-autogen PASSED C 0:01.645 - R 0:00.006
23:35:48 raii/init_once PASSED C 0:01.398 - R 0:00.009
23:35:48 linking/withthreads PASSED C 0:10.947 - R 0:00.006
23:35:48 raii/partial-ERR1 PASSED C 0:00.674 - R n/a
23:35:48 malloc PASSED C 0:09.893 - R 0:00.005
23:35:48 raii/partial PASSED C 0:01.157 - R 0:00.005
23:35:48 raii/typeof-member PASSED C 0:01.033 - R 0:00.005
23:35:48 meta/dumpable PASSED C 0:08.688 - R 0:00.005
23:35:48 result PASSED C 0:01.764 - R 0:00.005
23:35:48 raii/dtor-early-exit-ERR1 PASSED C 0:04.797 - R n/a
23:35:48 raii/memberCtors-ERR1 PASSED C 0:03.977 - R n/a
23:35:48 raii/dtor-early-exit-ERR2 PASSED C 0:04.782 - R n/a
23:35:48 quotedKeyword PASSED C 0:06.123 - R 0:00.005
23:35:48 simpleGenericTriple PASSED C 0:01.489 - R 0:00.006
23:35:48 raii/boxed-types PASSED C 0:06.210 - R 0:00.007
23:35:48 polymorphism PASSED C 0:06.507 - R 0:00.006
23:35:48 smart-pointers PASSED C 0:01.502 - R 0:00.005
23:35:48 raii/globals PASSED C 0:06.266 - R 0:00.007
23:35:48 minmax PASSED C 0:12.101 - R 0:00.005
23:35:48 switch PASSED C 0:01.138 - R 0:00.005
23:35:48 raii/memberCtors PASSED C 0:06.542 - R 0:00.009
23:35:48 tuple/tupleCast PASSED C 0:01.105 - R 0:00.005
23:35:48 tuple/tupleFunction PASSED C 0:01.210 - R 0:00.005
23:35:48 tuple/tupleMember PASSED C 0:01.140 - R 0:00.006
23:35:48 raii/dtor-early-exit PASSED C 0:08.586 - R 0:00.006
23:35:48 typedefRedef-ERR1 PASSED C 0:00.109 - R n/a
23:35:48 tuple/tuplePolymorphism PASSED C 0:01.522 - R 0:00.005
23:35:48 references PASSED C 0:06.578 - R 0:00.005
23:35:48 shortCircuit PASSED C 0:06.158 - R 0:00.005
23:35:48 var-assert PASSED C 0:00.132 - R n/a
23:35:48 typedefRedef PASSED C 0:01.070 - R 0:00.009
23:35:48 typeof PASSED C 0:01.048 - R 0:00.005
23:35:48 variableDeclarator PASSED C 0:01.078 - R 0:00.005
23:35:48 sizeof PASSED C 0:06.106 - R 0:00.005
23:35:48 strstream PASSED C 0:06.659 - R 0:00.005
23:35:48 searchsort PASSED C 0:09.051 - R 0:00.009
23:35:48 tuple/tupleVariadic PASSED C 0:04.740 - R 0:00.005
23:35:48 tuple/tupleAssign PASSED C 0:06.832 - R 0:00.006
23:35:48 tuplearray PASSED C 0:06.186 - R 0:00.005
23:35:48 time PASSED C 0:08.393 - R 0:00.006
23:35:48 sum PASSED C 0:08.878 - R 0:00.005
23:35:48 voidPtr PASSED C 0:01.037 - R 0:00.004
23:35:48 withconflict PASSED C 0:00.588 - R n/a
23:35:48 swap PASSED C 0:09.549 - R 0:00.005
23:35:48 warnings/self-assignment PASSED C 0:01.017 - R 0:00.001
23:35:48 userLiterals PASSED C 0:07.235 - R 0:00.011
23:35:48 KRfunctions PASSED C 0:00.952 - R 0:00.001
23:35:48 vector PASSED C 0:07.562 - R 0:00.005
23:35:48 ...collections/dimexpr-match-c-ERRS PASSED C 0:01.017 - R n/a
23:35:48 vector_math/vec2_double PASSED C 0:09.160 - R 0:00.005
23:35:48 zero_one-ERR1 PASSED C 0:03.453 - R n/a
23:35:48 ...llections/dimexpr-match-cfa-ERRS PASSED C 0:01.334 - R n/a
23:35:48 arithmeticConversions PASSED C 0:02.849 - R 0:00.005
23:35:48 attributes PASSED C 0:01.192 - R 0:00.012
23:35:48 vector_math/vec2_uint PASSED C 0:09.113 - R 0:00.007
23:35:48 zero_one PASSED C 0:06.255 - R 0:00.005
23:35:48 abs PASSED C 0:08.549 - R 0:00.005
23:35:48 declarationSpecifier PASSED C 0:01.075 - R 0:00.001
23:35:48 errors/completeType PASSED C 0:00.624 - R n/a
23:35:48 vector_math/vec2_float PASSED C 0:17.382 - R 0:00.009
23:35:48 vector_math/vec3_int PASSED C 0:15.478 - R 0:00.011
23:35:48 ato PASSED C 0:09.535 - R 0:00.008
23:35:48 vector_math/vec2_int PASSED C 0:18.164 - R 0:00.009
23:35:48 extension PASSED C 0:01.090 - R 0:00.001
23:35:48 functions PASSED C 0:01.037 - R 0:00.002
23:35:48 vector_math/vec4_int PASSED C 0:16.759 - R 0:00.020
23:35:48 gccExtensions PASSED C 0:01.028 - R 0:00.005
23:35:48 vector_math/vec4_float PASSED C 0:18.459 - R 0:00.009
23:35:48 vector_math/vec3_float PASSED C 0:19.224 - R 0:00.025
23:35:48 concurrency/pthread/bounded_buffer PASSED C 0:11.454 - R 0:00.033
23:35:48 configs/parsenums PASSED C 0:10.100 - R 0:00.068
23:35:48 meta/arch PASSED C 0:00.579 - R n/a
23:35:48 PRNG PASSED C 0:16.491 - R 0:00.421
23:35:48 bitmanip1 PASSED C 0:13.998 - R 0:00.011
23:35:48 bitmanip2 PASSED C 0:14.157 - R 0:00.017
23:35:48 bitmanip3 PASSED C 0:13.505 - R 0:00.017
23:35:48 rational PASSED C 0:31.900 - R 0:00.009
23:35:48 exceptions/cardgame PASSED C 0:10.308 - R 0:00.009
23:35:48 exceptions/hotpotato_checked PASSED C 0:10.618 - R 0:00.009
23:35:48 exceptions/hotpotato PASSED C 0:10.596 - R 0:00.009
23:35:48 io/manipulatorsInput PASSED C 0:09.395 - R 0:00.009
23:35:48 random PASSED C 0:09.136 - R 0:00.005
23:35:48 vector_math/vec2_ldouble PASSED C 0:08.942 - R 0:00.005
23:35:48 nested_function PASSED C 0:10.755 - R 0:00.019
23:35:48 io/manipulatorsOutput2 PASSED C 0:12.368 - R 0:00.005
23:35:48 math PASSED C 0:12.444 - R 0:00.010
23:35:48 mathX PASSED C 0:13.010 - R 0:00.018
23:35:48 io/manipulatorsOutput1 PASSED C 0:19.211 - R 0:00.011
23:35:48 concurrency/barrier/last TIMEOUT C 0:13.529 - R10:00.250
23:35:48Cforall Runtime error (UNIX pid:1401393): Application interrupted by signal: Aborted.
23:35:48Stack back trace for: /var/lib/jenkins/workspace/Cforall_master_2@tmp/libcfa/x86-nodebug/src/.libs/libcfa.so.1
23:35:48(0) linux-gate.so.1 : __kernel_vsyscall + 0x9 [0xf7fc7579]
23:35:48(1) /lib32/libc.so.6 : + 0x874be [0xf7b9b4be]
23:35:48(2) /lib32/libc.so.6 : pthread_mutex_lock + 0x179 [0xf7ba2419]
23:35:48(3) /lib/ld-linux.so.2 : _dl_allocate_tls_init + 0x46 [0xf7fda0a6]
23:35:48(4) /lib/ld-linux.so.2 : _dl_allocate_tls + 0x1b [0xf7fda34b]
23:35:48(5) /lib32/libc.so.6 : pthread_create + 0x6fb [0xf7b9f78b]
23:35:48(6) /var/lib/jenkins/workspace/Cforall_master_2@tmp/libcfa/x86-nodebug/src/.libs/libcfathread.so.1 : + 0x27a0c [0xf7f99a0c]
23:35:48(7) /var/lib/jenkins/workspace/Cforall_master_2@tmp/libcfa/x86-nodebug/src/.libs/libcfathread.so.1 : _X12_constructorFv_S9processorPKcS7clusterPS7thread$__1 + 0x10d [0xf7f99b5d]
23:35:48(8) /var/lib/jenkins/workspace/Cforall_master_2@tmp/libcfa/x86-nodebug/src/.libs/libcfathread.so.1 : _X12_constructorFv_S9processorPKcS7cluster__1 + 0x22 [0xf7f99b92]
23:35:48(9) /var/lib/jenkins/workspace/Cforall_master_2@tmp/tests/concurrency/barrier/last : _X4mainFi___1 + 0x99 [0x56557a39]
23:35:4823:35:48warning: Can't open file anon_inode:[io_uring] which was expanded to anon_inode:[io_uring] during file-backed mapping note processing
23:35:48[New LWP 1401393]
23:35:48[New LWP 1401394]
23:35:48[New LWP 1401396]
23:35:48[New LWP 1401395]
23:35:48[New LWP 1401398]
23:35:48[New LWP 1401399]
23:35:48[New LWP 1401397]
23:35:48[Thread debugging using libthread_db enabled]
23:35:48Using host libthread_db library "/lib/x86_64-linux-gnu/libthread_db.so.1".
23:35:48Core was generated by `/var/lib/jenkins/workspace/Cforall_master_2@tmp/tests/concurrency/barrier/last'.
23:35:48Program terminated with signal SIGABRT, Aborted.
23:35:48#0 0xf7fc7579 in __kernel_vsyscall ()
23:35:48[Current thread is 1 (Thread 0xf7b12a00 (LWP 1401393))]
23:35:48-----
23:35:48#0 0xf7fc7579 in __kernel_vsyscall ()
23:35:48#1 0xf7ba0e57 in ?? () from /lib32/libc.so.6
23:35:48#2 0xf7b4fc41 in raise () from /lib32/libc.so.6
23:35:48#3 0xf7b372b7 in abort () from /lib32/libc.so.6
23:35:48#4 0xf7f0bf10 in _X7__abortFv_bPKcY17__builtin_va_list__1 (_X11signalAbortb_1=<optimized out>, _X3fmtPKc_1=<optimized out>, _X4argsY17__builtin_va_list_1=<optimized out>) at /var/lib/jenkins/workspace/Cforall_master_2/libcfa/src/interpose.cfa:286
23:35:48#5 0xf7f0c2a6 in _X5abortFv_bPKc__1 (_X11signalAbortb_1=true, _X3fmtPKc_1=0xf7f279d4 "Application interrupted by signal: %s.\n") at /var/lib/jenkins/workspace/Cforall_master_2/libcfa/src/interpose.cfa:301
23:35:48#6 0xf7f0c2da in _X15sigHandler_termFv_iPS21__anonymous_siginfo_tPS10ucontext_t__1 (_X3sigi_1=6, _X3sfpPS21__anonymous_siginfo_t_1=0xf7f70c0c <stack+64316>, _X3cxtPS10ucontext_t_1=0xf7f70c8c <stack+64444>) at /var/lib/jenkins/workspace/Cforall_master_2/libcfa/src/interpose.cfa:337
23:35:48#7 <signal handler called>
23:35:48#8 0xf7fc7579 in __kernel_vsyscall ()
23:35:48#9 0xf7b9b4be in ?? () from /lib32/libc.so.6
23:35:48#10 0xf7ba2419 in pthread_mutex_lock () from /lib32/libc.so.6
23:35:48#11 0xf7fda0a6 in _dl_allocate_tls_init () from /lib/ld-linux.so.2
23:35:48#12 0xf7fda34b in _dl_allocate_tls () from /lib/ld-linux.so.2
23:35:48#13 0xf7b9f78b in pthread_create () from /lib32/libc.so.6
23:35:48#14 0xf7f99a0c in _X16__create_pthreadFPv_PmFPv_Pv_Pv__1 (_X7pthreadPm_1=0xffffd210, _X5startFPv_Pv__1=0xf7f98f30 <_X18__invoke_processorFPv_Pv__1>, _X3argPv_1=0xffffd1c0) at /var/lib/jenkins/workspace/Cforall_master_2/libcfa/src/concurrency/kernel/startup.cfa:810
23:35:48#15 0xf7f99b5d in _X12_constructorFv_S9processorPKcS7clusterPS7thread$__1 (_X4thisS9processor_1=0xffffd1c0, _X4namePKc_1=0x5655909e "Anonymous Processor", _X5_cltrS7cluster_1=0xf7fbc900 <_X19storage_mainClusterA0c_1>, _X5initTPS7thread$_1=0x0) at /var/lib/jenkins/workspace/Cforall_master_2/libcfa/src/concurrency/kernel/startup.cfa:589
23:35:48#16 0xf7f99b92 in _X12_constructorFv_S9processorPKcS7cluster__1 (_X4thisS9processor_1=0xffffd1c0, _X4namePKc_1=0x5655909e "Anonymous Processor", _X5_cltrS7cluster_1=0xf7fbc900 <_X19storage_mainClusterA0c_1>) at /var/lib/jenkins/workspace/Cforall_master_2/libcfa/src/concurrency/kernel/startup.cfa:593
23:35:48#17 0x56557a39 in _X12_constructorFv_S9processor__1 (_X4thisS9processor_1=0xffffd1c0) at /var/lib/jenkins/workspace/Cforall_master_2/libcfa/src/concurrency/kernel.hfa:164
23:35:48#18 _X4mainFi___1 () at concurrency/barrier/last.cfa:72
23:35:48#19 0x565573b2 in invoke_main (envp=0xffffd3ec, argv=0xffffd3e4, argc=1) at concurrency/barrier/last.cfa:32
23:35:48#20 main (_X4argci_1=1, _X4argvPPc_1=0xffffd3e4, _X4envpPPc_1=0xffffd3ec) at concurrency/barrier/last.cfa:53
23:35:48-----
23:35:48 Id Target Id Frame
23:35:48* 1 Thread 0xf7b12a00 (LWP 1401393) 0xf7fc7579 in __kernel_vsyscall ()
23:35:48 2 Thread 0x565a7ec0 (LWP 1401394) 0xf7fc7579 in __kernel_vsyscall ()
23:35:48 3 Thread 0x5669a340 (LWP 1401396) 0xf7fc7579 in __kernel_vsyscall ()
23:35:48 4 Thread 0x56627f80 (LWP 1401395) 0xf7fc7579 in __kernel_vsyscall ()
23:35:48 5 Thread 0x5671a4c0 (LWP 1401398) 0xf7fc7579 in __kernel_vsyscall ()
23:35:48 6 Thread 0x5679a340 (LWP 1401399) 0xf7fc7579 in __kernel_vsyscall ()
23:35:48 7 Thread 0x566da400 (LWP 1401397) 0xf7fc7579 in __kernel_vsyscall ()
23:35:4823:35:48Archiving concurrency/barrier/last (executable and core) to crashes/full-nodebug/concurrency/barrier/last
23:35:48374 passes, 0 failures, 1 timeouts, 0 cancelled, 0 other
23:35:48Tests took 10:39.095
23:35:48make: *** [Makefile:986: all-local] Error 1
23:35:48[Pipeline] }
23:35:48[Pipeline] // dir
23:35:48[Pipeline] }
23:35:48[Pipeline] // stage
23:35:48[Pipeline] echo
23:35:48Archiving core dumps
23:35:48[Pipeline] dir
23:35:48Running in /var/lib/jenkins/workspace/Cforall_master_2@tmp
23:35:48[Pipeline] {
23:35:48[Pipeline] fileExists
23:35:48[Pipeline] sh
23:35:48+ /var/lib/jenkins/workspace/Cforall_master_2/tools/jenkins/archive-gen.sh
23:35:48[Pipeline] archiveArtifacts
23:35:48Archiving artifacts
23:35:48Recording fingerprints
23:35:48[Pipeline] }
23:35:48[Pipeline] // dir
23:35:48[Pipeline] }
23:35:48[Pipeline] // wrap
23:35:48[Pipeline] }
23:35:48[Pipeline] // node
23:35:48[Pipeline] echo
23:35:48hudson.AbortException: script returned exit code 2
23:35:48[Pipeline] node
23:35:48Running on Algol in /var/lib/jenkins/workspace/Cforall_master
23:35:48[Pipeline] {
23:35:48[Pipeline] echo
23:35:48Notifying users of result
23:35:48[Pipeline] echo
23:35:48Reusing previously constructed message
23:35:48[Pipeline] echo
23:35:48Would send email to: cforall@lists.uwaterloo.ca
23:35:48[Pipeline] echo
23:35:48With title: [cforall git][BUILD# 3760 - FAILURE] - branch master
23:35:48[Pipeline] echo
23:35:48Content:
23:35:48<p>This is an automated email from the Jenkins build machine. It was
23:35:48generated because of a git hooks/post-receive script following
23:35:48a ref change which was pushed to the C∀ repository.</p>
23:35:4823:35:48<p>- Status --------------------------------------------------------------</p>
23:35:4823:35:48<p>BUILD# 3760 - FAILURE</p>
23:35:48<p>Check console output at https://cforall.uwaterloo.ca/jenkins/job/Cforall/job/master/3760/ to view the results.</p>
23:35:4823:35:48<p>- Changes -------------------------------------------------------------</p>
23:35:4823:35:48<pre>
23:35:48The branch master has been updated.
23:35:48 from e98b4ec769cbe797fd14db5f82f2fef821a3e1f0 (commit)
23:35:48</pre>
23:35:4823:35:48<p>- Log -----------------------------------------------------------------</p>
23:35:4823:35:48<pre>
23:35:4823:35:48</pre>
23:35:4823:35:48<p>-----------------------------------------------------------------------</p>
23:35:48<pre>
23:35:48Summary of changes:
23:35:4823:35:48</pre>
23:35:4823:35:48[Pipeline] }
23:35:48[Pipeline] // node
23:35:48[Pipeline] echo
23:35:48Build Completed
23:35:48[Pipeline] End of Pipeline
23:35:48ERROR: script returned exit code 2
23:35:48Finished: FAILURE
[Pipeline] error
[Pipeline] }
23:35:48Failed in branch gcc_11_x86_new
[Pipeline] // parallel
[Pipeline] }
[Pipeline] // stage
[Pipeline] }
[Pipeline] // wrap
[Pipeline] echo
error caught
[Pipeline] node
Running on Brokk 4 in /var/lib/jenkins/workspace/Cforall_Full_Build
[Pipeline] {
[Pipeline] echo
notifying users
[Pipeline] emailext
Sending email to: cforall@lists.uwaterloo.ca
[Pipeline] }
[Pipeline] // node
[Pipeline] }
[Pipeline] // node
[Pipeline] End of Pipeline
ERROR: FAILURE
Finished: FAILURE