guPpfVsy5AAAAzR+LCAAAAAAAAP9b85aBtbiIQSOjNKU4P0+vIKc0PTOvWK8kMze1uCQxtyC1SC8ExvbLL0llgABGJgYmLwaB3MycnMzi4My85FTXgvzkDB8G3tScxILi1BRfsEwJg4BPVmJZon5OYl66vk9+Xrp1RRGDFNSy5Py84vycVD1nCI1qPENFAZBe8OBEkjPQfXwgU/RApuiBTel+MuFMv/J9JgZGLwbWssSc0lSguQIIRX6luUmpRW1rpspyT3nQDTUNCNhUPwIAsNq0BfIAAAA=[0m exceptions/try-leave-catch PASSED C 0:01.700 - R 0:00.038
22:53:43 ctrl-flow/ifwhileCtl PASSED C 0:07.126 - R 0:00.070
22:53:43 coroutine/devicedriver PASSED C 0:08.766 - R 0:00.070
22:53:43 ...nified_locking/simple_owner_lock PASSED C 0:15.143 - R 0:00.376
22:53:43 configs/parsebools PASSED C 0:09.880 - R 0:00.527
22:53:43 exceptions/message PASSED C 0:02.870 - R 0:00.126
22:53:43 coroutine/runningTotal PASSED C 0:08.424 - R 0:00.068
22:53:43 concurrency/waitfor/when PASSED C 0:12.649 - R 0:00.376
22:53:43 concurrency/waitfor/statment PASSED C 0:13.176 - R 0:00.122
22:53:43 coroutine/raii PASSED C 0:09.025 - R 0:00.038
22:53:43 expression PASSED C 0:01.502 - R 0:00.039
22:53:43 coroutine/fmtLines PASSED C 0:09.485 - R 0:00.071
22:53:43 ...rrency/pthread/pthread_demo_lock PASSED C 0:11.895 - R 0:08.523
22:53:43 global-monomorph PASSED C 0:01.567 - R 0:00.039
22:53:43 enum_tests/anonymous PASSED C 0:06.957 - R 0:00.074
22:53:43 configs/usage PASSED C 0:11.121 - R 0:00.038
22:53:43 configs/parseconfig PASSED C 0:11.490 - R 0:00.040
22:53:43 init1-ERROR PASSED C 0:00.803 - R n/a
22:53:43 identFuncDeclarator PASSED C 0:01.497 - R 0:00.038
22:53:43 concurrency/waituntil/timeout PASSED C 0:08.107 - R 0:03.740
22:53:43 coroutine/pingpong PASSED C 0:10.204 - R 0:00.069
22:53:43 identParamDeclarator PASSED C 0:01.544 - R 0:00.042
22:53:43 ctrl-flow/loop_else-WRN1 PASSED C 0:08.455 - R 0:00.002
22:53:43 enum_tests/enumInlineValue PASSED C 0:07.559 - R 0:00.040
22:53:43 coroutine/prodcons PASSED C 0:10.418 - R 0:00.073
22:53:43 enum_tests/input PASSED C 0:07.073 - R 0:00.179
22:53:43 concurrency/waitfor/dtor PASSED C 0:12.053 - R 0:04.291
22:53:43 coroutine/fibonacci PASSED C 0:10.663 - R 0:00.074
22:53:43 concurrency/waitfor/recurse PASSED C 0:13.140 - R 0:02.793
22:53:43 ctrl-flow/loopctrl PASSED C 0:08.724 - R 0:00.041
22:53:43 init1 PASSED C 0:01.683 - R 0:00.081
22:53:43 include/vector-sequence PASSED C 0:02.183 - R 0:00.041
22:53:43 concurrency/signal/block PASSED C 0:12.825 - R 0:08.956
22:53:43 enum_tests/voidEnum PASSED C 0:06.876 - R 0:00.022
22:53:43 enum_tests/stringEnum PASSED C 0:07.370 - R 0:00.041
22:53:43 exceptions/conditional PASSED C 0:06.780 - R 0:00.079
22:53:43 limits PASSED C 0:01.565 - R 0:00.126
22:53:43 exceptions/data-except PASSED C 0:06.898 - R 0:00.023
22:53:43 enum_tests/typedIntEnum PASSED C 0:07.751 - R 0:00.074
22:53:43 include/vector-collections PASSED C 0:03.372 - R 0:00.043
22:53:43 linking/nostdlib PASSED C 0:01.529 - R 0:00.038
22:53:43 exceptions/finally PASSED C 0:06.915 - R 0:00.039
22:53:43 div PASSED C 0:10.095 - R 0:00.025
22:53:43 exceptions/defaults PASSED C 0:07.424 - R 0:00.022
22:53:43 exceptions/interact PASSED C 0:07.217 - R 0:00.040
22:53:43 nested-types-ERR1 PASSED C 0:00.186 - R n/a
22:53:43 enum_tests/planet PASSED C 0:09.715 - R 0:00.037
22:53:43 nested-types-ERR2 PASSED C 0:00.318 - R n/a
22:53:43 exceptions/polymorphic PASSED C 0:07.441 - R 0:00.041
22:53:43 concurrency/channels/daisy_chain PASSED C 0:16.071 - R 0:10.066
22:53:43 exceptions/trash PASSED C 0:06.785 - R 0:00.025
22:53:43 linkonce PASSED C 0:01.777 - R 0:00.079
22:53:43 enum_tests/position PASSED C 0:09.803 - R 0:00.074
22:53:43 exceptions/cancel/coroutine PASSED C 0:08.299 - R 0:00.121
22:53:43 exceptions/conditional-threads PASSED C 0:08.375 - R 0:00.135
22:53:43 opt-params PASSED C 0:00.150 - R n/a
22:53:43 exceptions/resume PASSED C 0:07.519 - R 0:00.129
22:53:43 concurrency/channels/hot_potato PASSED C 0:16.411 - R 0:10.121
22:53:43 concurrency/preempt PASSED C 0:13.919 - R 0:11.633
22:53:43 concurrency/channels/contend PASSED C 0:16.565 - R 0:10.164
22:53:43 concurrency/channels/churn PASSED C 0:16.647 - R 0:10.116
22:53:43 concurrency/channels/zero_size PASSED C 0:16.522 - R 0:10.234
22:53:43 maybe PASSED C 0:01.756 - R 0:00.039
22:53:43 nested-types PASSED C 0:01.548 - R 0:00.038
22:53:43 concurrency/channels/pub_sub PASSED C 0:16.878 - R 0:10.120
22:53:43 exceptions/terminate PASSED C 0:07.991 - R 0:00.078
22:53:43 exceptions/finally-threads PASSED C 0:08.572 - R 0:00.178
22:53:43 polybits PASSED C 0:00.360 - R n/a
22:53:43 concurrency/channels/ping_pong PASSED C 0:17.159 - R 0:10.064
22:53:43 generator/fibonacci PASSED C 0:06.708 - R 0:00.072
22:53:43 fstream_test PASSED C 0:06.949 - R 0:00.079
22:53:43 nowarn/array PASSED C 0:01.686 - R 0:00.023
22:53:43 nowarn/zero-thunk PASSED C 0:01.411 - R 0:00.071
22:53:43 exceptions/resume-threads PASSED C 0:08.758 - R 0:00.072
22:53:43 nowarn/unused PASSED C 0:01.531 - R 0:00.070
22:53:43 generator/suspend_then PASSED C 0:07.242 - R 0:00.038
22:53:43 generator/fmtLines PASSED C 0:07.309 - R 0:00.038
22:53:43 nowarn/exception PASSED C 0:01.824 - R 0:00.037
22:53:43 operators PASSED C 0:01.602 - R 0:00.127
22:53:43 concurrency/futures/future_except PASSED C 0:27.733 - R 0:00.174
22:53:43 exceptions/virtual-poly PASSED C 0:07.733 - R 0:00.075
22:53:43 device/cpu PASSED C 0:12.761 - R 0:00.170
22:53:43 nowarn/no-autogen PASSED C 0:01.745 - R 0:00.128
22:53:43 numericConstants PASSED C 0:01.695 - R 0:00.072
22:53:43 exceptions/terminate-threads PASSED C 0:08.855 - R 0:00.037
22:53:43 poly-member PASSED C 0:01.425 - R 0:00.039
22:53:43 linking/exception-nothreads PASSED C 0:04.766 - R 0:00.080
22:53:43 poly-many-arsz PASSED C 0:01.645 - R 0:00.040
22:53:43 concurrency/waituntil/basic_else PASSED C 0:18.929 - R 0:00.072
22:53:43 raii/ctor-autogen-ERR1 PASSED C 0:01.004 - R n/a
22:53:43 nowarn/printf-sizeof PASSED C 0:02.021 - R 0:00.076
22:53:43 poly-bare-assn PASSED C 0:01.929 - R 0:00.024
22:53:43 poly-o-cycle PASSED C 0:01.606 - R 0:00.131
22:53:43 hello PASSED C 0:07.009 - R 0:00.128
22:53:43 exceptions/virtual-cast PASSED C 0:08.456 - R 0:00.037
22:53:43 include/stdincludes PASSED C 0:06.964 - R 0:00.079
22:53:43 identity PASSED C 0:07.151 - R 0:00.024
22:53:43 quasiKeyword PASSED C 0:01.639 - R 0:00.037
22:53:43 poly-d-cycle PASSED C 0:02.096 - R 0:00.124
22:53:43 poly-self-cycle PASSED C 0:01.774 - R 0:00.076
22:53:43 poly-selection PASSED C 0:01.877 - R 0:00.041
22:53:43 raii/partial-ERR1 PASSED C 0:00.842 - R n/a
22:53:43 typedefRedef-ERR1 PASSED C 0:00.230 - R n/a
22:53:43 include/vector-fstream PASSED C 0:07.281 - R 0:00.041
22:53:43 exceptions/fibonacci_nonlocal PASSED C 0:10.505 - R 0:00.178
22:53:43 exceptions/defaults-threads PASSED C 0:10.733 - R 0:00.037
22:53:43 genericUnion PASSED C 0:08.412 - R 0:00.024
22:53:43 var-assert PASSED C 0:00.276 - R n/a
22:53:43 io/eofType PASSED C 0:06.825 - R 0:00.038
22:53:43 raii/init_once PASSED C 0:01.668 - R 0:00.037
22:53:43 forall PASSED C 0:08.993 - R 0:00.083
22:53:43 raii/partial PASSED C 0:01.549 - R 0:00.096
22:53:43 smart-pointers PASSED C 0:01.821 - R 0:00.039
22:53:43 simpleGenericTriple PASSED C 0:01.919 - R 0:00.059
22:53:43 switch PASSED C 0:01.671 - R 0:00.136
22:53:43 tuple/tupleCast PASSED C 0:01.571 - R 0:00.067
22:53:43 result PASSED C 0:02.095 - R 0:00.038
22:53:43 tuple/tupleMember PASSED C 0:01.663 - R 0:00.038
22:53:43 raii/ctor-autogen PASSED C 0:02.955 - R 0:00.039
22:53:43 raii/typeof-member PASSED C 0:02.147 - R 0:00.068
22:53:43 tuple/tupleFunction PASSED C 0:01.742 - R 0:00.073
22:53:43 typedefRedef PASSED C 0:01.541 - R 0:00.042
22:53:43 function-operator PASSED C 0:09.801 - R 0:00.050
22:53:43 linking/mangling/anon PASSED C 0:06.786 - R 0:00.024
22:53:43 typeof PASSED C 0:01.667 - R 0:00.035
22:53:43 linking/exception-withthreads PASSED C 0:07.030 - R 0:00.178
22:53:43 exceptions/cancel/thread PASSED C 0:12.642 - R 0:00.075
22:53:43 variableDeclarator PASSED C 0:01.610 - R 0:00.038
22:53:43 tuple/tuplePolymorphism PASSED C 0:02.037 - R 0:00.073
22:53:43 withconflict PASSED C 0:00.899 - R n/a
22:53:43 meta/fork+exec PASSED C 0:05.517 - R 0:00.325
22:53:43 concurrency/channels/big_elems PASSED C 0:19.769 - R 0:11.380
22:53:43 ...collections/dimexpr-match-c-ERRS PASSED C 0:01.077 - R n/a
22:53:43 exceptions/cor_resumer PASSED C 0:13.510 - R 0:00.038
22:53:43 KRfunctions PASSED C 0:01.314 - R 0:00.006
22:53:43 voidPtr PASSED C 0:01.674 - R 0:00.072
22:53:43 warnings/self-assignment PASSED C 0:01.756 - R 0:00.003
22:53:43 errors/completeType PASSED C 0:00.868 - R n/a
22:53:43 raii/dtor-early-exit-ERR1 PASSED C 0:04.853 - R n/a
22:53:43 raii/memberCtors-ERR1 PASSED C 0:04.318 - R n/a
22:53:43 exceptions/pingpong_nonlocal PASSED C 0:13.517 - R 0:00.070
22:53:43 ...llections/dimexpr-match-cfa-ERRS PASSED C 0:01.739 - R n/a
22:53:43 attributes PASSED C 0:01.631 - R 0:00.006
22:53:43 literals PASSED C 0:07.321 - R 0:00.124
22:53:43 linking/nothreads PASSED C 0:08.840 - R 0:00.036
22:53:43 list/dlist-insert-remove PASSED C 0:07.979 - R 0:00.175
22:53:43 declarationSpecifier PASSED C 0:01.568 - R 0:00.005
22:53:43 list/dlist2-insert-remove PASSED C 0:07.885 - R 0:00.123
22:53:43 raii/dtor-early-exit-ERR2 PASSED C 0:05.311 - R n/a
22:53:43 linking/io-acquire PASSED C 0:09.786 - R 0:00.121
22:53:43 linking/weakso_nothd PASSED C 0:09.178 - R 0:00.039
22:53:43 io/io PASSED C 0:10.738 - R 0:00.042
22:53:43 extension PASSED C 0:01.499 - R 0:00.005
22:53:43 functions PASSED C 0:01.483 - R 0:00.002
22:53:43 arithmeticConversions PASSED C 0:02.958 - R 0:00.125
22:53:43 meta/arch PASSED C 0:00.854 - R n/a
22:53:43 io/manipulatorsOutput4 PASSED C 0:10.401 - R 0:00.120
22:53:43 gccExtensions PASSED C 0:01.456 - R 0:00.003
22:53:43 tuple/tupleVariadic PASSED C 0:04.868 - R 0:00.038
22:53:43 concurrency/waituntil/one_chan PASSED C 0:13.011 - R 0:10.119
22:53:43 zero_one-ERR1 PASSED C 0:03.570 - R n/a
22:53:43 io/manipulatorsInput-uchunk PASSED C 0:10.866 - R 0:00.068
22:53:43 meta/dumpable PASSED C 0:08.888 - R 0:00.039
22:53:43 quotedKeyword PASSED C 0:06.990 - R 0:00.038
22:53:43 raii/boxed-types PASSED C 0:07.216 - R 0:00.037
22:53:43 raii/globals PASSED C 0:06.956 - R 0:00.037
22:53:43 malloc PASSED C 0:09.587 - R 0:00.036
22:53:43 polymorphism PASSED C 0:07.820 - R 0:00.039
22:53:43 sizeof PASSED C 0:06.713 - R 0:00.037
22:53:43 raii/memberCtors PASSED C 0:07.411 - R 0:00.038
22:53:43 concurrency/preempt2 PASSED C 0:13.032 - R 0:21.283
22:53:43 strstream PASSED C 0:07.283 - R 0:00.037
22:53:43 tuplearray PASSED C 0:06.806 - R 0:00.039
22:53:43 shortCircuit PASSED C 0:07.508 - R 0:00.037
22:53:43 io/io-acquire-in PASSED C 0:12.606 - R 0:00.220
22:53:43 io/io-acquire-out PASSED C 0:12.782 - R 0:00.120
22:53:43 ...rrency/examples/boundedBufferEXT PASSED C 0:12.595 - R 0:23.282
22:53:43 userLiterals PASSED C 0:07.390 - R 0:00.037
22:53:43 io/io-acquire PASSED C 0:13.438 - R 0:00.173
22:53:43 linking/withthreads PASSED C 0:12.113 - R 0:00.037
22:53:43 concurrency/waituntil/channel_close PASSED C 0:17.015 - R 0:10.118
22:53:43 references PASSED C 0:08.369 - R 0:00.036
22:53:43 tuple/tupleAssign PASSED C 0:08.241 - R 0:00.019
22:53:43 raii/dtor-early-exit PASSED C 0:09.413 - R 0:00.019
22:53:43 zero_one PASSED C 0:06.798 - R 0:00.021
22:53:43 time PASSED C 0:08.767 - R 0:00.020
22:53:43 searchsort PASSED C 0:09.329 - R 0:00.039
22:53:43 vector PASSED C 0:08.726 - R 0:00.037
22:53:43 sum PASSED C 0:09.654 - R 0:00.036
22:53:43 minmax PASSED C 0:12.685 - R 0:00.037
22:53:43 concurrency/waituntil/futures PASSED C 0:28.371 - R 0:00.068
22:53:43 io/io-acquire2 PASSED C 0:15.223 - R 0:00.377
22:53:43 ...collections/array-md-sbscr-cases PASSED C 0:08.224 - R 0:00.036
22:53:43 vector_math/vec2_double PASSED C 0:09.697 - R 0:00.036
22:53:43 vector_math/vec2_uint PASSED C 0:09.659 - R 0:00.036
22:53:43 swap PASSED C 0:10.983 - R 0:00.036
22:53:43 io/comp_basic PASSED C 0:16.454 - R 0:00.671
22:53:43 abs PASSED C 0:09.077 - R 0:00.036
22:53:43 collections/atomic_mpsc PASSED C 0:12.821 - R 0:26.931
22:53:43 io/away_fair PASSED C 0:17.455 - R 0:00.268
22:53:43 ato PASSED C 0:09.533 - R 0:00.037
22:53:43 io/manipulatorsInput PASSED C 0:08.272 - R 0:00.036
22:53:43 gmp PASSED C 0:08.373 - R 0:00.068
22:53:43 random PASSED C 0:08.486 - R 0:00.036
22:53:43 bitmanip1 PASSED C 0:10.488 - R 0:00.068
22:53:43 bitmanip2 PASSED C 0:10.719 - R 0:00.118
22:53:43 io/many_read FAILED with code -6 C 0:18.230 - R 0:00.119
22:53:43File has size: 72 bytes
22:53:43This is the content of the file to read, it's pretty self explanatory!
22:53:4322:53:4322:53:43Processor (0xffffffffd480) tearing down ring with 4294967295 entries allocated but not submitted, out of 256
22:53:43Cforall Runtime error (UNIX pid:319009):
22:53:43Cforall Assertion error "t" from program "many_read" in "_X13active_threadFPS7thread$___1" at line 109 in file "/var/lib/jenkins/workspace/Cforall_master/libcfa/src/concurrency/kernel/fwd.hfa".
22:53:4322:53:43warning: Can't open file anon_inode:[io_uring] which was expanded to anon_inode:[io_uring] during file-backed mapping note processing
22:53:43[New LWP 319015]
22:53:43[New LWP 319009]
22:53:43[New LWP 319012]
22:53:43[Thread debugging using libthread_db enabled]
22:53:43Using host libthread_db library "/lib/aarch64-linux-gnu/libthread_db.so.1".
22:53:43Core was generated by `/var/lib/jenkins/workspace/Cforall_master@tmp/tests/io/many_read'.
22:53:43Program terminated with signal SIGABRT, Aborted.
22:53:43#0 __pthread_kill_implementation (threadid=187649985492928, signo=signo@entry=6, no_tid=no_tid@entry=0) at ./nptl/pthread_kill.c:44
22:53:4322:53:43warning: 44 ./nptl/pthread_kill.c: No such file or directory
22:53:43[Current thread is 1 (Thread 0xaaaaaaba37c0 (LWP 319015))]
22:53:43-----
22:53:43#0 __pthread_kill_implementation (threadid=187649985492928, signo=signo@entry=6, no_tid=no_tid@entry=0) at ./nptl/pthread_kill.c:44
22:53:43#1 0x0000fffff7b47540 in __pthread_kill_internal (signo=6, threadid=<optimized out>) at ./nptl/pthread_kill.c:78
22:53:43#2 0x0000fffff7afcb3c in __GI_raise (sig=sig@entry=6) at ../sysdeps/posix/raise.c:26
22:53:43#3 0x0000fffff7ae7e00 in __GI_abort () at ./stdlib/abort.c:79
22:53:43#4 0x0000fffff7e5dfb8 in _X7__abortFv_bPKcY17__builtin_va_list__1 (_X11signalAbortb_1=false, _X3fmtPKc_1=0xfffff7e7d420 "%s", _X4argsY17__builtin_va_list_1=...) at /var/lib/jenkins/workspace/Cforall_master/libcfa/src/interpose.cfa:263
22:53:43#5 0x0000fffff7e5e258 in _X5abortFv_bPKc__1 (_X11signalAbortb_1=false, _X3fmtPKc_1=0xfffff7e7d420 "%s") at /var/lib/jenkins/workspace/Cforall_master/libcfa/src/interpose.cfa:301
22:53:43#6 0x0000fffff7e5da70 in abort () at /var/lib/jenkins/workspace/Cforall_master/libcfa/src/interpose.cfa:176
22:53:43#7 0x0000fffff7e5bd98 in __assert_fail (assertion=0xfffff7f80228 "t", file=0xfffff7f801d8 "/var/lib/jenkins/workspace/Cforall_master/libcfa/src/concurrency/kernel/fwd.hfa", line=109, function=0xfffff7f80b18 <__PRETTY_FUNCTION__.89> "_X13active_threadFPS7thread$___1") at /var/lib/jenkins/workspace/Cforall_master/libcfa/src/assert.cfa:33
22:53:43#8 0x0000fffff7f6d908 in _X13active_threadFPS7thread$___1 () at /var/lib/jenkins/workspace/Cforall_master/libcfa/src/concurrency/kernel/fwd.hfa:109
22:53:43#9 0x0000fffff7f6f7ec in _X4lockFv_S17simple_owner_lock__1 (_X4thisS17simple_owner_lock_1=0xfffff7fb1800 <_X9once_lockS17simple_owner_lock_1>) at /var/lib/jenkins/workspace/Cforall_master/libcfa/src/concurrency/locks.hfa:534
22:53:43#10 0x0000fffff7f72938 in pthread_once (once_control=0xfffff7cb0284, init_routine=0xfffff7c946e0) at /var/lib/jenkins/workspace/Cforall_master/libcfa/src/concurrency/pthread.cfa:504
22:53:43#11 0x0000fffff7c97210 in ?? () from /lib/aarch64-linux-gnu/libgcc_s.so.1
22:53:43#12 0x0000fffff7c97e54 in _Unwind_Backtrace () from /lib/aarch64-linux-gnu/libgcc_s.so.1
22:53:43#13 0x0000fffff7bb74ac in __GI___backtrace (array=<optimized out>, size=50) at ./debug/backtrace.c:78
22:53:43#14 0x0000fffff7e5dbc4 in _X18__cfaabi_backtraceFv_i__1 (_X5starti_1=2) at /var/lib/jenkins/workspace/Cforall_master/libcfa/src/interpose.cfa:204
22:53:43#15 0x0000fffff7e5e0e0 in _X7__abortFv_bPKcY17__builtin_va_list__1 (_X11signalAbortb_1=false, _X3fmtPKc_1=0xfffff7e7d420 "%s", _X4argsY17__builtin_va_list_1=...) at /var/lib/jenkins/workspace/Cforall_master/libcfa/src/interpose.cfa:283
22:53:43#16 0x0000fffff7e5e258 in _X5abortFv_bPKc__1 (_X11signalAbortb_1=false, _X3fmtPKc_1=0xfffff7e7d420 "%s") at /var/lib/jenkins/workspace/Cforall_master/libcfa/src/interpose.cfa:301
22:53:43#17 0x0000fffff7e5da70 in abort () at /var/lib/jenkins/workspace/Cforall_master/libcfa/src/interpose.cfa:176
22:53:43#18 0x0000fffff7dae848 in _X4endsFv_S8ofstream__1 (_X2osS8ofstream_1=0xfffff7ec1368 <_X9abortFileS8ofstream_1>) at /var/lib/jenkins/workspace/Cforall_master/libcfa/src/fstream.cfa:106
22:53:43#19 0x0000fffff7db8e30 in _X15_operator_bitorQ1_0_0_1__X19basic_ostream_tableKS18basic_ostream_data_BD0__Fv_BD0j__1 (_X19basic_ostream_tableKS18basic_ostream_data_Y6ostype__1=0xfffff7ec13d8 <_X19ofstream_basic_dataS18basic_ostream_data_S8ofstream__1>, _X2osY6ostype_1=0xfffff7ec1368 <_X9abortFileS8ofstream_1>, _X1tj_1=256) at /var/lib/jenkins/workspace/Cforall_master/libcfa/src/iostream.cfa:98
22:53:43#20 0x0000fffff7f3b7dc in _X19__io_uring_teardownFv_S11io_context$__1 (_X4thisS11io_context$_1=0xaaaaaacc1040) at /var/lib/jenkins/workspace/Cforall_master/libcfa/src/concurrency/io/setup.cfa:288
22:53:43#21 0x0000fffff7f3a63c in _X11_destructorFv_S11io_context$__1 (_X4thisS11io_context$_1=0xaaaaaacc1040) at /var/lib/jenkins/workspace/Cforall_master/libcfa/src/concurrency/io/setup.cfa:125
22:53:43#22 0x0000fffff7f3bbd8 in _X13__cfa_io_stopFv_PS9processor__1 (_X4procPS9processor_1=0xffffffffd480) at /var/lib/jenkins/workspace/Cforall_master/libcfa/src/concurrency/io/setup.cfa:313
22:53:43#23 0x0000fffff7f47a18 in _X18__invoke_processorFPv_Pv__1 (_X3argPv_1=0xffffffffd480) at /var/lib/jenkins/workspace/Cforall_master/libcfa/src/concurrency/kernel/startup.cfa:406
22:53:43#24 0x0000fffff7b4582c in start_thread (arg=0xfffff7fea500) at ./nptl/pthread_create.c:447
22:53:43#25 0x0000fffff7babb4c in thread_start () at ../sysdeps/unix/sysv/linux/aarch64/clone3.S:76
22:53:43-----
22:53:43 Id Target Id Frame
22:53:43* 1 Thread 0xaaaaaaba37c0 (LWP 319015) __pthread_kill_implementation (threadid=187649985492928, signo=signo@entry=6, no_tid=no_tid@entry=0) at ./nptl/pthread_kill.c:44
22:53:43 2 Thread 0xfffff7fe9dc0 (LWP 319009) 0x0000fffff7b41d6c in __futex_abstimed_wait_common64 (private=128, cancel=true, abstime=0x0, op=265, expected=319015, futex_word=0xaaaaaaba3890) at ./nptl/futex-internal.c:57
22:53:43 3 Thread 0xaaaaaab137c0 (LWP 319012) 0x0000fffff7afda18 in __GI___sigtimedwait (set=0xaaaaaab12df8, info=0xaaaaaab12e78, timeout=0x0) at ../sysdeps/unix/sysv/linux/sigtimedwait.c:31
22:53:4322:53:43Archiving io/many_read (executable and core) to crashes/full-debug/io/many_read
22:53:43 vector_math/vec2_ldouble PASSED C 0:09.177 - R 0:00.037
22:53:43 exceptions/hotpotato_checked PASSED C 0:10.315 - R 0:00.118
22:53:43 io/comp_fair PASSED C 0:18.890 - R 0:00.720
22:53:43 io/manipulatorsOutput2 PASSED C 0:09.967 - R 0:00.037
22:53:43 exceptions/cardgame PASSED C 0:10.732 - R 0:00.117
22:53:43 vector_math/vec3_int PASSED C 0:12.803 - R 0:00.068
22:53:43 bitmanip3 PASSED C 0:11.715 - R 0:00.069
22:53:43 vector_math/vec4_int PASSED C 0:13.041 - R 0:00.068
22:53:43 vector_math/vec2_int PASSED C 0:13.822 - R 0:00.035
22:53:43 exceptions/hotpotato PASSED C 0:11.668 - R 0:00.069
22:53:43 ...rrency/examples/boundedBufferINT PASSED C 0:12.584 - R 0:31.149
22:53:43 vector_math/vec2_float PASSED C 0:14.522 - R 0:00.037
22:53:43 vector_math/vec3_float PASSED C 0:14.655 - R 0:00.073
22:53:43 vector_math/vec4_float PASSED C 0:14.918 - R 0:00.067
22:53:43 mathX PASSED C 0:12.459 - R 0:00.037
22:53:43 math PASSED C 0:13.618 - R 0:00.035
22:53:43 io/manipulatorsOutput3 PASSED C 0:13.940 - R 0:00.118
22:53:43 io/manipulatorsOutput1 PASSED C 0:14.879 - R 0:00.034
22:53:43 include/includes PASSED C 0:25.707 - R 0:00.037
22:53:43 concurrency/actors/dynamic PASSED C 0:17.907 - R 0:29.542
22:53:43 PRNG PASSED C 0:16.211 - R 0:02.170
22:53:43 concurrency/unified_locking/mcs PASSED C 0:15.458 - R 0:28.273
22:53:43 io/io-acquire-no-io PASSED C 0:15.113 - R 0:11.291
22:53:43 heap PASSED C 0:10.062 - R 0:19.632
22:53:43 concurrency/waituntil/repeat_close PASSED C 0:13.719 - R 0:30.113
22:53:43 ...ency/waituntil/channel_zero_size PASSED C 0:12.841 - R 0:32.735
22:53:43 rational PASSED C 0:27.338 - R 0:00.041
22:53:43 ...ency/unified_locking/futex_mutex PASSED C 0:14.474 - R 0:39.801
22:53:43 concurrency/waituntil/channels PASSED C 0:13.772 - R 0:35.126
22:53:43 concurrency/waituntil/all_types PASSED C 0:36.156 - R 0:23.254
22:53:43 concurrency/monitor PASSED C 0:12.391 - R 0:56.988
22:53:43 ...urrency/unified_locking/mcs_spin PASSED C 0:14.498 - R 0:50.811
22:53:43 concurrency/multi-monitor PASSED C 0:12.639 - R 0:58.386
22:53:43 .../unified_locking/spin_queue_lock PASSED C 0:14.430 - R 0:51.997
22:53:43 concurrency/waituntil/locks PASSED C 0:15.090 - R 1:08.121
22:53:43 concurrency/unified_locking/locks PASSED C 0:15.109 - R 1:33.821
22:53:43 concurrency/mutexstmt/locks PASSED C 0:13.793 - R 2:16.612
22:53:43374 passes, 1 failures, 0 timeouts, 0 cancelled, 0 other
22:53:43Tests took 2:31.365
22:53:43make: *** [Makefile:986: all-local] Error 1
22:53:43[Pipeline] }
22:53:43[Pipeline] // dir
22:53:43[Pipeline] }
22:53:43[Pipeline] // stage
22:53:43[Pipeline] echo
22:53:43Archiving core dumps
22:53:43[Pipeline] dir
22:53:43Running in /var/lib/jenkins/workspace/Cforall_master@tmp
22:53:43[Pipeline] {
22:53:43[Pipeline] fileExists
22:53:43[Pipeline] sh
22:53:43+ /var/lib/jenkins/workspace/Cforall_master/tools/jenkins/archive-gen.sh
22:53:43[Pipeline] archiveArtifacts
22:53:43Archiving artifacts
22:53:43Recording fingerprints
22:53:43[Pipeline] }
22:53:43[Pipeline] // dir
22:53:43[Pipeline] }
22:53:43[Pipeline] // wrap
22:53:43[Pipeline] }
22:53:43[Pipeline] // node
22:53:43[Pipeline] echo
22:53:43hudson.AbortException: script returned exit code 2
22:53:43[Pipeline] node
22:53:43Running on Brokk 1 in /var/lib/jenkins/workspace/Cforall_master
22:53:43[Pipeline] {
22:53:43[Pipeline] echo
22:53:43Notifying users of result
22:53:43[Pipeline] echo
22:53:43Reusing previously constructed message
22:53:43[Pipeline] echo
22:53:43Would send email to: cforall@lists.uwaterloo.ca
22:53:43[Pipeline] echo
22:53:43With title: [cforall git][BUILD# 3687 - FAILURE] - branch master
22:53:43[Pipeline] echo
22:53:43Content:
22:53:43<p>This is an automated email from the Jenkins build machine. It was
22:53:43generated because of a git hooks/post-receive script following
22:53:43a ref change which was pushed to the Cā repository.</p>
22:53:4322:53:43<p>- Status --------------------------------------------------------------</p>
22:53:4322:53:43<p>BUILD# 3687 - FAILURE</p>
22:53:43<p>Check console output at https://cforall.uwaterloo.ca/jenkins/job/Cforall/job/master/3687/ to view the results.</p>
22:53:4322:53:43<p>- Changes -------------------------------------------------------------</p>
22:53:4322:53:43<pre>
22:53:43The branch master has been updated.
22:53:43 from 26db8d037230dd5a87499062454cd8686ee33d26 (commit)
22:53:43</pre>
22:53:4322:53:43<p>- Log -----------------------------------------------------------------</p>
22:53:4322:53:43<pre>
22:53:4322:53:43</pre>
22:53:4322:53:43<p>-----------------------------------------------------------------------</p>
22:53:43<pre>
22:53:43Summary of changes:
22:53:4322:53:43</pre>
22:53:4322:53:43[Pipeline] }
22:53:43[Pipeline] // node
22:53:43[Pipeline] echo
22:53:43Build Completed
22:53:43[Pipeline] End of Pipeline
22:53:43ERROR: script returned exit code 2
22:53:43Finished: FAILURE