Started by timer Running as Jenkins Build User Obtained Jenkins/FullBuild from git cforall@plg.uwaterloo.ca:software/cfa/cfa-cc [Pipeline] Start of Pipeline [Pipeline] node Running on Brokk 3 in /var/lib/jenkins/workspace/Cforall_Full_Build [Pipeline] { [Pipeline] checkout The recommended git tool is: NONE using credential git_key_aug2025 Fetching changes from the remote Git repository Checking out Revision 4ff8cb209307cd30c3626d4fbe3cc2d2ce4219ea (refs/remotes/origin/master) Commit message: "fix Mesa citation" > git rev-parse --resolve-git-dir /var/lib/jenkins/workspace/Cforall_Full_Build/.git # timeout=10 > git config remote.origin.url cforall@plg.uwaterloo.ca:software/cfa/cfa-cc # timeout=10 Fetching upstream changes from cforall@plg.uwaterloo.ca:software/cfa/cfa-cc > git --version # timeout=10 > git --version # 'git version 2.43.0' using GIT_SSH to set credentials Git key use to connect to the cforall git repo (August 2025) Verifying host key using known hosts file > git fetch --tags --force --progress -- cforall@plg.uwaterloo.ca:software/cfa/cfa-cc +refs/heads/*:refs/remotes/origin/* # timeout=10 > git rev-parse refs/remotes/origin/master^{commit} # timeout=10 > git config core.sparsecheckout # timeout=10 > git checkout -f 4ff8cb209307cd30c3626d4fbe3cc2d2ce4219ea # timeout=10 > git rev-list --no-walk 4ff8cb209307cd30c3626d4fbe3cc2d2ce4219ea # timeout=10 [Pipeline] wrap [Pipeline] { [Pipeline] stage [Pipeline] { (Build) [Pipeline] parallel [Pipeline] { (Branch: gcc_10_x86_new) [Pipeline] { (Branch: gcc_11_x86_new) [Pipeline] { (Branch: gcc_12_x86_new) [Pipeline] { (Branch: gcc_9_x64_new) [Pipeline] { (Branch: gcc_10_x64_new) [Pipeline] { (Branch: gcc_11_x64_new) [Pipeline] { (Branch: gcc_12_x64_new) [Pipeline] { (Branch: gcc_10_arm64_new) [Pipeline] { (Branch: gcc_11_arm64_new) [Pipeline] { (Branch: gcc_12_arm64_new) [Pipeline] { (Branch: clang_x64_new) [Pipeline] sleep No need to sleep any longer [Pipeline] sleep No need to sleep any longer [Pipeline] sleep No need to sleep any longer [Pipeline] sleep Sleeping for 4 min 0 sec [Pipeline] sleep Sleeping for 2 min 0 sec [Pipeline] sleep Sleeping for 1 min 0 sec [Pipeline] sleep No need to sleep any longer [Pipeline] sleep Sleeping for 2 min 0 sec [Pipeline] sleep Sleeping for 3 min 0 sec [Pipeline] sleep Sleeping for 3 min 0 sec [Pipeline] sleep No need to sleep any longer [Pipeline] build Scheduling project: Cforall » master [Pipeline] build Scheduling project: Cforall » master [Pipeline] build Scheduling project: Cforall » master [Pipeline] build Scheduling project: Cforall » master [Pipeline] build Scheduling project: Cforall » master Starting building: Cforall » master #3651 Starting building: Cforall » master #3650 Starting building: Cforall » master #3653 Starting building: Cforall » master #3652 Starting building: Cforall » master #3649 [Pipeline] build Scheduling project: Cforall » master Starting building: Cforall » master #3654 [Pipeline] build Scheduling project: Cforall » master [Pipeline] build Scheduling project: Cforall » master Starting building: Cforall » master #3655 Starting building: Cforall » master #3656 [Pipeline] build Scheduling project: Cforall » master [Pipeline] build Scheduling project: Cforall » master Starting building: Cforall » master #3657 Starting building: Cforall » master #3658 [Pipeline] build Scheduling project: Cforall » master Starting building: Cforall » master #3659 Build Cforall » master #3656 completed: FAILURE [Pipeline] echo FAILURE [Pipeline] sh + wget -q -O - https://cforall.uwaterloo.ca/jenkins/job/Cforall/job/master/3656/consoleText Started by upstream project "Cforall_Full_Build" build number 413 originally caused by: Started by timer Running as Jenkins Build User > git rev-parse --resolve-git-dir /var/lib/jenkins/caches/git-914b6fdde163b7e17ee75d99ca23f18a/.git # timeout=10 Setting origin to cforall@plg.uwaterloo.ca:software/cfa/cfa-cc > git config remote.origin.url cforall@plg.uwaterloo.ca:software/cfa/cfa-cc # timeout=10 Fetching origin... Fetching upstream changes from origin > git --version # timeout=10 > git --version # 'git version 2.43.0' > git config --get remote.origin.url # timeout=10 using GIT_SSH to set credentials Git key use to connect to the cforall git repo (August 2025) Verifying host key using known hosts file > git fetch --no-tags --force --progress -- origin +refs/heads/*:refs/remotes/origin/* # timeout=10 Seen branch in repository origin/ADT Seen branch in repository origin/aaron-thesis Seen branch in repository origin/arm-eh Seen branch in repository origin/ast-experimental Seen branch in repository origin/cleanup-dtors Seen branch in repository origin/ctor Seen branch in repository origin/deferred_resn Seen branch in repository origin/demangler Seen branch in repository origin/enum Seen branch in repository origin/forall-pointer-decay Seen branch in repository origin/gc_noraii Seen branch in repository origin/jacob/cs343-translation Seen branch in repository origin/jenkins-sandbox Seen branch in repository origin/master Seen branch in repository origin/memory Seen branch in repository origin/new-ast Seen branch in repository origin/new-ast-unique-expr Seen branch in repository origin/new-env Seen branch in repository origin/no_list Seen branch in repository origin/persistent-indexer Seen branch in repository origin/pthread-emulation Seen branch in repository origin/qualifiedEnum Seen branch in repository origin/resolv-new Seen branch in repository origin/string Seen branch in repository origin/stuck-waitfor-destruct Seen branch in repository origin/with_gc Seen 26 remote branches Obtained Jenkinsfile from 4ff8cb209307cd30c3626d4fbe3cc2d2ce4219ea [Pipeline] Start of Pipeline [Pipeline] node Running on Algol in /var/lib/jenkins/workspace/Cforall_master [Pipeline] { [Pipeline] wrap [Pipeline] { [Pipeline] properties WARNING: Unknown parameter(s) found for class type 'hudson.model.ChoiceParameterDefinition': defaultValue WARNING: Unknown parameter(s) found for class type 'hudson.model.ChoiceParameterDefinition': defaultValue [Pipeline] checkout The recommended git tool is: NONE using credential git_key_aug2025 Fetching changes from the remote Git repository Cleaning workspace Fetching without tags Checking out Revision 4ff8cb209307cd30c3626d4fbe3cc2d2ce4219ea (master) Commit message: "fix Mesa citation" [Pipeline] load [Pipeline] { (Jenkins/tools.groovy) [Pipeline] } [Pipeline] // load [Pipeline] echo Compiler : gcc-10 (g++-10/gcc-10) Architecture : arm64 Arc Flags : --host=aarch64 Run All Tests : true Run Benchmark : true Build Documentation : false Publish : true Silent : true [Pipeline] } [Pipeline] // wrap [Pipeline] } [Pipeline] // node [Pipeline] node Running on Algol in /var/lib/jenkins/workspace/Cforall_master [Pipeline] { [Pipeline] wrap [Pipeline] { [Pipeline] pwd [Pipeline] pwd > git rev-parse --resolve-git-dir /var/lib/jenkins/workspace/Cforall_master/.git # timeout=10 > git config remote.origin.url cforall@plg.uwaterloo.ca:software/cfa/cfa-cc # timeout=10 > git rev-parse --verify HEAD # timeout=10 Resetting working tree > git reset --hard # timeout=10 > git clean -fdx # timeout=10 Fetching upstream changes from cforall@plg.uwaterloo.ca:software/cfa/cfa-cc > git --version # timeout=10 > git --version # 'git version 2.43.0' using GIT_SSH to set credentials Git key use to connect to the cforall git repo (August 2025) Verifying host key using known hosts file > git fetch --no-tags --force --progress -- cforall@plg.uwaterloo.ca:software/cfa/cfa-cc +refs/heads/*:refs/remotes/origin/* # timeout=10 > git config core.sparsecheckout # timeout=10 > git checkout -f 4ff8cb209307cd30c3626d4fbe3cc2d2ce4219ea # timeout=10 > git rev-list --no-walk 4ff8cb209307cd30c3626d4fbe3cc2d2ce4219ea # timeout=10 [Pipeline] echo -------- Cleanup -------- [Pipeline] stage [Pipeline] { (Cleanup) [Pipeline] dir Running in /var/lib/jenkins/workspace/Cforall_master@tmp [Pipeline] { [Pipeline] deleteDir [Pipeline] } [Pipeline] // dir [Pipeline] } [Pipeline] // stage [Pipeline] echo -------- Checkout -------- [Pipeline] stage [Pipeline] { (Checkout) [Pipeline] checkout The recommended git tool is: NONE using credential git_key_aug2025 Fetching changes from the remote Git repository Cleaning workspace Fetching without tags Checking out Revision 4ff8cb209307cd30c3626d4fbe3cc2d2ce4219ea (master) Commit message: "fix Mesa citation" [Pipeline] echo Constructing new git message [Pipeline] sh > git rev-parse --resolve-git-dir /var/lib/jenkins/workspace/Cforall_master/.git # timeout=10 > git config remote.origin.url cforall@plg.uwaterloo.ca:software/cfa/cfa-cc # timeout=10 > git rev-parse --verify HEAD # timeout=10 Resetting working tree > git reset --hard # timeout=10 > git clean -fdx # timeout=10 Fetching upstream changes from cforall@plg.uwaterloo.ca:software/cfa/cfa-cc > git --version # timeout=10 > git --version # 'git version 2.43.0' using GIT_SSH to set credentials Git key use to connect to the cforall git repo (August 2025) Verifying host key using known hosts file > git fetch --no-tags --force --progress -- cforall@plg.uwaterloo.ca:software/cfa/cfa-cc +refs/heads/*:refs/remotes/origin/* # timeout=10 > git config core.sparsecheckout # timeout=10 > git checkout -f 4ff8cb209307cd30c3626d4fbe3cc2d2ce4219ea # timeout=10 + git rev-list 4ff8cb209307cd30c3626d4fbe3cc2d2ce4219ea..4ff8cb209307cd30c3626d4fbe3cc2d2ce4219ea [Pipeline] sh + git cat-file -t 4ff8cb209307cd30c3626d4fbe3cc2d2ce4219ea [Pipeline] sh + git rev-list --format=short 4ff8cb209307cd30c3626d4fbe3cc2d2ce4219ea...4ff8cb209307cd30c3626d4fbe3cc2d2ce4219ea [Pipeline] sh + git diff --stat --color 4ff8cb209307cd30c3626d4fbe3cc2d2ce4219ea 4ff8cb209307cd30c3626d4fbe3cc2d2ce4219ea [Pipeline] echo

- Changes -------------------------------------------------------------

The branch master has been updated.
      from  4ff8cb209307cd30c3626d4fbe3cc2d2ce4219ea (commit)

- Log -----------------------------------------------------------------


-----------------------------------------------------------------------

Summary of changes:

[Pipeline] } [Pipeline] // stage [Pipeline] echo -------- Build : configure -------- [Pipeline] stage [Pipeline] { (Build : configure) [Pipeline] dir Running in /var/lib/jenkins/workspace/Cforall_master [Pipeline] { [Pipeline] sh + ./autogen.sh Running aclocal in root Running libtoolize in root libtoolize: putting auxiliary files in AC_CONFIG_AUX_DIR, 'automake'. libtoolize: linking file 'automake/ltmain.sh' libtoolize: putting macros in AC_CONFIG_MACRO_DIRS, 'automake'. libtoolize: linking file 'automake/libtool.m4' libtoolize: linking file 'automake/ltoptions.m4' libtoolize: linking file 'automake/ltsugar.m4' libtoolize: linking file 'automake/ltversion.m4' libtoolize: linking file 'automake/lt~obsolete.m4' Running autoconf in root Running automake in root configure.ac:223: installing 'automake/compile' configure.ac:138: installing 'automake/config.guess' configure.ac:138: installing 'automake/config.sub' configure.ac:17: installing 'automake/install-sh' benchmark/Makefile.am: installing 'automake/depcomp' parallel-tests: installing 'automake/test-driver' configure.ac: installing 'automake/ylwrap' Running aclocal in libcfa Running libtoolize in libcfa libtoolize: putting auxiliary files in AC_CONFIG_AUX_DIR, 'automake'. libtoolize: linking file 'automake/ltmain.sh' libtoolize: putting macros in AC_CONFIG_MACRO_DIRS, 'automake'. libtoolize: linking file 'automake/libtool.m4' libtoolize: linking file 'automake/ltoptions.m4' libtoolize: linking file 'automake/ltsugar.m4' libtoolize: linking file 'automake/ltversion.m4' libtoolize: linking file 'automake/lt~obsolete.m4' Running autoconf in libcfa Running automake in libcfa configure.ac:119: installing 'automake/compile' configure.ac:119: installing 'automake/config.guess' configure.ac:119: installing 'automake/config.sub' configure.ac:12: installing 'automake/install-sh' src/Makefile.am: installing 'automake/depcomp' [Pipeline] } [Pipeline] // dir [Pipeline] dir Running in /var/lib/jenkins/workspace/Cforall_master@tmp [Pipeline] { [Pipeline] sh + /var/lib/jenkins/workspace/Cforall_master/configure CXX=g++-10 CC=gcc-10 --host=aarch64 AR=gcc-ar RANLIB=gcc-ranlib --with-target-hosts=host:debug,host:nodebug --quiet --prefix=/var/lib/jenkins/workspace/Cforall_master@tmp [Pipeline] sh + nproc + make -j 96 --no-print-directory configure-libcfa libcfa/arm64-debug/config.data Configuring libcfa (/var/lib/jenkins/workspace/Cforall_master/libcfa/configure) with ''CXX=g++-10' 'CC=gcc-10' 'AR=gcc-ar' 'RANLIB=gcc-ranlib' '--prefix=/var/lib/jenkins/workspace/Cforall_master@tmp' DRIVER_DIR=/var/lib/jenkins/workspace/Cforall_master@tmp/driver/ ARCHITECTURE=arm64 CONFIGURATION=debug CFA_VERSION=1:0:0' from /var/lib/jenkins/workspace/Cforall_master@tmp / libcfa/arm64-debug/ libcfa/arm64-nodebug/config.data Configuring libcfa (/var/lib/jenkins/workspace/Cforall_master/libcfa/configure) with ''CXX=g++-10' 'CC=gcc-10' 'AR=gcc-ar' 'RANLIB=gcc-ranlib' '--prefix=/var/lib/jenkins/workspace/Cforall_master@tmp' DRIVER_DIR=/var/lib/jenkins/workspace/Cforall_master@tmp/driver/ ARCHITECTURE=arm64 CONFIGURATION=nodebug CFA_VERSION=1:0:0' from /var/lib/jenkins/workspace/Cforall_master@tmp / libcfa/arm64-nodebug/ checking whether make supports nested variables... yes checking for a BSD-compatible install... /usr/bin/install -c checking whether build environment is sane... yes checking whether make supports nested variables... yes checking for a BSD-compatible install... checking for a race-free mkdir -p... /usr/bin/mkdir -p checking for gawk... gawk checking whether make sets $(MAKE)... /usr/bin/install -c checking whether build environment is sane... yes yes checking for a race-free mkdir -p... /usr/bin/mkdir -p checking for gawk... gawk checking whether make sets $(MAKE)... checking for distributated build... no yes checking build system type... checking for distributated build... no checking build system type... aarch64-unknown-linux-gnu checking host system type... aarch64-unknown-linux-gnu checking how to print strings... printf checking whether make supports the include directive... yes (GNU style) checking for gcc... gcc-10 aarch64-unknown-linux-gnu checking host system type... aarch64-unknown-linux-gnu checking how to print strings... printf checking whether make supports the include directive... yes (GNU style) checking for gcc... gcc-10 checking whether the C compiler works... checking whether the C compiler works... yes checking for C compiler default output file name... a.out checking for suffix of executables... yes checking for C compiler default output file name... a.out checking for suffix of executables... checking whether we are cross compiling... checking whether we are cross compiling... no checking for suffix of object files... no checking for suffix of object files... o checking whether the compiler supports GNU C... o checking whether the compiler supports GNU C... yes checking whether gcc-10 accepts -g... yes checking whether gcc-10 accepts -g... yes checking for gcc-10 option to enable C11 features... yes checking for gcc-10 option to enable C11 features... none needed checking whether gcc-10 understands -c and -o together... none needed checking whether gcc-10 understands -c and -o together... yes checking dependency style of gcc-10... yes checking dependency style of gcc-10... gcc3 checking for a sed that does not truncate output... /usr/bin/sed checking for grep that handles long lines and -e... /usr/bin/grep checking for egrep... /usr/bin/grep -E checking for fgrep... /usr/bin/grep -F checking for ld used by gcc-10... gcc3 checking for a sed that does not truncate output... /usr/bin/ld checking if the linker (/usr/bin/ld) is GNU ld... /usr/bin/sed yes checking for BSD- or MS-compatible name lister (nm)... checking for grep that handles long lines and -e... /usr/bin/nm -B checking the name lister (/usr/bin/nm -B) interface... /usr/bin/grep checking for egrep... /usr/bin/grep -E checking for fgrep... /usr/bin/grep -F checking for ld used by gcc-10... /usr/bin/ld checking if the linker (/usr/bin/ld) is GNU ld... yes checking for BSD- or MS-compatible name lister (nm)... /usr/bin/nm -B checking the name lister (/usr/bin/nm -B) interface... BSD nm checking whether ln -s works... yes checking the maximum length of command line arguments... 1572864 checking how to convert aarch64-unknown-linux-gnu file names to aarch64-unknown-linux-gnu format... func_convert_file_noop checking how to convert aarch64-unknown-linux-gnu file names to toolchain format... func_convert_file_noop checking for /usr/bin/ld option to reload object files... -r checking for file... file checking for objdump... objdump checking how to recognize dependent libraries... pass_all checking for dlltool... no checking how to associate runtime and link libraries... printf %s\n checking for archiver @FILE support... BSD nm checking whether ln -s works... yes checking the maximum length of command line arguments... 1572864 checking how to convert aarch64-unknown-linux-gnu file names to aarch64-unknown-linux-gnu format... func_convert_file_noop checking how to convert aarch64-unknown-linux-gnu file names to toolchain format... func_convert_file_noop checking for /usr/bin/ld option to reload object files... -r checking for file... file checking for objdump... objdump checking how to recognize dependent libraries... pass_all checking for dlltool... no checking how to associate runtime and link libraries... printf %s\n checking for archiver @FILE support... @ checking for strip... strip checking for ranlib... gcc-ranlib checking command to parse /usr/bin/nm -B output from gcc-10 object... @ checking for strip... strip checking for ranlib... gcc-ranlib checking command to parse /usr/bin/nm -B output from gcc-10 object... ok checking for sysroot... no checking for a working dd... /usr/bin/dd checking how to truncate binary pipes... /usr/bin/dd bs=4096 count=1 checking for mt... mt checking if mt is a manifest tool... ok checking for sysroot... no checking for a working dd... no checking for stdio.h... /usr/bin/dd checking how to truncate binary pipes... /usr/bin/dd bs=4096 count=1 checking for mt... mt checking if mt is a manifest tool... no checking for stdio.h... yes checking for stdlib.h... yes checking for stdlib.h... yes checking for string.h... yes checking for string.h... yes checking for inttypes.h... yes checking for inttypes.h... yes checking for stdint.h... yes checking for stdint.h... yes checking for strings.h... yes checking for strings.h... yes checking for sys/stat.h... yes checking for sys/stat.h... yes checking for sys/types.h... yes checking for sys/types.h... yes checking for unistd.h... yes checking for unistd.h... yes checking for dlfcn.h... yes checking for dlfcn.h... yes checking for objdir... .libs yes checking for objdir... .libs checking if gcc-10 supports -fno-rtti -fno-exceptions... checking if gcc-10 supports -fno-rtti -fno-exceptions... no checking for gcc-10 option to produce PIC... -fPIC -DPIC checking if gcc-10 PIC flag -fPIC -DPIC works... no checking for gcc-10 option to produce PIC... -fPIC -DPIC checking if gcc-10 PIC flag -fPIC -DPIC works... yes checking if gcc-10 static flag -static works... yes checking if gcc-10 static flag -static works... yes checking if gcc-10 supports -c -o file.o... yes checking if gcc-10 supports -c -o file.o... yes checking if gcc-10 supports -c -o file.o... (cached) yes checking whether the gcc-10 linker (/usr/bin/ld) supports shared libraries... yes checking if gcc-10 supports -c -o file.o... (cached) yes checking whether the gcc-10 linker (/usr/bin/ld) supports shared libraries... yes checking whether -lc should be explicitly linked in... yes checking whether -lc should be explicitly linked in... no checking dynamic linker characteristics... no checking dynamic linker characteristics... GNU/Linux ld.so checking how to hardcode library paths into programs... immediate checking whether stripping libraries is possible... yes checking if libtool supports shared libraries... yes checking whether to build shared libraries... yes checking whether to build static libraries... no GNU/Linux ld.so checking how to hardcode library paths into programs... immediate checking whether stripping libraries is possible... yes checking if libtool supports shared libraries... yes checking whether to build shared libraries... yes checking whether to build static libraries... no checking whether the compiler supports GNU C++... checking whether the compiler supports GNU C++... yes checking whether g++-10 accepts -g... yes checking whether g++-10 accepts -g... yes checking for g++-10 option to enable C++11 features... yes checking for g++-10 option to enable C++11 features... none needed checking dependency style of g++-10... none needed checking dependency style of g++-10... gcc3 checking how to run the C++ preprocessor... gcc3 checking how to run the C++ preprocessor... g++-10 -E g++-10 -E checking for ld used by g++-10... checking for ld used by g++-10... /usr/bin/ld checking if the linker (/usr/bin/ld) is GNU ld... /usr/bin/ld checking if the linker (/usr/bin/ld) is GNU ld... yes yes checking whether the g++-10 linker (/usr/bin/ld) supports shared libraries... checking whether the g++-10 linker (/usr/bin/ld) supports shared libraries... yes yes checking for g++-10 option to produce PIC... -fPIC -DPIC checking if g++-10 PIC flag -fPIC -DPIC works... checking for g++-10 option to produce PIC... -fPIC -DPIC checking if g++-10 PIC flag -fPIC -DPIC works... yes checking if g++-10 static flag -static works... yes checking if g++-10 static flag -static works... yes checking if g++-10 supports -c -o file.o... yes checking if g++-10 supports -c -o file.o... yes checking if g++-10 supports -c -o file.o... (cached) yes checking whether the g++-10 linker (/usr/bin/ld) supports shared libraries... yes checking dynamic linker characteristics... (cached) GNU/Linux ld.so checking how to hardcode library paths into programs... immediate yes checking if g++-10 supports -c -o file.o... (cached) yes checking whether the g++-10 linker (/usr/bin/ld) supports shared libraries... yes checking dynamic linker characteristics... (cached) checking for gcc... (cached) gcc-10 GNU/Linux ld.so checking how to hardcode library paths into programs... immediate checking for gcc... (cached) gcc-10 checking whether the compiler supports GNU C... (cached) yes checking whether gcc-10 accepts -g... (cached) yes checking for gcc-10 option to enable C11 features... (cached) none needed checking whether gcc-10 understands -c and -o together... (cached) yes checking dependency style of gcc-10... (cached) gcc3 checking dependency style of gcc-10... checking whether the compiler supports GNU C... (cached) yes checking whether gcc-10 accepts -g... (cached) yes checking for gcc-10 option to enable C11 features... (cached) none needed checking whether gcc-10 understands -c and -o together... (cached) yes checking dependency style of gcc-10... (cached) gcc3 checking dependency style of gcc-10... gcc3 checking whether make sets $(MAKE)... (cached) yes checking for linux/rseq.h... gcc3 checking whether make sets $(MAKE)... (cached) yes checking for linux/rseq.h... yes checking for rseq_available in -lrseq... yes checking for rseq_available in -lrseq... no checking for gcc-10 options needed to detect all undeclared functions... no checking for gcc-10 options needed to detect all undeclared functions... none needed checking for linux/io_uring.h... none needed checking for linux/io_uring.h... yes checking for liburing.h... yes checking for liburing.h... no checking whether IORING_OP_NOP is declared... no checking whether IORING_OP_NOP is declared... yes checking whether IORING_OP_READV is declared... yes checking whether IORING_OP_READV is declared... yes checking whether IORING_OP_WRITEV is declared... yes checking whether IORING_OP_WRITEV is declared... yes checking whether IORING_OP_FSYNC is declared... yes checking whether IORING_OP_FSYNC is declared... yes checking whether IORING_OP_READ_FIXED is declared... yes checking whether IORING_OP_READ_FIXED is declared... yes checking whether IORING_OP_WRITE_FIXED is declared... yes checking whether IORING_OP_WRITE_FIXED is declared... yes checking whether IORING_OP_POLL_ADD is declared... yes checking whether IORING_OP_POLL_ADD is declared... yes yes checking whether IORING_OP_POLL_REMOVE is declared... checking whether IORING_OP_POLL_REMOVE is declared... yes yes checking whether IORING_OP_SYNC_FILE_RANGE is declared... checking whether IORING_OP_SYNC_FILE_RANGE is declared... yes yes checking whether IORING_OP_SENDMSG is declared... checking whether IORING_OP_SENDMSG is declared... yes yes checking whether IORING_OP_RECVMSG is declared... checking whether IORING_OP_RECVMSG is declared... yes yes checking whether IORING_OP_TIMEOUT is declared... checking whether IORING_OP_TIMEOUT is declared... yes yes checking whether IORING_OP_TIMEOUT_REMOVE is declared... checking whether IORING_OP_TIMEOUT_REMOVE is declared... yes yes checking whether IORING_OP_ACCEPT is declared... checking whether IORING_OP_ACCEPT is declared... yes yes checking whether IORING_OP_ASYNC_CANCEL is declared... checking whether IORING_OP_ASYNC_CANCEL is declared... yes checking whether IORING_OP_LINK_TIMEOUT is declared... yes checking whether IORING_OP_LINK_TIMEOUT is declared... yes checking whether IORING_OP_CONNECT is declared... yes checking whether IORING_OP_CONNECT is declared... yes checking whether IORING_OP_FALLOCATE is declared... yes checking whether IORING_OP_FALLOCATE is declared... yes checking whether IORING_OP_OPENAT is declared... yes checking whether IORING_OP_OPENAT is declared... yes checking whether IORING_OP_CLOSE is declared... yes checking whether IORING_OP_CLOSE is declared... yes checking whether IORING_OP_FILES_UPDATE is declared... yes checking whether IORING_OP_FILES_UPDATE is declared... yes checking whether IORING_OP_STATX is declared... yes checking whether IORING_OP_STATX is declared... yes checking whether IORING_OP_READ is declared... yes checking whether IORING_OP_READ is declared... yes checking whether IORING_OP_WRITE is declared... yes checking whether IORING_OP_WRITE is declared... yes checking whether IORING_OP_FADVISE is declared... yes checking whether IORING_OP_FADVISE is declared... yes checking whether IORING_OP_MADVISE is declared... yes checking whether IORING_OP_MADVISE is declared... yes checking whether IORING_OP_SEND is declared... yes checking whether IORING_OP_SEND is declared... yes checking whether IORING_OP_RECV is declared... yes checking whether IORING_OP_RECV is declared... yes checking whether IORING_OP_OPENAT2 is declared... yes checking whether IORING_OP_OPENAT2 is declared... yes checking whether IORING_OP_EPOLL_CTL is declared... yes checking whether IORING_OP_EPOLL_CTL is declared... yes checking whether IORING_OP_SPLICE is declared... yes yes checking whether IORING_OP_SPLICE is declared... checking whether IORING_OP_PROVIDE_BUFFERS is declared... yes yes checking whether IORING_OP_REMOVE_BUFFER is declared... checking whether IORING_OP_PROVIDE_BUFFERS is declared... yes no checking whether IORING_OP_REMOVE_BUFFER is declared... checking whether IORING_OP_TEE is declared... no checking whether IORING_OP_TEE is declared... yes checking whether IOSQE_FIXED_FILE is declared... yes yes checking whether IOSQE_FIXED_FILE is declared... checking whether IOSQE_IO_DRAIN is declared... yes yes checking whether IOSQE_IO_DRAIN is declared... checking whether IOSQE_IO_LINK is declared... yes yes checking whether IOSQE_IO_LINK is declared... checking whether IOSQE_IO_HARDLINK is declared... yes yes checking whether IOSQE_IO_HARDLINK is declared... checking whether IOSQE_ASYNC is declared... yes checking whether IOSQE_ASYNC is declared... yes checking whether IOSQE_BUFFER_SELECT is declared... yes yes checking whether IOSQE_BUFFER_SELECT is declared... checking whether SPLICE_F_FD_IN_FIXED is declared... yes yes checking whether IORING_SETUP_ATTACH_WQ is declared... checking whether SPLICE_F_FD_IN_FIXED is declared... yes checking whether IORING_REGISTER_IOWQ_MAX_WORKERS is declared... yes checking whether IORING_SETUP_ATTACH_WQ is declared... yes checking for preadv2... yes checking whether IORING_REGISTER_IOWQ_MAX_WORKERS is declared... yes checking for preadv2... yes checking for pwritev2... yes checking for pwritev2... yes checking that generated files are newer than configure... done configure: creating ./config.status yes checking that generated files are newer than configure... done configure: creating ./config.status config.status: creating Makefile config.status: creating src/Makefile config.status: creating prelude/Makefile config.status: creating src/concurrency/io/call.cfa config.status: creating Makefile /var/lib/jenkins/workspace/Cforall_master/libcfa/src/concurrency/io/call.cfa.in:144: SyntaxWarning: invalid escape sequence '\(' sig = re.search("(.*) (.*)\((.*)\)", signature) config.status: creating src/Makefile config.status: creating prelude/defines.hfa config.status: creating prelude/Makefile config.status: executing depfiles commands config.status: creating src/concurrency/io/call.cfa /var/lib/jenkins/workspace/Cforall_master/libcfa/src/concurrency/io/call.cfa.in:144: SyntaxWarning: invalid escape sequence '\(' sig = re.search("(.*) (.*)\((.*)\)", signature) config.status: executing libtool commands config.status: creating prelude/defines.hfa Cforall library configuraton completed. Type "make -j 8 install". config.status: executing depfiles commands config.status: executing libtool commands Cforall library configuraton completed. Type "make -j 8 install". [Pipeline] } [Pipeline] // dir [Pipeline] } [Pipeline] // stage [Pipeline] echo -------- Build : cfa-cpp -------- [Pipeline] stage [Pipeline] { (Build : cfa-cpp) [Pipeline] dir Running in /var/lib/jenkins/workspace/Cforall_master@tmp [Pipeline] { [Pipeline] sh + nproc + make -j 96 --no-print-directory -C driver CXX as.o CXX cfa.o CXX cc1.o CXXLD as CXXLD cc1 CXXLD cfa [Pipeline] sh + nproc + make -j 96 --no-print-directory -C src YACC Parser/parser.cc updating Parser/parser.output updating Parser/parser.hh make all-am CXX main.o CXX CompilationState.o CXX MakeLibCfa.o LEX Parser/lex.cc CXX AST/Attribute.o CXX AST/Copy.o CXX AST/Create.o CXX AST/Decl.o CXX AST/DeclReplacer.o CXX AST/Expr.o CXX AST/GenericSubstitution.o CXX AST/Init.o CXX AST/LinkageSpec.o CXX AST/Node.o CXX AST/Pass.o CXX AST/Print.o CXX AST/Inspect.o CXX AST/Stmt.o CXX AST/SymbolTable.o CXX AST/Type.o CXX AST/TypeEnvironment.o CXX AST/TypeSubstitution.o CXX AST/Util.o CXX CodeGen/CodeGenerator.o CXX CodeGen/GenType.o CXX CodeGen/OperatorTable.o CXX CodeGen/FixMain.o CXX CodeGen/FixNames.o CXX CodeGen/Generate.o CXX CodeGen/LinkOnce.o CXX Concurrency/Actors.o CXX Concurrency/Corun.o CXX Concurrency/Keywords.o CXX Concurrency/Waitfor.o CXX Concurrency/Waituntil.o CXX Common/Assert.o CXX Common/CodeLocationTools.o CXX Common/DeclStats.o CXX Common/Eval.o CXX Common/Examine.o CXX Common/Indenter.o CXX Common/ResolvProtoDump.o CXX Common/SemanticError.o CXX Common/Stats/Counter.o CXX Common/Stats/Heap.o CXX Common/Stats/ResolveTime.o CXX Common/Stats/Stats.o CXX Common/Stats/Time.o CXX Common/Symbol.o CXX Common/UniqueName.o CXX Common/DebugMalloc.o CXX ControlStruct/ExceptDecl.o CXX ControlStruct/ExceptTranslate.o CXX ControlStruct/FixLabels.o CXX ControlStruct/HoistControlDecls.o CXX ControlStruct/LabelGenerator.o CXX ControlStruct/MultiLevelExit.o CXX ControlStruct/TranslateEnumRange.o CXX GenPoly/GenPoly.o CXX GenPoly/Lvalue2.o CXX GenPoly/Box.o CXX GenPoly/FindFunction.o CXX GenPoly/InstantiateGeneric.o CXX GenPoly/Lvalue.o CXX GenPoly/ScrubTypeVars.o CXX GenPoly/Specialize.o CXX InitTweak/GenInit.o CXX InitTweak/InitTweak.o CXX InitTweak/FixGlobalInit.o CXX InitTweak/FixInit.o CXX Parser/DeclarationNode.o CXX Parser/ExpressionNode.o CXX Parser/InitializerNode.o CXX Parser/ParseNode.o CXX Parser/parser.o CXX Parser/RunParser.o CXX Parser/StatementNode.o CXX Parser/TypeData.o CXX Parser/TypedefTable.o CXX ResolvExpr/AdjustExprType.o CXX ResolvExpr/Candidate.o CXX ResolvExpr/CandidateFinder.o CXX ResolvExpr/CastCost.o CXX ResolvExpr/CommonType.o CXX ResolvExpr/ConversionCost.o CXX ResolvExpr/CurrentObject.o CXX ResolvExpr/ExplodedArg.o CXX ResolvExpr/FindOpenVars.o CXX ResolvExpr/PolyCost.o CXX ResolvExpr/PtrsAssignable.o CXX ResolvExpr/PtrsCastable.o CXX ResolvExpr/RenameVars.o CXX ResolvExpr/Resolver.o CXX ResolvExpr/ResolveTypeof.o CXX ResolvExpr/SatisfyAssertions.o CXX ResolvExpr/SpecCost.o In file included from /usr/include/aarch64-linux-gnu/c++/10/bits/os_defines.h:39, from /usr/include/aarch64-linux-gnu/c++/10/bits/c++config.h:522, from /usr/include/c++/10/cstdio:41, from /var/lib/jenkins/workspace/Cforall_master/src/Parser/parser.yy:41: /usr/include/features.h:415:4: warning: #warning _FORTIFY_SOURCE requires GCC 4.1 or later [-Wcpp] 415 | # warning _FORTIFY_SOURCE requires GCC 4.1 or later | ^~~~~~~ CXX ResolvExpr/Unify.o CXX ResolvExpr/CandidatePrinter.o CXX ResolvExpr/EraseWith.o CXX SymTab/FixFunction.o CXX SymTab/GenImplicitCall.o CXX SymTab/Mangler.o CXX SymTab/ManglerCommon.o CXX Tuples/Explode.o CXX Tuples/TupleAssignment.o CXX Tuples/TupleExpansion.o CXX Tuples/Tuples.o CXX Validate/Autogen.o CXX Validate/CheckAssertions.o CXX Validate/CompoundLiteral.o CXX Validate/EliminateTypedef.o CXX Validate/EnumAndPointerDecay.o CXX Validate/FindSpecialDecls.o CXX Validate/FixQualifiedTypes.o CXX Validate/FixReturnTypes.o CXX Validate/ForallPointerDecay.o CXX Validate/GenericParameter.o CXX Validate/HoistStruct.o CXX Validate/HoistTypeDecls.o CXX Validate/ImplementEnumFunc.o CXX Validate/InitializerLength.o CXX Validate/LabelAddressFixer.o CXX Validate/LinkInstanceTypes.o CXX Validate/ReplaceTypedef.o CXX Validate/ReturnCheck.o CXX Validate/VerifyCtorDtorAssign.o CXX Virtual/ExpandCasts.o CXX Virtual/Tables.o CXX Virtual/VirtualDtor.o CXX Parser/lex.o /var/lib/jenkins/workspace/Cforall_master/src/ResolvExpr/CommonType.cpp: In function ‘ast::ptr ResolvExpr::{anonymous}::handleReference(ast::ptr&, ast::ptr&, ResolvExpr::WidenMode, ast::TypeEnvironment&, const OpenVarSet&)’: /var/lib/jenkins/workspace/Cforall_master/src/ResolvExpr/CommonType.cpp:716:23: note: parameter passing for argument of type ‘ResolvExpr::WidenMode’ changed in GCC 9.1 716 | ast::ptr< ast::Type > handleReference( | ^~~~~~~~~~~~~~~ /var/lib/jenkins/workspace/Cforall_master/src/ResolvExpr/CommonType.cpp: In function ‘ast::ptr ResolvExpr::commonType(ast::ptr&, ast::ptr&, ast::TypeEnvironment&, ast::AssertionSet&, ast::AssertionSet&, const OpenVarSet&, ResolvExpr::WidenMode)’: /var/lib/jenkins/workspace/Cforall_master/src/ResolvExpr/CommonType.cpp:748:23: note: parameter passing for argument of type ‘ResolvExpr::WidenMode’ changed in GCC 9.1 748 | ast::ptr< ast::Type > commonType( | ^~~~~~~~~~ /var/lib/jenkins/workspace/Cforall_master/src/ResolvExpr/Unify.cpp: In function ‘bool ResolvExpr::unifyExact(const ast::Type*, const ast::Type*, ast::TypeEnvironment&, ast::AssertionSet&, ast::AssertionSet&, const OpenVarSet&, ResolvExpr::WidenMode)’: /var/lib/jenkins/workspace/Cforall_master/src/ResolvExpr/Unify.cpp:644:6: note: parameter passing for argument of type ‘ResolvExpr::WidenMode’ changed in GCC 9.1 644 | bool unifyExact( | ^~~~~~~~~~ /var/lib/jenkins/workspace/Cforall_master/src/AST/TypeEnvironment.cpp: In member function ‘bool ast::TypeEnvironment::bindVar(const ast::TypeInstType*, const ast::Type*, const ast::TypeData&, ast::AssertionSet&, ast::AssertionSet&, const OpenVarSet&, ResolvExpr::WidenMode)’: /var/lib/jenkins/workspace/Cforall_master/src/AST/TypeEnvironment.cpp:280:6: note: parameter passing for argument of type ‘ResolvExpr::WidenMode’ changed in GCC 9.1 280 | bool TypeEnvironment::bindVar( | ^~~~~~~~~~~~~~~ /var/lib/jenkins/workspace/Cforall_master/src/ResolvExpr/Unify.cpp: In function ‘bool ResolvExpr::unifyInexact(ast::ptr&, ast::ptr&, ast::TypeEnvironment&, ast::AssertionSet&, ast::AssertionSet&, const OpenVarSet&, ResolvExpr::WidenMode, ast::ptr&)’: /var/lib/jenkins/workspace/Cforall_master/src/ResolvExpr/Unify.cpp:671:6: note: parameter passing for argument of type ‘ResolvExpr::WidenMode’ changed in GCC 9.1 671 | bool unifyInexact( | ^~~~~~~~~~~~ /var/lib/jenkins/workspace/Cforall_master/src/AST/TypeEnvironment.cpp: In member function ‘bool ast::TypeEnvironment::bindVarToVar(const ast::TypeInstType*, const ast::TypeInstType*, ast::TypeData&&, ast::AssertionSet&, ast::AssertionSet&, const OpenVarSet&, ResolvExpr::WidenMode)’: /var/lib/jenkins/workspace/Cforall_master/src/AST/TypeEnvironment.cpp:319:6: note: parameter passing for argument of type ‘ResolvExpr::WidenMode’ changed in GCC 9.1 319 | bool TypeEnvironment::bindVarToVar( | ^~~~~~~~~~~~~~~ CXXLD ../driver/cfa-cpp [Pipeline] } [Pipeline] // dir [Pipeline] } [Pipeline] // stage [Pipeline] echo -------- Build : libcfa(debug) -------- [Pipeline] stage [Pipeline] { (Build : libcfa(debug)) [Pipeline] dir Running in /var/lib/jenkins/workspace/Cforall_master@tmp [Pipeline] { [Pipeline] sh + nproc + make -j 96 --no-print-directory -C libcfa/arm64-debug Making all in prelude mkdir .deps touch .deps/builtins.Po (CDPATH="${ZSH_VERSION+.}:" && cd /var/lib/jenkins/workspace/Cforall_master/libcfa && /bin/bash '/var/lib/jenkins/workspace/Cforall_master/libcfa/automake/missing' autoheader) rm -f stamp-h1 touch /var/lib/jenkins/workspace/Cforall_master/libcfa/prelude/defines.hfa.in cd .. && /bin/bash ./config.status prelude/defines.hfa config.status: creating prelude/defines.hfa config.status: prelude/defines.hfa is unchanged make all-am GEN gcc-builtins.c GEN builtins.cfa GEN prelude.cfa GEN extras.cfa GEN extras.cfa GEN gcc-builtins.cfa GEN bootloader.c Making all in src CFA common.lo CFA fstream.lo CFA heap.lo CFA iterator.lo CFA iostream.lo CFA limits.lo CFA math.lo CFA memory.lo CFA parseargs.lo CFA parseconfig.lo CFA rational.lo CFA stdlib.lo CFA strstream.lo CFA time.lo CFA assert.lo CC exception.lo CFA interpose.lo CFA prelude-inline.lo CFA startup.lo CC virtual.lo GEN prelude.lo CFA interpose_thread.lo CFA bits/weakso_locks.lo CFA algorithms/range_iterator.lo CFA collections/maybe.lo CFA collections/pair.lo CFA collections/result.lo CFA collections/string.lo CFA collections/string_res.lo CFA collections/vector.lo CFA device/cpu.lo CFA bits/debug.lo CFA concurrency/alarm.lo CFA concurrency/coroutine.lo CFA concurrency/exception.lo CFA concurrency/kernel.lo CFA concurrency/kernel/cluster.lo CFA concurrency/locks.lo CFA concurrency/monitor.lo CFA concurrency/mutex.lo CFA concurrency/select.lo CFA concurrency/thread.lo CFA concurrency/cofor.lo CFA concurrency/clib/cfathread.lo CPPAS concurrency/CtxSwitch-arm64.lo CC concurrency/invoke.lo CFA concurrency/io.lo CFA concurrency/io/setup.lo CFA concurrency/io/call.lo CFA concurrency/kernel/startup.lo CFA concurrency/preemption.lo CFA concurrency/ready_queue.lo CFA concurrency/stats.lo CFA concurrency/pthread.lo /usr/include/linux/io_uring.h:83:36: warning: 'packed' attribute ignored for field of type 'union __io_uring_sqe____anonymous65' [-Wattributes] 83 | } __attribute__((packed)); | ^ CCLD libcfa.la /usr/bin/ld: warning: .libs/common.o: requires executable stack (because the .note.GNU-stack section is executable) /usr/include/linux/io_uring.h:83:36: warning: 'packed' attribute ignored for field of type 'union __io_uring_sqe____anonymous129' [-Wattributes] 83 | } __attribute__((packed)); | ^ /usr/include/linux/io_uring.h:83:36: warning: 'packed' attribute ignored for field of type 'union __io_uring_sqe____anonymous53' [-Wattributes] 83 | } __attribute__((packed)); | ^ /usr/include/linux/io_uring.h:83:36: warning: 'packed' attribute ignored for field of type 'union __io_uring_sqe____anonymous119' [-Wattributes] 83 | } __attribute__((packed)); | ^ /usr/include/linux/io_uring.h:83:36: warning: 'packed' attribute ignored for field of type 'union __io_uring_sqe____anonymous119' [-Wattributes] 83 | } __attribute__((packed)); | ^ /usr/include/linux/io_uring.h:83:36: warning: 'packed' attribute ignored for field of type 'union __io_uring_sqe____anonymous32' [-Wattributes] 83 | } __attribute__((packed)); | ^ /usr/include/linux/io_uring.h:83:36: warning: 'packed' attribute ignored for field of type 'union __io_uring_sqe____anonymous97' [-Wattributes] 83 | } __attribute__((packed)); | ^ CCLD libcfathread.la /usr/bin/ld: warning: concurrency/.libs/alarm.o: requires executable stack (because the .note.GNU-stack section is executable) make[1]: Nothing to be done for 'all-am'. [Pipeline] } [Pipeline] // dir [Pipeline] } [Pipeline] // stage [Pipeline] echo -------- Build : libcfa(nodebug) -------- [Pipeline] stage [Pipeline] { (Build : libcfa(nodebug)) [Pipeline] dir Running in /var/lib/jenkins/workspace/Cforall_master@tmp [Pipeline] { [Pipeline] sh + nproc + make -j 96 --no-print-directory -C libcfa/arm64-nodebug Making all in prelude mkdir .deps touch .deps/builtins.Po cd .. && /bin/bash ./config.status prelude/defines.hfa config.status: creating prelude/defines.hfa config.status: prelude/defines.hfa is unchanged make all-am GEN gcc-builtins.c GEN builtins.cfa GEN prelude.cfa GEN extras.cfa GEN gcc-builtins.cfa GEN extras.cfa GEN bootloader.c Making all in src CFA common.lo CFA fstream.lo CFA heap.lo CFA iostream.lo CFA iterator.lo CFA limits.lo CFA math.lo CFA parseargs.lo CFA parseconfig.lo CFA rational.lo CFA memory.lo CFA stdlib.lo CFA strstream.lo CFA time.lo CFA assert.lo CFA bits/debug.lo CC exception.lo CFA interpose.lo CFA prelude-inline.lo CFA startup.lo CC virtual.lo GEN prelude.lo CFA interpose_thread.lo CFA bits/weakso_locks.lo CFA algorithms/range_iterator.lo CFA collections/maybe.lo CFA collections/pair.lo CFA collections/result.lo CFA collections/string.lo CFA collections/string_res.lo CFA collections/vector.lo CFA device/cpu.lo CFA concurrency/alarm.lo CFA concurrency/coroutine.lo CFA concurrency/exception.lo CFA concurrency/kernel.lo CFA concurrency/kernel/cluster.lo CFA concurrency/locks.lo CFA concurrency/monitor.lo CFA concurrency/mutex.lo CFA concurrency/select.lo CFA concurrency/thread.lo CFA concurrency/cofor.lo CFA concurrency/clib/cfathread.lo CPPAS concurrency/CtxSwitch-arm64.lo CC concurrency/invoke.lo CFA concurrency/io.lo CFA concurrency/io/setup.lo CFA concurrency/io/call.lo CFA concurrency/kernel/startup.lo CFA concurrency/preemption.lo CFA concurrency/ready_queue.lo CFA concurrency/stats.lo CFA concurrency/pthread.lo /var/lib/jenkins/workspace/Cforall_master/libcfa/src/exception.c: In function '__cfaehm_allocate_exception': /var/lib/jenkins/workspace/Cforall_master/libcfa/src/exception.c:142:3: warning: ignoring return value of 'write' declared with attribute 'warn_unused_result' [-Wunused-result] 142 | write( 2, "abort2\n", 7 ); | ^~~~~~~~~~~~~~~~~~~~~~~~~ /var/lib/jenkins/workspace/Cforall_master/libcfa/src/exception.c: In function '__cfaehm_exception_cleanup': /var/lib/jenkins/workspace/Cforall_master/libcfa/src/exception.c:127:3: warning: ignoring return value of 'write' declared with attribute 'warn_unused_result' [-Wunused-result] 127 | write( 2, "abort1\n", 7 ); | ^~~~~~~~~~~~~~~~~~~~~~~~~ /var/lib/jenkins/workspace/Cforall_master/libcfa/src/exception.c: In function '__cfaehm_cancel_stack': /var/lib/jenkins/workspace/Cforall_master/libcfa/src/exception.c:230:2: warning: ignoring return value of 'write' declared with attribute 'warn_unused_result' [-Wunused-result] 230 | write( 2, "abort3\n", 7 ); | ^~~~~~~~~~~~~~~~~~~~~~~~~ /var/lib/jenkins/workspace/Cforall_master/libcfa/src/exception.c: In function '__cfaehm_begin_unwind': /var/lib/jenkins/workspace/Cforall_master/libcfa/src/exception.c:252:3: warning: ignoring return value of 'write' declared with attribute 'warn_unused_result' [-Wunused-result] 252 | write( 2, "abort4\n", 7 ); | ^~~~~~~~~~~~~~~~~~~~~~~~~ /var/lib/jenkins/workspace/Cforall_master/libcfa/src/exception.c:278:3: warning: ignoring return value of 'write' declared with attribute 'warn_unused_result' [-Wunused-result] 278 | write( 2, "abort5\n", 7 ); | ^~~~~~~~~~~~~~~~~~~~~~~~~ /var/lib/jenkins/workspace/Cforall_master/libcfa/src/exception.c: In function '__cfaehm_rethrow_terminate': /var/lib/jenkins/workspace/Cforall_master/libcfa/src/exception.c:308:2: warning: ignoring return value of 'write' declared with attribute 'warn_unused_result' [-Wunused-result] 308 | write( 2, "abort7\n", 7 ); | ^~~~~~~~~~~~~~~~~~~~~~~~~ /var/lib/jenkins/workspace/Cforall_master/libcfa/src/exception.c: In function '__cfaehm_rethrow_adapter': /var/lib/jenkins/workspace/Cforall_master/libcfa/src/exception.c:300:2: warning: ignoring return value of 'write' declared with attribute 'warn_unused_result' [-Wunused-result] 300 | write( 2, "abort6\n", 7 ); | ^~~~~~~~~~~~~~~~~~~~~~~~~ /usr/include/linux/io_uring.h:83:36: warning: 'packed' attribute ignored for field of type 'union __io_uring_sqe____anonymous65' [-Wattributes] 83 | } __attribute__((packed)); | ^ /usr/include/aarch64-linux-gnu/bits/socket2.h:70:94: warning: '_X12_constructorFv_U26__anonymous___SOCKADDR_ARGU26__anonymous___SOCKADDR_ARG_autogen___1' is static but used in inline function 'recvfrom' which is not static 70 | return __recvfrom_chk (__fd, __buf, __n, sz, __flags, __addr, __addr_len); | ^ /usr/include/aarch64-linux-gnu/bits/socket2.h:70:124: warning: '_X11_destructorFv_U26__anonymous___SOCKADDR_ARG_autogen___1' is static but used in inline function 'recvfrom' which is not static 70 | return __recvfrom_chk (__fd, __buf, __n, sz, __flags, __addr, __addr_len); | ^ /usr/include/aarch64-linux-gnu/bits/socket2.h:68:103: warning: '_X12_constructorFv_U26__anonymous___SOCKADDR_ARGU26__anonymous___SOCKADDR_ARG_autogen___1' is static but used in inline function 'recvfrom' which is not static 68 | return __recvfrom_chk_warn (__fd, __buf, __n, sz, __flags, __addr, | ^ /usr/include/aarch64-linux-gnu/bits/socket2.h:68:128: warning: '_X11_destructorFv_U26__anonymous___SOCKADDR_ARG_autogen___1' is static but used in inline function 'recvfrom' which is not static 68 | return __recvfrom_chk_warn (__fd, __buf, __n, sz, __flags, __addr, | ^ /usr/include/aarch64-linux-gnu/bits/socket2.h:66:96: warning: '_X12_constructorFv_U26__anonymous___SOCKADDR_ARGU26__anonymous___SOCKADDR_ARG_autogen___1' is static but used in inline function 'recvfrom' which is not static 66 | return __recvfrom_alias (__fd, __buf, __n, __flags, __addr, __addr_len); | ^ /usr/include/aarch64-linux-gnu/bits/socket2.h:66:128: warning: '_X11_destructorFv_U26__anonymous___SOCKADDR_ARG_autogen___1' is static but used in inline function 'recvfrom' which is not static 66 | return __recvfrom_alias (__fd, __buf, __n, __flags, __addr, __addr_len); | ^ /usr/include/linux/io_uring.h:83:36: warning: 'packed' attribute ignored for field of type 'union __io_uring_sqe____anonymous53' [-Wattributes] 83 | } __attribute__((packed)); | ^ /usr/include/aarch64-linux-gnu/bits/socket2.h:70:95: warning: '_X12_constructorFv_U26__anonymous___SOCKADDR_ARGU26__anonymous___SOCKADDR_ARG_autogen___1' is static but used in inline function 'recvfrom' which is not static 70 | return __recvfrom_chk (__fd, __buf, __n, sz, __flags, __addr, __addr_len); | ^ /usr/include/aarch64-linux-gnu/bits/socket2.h:70:125: warning: '_X11_destructorFv_U26__anonymous___SOCKADDR_ARG_autogen___1' is static but used in inline function 'recvfrom' which is not static 70 | return __recvfrom_chk (__fd, __buf, __n, sz, __flags, __addr, __addr_len); | ^ /usr/include/aarch64-linux-gnu/bits/socket2.h:68:104: warning: '_X12_constructorFv_U26__anonymous___SOCKADDR_ARGU26__anonymous___SOCKADDR_ARG_autogen___1' is static but used in inline function 'recvfrom' which is not static 68 | return __recvfrom_chk_warn (__fd, __buf, __n, sz, __flags, __addr, | ^ /usr/include/aarch64-linux-gnu/bits/socket2.h:68:129: warning: '_X11_destructorFv_U26__anonymous___SOCKADDR_ARG_autogen___1' is static but used in inline function 'recvfrom' which is not static 68 | return __recvfrom_chk_warn (__fd, __buf, __n, sz, __flags, __addr, | ^ /usr/include/aarch64-linux-gnu/bits/socket2.h:66:97: warning: '_X12_constructorFv_U26__anonymous___SOCKADDR_ARGU26__anonymous___SOCKADDR_ARG_autogen___1' is static but used in inline function 'recvfrom' which is not static 66 | return __recvfrom_alias (__fd, __buf, __n, __flags, __addr, __addr_len); | ^ /usr/include/aarch64-linux-gnu/bits/socket2.h:66:129: warning: '_X11_destructorFv_U26__anonymous___SOCKADDR_ARG_autogen___1' is static but used in inline function 'recvfrom' which is not static 66 | return __recvfrom_alias (__fd, __buf, __n, __flags, __addr, __addr_len); | ^ /usr/include/linux/io_uring.h:83:36: warning: 'packed' attribute ignored for field of type 'union __io_uring_sqe____anonymous129' [-Wattributes] 83 | } __attribute__((packed)); | ^ /usr/include/aarch64-linux-gnu/bits/socket2.h:70:95: warning: '_X12_constructorFv_U26__anonymous___SOCKADDR_ARGU26__anonymous___SOCKADDR_ARG_autogen___1' is static but used in inline function 'recvfrom' which is not static 70 | return __recvfrom_chk (__fd, __buf, __n, sz, __flags, __addr, __addr_len); | ^ /usr/include/aarch64-linux-gnu/bits/socket2.h:70:125: warning: '_X11_destructorFv_U26__anonymous___SOCKADDR_ARG_autogen___1' is static but used in inline function 'recvfrom' which is not static 70 | return __recvfrom_chk (__fd, __buf, __n, sz, __flags, __addr, __addr_len); | ^ /usr/include/aarch64-linux-gnu/bits/socket2.h:68:104: warning: '_X12_constructorFv_U26__anonymous___SOCKADDR_ARGU26__anonymous___SOCKADDR_ARG_autogen___1' is static but used in inline function 'recvfrom' which is not static 68 | return __recvfrom_chk_warn (__fd, __buf, __n, sz, __flags, __addr, | ^ /usr/include/aarch64-linux-gnu/bits/socket2.h:68:129: warning: '_X11_destructorFv_U26__anonymous___SOCKADDR_ARG_autogen___1' is static but used in inline function 'recvfrom' which is not static 68 | return __recvfrom_chk_warn (__fd, __buf, __n, sz, __flags, __addr, | ^ /usr/include/aarch64-linux-gnu/bits/socket2.h:66:97: warning: '_X12_constructorFv_U26__anonymous___SOCKADDR_ARGU26__anonymous___SOCKADDR_ARG_autogen___1' is static but used in inline function 'recvfrom' which is not static 66 | return __recvfrom_alias (__fd, __buf, __n, __flags, __addr, __addr_len); | ^ /usr/include/aarch64-linux-gnu/bits/socket2.h:66:129: warning: '_X11_destructorFv_U26__anonymous___SOCKADDR_ARG_autogen___1' is static but used in inline function 'recvfrom' which is not static 66 | return __recvfrom_alias (__fd, __buf, __n, __flags, __addr, __addr_len); | ^ /usr/include/linux/io_uring.h:83:36: warning: 'packed' attribute ignored for field of type 'union __io_uring_sqe____anonymous119' [-Wattributes] 83 | } __attribute__((packed)); | ^ /usr/include/aarch64-linux-gnu/bits/socket2.h:70:95: warning: '_X12_constructorFv_U26__anonymous___SOCKADDR_ARGU26__anonymous___SOCKADDR_ARG_autogen___1' is static but used in inline function 'recvfrom' which is not static 70 | return __recvfrom_chk (__fd, __buf, __n, sz, __flags, __addr, __addr_len); | ^ /usr/include/aarch64-linux-gnu/bits/socket2.h:70:125: warning: '_X11_destructorFv_U26__anonymous___SOCKADDR_ARG_autogen___1' is static but used in inline function 'recvfrom' which is not static 70 | return __recvfrom_chk (__fd, __buf, __n, sz, __flags, __addr, __addr_len); | ^ /usr/include/aarch64-linux-gnu/bits/socket2.h:68:104: warning: '_X12_constructorFv_U26__anonymous___SOCKADDR_ARGU26__anonymous___SOCKADDR_ARG_autogen___1' is static but used in inline function 'recvfrom' which is not static 68 | return __recvfrom_chk_warn (__fd, __buf, __n, sz, __flags, __addr, | ^ /usr/include/aarch64-linux-gnu/bits/socket2.h:68:129: warning: '_X11_destructorFv_U26__anonymous___SOCKADDR_ARG_autogen___1' is static but used in inline function 'recvfrom' which is not static 68 | return __recvfrom_chk_warn (__fd, __buf, __n, sz, __flags, __addr, | ^ /usr/include/aarch64-linux-gnu/bits/socket2.h:66:97: warning: '_X12_constructorFv_U26__anonymous___SOCKADDR_ARGU26__anonymous___SOCKADDR_ARG_autogen___1' is static but used in inline function 'recvfrom' which is not static 66 | return __recvfrom_alias (__fd, __buf, __n, __flags, __addr, __addr_len); | ^ /usr/include/aarch64-linux-gnu/bits/socket2.h:66:129: warning: '_X11_destructorFv_U26__anonymous___SOCKADDR_ARG_autogen___1' is static but used in inline function 'recvfrom' which is not static 66 | return __recvfrom_alias (__fd, __buf, __n, __flags, __addr, __addr_len); | ^ /usr/include/linux/io_uring.h:83:36: warning: 'packed' attribute ignored for field of type 'union __io_uring_sqe____anonymous119' [-Wattributes] 83 | } __attribute__((packed)); | ^ /usr/include/aarch64-linux-gnu/bits/socket2.h:70:95: warning: '_X12_constructorFv_U26__anonymous___SOCKADDR_ARGU26__anonymous___SOCKADDR_ARG_autogen___1' is static but used in inline function 'recvfrom' which is not static 70 | return __recvfrom_chk (__fd, __buf, __n, sz, __flags, __addr, __addr_len); | ^ /usr/include/aarch64-linux-gnu/bits/socket2.h:70:125: warning: '_X11_destructorFv_U26__anonymous___SOCKADDR_ARG_autogen___1' is static but used in inline function 'recvfrom' which is not static 70 | return __recvfrom_chk (__fd, __buf, __n, sz, __flags, __addr, __addr_len); | ^ /usr/include/aarch64-linux-gnu/bits/socket2.h:68:104: warning: '_X12_constructorFv_U26__anonymous___SOCKADDR_ARGU26__anonymous___SOCKADDR_ARG_autogen___1' is static but used in inline function 'recvfrom' which is not static 68 | return __recvfrom_chk_warn (__fd, __buf, __n, sz, __flags, __addr, | ^ /usr/include/aarch64-linux-gnu/bits/socket2.h:68:129: warning: '_X11_destructorFv_U26__anonymous___SOCKADDR_ARG_autogen___1' is static but used in inline function 'recvfrom' which is not static 68 | return __recvfrom_chk_warn (__fd, __buf, __n, sz, __flags, __addr, | ^ /usr/include/aarch64-linux-gnu/bits/socket2.h:66:97: warning: '_X12_constructorFv_U26__anonymous___SOCKADDR_ARGU26__anonymous___SOCKADDR_ARG_autogen___1' is static but used in inline function 'recvfrom' which is not static 66 | return __recvfrom_alias (__fd, __buf, __n, __flags, __addr, __addr_len); | ^ /usr/include/aarch64-linux-gnu/bits/socket2.h:66:129: warning: '_X11_destructorFv_U26__anonymous___SOCKADDR_ARG_autogen___1' is static but used in inline function 'recvfrom' which is not static 66 | return __recvfrom_alias (__fd, __buf, __n, __flags, __addr, __addr_len); | ^ CCLD libcfa.la /usr/bin/ld: warning: .libs/common.o: requires executable stack (because the .note.GNU-stack section is executable) /usr/include/linux/io_uring.h:83:36: warning: 'packed' attribute ignored for field of type 'union __io_uring_sqe____anonymous32' [-Wattributes] 83 | } __attribute__((packed)); | ^ /usr/include/aarch64-linux-gnu/bits/socket2.h:70:94: warning: '_X12_constructorFv_U26__anonymous___SOCKADDR_ARGU26__anonymous___SOCKADDR_ARG_autogen___1' is static but used in inline function 'recvfrom' which is not static 70 | return __recvfrom_chk (__fd, __buf, __n, sz, __flags, __addr, __addr_len); | ^ /usr/include/aarch64-linux-gnu/bits/socket2.h:70:124: warning: '_X11_destructorFv_U26__anonymous___SOCKADDR_ARG_autogen___1' is static but used in inline function 'recvfrom' which is not static 70 | return __recvfrom_chk (__fd, __buf, __n, sz, __flags, __addr, __addr_len); | ^ /usr/include/aarch64-linux-gnu/bits/socket2.h:68:103: warning: '_X12_constructorFv_U26__anonymous___SOCKADDR_ARGU26__anonymous___SOCKADDR_ARG_autogen___1' is static but used in inline function 'recvfrom' which is not static 68 | return __recvfrom_chk_warn (__fd, __buf, __n, sz, __flags, __addr, | ^ /usr/include/aarch64-linux-gnu/bits/socket2.h:68:128: warning: '_X11_destructorFv_U26__anonymous___SOCKADDR_ARG_autogen___1' is static but used in inline function 'recvfrom' which is not static 68 | return __recvfrom_chk_warn (__fd, __buf, __n, sz, __flags, __addr, | ^ /usr/include/aarch64-linux-gnu/bits/socket2.h:66:96: warning: '_X12_constructorFv_U26__anonymous___SOCKADDR_ARGU26__anonymous___SOCKADDR_ARG_autogen___1' is static but used in inline function 'recvfrom' which is not static 66 | return __recvfrom_alias (__fd, __buf, __n, __flags, __addr, __addr_len); | ^ /usr/include/aarch64-linux-gnu/bits/socket2.h:66:128: warning: '_X11_destructorFv_U26__anonymous___SOCKADDR_ARG_autogen___1' is static but used in inline function 'recvfrom' which is not static 66 | return __recvfrom_alias (__fd, __buf, __n, __flags, __addr, __addr_len); | ^ /usr/include/linux/io_uring.h:83:36: warning: 'packed' attribute ignored for field of type 'union __io_uring_sqe____anonymous97' [-Wattributes] 83 | } __attribute__((packed)); | ^ /usr/include/aarch64-linux-gnu/bits/socket2.h:70:95: warning: '_X12_constructorFv_U26__anonymous___SOCKADDR_ARGU26__anonymous___SOCKADDR_ARG_autogen___1' is static but used in inline function 'recvfrom' which is not static 70 | return __recvfrom_chk (__fd, __buf, __n, sz, __flags, __addr, __addr_len); | ^ /usr/include/aarch64-linux-gnu/bits/socket2.h:70:125: warning: '_X11_destructorFv_U26__anonymous___SOCKADDR_ARG_autogen___1' is static but used in inline function 'recvfrom' which is not static 70 | return __recvfrom_chk (__fd, __buf, __n, sz, __flags, __addr, __addr_len); | ^ /usr/include/aarch64-linux-gnu/bits/socket2.h:68:104: warning: '_X12_constructorFv_U26__anonymous___SOCKADDR_ARGU26__anonymous___SOCKADDR_ARG_autogen___1' is static but used in inline function 'recvfrom' which is not static 68 | return __recvfrom_chk_warn (__fd, __buf, __n, sz, __flags, __addr, | ^ /usr/include/aarch64-linux-gnu/bits/socket2.h:68:129: warning: '_X11_destructorFv_U26__anonymous___SOCKADDR_ARG_autogen___1' is static but used in inline function 'recvfrom' which is not static 68 | return __recvfrom_chk_warn (__fd, __buf, __n, sz, __flags, __addr, | ^ /usr/include/aarch64-linux-gnu/bits/socket2.h:66:97: warning: '_X12_constructorFv_U26__anonymous___SOCKADDR_ARGU26__anonymous___SOCKADDR_ARG_autogen___1' is static but used in inline function 'recvfrom' which is not static 66 | return __recvfrom_alias (__fd, __buf, __n, __flags, __addr, __addr_len); | ^ /usr/include/aarch64-linux-gnu/bits/socket2.h:66:129: warning: '_X11_destructorFv_U26__anonymous___SOCKADDR_ARG_autogen___1' is static but used in inline function 'recvfrom' which is not static 66 | return __recvfrom_alias (__fd, __buf, __n, __flags, __addr, __addr_len); | ^ CCLD libcfathread.la /usr/bin/ld: warning: concurrency/.libs/coroutine.o: requires executable stack (because the .note.GNU-stack section is executable) make[1]: Nothing to be done for 'all-am'. [Pipeline] } [Pipeline] // dir [Pipeline] } [Pipeline] // stage [Pipeline] echo -------- Build : install -------- [Pipeline] stage [Pipeline] { (Build : install) [Pipeline] dir Running in /var/lib/jenkins/workspace/Cforall_master@tmp [Pipeline] { [Pipeline] sh + nproc + make -j 96 --no-print-directory install Making install in driver make install-exec-hook /usr/bin/install -c cfa '/var/lib/jenkins/workspace/Cforall_master@tmp/bin//cfa' /usr/bin/mkdir -p '/var/lib/jenkins/workspace/Cforall_master@tmp/lib/cfa/' /bin/bash ../libtool --mode=install /usr/bin/install -c as cc1 '/var/lib/jenkins/workspace/Cforall_master@tmp/lib/cfa/' libtool: install: /usr/bin/install -c as /var/lib/jenkins/workspace/Cforall_master@tmp/lib/cfa/as libtool: install: /usr/bin/install -c cc1 /var/lib/jenkins/workspace/Cforall_master@tmp/lib/cfa/cc1 Making install in src make install-am make[3]: Nothing to be done for 'install-exec-am'. /usr/bin/mkdir -p '/var/lib/jenkins/workspace/Cforall_master@tmp/lib/cfa/' /bin/bash ../libtool --mode=install /usr/bin/install -c ../driver/cfa-cpp '/var/lib/jenkins/workspace/Cforall_master@tmp/lib/cfa/' libtool: install: /usr/bin/install -c ../driver/cfa-cpp /var/lib/jenkins/workspace/Cforall_master@tmp/lib/cfa/cfa-cpp Making install in . (CDPATH="${ZSH_VERSION+.}:" && cd /var/lib/jenkins/workspace/Cforall_master && /bin/bash '/var/lib/jenkins/workspace/Cforall_master/automake/missing' autoheader) rm -f stamp-h1 touch /var/lib/jenkins/workspace/Cforall_master/src/config.h.in cd . && /bin/bash ./config.status config.h config.status: creating config.h config.status: config.h is unchanged make[2]: Nothing to be done for 'install-exec-am'. /usr/bin/mkdir -p '/var/lib/jenkins/workspace/Cforall_master@tmp/share/man/man1' /usr/bin/install -c -m 644 /var/lib/jenkins/workspace/Cforall_master/doc/man/cfa.1 '/var/lib/jenkins/workspace/Cforall_master@tmp/share/man/man1' Making install in libcfa/arm64-debug Making install in prelude touch .deps/builtins.Po make[3]: Nothing to be done for 'install-exec-am'. /usr/bin/mkdir -p '/var/lib/jenkins/workspace/Cforall_master@tmp/lib/cfa/arm64-debug/' /usr/bin/install -c -m 644 gcc-builtins.cfa builtins.cfa extras.cfa prelude.cfa bootloader.c defines.hfa '/var/lib/jenkins/workspace/Cforall_master@tmp/lib/cfa/arm64-debug/' Making install in src /usr/bin/mkdir -p '/var/lib/jenkins/workspace/Cforall_master@tmp/lib/cfa/arm64-debug/' /bin/bash ../libtool --mode=install /usr/bin/install -c libcfa.la libcfathread.la '/var/lib/jenkins/workspace/Cforall_master@tmp/lib/cfa/arm64-debug/' /usr/bin/mkdir -p '/var/lib/jenkins/workspace/Cforall_master@tmp/include/cfa/' /usr/bin/mkdir -p '/var/lib/jenkins/workspace/Cforall_master@tmp/include/cfa//stdhdr/sys' /usr/bin/install -c -m 644 /var/lib/jenkins/workspace/Cforall_master/libcfa/src/stdhdr/sys/mman.h /var/lib/jenkins/workspace/Cforall_master/libcfa/src/stdhdr/sys/time.h /var/lib/jenkins/workspace/Cforall_master/libcfa/src/stdhdr/sys/socket.h '/var/lib/jenkins/workspace/Cforall_master@tmp/include/cfa//stdhdr/sys' /usr/bin/mkdir -p '/var/lib/jenkins/workspace/Cforall_master@tmp/include/cfa//algorithms' /usr/bin/install -c -m 644 /var/lib/jenkins/workspace/Cforall_master/libcfa/src/algorithms/range_iterator.hfa '/var/lib/jenkins/workspace/Cforall_master@tmp/include/cfa//algorithms' /usr/bin/mkdir -p '/var/lib/jenkins/workspace/Cforall_master@tmp/include/cfa//concurrency/kernel' /usr/bin/install -c -m 644 /var/lib/jenkins/workspace/Cforall_master/libcfa/src/concurrency/kernel/cluster.hfa /var/lib/jenkins/workspace/Cforall_master/libcfa/src/concurrency/kernel/fwd.hfa '/var/lib/jenkins/workspace/Cforall_master@tmp/include/cfa//concurrency/kernel' /usr/bin/install -c -m 644 /var/lib/jenkins/workspace/Cforall_master/libcfa/src/common.hfa /var/lib/jenkins/workspace/Cforall_master/libcfa/src/fstream.hfa /var/lib/jenkins/workspace/Cforall_master/libcfa/src/heap.hfa /var/lib/jenkins/workspace/Cforall_master/libcfa/src/iostream.hfa /var/lib/jenkins/workspace/Cforall_master/libcfa/src/iterator.hfa /var/lib/jenkins/workspace/Cforall_master/libcfa/src/limits.hfa /var/lib/jenkins/workspace/Cforall_master/libcfa/src/math.hfa /var/lib/jenkins/workspace/Cforall_master/libcfa/src/memory.hfa /var/lib/jenkins/workspace/Cforall_master/libcfa/src/parseargs.hfa /var/lib/jenkins/workspace/Cforall_master/libcfa/src/parseconfig.hfa /var/lib/jenkins/workspace/Cforall_master/libcfa/src/rational.hfa /var/lib/jenkins/workspace/Cforall_master/libcfa/src/stdlib.hfa /var/lib/jenkins/workspace/Cforall_master/libcfa/src/strstream.hfa /var/lib/jenkins/workspace/Cforall_master/libcfa/src/time.hfa /var/lib/jenkins/workspace/Cforall_master/libcfa/src/Exception.hfa /var/lib/jenkins/workspace/Cforall_master/libcfa/src/bitmanip.hfa /var/lib/jenkins/workspace/Cforall_master/libcfa/src/clock.hfa /var/lib/jenkins/workspace/Cforall_master/libcfa/src/exception.hfa /var/lib/jenkins/workspace/Cforall_master/libcfa/src/exception.h /var/lib/jenkins/workspace/Cforall_master/libcfa/src/gmp.hfa /var/lib/jenkins/workspace/Cforall_master/libcfa/src/math.trait.hfa /var/lib/jenkins/workspace/Cforall_master/libcfa/src/raii.hfa /var/lib/jenkins/workspace/Cforall_master/libcfa/src/time_t.hfa /var/lib/jenkins/workspace/Cforall_master/libcfa/src/virtual_dtor.hfa '/var/lib/jenkins/workspace/Cforall_master@tmp/include/cfa//.' /usr/bin/mkdir -p '/var/lib/jenkins/workspace/Cforall_master@tmp/include/cfa//concurrency' /usr/bin/install -c -m 644 /var/lib/jenkins/workspace/Cforall_master/libcfa/src/concurrency/iofwd.hfa /var/lib/jenkins/workspace/Cforall_master/libcfa/src/concurrency/barrier.hfa /var/lib/jenkins/workspace/Cforall_master/libcfa/src/concurrency/alarm.hfa /var/lib/jenkins/workspace/Cforall_master/libcfa/src/concurrency/coroutine.hfa /var/lib/jenkins/workspace/Cforall_master/libcfa/src/concurrency/exception.hfa /var/lib/jenkins/workspace/Cforall_master/libcfa/src/concurrency/kernel.hfa /var/lib/jenkins/workspace/Cforall_master/libcfa/src/concurrency/locks.hfa /var/lib/jenkins/workspace/Cforall_master/libcfa/src/concurrency/monitor.hfa /var/lib/jenkins/workspace/Cforall_master/libcfa/src/concurrency/mutex.hfa /var/lib/jenkins/workspace/Cforall_master/libcfa/src/concurrency/select.hfa /var/lib/jenkins/workspace/Cforall_master/libcfa/src/concurrency/thread.hfa /var/lib/jenkins/workspace/Cforall_master/libcfa/src/concurrency/cofor.hfa /var/lib/jenkins/workspace/Cforall_master/libcfa/src/concurrency/invoke.h /var/lib/jenkins/workspace/Cforall_master/libcfa/src/concurrency/future.hfa /var/lib/jenkins/workspace/Cforall_master/libcfa/src/concurrency/once.hfa /var/lib/jenkins/workspace/Cforall_master/libcfa/src/concurrency/mutex_stmt.hfa /var/lib/jenkins/workspace/Cforall_master/libcfa/src/concurrency/channel.hfa /var/lib/jenkins/workspace/Cforall_master/libcfa/src/concurrency/actor.hfa '/var/lib/jenkins/workspace/Cforall_master@tmp/include/cfa//concurrency' /usr/bin/mkdir -p '/var/lib/jenkins/workspace/Cforall_master@tmp/include/cfa//concurrency/clib' /usr/bin/install -c -m 644 /var/lib/jenkins/workspace/Cforall_master/libcfa/src/concurrency/clib/cfathread.h '/var/lib/jenkins/workspace/Cforall_master@tmp/include/cfa//concurrency/clib' /usr/bin/mkdir -p '/var/lib/jenkins/workspace/Cforall_master@tmp/include/cfa//device' /usr/bin/install -c -m 644 /var/lib/jenkins/workspace/Cforall_master/libcfa/src/device/cpu.hfa '/var/lib/jenkins/workspace/Cforall_master@tmp/include/cfa//device' /usr/bin/mkdir -p '/var/lib/jenkins/workspace/Cforall_master@tmp/include/cfa//stdhdr/libltdl' /usr/bin/install -c -m 644 /var/lib/jenkins/workspace/Cforall_master/libcfa/src/stdhdr/libltdl/lt_dlloader.h '/var/lib/jenkins/workspace/Cforall_master@tmp/include/cfa//stdhdr/libltdl' /usr/bin/mkdir -p '/var/lib/jenkins/workspace/Cforall_master@tmp/include/cfa//vec' /usr/bin/install -c -m 644 /var/lib/jenkins/workspace/Cforall_master/libcfa/src/vec/vec.hfa /var/lib/jenkins/workspace/Cforall_master/libcfa/src/vec/vec2.hfa /var/lib/jenkins/workspace/Cforall_master/libcfa/src/vec/vec3.hfa /var/lib/jenkins/workspace/Cforall_master/libcfa/src/vec/vec4.hfa '/var/lib/jenkins/workspace/Cforall_master@tmp/include/cfa//vec' /usr/bin/mkdir -p '/var/lib/jenkins/workspace/Cforall_master@tmp/include/cfa//bits' libtool: install: /usr/bin/install -c .libs/libcfa.so.1.0.0 /var/lib/jenkins/workspace/Cforall_master@tmp/lib/cfa/arm64-debug/libcfa.so.1.0.0 /usr/bin/install -c -m 644 /var/lib/jenkins/workspace/Cforall_master/libcfa/src/bits/weakso_locks.hfa /var/lib/jenkins/workspace/Cforall_master/libcfa/src/bits/algorithm.hfa /var/lib/jenkins/workspace/Cforall_master/libcfa/src/bits/align.hfa /var/lib/jenkins/workspace/Cforall_master/libcfa/src/bits/collections.hfa /var/lib/jenkins/workspace/Cforall_master/libcfa/src/bits/debug.hfa /var/lib/jenkins/workspace/Cforall_master/libcfa/src/bits/defs.hfa /var/lib/jenkins/workspace/Cforall_master/libcfa/src/bits/locks.hfa /var/lib/jenkins/workspace/Cforall_master/libcfa/src/bits/collection.hfa /var/lib/jenkins/workspace/Cforall_master/libcfa/src/bits/stack.hfa /var/lib/jenkins/workspace/Cforall_master/libcfa/src/bits/queue.hfa /var/lib/jenkins/workspace/Cforall_master/libcfa/src/bits/sequence.hfa /var/lib/jenkins/workspace/Cforall_master/libcfa/src/bits/atomic.hfa /var/lib/jenkins/workspace/Cforall_master/libcfa/src/bits/random.hfa '/var/lib/jenkins/workspace/Cforall_master@tmp/include/cfa//bits' /usr/bin/mkdir -p '/var/lib/jenkins/workspace/Cforall_master@tmp/include/cfa//stdhdr' /usr/bin/install -c -m 644 /var/lib/jenkins/workspace/Cforall_master/libcfa/src/stdhdr/stdalign.h /var/lib/jenkins/workspace/Cforall_master/libcfa/src/stdhdr/stdio.h /var/lib/jenkins/workspace/Cforall_master/libcfa/src/stdhdr/malloc.h /var/lib/jenkins/workspace/Cforall_master/libcfa/src/stdhdr/time.h /var/lib/jenkins/workspace/Cforall_master/libcfa/src/stdhdr/signal.h /var/lib/jenkins/workspace/Cforall_master/libcfa/src/stdhdr/stdbool.h /var/lib/jenkins/workspace/Cforall_master/libcfa/src/stdhdr/unistd.h /var/lib/jenkins/workspace/Cforall_master/libcfa/src/stdhdr/stdatomic.h /var/lib/jenkins/workspace/Cforall_master/libcfa/src/stdhdr/stdint.h /var/lib/jenkins/workspace/Cforall_master/libcfa/src/stdhdr/gmp.h /var/lib/jenkins/workspace/Cforall_master/libcfa/src/stdhdr/locale.h /var/lib/jenkins/workspace/Cforall_master/libcfa/src/stdhdr/string.h /var/lib/jenkins/workspace/Cforall_master/libcfa/src/stdhdr/fenv.h /var/lib/jenkins/workspace/Cforall_master/libcfa/src/stdhdr/wchar.h /var/lib/jenkins/workspace/Cforall_master/libcfa/src/stdhdr/tgmath.h /var/lib/jenkins/workspace/Cforall_master/libcfa/src/stdhdr/math.h /var/lib/jenkins/workspace/Cforall_master/libcfa/src/stdhdr/pthread.h /var/lib/jenkins/workspace/Cforall_master/libcfa/src/stdhdr/complex.h /var/lib/jenkins/workspace/Cforall_master/libcfa/src/stdhdr/wctype.h /var/lib/jenkins/workspace/Cforall_master/libcfa/src/stdhdr/unwind.h /var/lib/jenkins/workspace/Cforall_master/libcfa/src/stdhdr/float.h /var/lib/jenkins/workspace/Cforall_master/libcfa/src/stdhdr/stdarg.h /var/lib/jenkins/workspace/Cforall_master/libcfa/src/stdhdr/stdlib.h /var/lib/jenkins/workspace/Cforall_master/libcfa/src/stdhdr/iso646.h /var/lib/jenkins/workspace/Cforall_master/libcfa/src/stdhdr/stddef.h /var/lib/jenkins/workspace/Cforall_master/libcfa/src/stdhdr/stdnoreturn.h /var/lib/jenkins/workspace/Cforall_master/libcfa/src/stdhdr/assert.h /var/lib/jenkins/workspace/Cforall_master/libcfa/src/stdhdr/ctype.h /var/lib/jenkins/workspace/Cforall_master/libcfa/src/stdhdr/errno.h /var/lib/jenkins/workspace/Cforall_master/libcfa/src/stdhdr/threads.h /var/lib/jenkins/workspace/Cforall_master/libcfa/src/stdhdr/uchar.h /var/lib/jenkins/workspace/Cforall_master/libcfa/src/stdhdr/inttypes.h /var/lib/jenkins/workspace/Cforall_master/libcfa/src/stdhdr/limits.h /var/lib/jenkins/workspace/Cforall_master/libcfa/src/stdhdr/setjmp.h '/var/lib/jenkins/workspace/Cforall_master@tmp/include/cfa//stdhdr' libtool: install: (cd /var/lib/jenkins/workspace/Cforall_master@tmp/lib/cfa/arm64-debug && { ln -s -f libcfa.so.1.0.0 libcfa.so.1 || { rm -f libcfa.so.1 && ln -s libcfa.so.1.0.0 libcfa.so.1; }; }) /usr/bin/mkdir -p '/var/lib/jenkins/workspace/Cforall_master@tmp/include/cfa//collections' /usr/bin/install -c -m 644 /var/lib/jenkins/workspace/Cforall_master/libcfa/src/collections/maybe.hfa /var/lib/jenkins/workspace/Cforall_master/libcfa/src/collections/pair.hfa /var/lib/jenkins/workspace/Cforall_master/libcfa/src/collections/result.hfa /var/lib/jenkins/workspace/Cforall_master/libcfa/src/collections/string.hfa /var/lib/jenkins/workspace/Cforall_master/libcfa/src/collections/string_res.hfa /var/lib/jenkins/workspace/Cforall_master/libcfa/src/collections/vector.hfa /var/lib/jenkins/workspace/Cforall_master/libcfa/src/collections/array.hfa /var/lib/jenkins/workspace/Cforall_master/libcfa/src/collections/list.hfa /var/lib/jenkins/workspace/Cforall_master/libcfa/src/collections/list2.hfa /var/lib/jenkins/workspace/Cforall_master/libcfa/src/collections/lockfree.hfa /var/lib/jenkins/workspace/Cforall_master/libcfa/src/collections/string_sharectx.hfa /var/lib/jenkins/workspace/Cforall_master/libcfa/src/collections/vector2.hfa '/var/lib/jenkins/workspace/Cforall_master@tmp/include/cfa//collections' libtool: install: (cd /var/lib/jenkins/workspace/Cforall_master@tmp/lib/cfa/arm64-debug && { ln -s -f libcfa.so.1.0.0 libcfa.so || { rm -f libcfa.so && ln -s libcfa.so.1.0.0 libcfa.so; }; }) libtool: install: /usr/bin/install -c .libs/libcfa.lai /var/lib/jenkins/workspace/Cforall_master@tmp/lib/cfa/arm64-debug/libcfa.la libtool: install: /usr/bin/install -c .libs/libcfathread.so.1.0.0 /var/lib/jenkins/workspace/Cforall_master@tmp/lib/cfa/arm64-debug/libcfathread.so.1.0.0 libtool: install: (cd /var/lib/jenkins/workspace/Cforall_master@tmp/lib/cfa/arm64-debug && { ln -s -f libcfathread.so.1.0.0 libcfathread.so.1 || { rm -f libcfathread.so.1 && ln -s libcfathread.so.1.0.0 libcfathread.so.1; }; }) libtool: install: (cd /var/lib/jenkins/workspace/Cforall_master@tmp/lib/cfa/arm64-debug && { ln -s -f libcfathread.so.1.0.0 libcfathread.so || { rm -f libcfathread.so && ln -s libcfathread.so.1.0.0 libcfathread.so; }; }) libtool: install: /usr/bin/install -c .libs/libcfathread.lai /var/lib/jenkins/workspace/Cforall_master@tmp/lib/cfa/arm64-debug/libcfathread.la libtool: warning: remember to run 'libtool --finish /var/lib/jenkins/workspace/Cforall_master@tmp/lib/cfa/arm64-debug/' make[3]: Nothing to be done for 'install-exec-am'. make[3]: Nothing to be done for 'install-data-am'. Making install in libcfa/arm64-nodebug Making install in prelude touch .deps/builtins.Po make[3]: Nothing to be done for 'install-exec-am'. /usr/bin/mkdir -p '/var/lib/jenkins/workspace/Cforall_master@tmp/lib/cfa/arm64-nodebug/' /usr/bin/install -c -m 644 gcc-builtins.cfa builtins.cfa extras.cfa prelude.cfa bootloader.c defines.hfa '/var/lib/jenkins/workspace/Cforall_master@tmp/lib/cfa/arm64-nodebug/' Making install in src /usr/bin/mkdir -p '/var/lib/jenkins/workspace/Cforall_master@tmp/lib/cfa/arm64-nodebug/' /bin/bash ../libtool --mode=install /usr/bin/install -c libcfa.la libcfathread.la '/var/lib/jenkins/workspace/Cforall_master@tmp/lib/cfa/arm64-nodebug/' /usr/bin/mkdir -p '/var/lib/jenkins/workspace/Cforall_master@tmp/include/cfa/' /usr/bin/mkdir -p '/var/lib/jenkins/workspace/Cforall_master@tmp/include/cfa//stdhdr/sys' /usr/bin/install -c -m 644 /var/lib/jenkins/workspace/Cforall_master/libcfa/src/stdhdr/sys/mman.h /var/lib/jenkins/workspace/Cforall_master/libcfa/src/stdhdr/sys/time.h /var/lib/jenkins/workspace/Cforall_master/libcfa/src/stdhdr/sys/socket.h '/var/lib/jenkins/workspace/Cforall_master@tmp/include/cfa//stdhdr/sys' /usr/bin/mkdir -p '/var/lib/jenkins/workspace/Cforall_master@tmp/include/cfa//algorithms' /usr/bin/install -c -m 644 /var/lib/jenkins/workspace/Cforall_master/libcfa/src/algorithms/range_iterator.hfa '/var/lib/jenkins/workspace/Cforall_master@tmp/include/cfa//algorithms' /usr/bin/mkdir -p '/var/lib/jenkins/workspace/Cforall_master@tmp/include/cfa//concurrency/kernel' /usr/bin/install -c -m 644 /var/lib/jenkins/workspace/Cforall_master/libcfa/src/concurrency/kernel/cluster.hfa /var/lib/jenkins/workspace/Cforall_master/libcfa/src/concurrency/kernel/fwd.hfa '/var/lib/jenkins/workspace/Cforall_master@tmp/include/cfa//concurrency/kernel' /usr/bin/install -c -m 644 /var/lib/jenkins/workspace/Cforall_master/libcfa/src/common.hfa /var/lib/jenkins/workspace/Cforall_master/libcfa/src/fstream.hfa /var/lib/jenkins/workspace/Cforall_master/libcfa/src/heap.hfa /var/lib/jenkins/workspace/Cforall_master/libcfa/src/iostream.hfa /var/lib/jenkins/workspace/Cforall_master/libcfa/src/iterator.hfa /var/lib/jenkins/workspace/Cforall_master/libcfa/src/limits.hfa /var/lib/jenkins/workspace/Cforall_master/libcfa/src/math.hfa /var/lib/jenkins/workspace/Cforall_master/libcfa/src/memory.hfa /var/lib/jenkins/workspace/Cforall_master/libcfa/src/parseargs.hfa /var/lib/jenkins/workspace/Cforall_master/libcfa/src/parseconfig.hfa /var/lib/jenkins/workspace/Cforall_master/libcfa/src/rational.hfa /var/lib/jenkins/workspace/Cforall_master/libcfa/src/stdlib.hfa /var/lib/jenkins/workspace/Cforall_master/libcfa/src/strstream.hfa /var/lib/jenkins/workspace/Cforall_master/libcfa/src/time.hfa /var/lib/jenkins/workspace/Cforall_master/libcfa/src/Exception.hfa /var/lib/jenkins/workspace/Cforall_master/libcfa/src/bitmanip.hfa /var/lib/jenkins/workspace/Cforall_master/libcfa/src/clock.hfa /var/lib/jenkins/workspace/Cforall_master/libcfa/src/exception.hfa /var/lib/jenkins/workspace/Cforall_master/libcfa/src/exception.h /var/lib/jenkins/workspace/Cforall_master/libcfa/src/gmp.hfa /var/lib/jenkins/workspace/Cforall_master/libcfa/src/math.trait.hfa /var/lib/jenkins/workspace/Cforall_master/libcfa/src/raii.hfa /var/lib/jenkins/workspace/Cforall_master/libcfa/src/time_t.hfa /var/lib/jenkins/workspace/Cforall_master/libcfa/src/virtual_dtor.hfa '/var/lib/jenkins/workspace/Cforall_master@tmp/include/cfa//.' /usr/bin/mkdir -p '/var/lib/jenkins/workspace/Cforall_master@tmp/include/cfa//concurrency' /usr/bin/install -c -m 644 /var/lib/jenkins/workspace/Cforall_master/libcfa/src/concurrency/iofwd.hfa /var/lib/jenkins/workspace/Cforall_master/libcfa/src/concurrency/barrier.hfa /var/lib/jenkins/workspace/Cforall_master/libcfa/src/concurrency/alarm.hfa /var/lib/jenkins/workspace/Cforall_master/libcfa/src/concurrency/coroutine.hfa /var/lib/jenkins/workspace/Cforall_master/libcfa/src/concurrency/exception.hfa /var/lib/jenkins/workspace/Cforall_master/libcfa/src/concurrency/kernel.hfa /var/lib/jenkins/workspace/Cforall_master/libcfa/src/concurrency/locks.hfa /var/lib/jenkins/workspace/Cforall_master/libcfa/src/concurrency/monitor.hfa /var/lib/jenkins/workspace/Cforall_master/libcfa/src/concurrency/mutex.hfa /var/lib/jenkins/workspace/Cforall_master/libcfa/src/concurrency/select.hfa /var/lib/jenkins/workspace/Cforall_master/libcfa/src/concurrency/thread.hfa /var/lib/jenkins/workspace/Cforall_master/libcfa/src/concurrency/cofor.hfa /var/lib/jenkins/workspace/Cforall_master/libcfa/src/concurrency/invoke.h /var/lib/jenkins/workspace/Cforall_master/libcfa/src/concurrency/future.hfa /var/lib/jenkins/workspace/Cforall_master/libcfa/src/concurrency/once.hfa /var/lib/jenkins/workspace/Cforall_master/libcfa/src/concurrency/mutex_stmt.hfa /var/lib/jenkins/workspace/Cforall_master/libcfa/src/concurrency/channel.hfa /var/lib/jenkins/workspace/Cforall_master/libcfa/src/concurrency/actor.hfa '/var/lib/jenkins/workspace/Cforall_master@tmp/include/cfa//concurrency' /usr/bin/mkdir -p '/var/lib/jenkins/workspace/Cforall_master@tmp/include/cfa//concurrency/clib' /usr/bin/install -c -m 644 /var/lib/jenkins/workspace/Cforall_master/libcfa/src/concurrency/clib/cfathread.h '/var/lib/jenkins/workspace/Cforall_master@tmp/include/cfa//concurrency/clib' /usr/bin/mkdir -p '/var/lib/jenkins/workspace/Cforall_master@tmp/include/cfa//device' /usr/bin/install -c -m 644 /var/lib/jenkins/workspace/Cforall_master/libcfa/src/device/cpu.hfa '/var/lib/jenkins/workspace/Cforall_master@tmp/include/cfa//device' /usr/bin/mkdir -p '/var/lib/jenkins/workspace/Cforall_master@tmp/include/cfa//stdhdr/libltdl' /usr/bin/install -c -m 644 /var/lib/jenkins/workspace/Cforall_master/libcfa/src/stdhdr/libltdl/lt_dlloader.h '/var/lib/jenkins/workspace/Cforall_master@tmp/include/cfa//stdhdr/libltdl' /usr/bin/mkdir -p '/var/lib/jenkins/workspace/Cforall_master@tmp/include/cfa//vec' /usr/bin/install -c -m 644 /var/lib/jenkins/workspace/Cforall_master/libcfa/src/vec/vec.hfa /var/lib/jenkins/workspace/Cforall_master/libcfa/src/vec/vec2.hfa /var/lib/jenkins/workspace/Cforall_master/libcfa/src/vec/vec3.hfa /var/lib/jenkins/workspace/Cforall_master/libcfa/src/vec/vec4.hfa '/var/lib/jenkins/workspace/Cforall_master@tmp/include/cfa//vec' /usr/bin/mkdir -p '/var/lib/jenkins/workspace/Cforall_master@tmp/include/cfa//bits' /usr/bin/install -c -m 644 /var/lib/jenkins/workspace/Cforall_master/libcfa/src/bits/weakso_locks.hfa /var/lib/jenkins/workspace/Cforall_master/libcfa/src/bits/algorithm.hfa /var/lib/jenkins/workspace/Cforall_master/libcfa/src/bits/align.hfa /var/lib/jenkins/workspace/Cforall_master/libcfa/src/bits/collections.hfa /var/lib/jenkins/workspace/Cforall_master/libcfa/src/bits/debug.hfa /var/lib/jenkins/workspace/Cforall_master/libcfa/src/bits/defs.hfa /var/lib/jenkins/workspace/Cforall_master/libcfa/src/bits/locks.hfa /var/lib/jenkins/workspace/Cforall_master/libcfa/src/bits/collection.hfa /var/lib/jenkins/workspace/Cforall_master/libcfa/src/bits/stack.hfa /var/lib/jenkins/workspace/Cforall_master/libcfa/src/bits/queue.hfa /var/lib/jenkins/workspace/Cforall_master/libcfa/src/bits/sequence.hfa /var/lib/jenkins/workspace/Cforall_master/libcfa/src/bits/atomic.hfa /var/lib/jenkins/workspace/Cforall_master/libcfa/src/bits/random.hfa '/var/lib/jenkins/workspace/Cforall_master@tmp/include/cfa//bits' libtool: install: /usr/bin/install -c .libs/libcfa.so.1.0.0 /var/lib/jenkins/workspace/Cforall_master@tmp/lib/cfa/arm64-nodebug/libcfa.so.1.0.0 /usr/bin/mkdir -p '/var/lib/jenkins/workspace/Cforall_master@tmp/include/cfa//stdhdr' /usr/bin/install -c -m 644 /var/lib/jenkins/workspace/Cforall_master/libcfa/src/stdhdr/stdalign.h /var/lib/jenkins/workspace/Cforall_master/libcfa/src/stdhdr/stdio.h /var/lib/jenkins/workspace/Cforall_master/libcfa/src/stdhdr/malloc.h /var/lib/jenkins/workspace/Cforall_master/libcfa/src/stdhdr/time.h /var/lib/jenkins/workspace/Cforall_master/libcfa/src/stdhdr/signal.h /var/lib/jenkins/workspace/Cforall_master/libcfa/src/stdhdr/stdbool.h /var/lib/jenkins/workspace/Cforall_master/libcfa/src/stdhdr/unistd.h /var/lib/jenkins/workspace/Cforall_master/libcfa/src/stdhdr/stdatomic.h /var/lib/jenkins/workspace/Cforall_master/libcfa/src/stdhdr/stdint.h /var/lib/jenkins/workspace/Cforall_master/libcfa/src/stdhdr/gmp.h /var/lib/jenkins/workspace/Cforall_master/libcfa/src/stdhdr/locale.h /var/lib/jenkins/workspace/Cforall_master/libcfa/src/stdhdr/string.h /var/lib/jenkins/workspace/Cforall_master/libcfa/src/stdhdr/fenv.h /var/lib/jenkins/workspace/Cforall_master/libcfa/src/stdhdr/wchar.h /var/lib/jenkins/workspace/Cforall_master/libcfa/src/stdhdr/tgmath.h /var/lib/jenkins/workspace/Cforall_master/libcfa/src/stdhdr/math.h /var/lib/jenkins/workspace/Cforall_master/libcfa/src/stdhdr/pthread.h /var/lib/jenkins/workspace/Cforall_master/libcfa/src/stdhdr/complex.h /var/lib/jenkins/workspace/Cforall_master/libcfa/src/stdhdr/wctype.h /var/lib/jenkins/workspace/Cforall_master/libcfa/src/stdhdr/unwind.h /var/lib/jenkins/workspace/Cforall_master/libcfa/src/stdhdr/float.h /var/lib/jenkins/workspace/Cforall_master/libcfa/src/stdhdr/stdarg.h /var/lib/jenkins/workspace/Cforall_master/libcfa/src/stdhdr/stdlib.h /var/lib/jenkins/workspace/Cforall_master/libcfa/src/stdhdr/iso646.h /var/lib/jenkins/workspace/Cforall_master/libcfa/src/stdhdr/stddef.h /var/lib/jenkins/workspace/Cforall_master/libcfa/src/stdhdr/stdnoreturn.h /var/lib/jenkins/workspace/Cforall_master/libcfa/src/stdhdr/assert.h /var/lib/jenkins/workspace/Cforall_master/libcfa/src/stdhdr/ctype.h /var/lib/jenkins/workspace/Cforall_master/libcfa/src/stdhdr/errno.h /var/lib/jenkins/workspace/Cforall_master/libcfa/src/stdhdr/threads.h /var/lib/jenkins/workspace/Cforall_master/libcfa/src/stdhdr/uchar.h /var/lib/jenkins/workspace/Cforall_master/libcfa/src/stdhdr/inttypes.h /var/lib/jenkins/workspace/Cforall_master/libcfa/src/stdhdr/limits.h /var/lib/jenkins/workspace/Cforall_master/libcfa/src/stdhdr/setjmp.h '/var/lib/jenkins/workspace/Cforall_master@tmp/include/cfa//stdhdr' /usr/bin/mkdir -p '/var/lib/jenkins/workspace/Cforall_master@tmp/include/cfa//collections' /usr/bin/install -c -m 644 /var/lib/jenkins/workspace/Cforall_master/libcfa/src/collections/maybe.hfa /var/lib/jenkins/workspace/Cforall_master/libcfa/src/collections/pair.hfa /var/lib/jenkins/workspace/Cforall_master/libcfa/src/collections/result.hfa /var/lib/jenkins/workspace/Cforall_master/libcfa/src/collections/string.hfa /var/lib/jenkins/workspace/Cforall_master/libcfa/src/collections/string_res.hfa /var/lib/jenkins/workspace/Cforall_master/libcfa/src/collections/vector.hfa /var/lib/jenkins/workspace/Cforall_master/libcfa/src/collections/array.hfa /var/lib/jenkins/workspace/Cforall_master/libcfa/src/collections/list.hfa /var/lib/jenkins/workspace/Cforall_master/libcfa/src/collections/list2.hfa /var/lib/jenkins/workspace/Cforall_master/libcfa/src/collections/lockfree.hfa /var/lib/jenkins/workspace/Cforall_master/libcfa/src/collections/string_sharectx.hfa /var/lib/jenkins/workspace/Cforall_master/libcfa/src/collections/vector2.hfa '/var/lib/jenkins/workspace/Cforall_master@tmp/include/cfa//collections' libtool: install: (cd /var/lib/jenkins/workspace/Cforall_master@tmp/lib/cfa/arm64-nodebug && { ln -s -f libcfa.so.1.0.0 libcfa.so.1 || { rm -f libcfa.so.1 && ln -s libcfa.so.1.0.0 libcfa.so.1; }; }) libtool: install: (cd /var/lib/jenkins/workspace/Cforall_master@tmp/lib/cfa/arm64-nodebug && { ln -s -f libcfa.so.1.0.0 libcfa.so || { rm -f libcfa.so && ln -s libcfa.so.1.0.0 libcfa.so; }; }) libtool: install: /usr/bin/install -c .libs/libcfa.lai /var/lib/jenkins/workspace/Cforall_master@tmp/lib/cfa/arm64-nodebug/libcfa.la libtool: install: /usr/bin/install -c .libs/libcfathread.so.1.0.0 /var/lib/jenkins/workspace/Cforall_master@tmp/lib/cfa/arm64-nodebug/libcfathread.so.1.0.0 libtool: install: (cd /var/lib/jenkins/workspace/Cforall_master@tmp/lib/cfa/arm64-nodebug && { ln -s -f libcfathread.so.1.0.0 libcfathread.so.1 || { rm -f libcfathread.so.1 && ln -s libcfathread.so.1.0.0 libcfathread.so.1; }; }) libtool: install: (cd /var/lib/jenkins/workspace/Cforall_master@tmp/lib/cfa/arm64-nodebug && { ln -s -f libcfathread.so.1.0.0 libcfathread.so || { rm -f libcfathread.so && ln -s libcfathread.so.1.0.0 libcfathread.so; }; }) libtool: install: /usr/bin/install -c .libs/libcfathread.lai /var/lib/jenkins/workspace/Cforall_master@tmp/lib/cfa/arm64-nodebug/libcfathread.la libtool: warning: remember to run 'libtool --finish /var/lib/jenkins/workspace/Cforall_master@tmp/lib/cfa/arm64-nodebug/' make[3]: Nothing to be done for 'install-exec-am'. make[3]: Nothing to be done for 'install-data-am'. [Pipeline] } [Pipeline] // dir [Pipeline] } [Pipeline] // stage [Pipeline] sh + free -h total used free shared buff/cache available Mem: 502Gi 8.2Gi 488Gi 3.5Mi 8.1Gi 494Gi Swap: 127Gi 0B 127Gi [Pipeline] sh + ulimit -a time(seconds) unlimited file(blocks) unlimited data(kbytes) unlimited stack(kbytes) 8192 coredump(blocks) 0 memory(kbytes) unlimited locked memory(kbytes) 65876424 process 2058179 nofiles 1048576 vmemory(kbytes) unlimited locks unlimited rtprio 0 [Pipeline] echo -------- Test: Debug -------- [Pipeline] stage [Pipeline] { (Test: Debug) [Pipeline] dir Running in /var/lib/jenkins/workspace/Cforall_master@tmp [Pipeline] { [Pipeline] sh + nproc + make -j 96 --no-print-directory -C tests timeout=600 global-timeout=14400 tests debug=yes archive-errors=/var/lib/jenkins/workspace/Cforall_master@tmp/tests/crashes/full-debug Running 375 tests on 96 cores (arm64 - debug) array-ERR2 PASSED C 0:00.118 - R n/a array-ERR3 PASSED C 0:00.130 - R n/a ...ollections/language-dim-mismatch PASSED C 0:00.364 - R n/a concurrency/mainError PASSED C 0:00.481 - R n/a concurrency/keywordErrors PASSED C 0:00.624 - R n/a array-collections/symtab-collision PASSED C 0:00.866 - R n/a castError PASSED C 0:00.932 - R n/a array-collections/safety-summary PASSED C 0:01.147 - R n/a concurrency/ctor-check PASSED C 0:01.195 - R n/a attr-priority PASSED C 0:01.644 - R 0:00.004 array-ERR1 PASSED C 0:01.659 - R n/a array PASSED C 0:01.618 - R 0:00.079 cast PASSED C 0:01.646 - R 0:00.079 castReturn PASSED C 0:01.733 - R 0:00.075 array-collections/c-dependent PASSED C 0:01.811 - R 0:00.038 builtins/sync PASSED C 0:01.846 - R 0:00.037 array-collections/array-raii-c PASSED C 0:01.855 - R 0:00.040 array-collections/dimexpr-match-c PASSED C 0:02.008 - R 0:00.081 concurrency/clib_tls PASSED C 0:02.626 - R 0:00.038 array-collections/array-sbscr-types PASSED C 0:02.971 - R 0:00.024 concurrency/clib PASSED C 0:02.784 - R 0:00.232 array-collections/dimexpr-match-cfa PASSED C 0:03.012 - R 0:00.041 array-collections/array-basic PASSED C 0:03.031 - R 0:00.037 ...ns/vector-err-retn-perm-it-byval PASSED C 0:03.098 - R n/a array-collections/boxed PASSED C 0:03.264 - R 0:00.074 ...ns/vector-err-pass-perm-it-byval PASSED C 0:03.592 - R n/a collections/string-operator-ERR13 PASSED C 0:05.398 - R n/a collections/string-operator-ERR16 PASSED C 0:05.420 - R n/a avl_test PASSED C 0:05.406 - R 0:00.039 collections/string-operator-ERR11 PASSED C 0:05.549 - R n/a ...urrency/pthread/pthread_key_test PASSED C 0:03.812 - R 0:00.038 collections/string-operator-ERR15 PASSED C 0:05.658 - R n/a collections/string-operator-ERR09 PASSED C 0:05.681 - R n/a alloc-ERROR PASSED C 0:06.058 - R n/a collections/vector-demo PASSED C 0:06.034 - R 0:00.021 algorithms/range_test PASSED C 0:06.743 - R 0:00.039 complex PASSED C 0:06.853 - R 0:00.025 array-collections/accordion PASSED C 0:07.122 - R 0:00.022 array-collections/array-raii-cfa PASSED C 0:07.343 - R 0:00.022 collections/string-gc PASSED C 0:07.443 - R 0:00.027 collections/string-istream PASSED C 0:08.273 - R 0:00.038 concurrency/futures/basic PASSED C 0:08.724 - R 0:00.121 concurrency/cluster PASSED C 0:08.906 - R 0:00.072 concurrency/futures/abandon PASSED C 0:08.906 - R 0:00.124 collections/stack PASSED C 0:09.102 - R 0:00.023 concurrency/park/start_parked PASSED C 0:08.344 - R 0:00.122 concurrency/park/contention PASSED C 0:08.650 - R 0:00.426 collections/string-compare PASSED C 0:09.817 - R 0:00.027 collections/string-ostream PASSED C 0:09.889 - R 0:00.042 collections/multi_list PASSED C 0:10.102 - R 0:00.022 collections/queue PASSED C 0:10.156 - R 0:00.028 collections/string-operator PASSED C 0:10.679 - R 0:00.037 collections/string-ctx-manage PASSED C 0:10.781 - R 0:00.125 concurrency/cofor PASSED C 0:10.816 - R 0:00.071 collections/sequence PASSED C 0:10.970 - R 0:00.071 collections/string-istream-manip PASSED C 0:11.392 - R 0:00.277 concurrency/examples/matrixSum PASSED C 0:11.771 - R 0:00.075 concurrency/join PASSED C 0:11.944 - R 0:00.072 ...ections/string-overwrite-noshare PASSED C 0:12.269 - R 0:00.130 collections/string-overwrite PASSED C 0:12.381 - R 0:00.072 concurrency/examples/gortn PASSED C 0:12.375 - R 0:00.127 concurrency/examples/datingService PASSED C 0:12.980 - R 0:00.126 alloc PASSED C 0:13.175 - R 0:00.040 concurrency/migrate PASSED C 0:12.971 - R 0:00.232 ...rrency/pthread/pthread_attr_test PASSED C 0:11.935 - R 0:00.079 const-init PASSED C 0:01.645 - R 0:00.079 const-ref PASSED C 0:01.572 - R 0:00.022 concurrency/park/force_preempt PASSED C 0:12.443 - R 0:00.479 ...pthread/pthread_demo_create_join PASSED C 0:11.981 - R 0:00.039 ...rrency/pthread/pthread_cond_test PASSED C 0:12.013 - R 0:00.132 ...rrency/pthread/pthread_once_test PASSED C 0:12.018 - R 0:00.172 ...ions/string-api-coverage-noshare PASSED C 0:14.086 - R 0:00.139 collections/string-api-coverage PASSED C 0:14.289 - R 0:00.071 concurrency/futures/wait_any PASSED C 0:14.891 - R 0:00.128 concurrency/once PASSED C 0:14.508 - R 0:00.325 concurrency/mutexstmt/tuple PASSED C 0:15.012 - R 0:00.128 concurrency/waitfor/parse PASSED C 0:07.791 - R 0:00.133 concurrency/readyQ/leader_spin PASSED C 0:12.197 - R 0:01.230 concurrency/coroutineYield PASSED C 0:15.337 - R 0:00.121 ctrl-flow/labelledExit PASSED C 0:01.649 - R 0:00.125 ctrl-flow/loop-inc PASSED C 0:01.610 - R 0:00.041 concurrency/barrier/last PASSED C 0:15.961 - R 0:00.322 concurrency/barrier/order PASSED C 0:16.046 - R 0:00.373 concurrency/signal/wait PASSED C 0:12.813 - R 0:00.924 concurrency/suspend_then PASSED C 0:13.309 - R 0:00.123 concurrency/lockfree_stack PASSED C 0:12.065 - R 0:04.592 alloc2 PASSED C 0:16.876 - R 0:00.074 concurrency/sleep PASSED C 0:12.869 - R 0:01.225 enum PASSED C 0:01.586 - R 0:00.043 concurrency/thread PASSED C 0:14.042 - R 0:00.073 ...cy/unified_locking/pthread_locks PASSED C 0:11.052 - R 0:00.578 concurrency/examples/quickSort PASSED C 0:17.152 - R 0:00.171 enum_tests/lvalue PASSED C 0:00.839 - R n/a ...ency/unified_locking/exp_backoff PASSED C 0:14.130 - R 0:00.124 errors/declaration PASSED C 0:00.160 - R n/a errors/scope-type PASSED C 0:00.252 - R n/a errors/signature PASSED C 0:00.203 - R n/a concurrency/barrier/generation PASSED C 0:15.478 - R 0:02.532 ...ncy/unified_locking/timeout_lock PASSED C 0:10.924 - R 0:01.279 designations PASSED C 0:02.937 - R 0:00.041 enum_tests/inc-dec PASSED C 0:01.738 - R 0:00.122 .../unified_locking/fast_block_lock PASSED C 0:14.680 - R 0:00.278 errors/scope PASSED C 0:00.929 - R n/a concurrency/waitfor/else PASSED C 0:11.379 - R 0:00.121 concurrency/actors/inline PASSED C 0:18.245 - R 0:00.171 concurrency/actors/static PASSED C 0:18.103 - R 0:00.376 concurrency/actors/types PASSED C 0:18.352 - R 0:00.226 concurrency/actors/executor PASSED C 0:18.529 - R 0:00.129 concurrency/actors/pingpong PASSED C 0:18.525 - R 0:00.174 concurrency/mutexstmt/monitors PASSED C 0:10.068 - R 0:08.528 concurrency/actors/inherit PASSED C 0:18.717 - R 0:00.069 concurrency/actors/poison PASSED C 0:18.653 - R 0:00.170 enum_tests/funcEnum PASSED C 0:02.621 - R 0:00.038 .../unified_locking/block_spin_lock PASSED C 0:14.326 - R 0:01.630 eval PASSED C 0:01.575 - R 0:00.040 concurrency/futures/typed PASSED C 0:18.769 - R 0:00.523 copyfile PASSED C 0:07.180 - R 0:00.124 ...urrency/waitfor/lexical_priority PASSED C 0:12.210 - R 0:00.084 concurrency/readyQ/barrier_sleeper PASSED C 0:15.223 - R 0:02.430 concurrency/actors/matrixMultiply PASSED C 0:18.261 - R 0:01.432 concurrency/waitfor/barge PASSED C 0:12.418 - R 0:01.230 enum_tests/structEnum PASSED C 0:02.666 - R 0:00.036 exceptions/try-ctrl-flow PASSED C 0:00.514 - R n/a exceptions/type-check PASSED C 0:00.666 - R n/a ...fied_locking/mcs_block_spin_lock PASSED C 0:14.427 - R 0:00.321 counter PASSED C 0:07.026 - R 0:00.127 ...nified_locking/simple_owner_lock PASSED C 0:14.634 - R 0:00.376 ctrl-flow/goto PASSED C 0:07.073 - R 0:00.040 ctrl-flow/loop_else PASSED C 0:06.489 - R 0:00.035 configs/parsebools PASSED C 0:09.761 - R 0:00.221 configs/parseconfig PASSED C 0:09.932 - R 0:00.069 concurrency/signal/disjoint PASSED C 0:12.566 - R 0:06.292 ctrl-flow/fallthrough PASSED C 0:07.160 - R 0:00.126 coroutine/fibonacci PASSED C 0:08.449 - R 0:00.069 ctrl-flow/break-misc PASSED C 0:07.445 - R 0:00.039 coroutine/devicedriver PASSED C 0:08.609 - R 0:00.043 ctrl-flow/ifwhileCtl PASSED C 0:07.252 - R 0:00.039 exceptions/try-leave-catch PASSED C 0:01.584 - R 0:00.133 configs/usage PASSED C 0:10.115 - R 0:00.070 concurrency/signal/block PASSED C 0:13.039 - R 0:06.347 concurrency/waitfor/statment PASSED C 0:13.036 - R 0:00.118 expression PASSED C 0:01.633 - R 0:00.040 exceptions/message PASSED C 0:02.842 - R 0:00.040 coroutine/fmtLines PASSED C 0:09.016 - R 0:00.123 coroutine/pingpong PASSED C 0:08.696 - R 0:00.038 concurrency/waituntil/timeout PASSED C 0:07.734 - R 0:03.642 ...rrency/pthread/pthread_demo_lock PASSED C 0:12.061 - R 0:08.408 coroutine/runningTotal PASSED C 0:08.854 - R 0:00.077 global-monomorph PASSED C 0:01.444 - R 0:00.021 identParamDeclarator PASSED C 0:01.443 - R 0:00.035 init1-ERROR PASSED C 0:00.932 - R n/a identFuncDeclarator PASSED C 0:01.644 - R 0:00.041 init1 PASSED C 0:01.457 - R 0:00.038 enum_tests/anonymous PASSED C 0:07.236 - R 0:00.038 ctrl-flow/loop_else-WRN1 PASSED C 0:08.257 - R 0:00.003 coroutine/raii PASSED C 0:10.071 - R 0:00.074 concurrency/waitfor/when PASSED C 0:14.220 - R 0:00.419 include/vector-sequence PASSED C 0:02.261 - R 0:00.036 enum_tests/enumInlineValue PASSED C 0:07.832 - R 0:00.038 enum_tests/input PASSED C 0:07.230 - R 0:00.177 enum_tests/typedIntEnum PASSED C 0:06.901 - R 0:00.039 enum_tests/voidEnum PASSED C 0:06.870 - R 0:00.043 enum_tests/stringEnum PASSED C 0:07.108 - R 0:00.121 ctrl-flow/loopctrl PASSED C 0:09.161 - R 0:00.131 concurrency/waitfor/dtor PASSED C 0:12.002 - R 0:05.893 concurrency/waitfor/recurse PASSED C 0:12.516 - R 0:04.796 div PASSED C 0:09.426 - R 0:00.041 include/vector-collections PASSED C 0:03.600 - R 0:00.025 limits PASSED C 0:01.562 - R 0:00.038 exceptions/data-except PASSED C 0:07.194 - R 0:00.038 coroutine/prodcons PASSED C 0:12.286 - R 0:00.171 exceptions/conditional PASSED C 0:07.368 - R 0:00.073 exceptions/finally PASSED C 0:07.192 - R 0:00.046 linking/nostdlib PASSED C 0:01.558 - R 0:00.128 exceptions/interact PASSED C 0:07.162 - R 0:00.043 enum_tests/planet PASSED C 0:09.208 - R 0:00.070 exceptions/resume PASSED C 0:07.081 - R 0:00.073 exceptions/polymorphic PASSED C 0:07.163 - R 0:00.072 exceptions/cancel/coroutine PASSED C 0:08.226 - R 0:00.071 nested-types-ERR1 PASSED C 0:00.194 - R n/a exceptions/terminate PASSED C 0:07.096 - R 0:00.040 concurrency/channels/daisy_chain PASSED C 0:16.263 - R 0:10.066 concurrency/channels/contend PASSED C 0:16.167 - R 0:10.230 nested-types-ERR2 PASSED C 0:00.425 - R n/a linkonce PASSED C 0:01.802 - R 0:00.072 exceptions/defaults PASSED C 0:08.211 - R 0:00.022 concurrency/channels/churn PASSED C 0:16.529 - R 0:10.127 concurrency/channels/ping_pong PASSED C 0:16.578 - R 0:10.179 opt-params PASSED C 0:00.144 - R n/a concurrency/channels/hot_potato PASSED C 0:16.672 - R 0:10.127 fstream_test PASSED C 0:06.706 - R 0:00.037 exceptions/conditional-threads PASSED C 0:08.617 - R 0:00.075 exceptions/virtual-poly PASSED C 0:07.455 - R 0:00.023 exceptions/defaults-threads PASSED C 0:08.820 - R 0:00.038 concurrency/channels/zero_size PASSED C 0:17.141 - R 0:10.225 concurrency/channels/pub_sub PASSED C 0:17.290 - R 0:10.086 device/cpu PASSED C 0:11.829 - R 0:00.274 exceptions/finally-threads PASSED C 0:08.720 - R 0:00.172 nested-types PASSED C 0:01.625 - R 0:00.076 polybits PASSED C 0:00.395 - R n/a maybe PASSED C 0:01.932 - R 0:00.124 nowarn/no-autogen PASSED C 0:01.536 - R 0:00.039 generator/suspend_then PASSED C 0:06.816 - R 0:00.038 generator/fmtLines PASSED C 0:06.917 - R 0:00.124 nowarn/unused PASSED C 0:01.485 - R 0:00.022 exceptions/trash PASSED C 0:08.451 - R 0:00.036 enum_tests/position PASSED C 0:10.846 - R 0:00.021 nowarn/array PASSED C 0:01.732 - R 0:00.071 nowarn/printf-sizeof PASSED C 0:01.708 - R 0:00.040 concurrency/waituntil/basic_else PASSED C 0:18.781 - R 0:00.039 nowarn/zero-thunk PASSED C 0:01.501 - R 0:00.068 numericConstants PASSED C 0:01.504 - R 0:00.039 forall PASSED C 0:08.001 - R 0:00.038 identity PASSED C 0:06.945 - R 0:00.022 nowarn/exception PASSED C 0:01.944 - R 0:00.021 operators PASSED C 0:01.597 - R 0:00.037 generator/fibonacci PASSED C 0:07.414 - R 0:00.076 poly-bare-assn PASSED C 0:01.484 - R 0:00.038 include/stdincludes PASSED C 0:06.890 - R 0:00.122 poly-member PASSED C 0:01.436 - R 0:00.021 concurrency/futures/future_except PASSED C 0:28.189 - R 0:00.068 hello PASSED C 0:07.284 - R 0:00.043 linking/exception-nothreads PASSED C 0:04.738 - R 0:00.040 poly-d-cycle PASSED C 0:01.728 - R 0:00.038 poly-many-arsz PASSED C 0:01.667 - R 0:00.038 poly-selection PASSED C 0:01.478 - R 0:00.041 include/vector-fstream PASSED C 0:07.262 - R 0:00.038 raii/ctor-autogen-ERR1 PASSED C 0:01.021 - R n/a poly-o-cycle PASSED C 0:01.728 - R 0:00.121 exceptions/virtual-cast PASSED C 0:08.992 - R 0:00.039 raii/partial-ERR1 PASSED C 0:00.925 - R n/a genericUnion PASSED C 0:07.894 - R 0:00.037 exceptions/fibonacci_nonlocal PASSED C 0:10.363 - R 0:00.071 poly-self-cycle PASSED C 0:01.804 - R 0:00.040 io/eofType PASSED C 0:06.759 - R 0:00.039 exceptions/terminate-threads PASSED C 0:09.599 - R 0:00.077 typedefRedef-ERR1 PASSED C 0:00.222 - R n/a quasiKeyword PASSED C 0:01.630 - R 0:00.036 concurrency/channels/big_elems PASSED C 0:16.625 - R 0:12.488 var-assert PASSED C 0:00.262 - R n/a exceptions/resume-threads PASSED C 0:10.269 - R 0:00.072 raii/typeof-member PASSED C 0:01.512 - R 0:00.082 concurrency/preempt PASSED C 0:13.531 - R 0:15.078 raii/partial PASSED C 0:01.698 - R 0:00.041 raii/init_once PASSED C 0:01.826 - R 0:00.069 raii/ctor-autogen PASSED C 0:02.271 - R 0:00.043 simpleGenericTriple PASSED C 0:01.825 - R 0:00.038 switch PASSED C 0:01.538 - R 0:00.123 tuple/tupleCast PASSED C 0:01.556 - R 0:00.038 result PASSED C 0:02.106 - R 0:00.070 exceptions/cancel/thread PASSED C 0:12.258 - R 0:00.039 typedefRedef PASSED C 0:01.595 - R 0:00.097 smart-pointers PASSED C 0:02.148 - R 0:00.157 tuple/tupleFunction PASSED C 0:01.785 - R 0:00.151 tuple/tupleMember PASSED C 0:01.736 - R 0:00.196 tuple/tuplePolymorphism PASSED C 0:02.049 - R 0:00.155 typeof PASSED C 0:01.764 - R 0:00.156 variableDeclarator PASSED C 0:01.678 - R 0:00.146 linking/exception-withthreads PASSED C 0:07.010 - R 0:00.155 withconflict PASSED C 0:00.885 - R n/a meta/fork+exec PASSED C 0:05.190 - R 0:00.221 linking/mangling/anon PASSED C 0:07.271 - R 0:00.024 exceptions/cor_resumer PASSED C 0:12.913 - R 0:00.074 warnings/self-assignment PASSED C 0:01.593 - R 0:00.003 ...collections/dimexpr-match-c-ERRS PASSED C 0:01.020 - R n/a voidPtr PASSED C 0:01.816 - R 0:00.039 KRfunctions PASSED C 0:01.410 - R 0:00.002 function-operator PASSED C 0:11.389 - R 0:00.038 literals PASSED C 0:06.993 - R 0:00.042 errors/completeType PASSED C 0:00.960 - R n/a attributes PASSED C 0:01.660 - R 0:00.005 ...llections/dimexpr-match-cfa-ERRS PASSED C 0:01.662 - R n/a list/dlist-insert-remove PASSED C 0:07.610 - R 0:00.174 raii/memberCtors-ERR1 PASSED C 0:04.876 - R n/a exceptions/pingpong_nonlocal PASSED C 0:13.884 - R 0:00.125 raii/dtor-early-exit-ERR1 PASSED C 0:05.066 - R n/a raii/dtor-early-exit-ERR2 PASSED C 0:05.069 - R n/a ...rrency/examples/boundedBufferINT PASSED C 0:12.502 - R 0:20.372 linking/io-acquire PASSED C 0:09.026 - R 0:00.022 list/dlist2-insert-remove PASSED C 0:08.055 - R 0:00.122 extension PASSED C 0:01.393 - R 0:00.004 functions PASSED C 0:01.371 - R 0:00.003 io/manipulatorsOutput4 PASSED C 0:09.871 - R 0:00.121 io/manipulatorsInput-uchunk PASSED C 0:10.011 - R 0:00.173 declarationSpecifier PASSED C 0:02.133 - R 0:00.003 gccExtensions PASSED C 0:01.404 - R 0:00.004 linking/weakso_nothd PASSED C 0:09.000 - R 0:00.037 linking/nothreads PASSED C 0:09.176 - R 0:00.073 ...rrency/examples/boundedBufferEXT PASSED C 0:12.679 - R 0:20.809 meta/arch PASSED C 0:00.797 - R n/a tuple/tupleVariadic PASSED C 0:04.856 - R 0:00.074 arithmeticConversions PASSED C 0:03.120 - R 0:00.123 concurrency/waituntil/one_chan PASSED C 0:13.893 - R 0:10.226 io/io PASSED C 0:12.019 - R 0:00.040 zero_one-ERR1 PASSED C 0:04.176 - R n/a quotedKeyword PASSED C 0:06.886 - R 0:00.075 polymorphism PASSED C 0:07.099 - R 0:00.037 meta/dumpable PASSED C 0:08.680 - R 0:00.041 raii/boxed-types PASSED C 0:07.058 - R 0:00.037 raii/globals PASSED C 0:07.052 - R 0:00.037 sizeof PASSED C 0:06.812 - R 0:00.021 concurrency/preempt2 PASSED C 0:12.596 - R 0:21.449 strstream PASSED C 0:07.164 - R 0:00.038 io/io-acquire-in PASSED C 0:12.753 - R 0:00.221 malloc PASSED C 0:10.306 - R 0:00.037 tuplearray PASSED C 0:06.798 - R 0:00.038 shortCircuit PASSED C 0:07.596 - R 0:00.023 io/io-acquire-out PASSED C 0:13.080 - R 0:00.120 concurrency/waituntil/channel_close PASSED C 0:16.517 - R 0:10.214 references PASSED C 0:07.912 - R 0:00.039 raii/memberCtors PASSED C 0:08.385 - R 0:00.036 io/io-acquire2 PASSED C 0:13.213 - R 0:00.271 userLiterals PASSED C 0:07.355 - R 0:00.037 io/io-acquire PASSED C 0:13.923 - R 0:00.220 linking/withthreads PASSED C 0:11.783 - R 0:00.069 zero_one PASSED C 0:06.691 - R 0:00.037 tuple/tupleAssign PASSED C 0:08.524 - R 0:00.035 raii/dtor-early-exit PASSED C 0:09.225 - R 0:00.039 time PASSED C 0:08.874 - R 0:00.036 vector PASSED C 0:08.250 - R 0:00.037 searchsort PASSED C 0:09.484 - R 0:00.035 sum PASSED C 0:09.570 - R 0:00.036 minmax PASSED C 0:12.101 - R 0:00.039 swap PASSED C 0:09.700 - R 0:00.036 ...collections/array-md-sbscr-cases PASSED C 0:07.985 - R 0:00.035 vector_math/vec2_double PASSED C 0:09.742 - R 0:00.035 io/comp_basic PASSED C 0:16.956 - R 0:00.470 abs PASSED C 0:08.770 - R 0:00.037 io/away_fair PASSED C 0:17.574 - R 0:00.271 io/comp_fair PASSED C 0:16.394 - R 0:01.173 io/many_read PASSED C 0:16.166 - R 0:00.069 vector_math/vec2_uint PASSED C 0:11.326 - R 0:00.036 io/manipulatorsInput PASSED C 0:08.332 - R 0:00.036 concurrency/waituntil/futures PASSED C 0:31.108 - R 0:00.068 bitmanip2 PASSED C 0:10.680 - R 0:00.067 bitmanip1 PASSED C 0:10.897 - R 0:00.067 gmp PASSED C 0:09.551 - R 0:00.035 exceptions/cardgame PASSED C 0:10.359 - R 0:00.117 collections/atomic_mpsc PASSED C 0:12.544 - R 0:29.474 ato PASSED C 0:11.389 - R 0:00.035 exceptions/hotpotato_checked PASSED C 0:10.696 - R 0:00.068 vector_math/vec3_int PASSED C 0:12.806 - R 0:00.035 vector_math/vec4_int PASSED C 0:12.724 - R 0:00.037 io/manipulatorsOutput2 PASSED C 0:09.795 - R 0:00.037 vector_math/vec2_ldouble PASSED C 0:09.728 - R 0:00.037 bitmanip3 PASSED C 0:11.899 - R 0:00.068 random PASSED C 0:10.440 - R 0:00.035 include/includes PASSED C 0:22.745 - R 0:00.019 exceptions/hotpotato PASSED C 0:12.302 - R 0:00.067 vector_math/vec4_float PASSED C 0:14.610 - R 0:00.035 vector_math/vec3_float PASSED C 0:15.033 - R 0:00.035 vector_math/vec2_int PASSED C 0:15.432 - R 0:00.068 vector_math/vec2_float PASSED C 0:15.570 - R 0:00.067 math PASSED C 0:12.474 - R 0:00.036 mathX PASSED C 0:13.590 - R 0:00.036 io/manipulatorsOutput1 PASSED C 0:14.007 - R 0:00.036 ...ency/waituntil/channel_zero_size PASSED C 0:12.799 - R 0:24.707 io/manipulatorsOutput3 PASSED C 0:14.981 - R 0:00.070 PRNG PASSED C 0:16.152 - R 0:02.123 heap PASSED C 0:09.751 - R 0:19.229 io/io-acquire-no-io PASSED C 0:14.051 - R 0:13.850 concurrency/waituntil/repeat_close PASSED C 0:13.699 - R 0:30.166 ...ency/unified_locking/futex_mutex PASSED C 0:14.262 - R 0:36.705 rational PASSED C 0:27.800 - R 0:00.070 concurrency/unified_locking/mcs PASSED C 0:14.346 - R 0:36.340 concurrency/waituntil/channels PASSED C 0:13.621 - R 0:35.190 concurrency/actors/dynamic PASSED C 0:17.730 - R 0:42.859 concurrency/waituntil/all_types PASSED C 0:34.369 - R 0:23.008 concurrency/multi-monitor PASSED C 0:11.905 - R 0:56.312 ...urrency/unified_locking/mcs_spin PASSED C 0:13.975 - R 0:52.350 .../unified_locking/spin_queue_lock PASSED C 0:14.707 - R 0:53.766 concurrency/monitor PASSED C 0:12.103 - R 1:02.511 concurrency/waituntil/locks PASSED C 0:15.651 - R 1:09.547 concurrency/unified_locking/locks PASSED C 0:15.138 - R 1:40.329 concurrency/mutexstmt/locks PASSED C 0:12.600 - R 2:08.523 375 passes, 0 failures, 0 timeouts, 0 cancelled, 0 other Tests took 2:22.064 [Pipeline] } [Pipeline] // dir [Pipeline] } [Pipeline] // stage [Pipeline] echo -------- Test: Release -------- [Pipeline] stage [Pipeline] { (Test: Release) [Pipeline] dir Running in /var/lib/jenkins/workspace/Cforall_master@tmp [Pipeline] { [Pipeline] sh + nproc + make -j 96 --no-print-directory -C tests timeout=600 global-timeout=14400 tests debug=no archive-errors=/var/lib/jenkins/workspace/Cforall_master@tmp/tests/crashes/full-nodebug Running 375 tests on 96 cores (arm64 - no debug) array-ERR3 PASSED C 0:00.120 - R n/a array-ERR2 PASSED C 0:00.128 - R n/a ...ollections/language-dim-mismatch PASSED C 0:00.393 - R n/a concurrency/keywordErrors PASSED C 0:00.625 - R n/a concurrency/mainError PASSED C 0:00.678 - R n/a array-collections/symtab-collision PASSED C 0:00.876 - R n/a castError PASSED C 0:00.895 - R n/a array-collections/safety-summary PASSED C 0:00.989 - R n/a concurrency/ctor-check PASSED C 0:01.260 - R n/a array-ERR1 PASSED C 0:01.489 - R n/a attr-priority PASSED C 0:01.574 - R 0:00.005 array-collections/c-dependent PASSED C 0:01.632 - R 0:00.039 castReturn PASSED C 0:01.669 - R 0:00.021 cast PASSED C 0:01.742 - R 0:00.075 array PASSED C 0:02.041 - R 0:00.081 builtins/sync PASSED C 0:02.084 - R 0:00.080 array-collections/array-raii-c PASSED C 0:02.251 - R 0:00.077 array-collections/dimexpr-match-c PASSED C 0:02.890 - R 0:00.079 array-collections/array-sbscr-types PASSED C 0:03.093 - R 0:00.022 concurrency/clib_tls PASSED C 0:03.280 - R 0:00.127 ...ns/vector-err-retn-perm-it-byval PASSED C 0:03.544 - R n/a array-collections/boxed PASSED C 0:03.527 - R 0:00.039 ...ns/vector-err-pass-perm-it-byval PASSED C 0:03.770 - R n/a concurrency/clib PASSED C 0:03.780 - R 0:00.072 array-collections/array-basic PASSED C 0:03.952 - R 0:00.023 array-collections/dimexpr-match-cfa PASSED C 0:05.044 - R 0:00.084 collections/string-operator-ERR09 PASSED C 0:05.489 - R n/a collections/string-operator-ERR16 PASSED C 0:05.498 - R n/a collections/string-operator-ERR15 PASSED C 0:05.498 - R n/a collections/string-operator-ERR13 PASSED C 0:05.619 - R n/a collections/string-operator-ERR11 PASSED C 0:05.909 - R n/a ...urrency/pthread/pthread_key_test PASSED C 0:04.287 - R 0:00.023 avl_test PASSED C 0:06.288 - R 0:00.023 alloc-ERROR PASSED C 0:06.768 - R n/a algorithms/range_test PASSED C 0:06.781 - R 0:00.023 complex PASSED C 0:07.068 - R 0:00.022 collections/vector-demo PASSED C 0:07.168 - R 0:00.025 array-collections/accordion PASSED C 0:07.354 - R 0:00.024 collections/string-gc PASSED C 0:07.646 - R 0:00.024 array-collections/array-raii-cfa PASSED C 0:08.078 - R 0:00.022 collections/string-istream PASSED C 0:08.523 - R 0:00.024 concurrency/futures/abandon PASSED C 0:08.882 - R 0:00.037 concurrency/futures/basic PASSED C 0:09.344 - R 0:00.042 concurrency/cluster PASSED C 0:09.606 - R 0:00.024 collections/stack PASSED C 0:09.672 - R 0:00.024 concurrency/park/start_parked PASSED C 0:08.802 - R 0:00.027 concurrency/park/contention PASSED C 0:09.033 - R 0:00.074 collections/multi_list PASSED C 0:10.459 - R 0:00.023 concurrency/mutexstmt/monitors PASSED C 0:09.948 - R 0:00.473 collections/string-ctx-manage PASSED C 0:11.351 - R 0:00.022 collections/queue PASSED C 0:11.457 - R 0:00.024 concurrency/cofor PASSED C 0:11.507 - R 0:00.039 concurrency/join PASSED C 0:11.922 - R 0:00.039 collections/string-ostream PASSED C 0:12.113 - R 0:00.027 concurrency/examples/gortn PASSED C 0:12.155 - R 0:00.039 concurrency/migrate PASSED C 0:12.133 - R 0:00.069 concurrency/examples/matrixSum PASSED C 0:12.195 - R 0:00.027 collections/sequence PASSED C 0:12.138 - R 0:00.125 collections/string-istream-manip PASSED C 0:12.731 - R 0:00.076 concurrency/coroutineYield PASSED C 0:12.848 - R 0:00.074 ...ections/string-overwrite-noshare PASSED C 0:12.964 - R 0:00.034 ...rrency/pthread/pthread_attr_test PASSED C 0:11.655 - R 0:00.071 collections/string-overwrite PASSED C 0:12.959 - R 0:00.121 collections/atomic_mpsc PASSED C 0:12.305 - R 0:00.928 concurrency/monitor PASSED C 0:11.899 - R 0:01.285 concurrency/examples/datingService PASSED C 0:13.117 - R 0:00.129 const-ref PASSED C 0:01.530 - R 0:00.023 concurrency/park/force_preempt PASSED C 0:12.864 - R 0:00.323 const-init PASSED C 0:01.680 - R 0:00.038 concurrency/multi-monitor PASSED C 0:11.904 - R 0:02.136 ...rrency/pthread/pthread_cond_test PASSED C 0:12.510 - R 0:00.126 ...pthread/pthread_demo_create_join PASSED C 0:12.511 - R 0:00.125 collections/string-compare PASSED C 0:14.571 - R 0:00.079 concurrency/examples/quickSort PASSED C 0:14.604 - R 0:00.073 collections/string-operator PASSED C 0:15.203 - R 0:00.081 concurrency/readyQ/leader_spin PASSED C 0:12.099 - R 0:01.081 concurrency/barrier/order PASSED C 0:15.249 - R 0:00.129 concurrency/barrier/last PASSED C 0:15.297 - R 0:00.126 concurrency/barrier/generation PASSED C 0:15.203 - R 0:00.234 concurrency/futures/wait_any PASSED C 0:15.407 - R 0:00.069 concurrency/waitfor/parse PASSED C 0:07.859 - R 0:00.043 ...rrency/examples/boundedBufferEXT PASSED C 0:14.033 - R 0:01.731 concurrency/once PASSED C 0:15.296 - R 0:00.076 ctrl-flow/loop-inc PASSED C 0:01.588 - R 0:00.074 concurrency/mutexstmt/tuple PASSED C 0:15.810 - R 0:00.022 ctrl-flow/labelledExit PASSED C 0:01.812 - R 0:00.073 ...rrency/examples/boundedBufferINT PASSED C 0:14.117 - R 0:02.090 concurrency/signal/wait PASSED C 0:13.319 - R 0:00.039 ...rrency/pthread/pthread_once_test PASSED C 0:14.644 - R 0:00.036 concurrency/mutexstmt/locks PASSED C 0:13.459 - R 0:03.043 concurrency/suspend_then PASSED C 0:13.118 - R 0:00.123 enum_tests/lvalue PASSED C 0:00.849 - R n/a concurrency/signal/disjoint FAILED with code -6 C 0:13.527 - R 0:00.072 ERROR Eager signal 2 Cforall Runtime error (UNIX pid:3188594): Stack back trace for: /var/lib/jenkins/workspace/Cforall_master@tmp/libcfa/arm64-nodebug/src/.libs/libcfa.so.1 (0) /var/lib/jenkins/workspace/Cforall_master@tmp/libcfa/arm64-nodebug/src/.libs/libcfa.so.1 : + 0x832a4 [0xfffff7ee32a4] (1) /var/lib/jenkins/workspace/Cforall_master@tmp/libcfa/arm64-nodebug/src/.libs/libcfa.so.1 : + 0x3b53c [0xfffff7e9b53c] (2) /var/lib/jenkins/workspace/Cforall_master@tmp/libcfa/arm64-nodebug/src/.libs/libcfa.so.1 : _X3eofFb_S8ifstream__1 + 0 [0xfffff7e9ceb4] (3) /var/lib/jenkins/workspace/Cforall_master@tmp/tests/concurrency/signal/disjoint : _X5logicFv_XS8global_t__1 + 0x15c [0xaaaaaaaa3dfc] warning: Can't open file anon_inode:[io_uring] which was expanded to anon_inode:[io_uring] during file-backed mapping note processing [New LWP 3188608] [New LWP 3188594] [New LWP 3188607] [Thread debugging using libthread_db enabled] Using host libthread_db library "/lib/aarch64-linux-gnu/libthread_db.so.1". Core was generated by `/var/lib/jenkins/workspace/Cforall_master@tmp/tests/concurrency/signal/disjoint'. Program terminated with signal SIGABRT, Aborted. #0 __pthread_kill_implementation (threadid=187649985424832, signo=signo@entry=6, no_tid=no_tid@entry=0) at ./nptl/pthread_kill.c:44 warning: 44 ./nptl/pthread_kill.c: No such file or directory [Current thread is 1 (Thread 0xaaaaaab92dc0 (LWP 3188608))] ----- #0 __pthread_kill_implementation (threadid=187649985424832, signo=signo@entry=6, no_tid=no_tid@entry=0) at ./nptl/pthread_kill.c:44 #1 0x0000fffff7c37540 in __pthread_kill_internal (signo=6, threadid=) at ./nptl/pthread_kill.c:78 #2 0x0000fffff7becb3c in __GI_raise (sig=sig@entry=6) at ../sysdeps/posix/raise.c:26 #3 0x0000fffff7bd7e00 in __GI_abort () at ./stdlib/abort.c:79 #4 0x0000fffff7ee2dcc in _X7__abortFv_bPKcY17__builtin_va_list__1 (_X11signalAbortb_1=_X11signalAbortb_1@entry=true, _X3fmtPKc_1=_X3fmtPKc_1@entry=0xfffff7ef4178 "Application interrupted by signal: %s.\n", _X4argsY17__builtin_va_list_1=...) at /var/lib/jenkins/workspace/Cforall_master/libcfa/src/interpose.cfa:263 #5 0x0000fffff7ee32a4 in _X5abortFv_bPKc__1 (_X11signalAbortb_1=_X11signalAbortb_1@entry=true, _X3fmtPKc_1=_X3fmtPKc_1@entry=0xfffff7ef4178 "Application interrupted by signal: %s.\n") at /var/lib/jenkins/workspace/Cforall_master/libcfa/src/interpose.cfa:301 #6 0x0000fffff7ee32c4 in _X15sigHandler_termFv_iPS21__anonymous_siginfo_tPS10ucontext_t__1 (_X3sigi_1=, _X3sfpPS21__anonymous_siginfo_t_1=, _X3cxtPS10ucontext_t_1=) at /var/lib/jenkins/workspace/Cforall_master/libcfa/src/interpose.cfa:337 #7 #8 __pthread_kill_implementation (threadid=187649985424832, signo=signo@entry=6, no_tid=no_tid@entry=0) at ./nptl/pthread_kill.c:44 #9 0x0000fffff7c37540 in __pthread_kill_internal (signo=6, threadid=) at ./nptl/pthread_kill.c:78 #10 0x0000fffff7becb3c in __GI_raise (sig=sig@entry=6) at ../sysdeps/posix/raise.c:26 #11 0x0000fffff7bd7e00 in __GI_abort () at ./stdlib/abort.c:79 #12 0x0000fffff7ee2e88 in _X7__abortFv_bPKcY17__builtin_va_list__1 (_X11signalAbortb_1=_X11signalAbortb_1@entry=false, _X3fmtPKc_1=_X3fmtPKc_1@entry=0xfffff7ef3250 "%s", _X4argsY17__builtin_va_list_1=...) at /var/lib/jenkins/workspace/Cforall_master/libcfa/src/interpose.cfa:286 #13 0x0000fffff7ee32a4 in _X5abortFv_bPKc__1 (_X11signalAbortb_1=_X11signalAbortb_1@entry=false, _X3fmtPKc_1=_X3fmtPKc_1@entry=0xfffff7ef3250 "%s") at /var/lib/jenkins/workspace/Cforall_master/libcfa/src/interpose.cfa:301 #14 0x0000fffff7e9b53c in abort () at /var/lib/jenkins/workspace/Cforall_master/libcfa/src/interpose.cfa:176 #15 0x0000fffff7e9ceb4 in _X4endsFv_S8ofstream__1 (_X2osS8ofstream_1=0xfffff7f311c8 <_X9abortFileS8ofstream_1>) at /var/lib/jenkins/workspace/Cforall_master/libcfa/src/fstream.cfa:106 #16 0x0000aaaaaaaa3dfc in _X5logicFv_XS8global_t__1 (_X1aXS8global_t_1=_X1aXS8global_t_1@entry=0xaaaaaaac02b0 <_X7globalsS13__anonymous66_1>) at concurrency/signal/disjoint.cfa:115 #17 0x0000aaaaaaaa3e60 in _X4mainFv_S9Signaller__1 (__anonymous_object2552=__anonymous_object2552@entry=0xffffffffd070) at concurrency/signal/disjoint.cfa:126 #18 0x0000fffff7f7a974 in __cfactx_invoke_thread (main=0xaaaaaaaa3e30 <_X4mainFv_S9Signaller__1>, this=0xffffffffd070) at /var/lib/jenkins/workspace/Cforall_master/libcfa/src/concurrency/invoke.c:87 #19 0x0000fffff7f7a950 in __cfactx_coroutine_unwind (storage=, cor=) at /var/lib/jenkins/workspace/Cforall_master/libcfa/src/concurrency/invoke.c:76 #20 0x0000aaaaaabffff0 in ?? () Backtrace stopped: previous frame inner to this frame (corrupt stack?) ----- Id Target Id Frame * 1 Thread 0xaaaaaab92dc0 (LWP 3188608) __pthread_kill_implementation (threadid=187649985424832, signo=signo@entry=6, no_tid=no_tid@entry=0) at ./nptl/pthread_kill.c:44 2 Thread 0xfffff7fe9dc0 (LWP 3188594) _X8cache_idFj_PS7clusterj__1 (_X3idxj_1=0, _X4cltrPS7cluster_1=0xfffff7fb0980 <_X19storage_mainClusterA0c_1>) at /var/lib/jenkins/workspace/Cforall_master/libcfa/src/concurrency/kernel/cluster.hfa:138 3 Thread 0xaaaaaab12c00 (LWP 3188607) 0x0000fffff7beda18 in __GI___sigtimedwait (set=set@entry=0xaaaaaab121e8, info=info@entry=0xaaaaaab12268, timeout=timeout@entry=0x0) at ../sysdeps/unix/sysv/linux/sigtimedwait.c:31 Archiving concurrency/signal/disjoint (executable and core) to crashes/full-nodebug/concurrency/signal/disjoint errors/declaration PASSED C 0:00.131 - R n/a concurrency/readyQ/barrier_sleeper PASSED C 0:14.669 - R 0:00.423 errors/scope-type PASSED C 0:00.245 - R n/a enum PASSED C 0:01.766 - R 0:00.041 concurrency/lockfree_stack PASSED C 0:12.553 - R 0:04.788 concurrency/sleep PASSED C 0:12.772 - R 0:01.175 errors/signature PASSED C 0:00.163 - R n/a enum_tests/inc-dec PASSED C 0:01.733 - R 0:00.022 concurrency/thread PASSED C 0:13.964 - R 0:00.073 concurrency/waitfor/else PASSED C 0:10.394 - R 0:00.037 errors/scope PASSED C 0:00.826 - R n/a collections/string-api-coverage PASSED C 0:17.969 - R 0:00.078 ...ions/string-api-coverage-noshare PASSED C 0:18.098 - R 0:00.040 concurrency/signal/block PASSED C 0:15.957 - R 0:00.169 .../unified_locking/block_spin_lock PASSED C 0:14.739 - R 0:00.036 .../unified_locking/fast_block_lock PASSED C 0:14.613 - R 0:00.040 ...ency/unified_locking/exp_backoff PASSED C 0:14.712 - R 0:00.038 ...cy/unified_locking/pthread_locks PASSED C 0:12.754 - R 0:00.042 designations PASSED C 0:03.304 - R 0:00.024 enum_tests/funcEnum PASSED C 0:02.868 - R 0:00.074 eval PASSED C 0:01.489 - R 0:00.022 concurrency/actors/static PASSED C 0:18.828 - R 0:00.227 concurrency/waitfor/barge PASSED C 0:12.379 - R 0:00.072 concurrency/actors/dynamic PASSED C 0:18.902 - R 0:00.372 concurrency/actors/executor PASSED C 0:19.239 - R 0:00.041 concurrency/waitfor/dtor PASSED C 0:12.042 - R 0:00.172 concurrency/actors/matrixMultiply PASSED C 0:19.092 - R 0:00.272 concurrency/futures/typed PASSED C 0:19.256 - R 0:00.076 ...ncy/unified_locking/timeout_lock PASSED C 0:11.491 - R 0:01.122 copyfile PASSED C 0:07.087 - R 0:00.021 enum_tests/structEnum PASSED C 0:02.867 - R 0:00.026 concurrency/actors/pingpong PASSED C 0:19.455 - R 0:00.069 concurrency/actors/inherit PASSED C 0:19.553 - R 0:00.121 ...urrency/waitfor/lexical_priority PASSED C 0:12.281 - R 0:00.022 concurrency/actors/poison PASSED C 0:19.244 - R 0:00.476 exceptions/try-ctrl-flow PASSED C 0:00.547 - R n/a ...fied_locking/mcs_block_spin_lock PASSED C 0:14.415 - R 0:00.040 alloc PASSED C 0:19.974 - R 0:00.021 exceptions/type-check PASSED C 0:00.682 - R n/a concurrency/actors/types PASSED C 0:20.012 - R 0:00.119 ...rrency/pthread/pthread_demo_lock PASSED C 0:12.062 - R 0:06.549 counter PASSED C 0:07.267 - R 0:00.039 ctrl-flow/break-misc PASSED C 0:06.855 - R 0:00.020 concurrency/actors/inline PASSED C 0:20.717 - R 0:00.122 ctrl-flow/goto PASSED C 0:06.914 - R 0:00.022 concurrency/waitfor/recurse PASSED C 0:12.680 - R 0:00.171 expression PASSED C 0:01.567 - R 0:00.027 exceptions/try-leave-catch PASSED C 0:01.703 - R 0:00.041 ctrl-flow/ifwhileCtl PASSED C 0:06.906 - R 0:00.042 concurrency/preempt PASSED C 0:14.289 - R 0:05.847 ctrl-flow/fallthrough PASSED C 0:07.073 - R 0:00.023 coroutine/fmtLines PASSED C 0:08.153 - R 0:00.071 concurrency/waitfor/when PASSED C 0:12.345 - R 0:00.075 coroutine/fibonacci PASSED C 0:08.446 - R 0:00.038 coroutine/pingpong PASSED C 0:08.454 - R 0:00.041 global-monomorph PASSED C 0:01.660 - R 0:00.024 identFuncDeclarator PASSED C 0:01.514 - R 0:00.043 concurrency/unified_locking/mcs PASSED C 0:14.990 - R 0:01.278 coroutine/runningTotal PASSED C 0:08.502 - R 0:00.039 identParamDeclarator PASSED C 0:01.457 - R 0:00.021 ctrl-flow/loop_else PASSED C 0:07.128 - R 0:00.024 coroutine/raii PASSED C 0:08.585 - R 0:00.021 exceptions/message PASSED C 0:03.190 - R 0:00.037 init1-ERROR PASSED C 0:00.813 - R n/a coroutine/devicedriver PASSED C 0:09.207 - R 0:00.023 enum_tests/anonymous PASSED C 0:06.900 - R 0:00.050 concurrency/waituntil/timeout PASSED C 0:07.854 - R 0:03.078 configs/parseconfig PASSED C 0:10.401 - R 0:00.025 init1 PASSED C 0:01.560 - R 0:00.025 concurrency/waitfor/statment PASSED C 0:14.118 - R 0:00.123 ctrl-flow/loop_else-WRN1 PASSED C 0:08.323 - R 0:00.004 include/vector-sequence PASSED C 0:02.138 - R 0:00.042 enum_tests/enumInlineValue PASSED C 0:07.712 - R 0:00.076 enum_tests/stringEnum PASSED C 0:06.947 - R 0:00.022 enum_tests/typedIntEnum PASSED C 0:06.933 - R 0:00.039 configs/parsebools PASSED C 0:11.310 - R 0:00.272 configs/usage PASSED C 0:11.275 - R 0:00.121 limits PASSED C 0:01.705 - R 0:00.023 ...nified_locking/simple_owner_lock PASSED C 0:17.652 - R 0:00.121 enum_tests/voidEnum PASSED C 0:07.007 - R 0:00.037 enum_tests/input PASSED C 0:07.834 - R 0:00.129 linking/nostdlib PASSED C 0:01.554 - R 0:00.076 coroutine/prodcons PASSED C 0:11.125 - R 0:00.122 include/vector-collections PASSED C 0:03.383 - R 0:00.040 nested-types-ERR1 PASSED C 0:00.184 - R n/a exceptions/conditional PASSED C 0:07.041 - R 0:00.023 nested-types-ERR2 PASSED C 0:00.311 - R n/a exceptions/data-except PASSED C 0:07.230 - R 0:00.023 ...ency/waituntil/channel_zero_size PASSED C 0:14.576 - R 0:00.776 exceptions/finally PASSED C 0:07.069 - R 0:00.024 exceptions/defaults PASSED C 0:07.567 - R 0:00.070 div PASSED C 0:09.831 - R 0:00.032 linkonce PASSED C 0:02.081 - R 0:00.021 ctrl-flow/loopctrl PASSED C 0:10.051 - R 0:00.043 enum_tests/planet PASSED C 0:09.298 - R 0:00.024 opt-params PASSED C 0:00.159 - R n/a maybe PASSED C 0:01.897 - R 0:00.040 nested-types PASSED C 0:01.573 - R 0:00.069 concurrency/waituntil/one_chan PASSED C 0:13.970 - R 0:00.324 exceptions/cancel/coroutine PASSED C 0:08.354 - R 0:00.025 enum_tests/position PASSED C 0:09.467 - R 0:00.077 exceptions/conditional-threads PASSED C 0:08.421 - R 0:00.043 nowarn/no-autogen PASSED C 0:01.456 - R 0:00.021 polybits PASSED C 0:00.335 - R n/a exceptions/interact PASSED C 0:07.481 - R 0:00.023 nowarn/exception PASSED C 0:01.619 - R 0:00.024 nowarn/array PASSED C 0:01.716 - R 0:00.022 exceptions/resume PASSED C 0:07.372 - R 0:00.022 exceptions/polymorphic PASSED C 0:07.418 - R 0:00.042 exceptions/trash PASSED C 0:06.958 - R 0:00.024 exceptions/terminate PASSED C 0:07.344 - R 0:00.076 fstream_test PASSED C 0:06.783 - R 0:00.038 nowarn/printf-sizeof PASSED C 0:01.710 - R 0:00.037 nowarn/unused PASSED C 0:01.531 - R 0:00.037 generator/suspend_then PASSED C 0:06.787 - R 0:00.021 generator/fmtLines PASSED C 0:06.941 - R 0:00.037 nowarn/zero-thunk PASSED C 0:01.485 - R 0:00.075 generator/fibonacci PASSED C 0:06.984 - R 0:00.023 operators PASSED C 0:01.486 - R 0:00.023 hello PASSED C 0:06.736 - R 0:00.038 numericConstants PASSED C 0:01.545 - R 0:00.028 genericUnion PASSED C 0:06.998 - R 0:00.040 exceptions/finally-threads PASSED C 0:08.390 - R 0:00.035 poly-bare-assn PASSED C 0:01.530 - R 0:00.022 concurrency/waituntil/channels PASSED C 0:15.120 - R 0:01.982 poly-d-cycle PASSED C 0:01.478 - R 0:00.043 poly-many-arsz PASSED C 0:01.527 - R 0:00.022 linking/exception-nothreads PASSED C 0:05.088 - R 0:00.024 raii/ctor-autogen-ERR1 PASSED C 0:00.882 - R n/a concurrency/channels/zero_size PASSED C 0:17.017 - R 0:10.067 concurrency/channels/ping_pong PASSED C 0:17.046 - R 0:10.065 poly-member PASSED C 0:01.567 - R 0:00.024 exceptions/virtual-poly PASSED C 0:07.771 - R 0:00.041 poly-o-cycle PASSED C 0:01.519 - R 0:00.037 poly-selection PASSED C 0:01.560 - R 0:00.022 concurrency/channels/contend PASSED C 0:17.032 - R 0:10.224 concurrency/channels/daisy_chain PASSED C 0:17.312 - R 0:10.069 raii/partial-ERR1 PASSED C 0:00.832 - R n/a poly-self-cycle PASSED C 0:01.692 - R 0:00.023 concurrency/channels/hot_potato PASSED C 0:17.433 - R 0:10.060 typedefRedef-ERR1 PASSED C 0:00.178 - R n/a concurrency/channels/churn PASSED C 0:17.581 - R 0:10.071 exceptions/defaults-threads PASSED C 0:09.758 - R 0:00.036 quasiKeyword PASSED C 0:01.668 - R 0:00.040 device/cpu PASSED C 0:12.215 - R 0:00.171 identity PASSED C 0:07.133 - R 0:00.042 concurrency/channels/pub_sub PASSED C 0:17.735 - R 0:10.061 var-assert PASSED C 0:00.211 - R n/a forall PASSED C 0:08.467 - R 0:00.025 concurrency/channels/big_elems PASSED C 0:17.415 - R 0:10.531 exceptions/terminate-threads PASSED C 0:08.797 - R 0:00.076 raii/partial PASSED C 0:01.568 - R 0:00.020 raii/init_once PASSED C 0:01.825 - R 0:00.043 exceptions/resume-threads PASSED C 0:09.393 - R 0:00.023 raii/ctor-autogen PASSED C 0:02.136 - R 0:00.026 raii/typeof-member PASSED C 0:01.653 - R 0:00.040 exceptions/virtual-cast PASSED C 0:09.226 - R 0:00.022 switch PASSED C 0:01.549 - R 0:00.022 tuple/tupleCast PASSED C 0:01.608 - R 0:00.022 concurrency/waituntil/basic_else PASSED C 0:19.118 - R 0:00.024 tuple/tupleFunction PASSED C 0:01.640 - R 0:00.021 concurrency/futures/future_except PASSED C 0:28.756 - R 0:00.076 tuple/tupleMember PASSED C 0:01.608 - R 0:00.044 include/vector-fstream PASSED C 0:07.869 - R 0:00.038 smart-pointers PASSED C 0:01.889 - R 0:00.048 typedefRedef PASSED C 0:01.531 - R 0:00.022 io/eofType PASSED C 0:07.485 - R 0:00.077 typeof PASSED C 0:01.554 - R 0:00.020 linking/exception-withthreads PASSED C 0:06.969 - R 0:00.038 simpleGenericTriple PASSED C 0:02.127 - R 0:00.070 withconflict PASSED C 0:00.925 - R n/a variableDeclarator PASSED C 0:01.443 - R 0:00.021 result PASSED C 0:02.286 - R 0:00.021 tuple/tuplePolymorphism PASSED C 0:01.997 - R 0:00.025 exceptions/fibonacci_nonlocal PASSED C 0:11.203 - R 0:00.073 meta/fork+exec PASSED C 0:05.575 - R 0:00.122 warnings/self-assignment PASSED C 0:01.447 - R 0:00.004 voidPtr PASSED C 0:01.503 - R 0:00.038 exceptions/cancel/thread PASSED C 0:12.309 - R 0:00.073 include/stdincludes PASSED C 0:09.039 - R 0:00.039 ...collections/dimexpr-match-c-ERRS PASSED C 0:01.052 - R n/a KRfunctions PASSED C 0:01.318 - R 0:00.004 function-operator PASSED C 0:10.412 - R 0:00.041 linking/mangling/anon PASSED C 0:07.404 - R 0:00.042 errors/completeType PASSED C 0:00.847 - R n/a attributes PASSED C 0:01.585 - R 0:00.005 declarationSpecifier PASSED C 0:01.399 - R 0:00.002 ...llections/dimexpr-match-cfa-ERRS PASSED C 0:01.663 - R n/a extension PASSED C 0:01.380 - R 0:00.003 raii/memberCtors-ERR1 PASSED C 0:04.252 - R n/a meta/arch PASSED C 0:00.793 - R n/a functions PASSED C 0:01.487 - R 0:00.004 gccExtensions PASSED C 0:01.347 - R 0:00.002 literals PASSED C 0:07.373 - R 0:00.022 raii/dtor-early-exit-ERR2 PASSED C 0:05.010 - R n/a raii/dtor-early-exit-ERR1 PASSED C 0:05.060 - R n/a list/dlist-insert-remove PASSED C 0:07.865 - R 0:00.024 exceptions/pingpong_nonlocal PASSED C 0:12.639 - R 0:00.043 linking/nothreads PASSED C 0:08.750 - R 0:00.020 concurrency/waituntil/locks PASSED C 0:16.578 - R 0:04.444 linking/io-acquire PASSED C 0:09.269 - R 0:00.020 linking/weakso_nothd PASSED C 0:09.010 - R 0:00.021 arithmeticConversions PASSED C 0:03.129 - R 0:00.020 exceptions/cor_resumer PASSED C 0:14.428 - R 0:00.021 zero_one-ERR1 PASSED C 0:03.718 - R n/a list/dlist2-insert-remove PASSED C 0:09.086 - R 0:00.020 alloc2 PASSED C 0:32.804 - R 0:00.021 tuple/tupleVariadic PASSED C 0:05.551 - R 0:00.022 polymorphism PASSED C 0:07.300 - R 0:00.022 raii/boxed-types PASSED C 0:07.073 - R 0:00.021 raii/globals PASSED C 0:06.925 - R 0:00.020 io/io PASSED C 0:11.950 - R 0:00.019 io/manipulatorsInput-uchunk PASSED C 0:11.685 - R 0:00.068 quotedKeyword PASSED C 0:07.542 - R 0:00.019 raii/memberCtors PASSED C 0:07.380 - R 0:00.021 sizeof PASSED C 0:06.815 - R 0:00.036 shortCircuit PASSED C 0:06.893 - R 0:00.035 concurrency/unified_locking/locks PASSED C 0:16.227 - R 0:12.414 concurrency/preempt2 PASSED C 0:12.844 - R 0:20.328 io/io-acquire-in PASSED C 0:12.442 - R 0:00.036 io/io-acquire-out PASSED C 0:12.364 - R 0:00.036 tuplearray PASSED C 0:06.962 - R 0:00.019 malloc PASSED C 0:10.741 - R 0:00.019 heap PASSED C 0:09.605 - R 0:04.791 strstream PASSED C 0:07.414 - R 0:00.020 io/io-acquire PASSED C 0:12.870 - R 0:00.039 meta/dumpable PASSED C 0:10.846 - R 0:00.019 tuple/tupleAssign PASSED C 0:07.600 - R 0:00.021 io/io-acquire2 PASSED C 0:13.036 - R 0:00.036 zero_one PASSED C 0:06.862 - R 0:00.035 references PASSED C 0:08.438 - R 0:00.035 linking/withthreads PASSED C 0:12.131 - R 0:00.019 raii/dtor-early-exit PASSED C 0:09.372 - R 0:00.020 userLiterals PASSED C 0:08.130 - R 0:00.019 io/manipulatorsOutput4 PASSED C 0:14.169 - R 0:00.036 vector PASSED C 0:08.554 - R 0:00.019 time PASSED C 0:09.227 - R 0:00.019 io/away_fair PASSED C 0:15.377 - R 0:00.035 sum PASSED C 0:09.878 - R 0:00.020 minmax PASSED C 0:12.986 - R 0:00.019 io/many_read PASSED C 0:15.211 - R 0:00.021 searchsort PASSED C 0:10.335 - R 0:00.020 swap PASSED C 0:10.308 - R 0:00.019 vector_math/vec2_double PASSED C 0:09.907 - R 0:00.019 vector_math/vec2_uint PASSED C 0:09.984 - R 0:00.020 io/comp_basic PASSED C 0:16.764 - R 0:00.035 abs PASSED C 0:09.169 - R 0:00.019 concurrency/waituntil/channel_close PASSED C 0:18.896 - R 0:10.063 ato PASSED C 0:09.827 - R 0:00.019 io/comp_fair PASSED C 0:17.612 - R 0:00.037 random PASSED C 0:09.503 - R 0:00.018 io/manipulatorsInput PASSED C 0:10.209 - R 0:00.019 exceptions/hotpotato_checked PASSED C 0:10.866 - R 0:00.020 exceptions/hotpotato PASSED C 0:11.046 - R 0:00.019 ...collections/array-md-sbscr-cases PASSED C 0:11.384 - R 0:00.018 vector_math/vec2_ldouble PASSED C 0:09.741 - R 0:00.018 concurrency/waituntil/futures PASSED C 0:30.170 - R 0:00.020 gmp PASSED C 0:11.068 - R 0:00.020 exceptions/cardgame PASSED C 0:11.725 - R 0:00.018 bitmanip3 PASSED C 0:13.337 - R 0:00.035 bitmanip1 PASSED C 0:13.552 - R 0:00.035 mathX PASSED C 0:12.779 - R 0:00.036 bitmanip2 PASSED C 0:13.930 - R 0:00.037 math PASSED C 0:13.340 - R 0:00.019 io/manipulatorsOutput2 PASSED C 0:13.418 - R 0:00.018 PRNG PASSED C 0:16.355 - R 0:00.369 vector_math/vec3_int PASSED C 0:17.594 - R 0:00.019 include/includes PASSED C 0:24.962 - R 0:00.021 concurrency/waituntil/all_types PASSED C 0:36.700 - R 0:00.122 vector_math/vec4_int PASSED C 0:18.769 - R 0:00.020 vector_math/vec2_float PASSED C 0:19.092 - R 0:00.021 vector_math/vec4_float PASSED C 0:19.103 - R 0:00.036 vector_math/vec2_int PASSED C 0:19.877 - R 0:00.023 vector_math/vec3_float PASSED C 0:20.593 - R 0:00.022 io/manipulatorsOutput1 PASSED C 0:21.768 - R 0:00.018 ...ency/unified_locking/futex_mutex PASSED C 0:14.383 - R 0:35.037 rational PASSED C 0:28.961 - R 0:00.038 io/io-acquire-no-io PASSED C 0:12.812 - R 0:22.610 concurrency/waituntil/repeat_close PASSED C 0:15.797 - R 0:30.041 io/manipulatorsOutput3 PASSED C 0:37.225 - R 0:00.025 ...urrency/unified_locking/mcs_spin PASSED C 0:15.677 - R 0:48.731 .../unified_locking/spin_queue_lock PASSED C 0:14.779 - R 0:49.190 374 passes, 1 failures, 0 timeouts, 0 cancelled, 0 other Tests took 1:11.199 make: *** [Makefile:986: all-local] Error 1 [Pipeline] } [Pipeline] // dir [Pipeline] } [Pipeline] // stage [Pipeline] echo Archiving core dumps [Pipeline] dir Running in /var/lib/jenkins/workspace/Cforall_master@tmp [Pipeline] { [Pipeline] fileExists [Pipeline] sh + /var/lib/jenkins/workspace/Cforall_master/tools/jenkins/archive-gen.sh [Pipeline] archiveArtifacts Archiving artifacts Recording fingerprints [Pipeline] } [Pipeline] // dir [Pipeline] } [Pipeline] // wrap [Pipeline] } [Pipeline] // node [Pipeline] echo hudson.AbortException: script returned exit code 2 [Pipeline] node Running on Brokk 4 in /var/lib/jenkins/workspace/Cforall_master [Pipeline] { [Pipeline] echo Notifying users of result [Pipeline] echo Reusing previously constructed message [Pipeline] echo Would send email to: cforall@lists.uwaterloo.ca [Pipeline] echo With title: [cforall git][BUILD# 3656 - FAILURE] - branch master [Pipeline] echo Content:

This is an automated email from the Jenkins build machine. It was generated because of a git hooks/post-receive script following a ref change which was pushed to the C∀ repository.

- Status --------------------------------------------------------------

BUILD# 3656 - FAILURE

Check console output at https://cforall.uwaterloo.ca/jenkins/job/Cforall/job/master/3656/ to view the results.

- Changes -------------------------------------------------------------

The branch master has been updated.
      from  4ff8cb209307cd30c3626d4fbe3cc2d2ce4219ea (commit)

- Log -----------------------------------------------------------------


-----------------------------------------------------------------------

Summary of changes:

[Pipeline] } [Pipeline] // node [Pipeline] echo Build Completed [Pipeline] End of Pipeline ERROR: script returned exit code 2 Finished: FAILURE [Pipeline] error [Pipeline] } Failed in branch gcc_10_arm64_new Build Cforall » master #3653 completed: SUCCESS [Pipeline] echo SUCCESS [Pipeline] } Build Cforall » master #3652 completed: SUCCESS [Pipeline] echo SUCCESS [Pipeline] } Build Cforall » master #3654 completed: SUCCESS [Pipeline] echo SUCCESS [Pipeline] } Build Cforall » master #3657 completed: FAILURE [Pipeline] echo FAILURE [Pipeline] sh + wget -q -O - https://cforall.uwaterloo.ca/jenkins/job/Cforall/job/master/3657/consoleText Started by upstream project "Cforall_Full_Build" build number 413 originally caused by: Started by timer Running as Jenkins Build User > git rev-parse --resolve-git-dir /var/lib/jenkins/caches/git-914b6fdde163b7e17ee75d99ca23f18a/.git # timeout=10 Setting origin to cforall@plg.uwaterloo.ca:software/cfa/cfa-cc > git config remote.origin.url cforall@plg.uwaterloo.ca:software/cfa/cfa-cc # timeout=10 Fetching origin... Fetching upstream changes from origin > git --version # timeout=10 > git --version # 'git version 2.43.0' > git config --get remote.origin.url # timeout=10 using GIT_SSH to set credentials Git key use to connect to the cforall git repo (August 2025) Verifying host key using known hosts file > git fetch --no-tags --force --progress -- origin +refs/heads/*:refs/remotes/origin/* # timeout=10 Seen branch in repository origin/ADT Seen branch in repository origin/aaron-thesis Seen branch in repository origin/arm-eh Seen branch in repository origin/ast-experimental Seen branch in repository origin/cleanup-dtors Seen branch in repository origin/ctor Seen branch in repository origin/deferred_resn Seen branch in repository origin/demangler Seen branch in repository origin/enum Seen branch in repository origin/forall-pointer-decay Seen branch in repository origin/gc_noraii Seen branch in repository origin/jacob/cs343-translation Seen branch in repository origin/jenkins-sandbox Seen branch in repository origin/master Seen branch in repository origin/memory Seen branch in repository origin/new-ast Seen branch in repository origin/new-ast-unique-expr Seen branch in repository origin/new-env Seen branch in repository origin/no_list Seen branch in repository origin/persistent-indexer Seen branch in repository origin/pthread-emulation Seen branch in repository origin/qualifiedEnum Seen branch in repository origin/resolv-new Seen branch in repository origin/string Seen branch in repository origin/stuck-waitfor-destruct Seen branch in repository origin/with_gc Seen 26 remote branches Obtained Jenkinsfile from 4ff8cb209307cd30c3626d4fbe3cc2d2ce4219ea [Pipeline] Start of Pipeline [Pipeline] node Running on Brokk 1 in /var/lib/jenkins/workspace/Cforall_master [Pipeline] { [Pipeline] wrap [Pipeline] { [Pipeline] properties WARNING: Unknown parameter(s) found for class type 'hudson.model.ChoiceParameterDefinition': defaultValue WARNING: Unknown parameter(s) found for class type 'hudson.model.ChoiceParameterDefinition': defaultValue [Pipeline] checkout The recommended git tool is: NONE using credential git_key_aug2025 Fetching changes from the remote Git repository Cleaning workspace Fetching without tags Checking out Revision 4ff8cb209307cd30c3626d4fbe3cc2d2ce4219ea (master) Commit message: "fix Mesa citation" [Pipeline] load [Pipeline] { (Jenkins/tools.groovy) [Pipeline] } [Pipeline] // load [Pipeline] echo Compiler : gcc-11 (g++-11/gcc-11) Architecture : arm64 Arc Flags : --host=aarch64 Run All Tests : true Run Benchmark : true Build Documentation : false Publish : true Silent : true [Pipeline] } > git rev-parse --resolve-git-dir /var/lib/jenkins/workspace/Cforall_master/.git # timeout=10 > git config remote.origin.url cforall@plg.uwaterloo.ca:software/cfa/cfa-cc # timeout=10 > git rev-parse --verify HEAD # timeout=10 Resetting working tree > git reset --hard # timeout=10 > git clean -fdx # timeout=10 Fetching upstream changes from cforall@plg.uwaterloo.ca:software/cfa/cfa-cc > git --version # timeout=10 > git --version # 'git version 2.43.0' using GIT_SSH to set credentials Git key use to connect to the cforall git repo (August 2025) Verifying host key using known hosts file > git fetch --no-tags --force --progress -- cforall@plg.uwaterloo.ca:software/cfa/cfa-cc +refs/heads/*:refs/remotes/origin/* # timeout=10 > git config core.sparsecheckout # timeout=10 > git checkout -f 4ff8cb209307cd30c3626d4fbe3cc2d2ce4219ea # timeout=10 > git rev-list --no-walk 4ff8cb209307cd30c3626d4fbe3cc2d2ce4219ea # timeout=10 [Pipeline] // wrap [Pipeline] } [Pipeline] // node [Pipeline] node Still waiting to schedule task Waiting for next available executor on ‘Algol’ Running on Algol in /var/lib/jenkins/workspace/Cforall_master [Pipeline] { [Pipeline] wrap [Pipeline] { [Pipeline] pwd [Pipeline] pwd [Pipeline] echo -------- Cleanup -------- [Pipeline] stage [Pipeline] { (Cleanup) [Pipeline] dir Running in /var/lib/jenkins/workspace/Cforall_master@tmp [Pipeline] { [Pipeline] deleteDir [Pipeline] } [Pipeline] // dir [Pipeline] } [Pipeline] // stage [Pipeline] echo -------- Checkout -------- [Pipeline] stage [Pipeline] { (Checkout) [Pipeline] checkout The recommended git tool is: NONE using credential git_key_aug2025 Fetching changes from the remote Git repository Cleaning workspace Fetching without tags > git rev-parse --resolve-git-dir /var/lib/jenkins/workspace/Cforall_master/.git # timeout=10 > git config remote.origin.url cforall@plg.uwaterloo.ca:software/cfa/cfa-cc # timeout=10 > git rev-parse --verify HEAD # timeout=10 Resetting working tree > git reset --hard # timeout=10 > git clean -fdx # timeout=10 Fetching upstream changes from cforall@plg.uwaterloo.ca:software/cfa/cfa-cc > git --version # timeout=10 > git --version # 'git version 2.43.0' using GIT_SSH to set credentials Git key use to connect to the cforall git repo (August 2025) Verifying host key using known hosts file > git fetch --no-tags --force --progress -- cforall@plg.uwaterloo.ca:software/cfa/cfa-cc +refs/heads/*:refs/remotes/origin/* # timeout=10 Checking out Revision 4ff8cb209307cd30c3626d4fbe3cc2d2ce4219ea (master) Commit message: "fix Mesa citation" [Pipeline] echo Constructing new git message [Pipeline] sh + git rev-list 4ff8cb209307cd30c3626d4fbe3cc2d2ce4219ea..4ff8cb209307cd30c3626d4fbe3cc2d2ce4219ea [Pipeline] sh > git config core.sparsecheckout # timeout=10 > git checkout -f 4ff8cb209307cd30c3626d4fbe3cc2d2ce4219ea # timeout=10 + git cat-file -t 4ff8cb209307cd30c3626d4fbe3cc2d2ce4219ea [Pipeline] sh + git rev-list --format=short 4ff8cb209307cd30c3626d4fbe3cc2d2ce4219ea...4ff8cb209307cd30c3626d4fbe3cc2d2ce4219ea [Pipeline] sh + git diff --stat --color 4ff8cb209307cd30c3626d4fbe3cc2d2ce4219ea 4ff8cb209307cd30c3626d4fbe3cc2d2ce4219ea [Pipeline] echo

- Changes -------------------------------------------------------------

The branch master has been updated.
      from  4ff8cb209307cd30c3626d4fbe3cc2d2ce4219ea (commit)

- Log -----------------------------------------------------------------


-----------------------------------------------------------------------

Summary of changes:

[Pipeline] } [Pipeline] // stage [Pipeline] echo -------- Build : configure -------- [Pipeline] stage [Pipeline] { (Build : configure) [Pipeline] dir Running in /var/lib/jenkins/workspace/Cforall_master [Pipeline] { [Pipeline] sh + ./autogen.sh Running aclocal in root Running libtoolize in root libtoolize: putting auxiliary files in AC_CONFIG_AUX_DIR, 'automake'. libtoolize: linking file 'automake/ltmain.sh' libtoolize: putting macros in AC_CONFIG_MACRO_DIRS, 'automake'. libtoolize: linking file 'automake/libtool.m4' libtoolize: linking file 'automake/ltoptions.m4' libtoolize: linking file 'automake/ltsugar.m4' libtoolize: linking file 'automake/ltversion.m4' libtoolize: linking file 'automake/lt~obsolete.m4' Running autoconf in root Running automake in root configure.ac:223: installing 'automake/compile' configure.ac:138: installing 'automake/config.guess' configure.ac:138: installing 'automake/config.sub' configure.ac:17: installing 'automake/install-sh' benchmark/Makefile.am: installing 'automake/depcomp' parallel-tests: installing 'automake/test-driver' configure.ac: installing 'automake/ylwrap' Running aclocal in libcfa Running libtoolize in libcfa libtoolize: putting auxiliary files in AC_CONFIG_AUX_DIR, 'automake'. libtoolize: linking file 'automake/ltmain.sh' libtoolize: putting macros in AC_CONFIG_MACRO_DIRS, 'automake'. libtoolize: linking file 'automake/libtool.m4' libtoolize: linking file 'automake/ltoptions.m4' libtoolize: linking file 'automake/ltsugar.m4' libtoolize: linking file 'automake/ltversion.m4' libtoolize: linking file 'automake/lt~obsolete.m4' Running autoconf in libcfa Running automake in libcfa configure.ac:119: installing 'automake/compile' configure.ac:119: installing 'automake/config.guess' configure.ac:119: installing 'automake/config.sub' configure.ac:12: installing 'automake/install-sh' src/Makefile.am: installing 'automake/depcomp' [Pipeline] } [Pipeline] // dir [Pipeline] dir Running in /var/lib/jenkins/workspace/Cforall_master@tmp [Pipeline] { [Pipeline] sh + /var/lib/jenkins/workspace/Cforall_master/configure CXX=g++-11 CC=gcc-11 --host=aarch64 AR=gcc-ar RANLIB=gcc-ranlib --with-target-hosts=host:debug,host:nodebug --quiet --prefix=/var/lib/jenkins/workspace/Cforall_master@tmp [Pipeline] sh + nproc + make -j 96 --no-print-directory configure-libcfa libcfa/arm64-debug/config.data Configuring libcfa (/var/lib/jenkins/workspace/Cforall_master/libcfa/configure) with ''CXX=g++-11' 'CC=gcc-11' 'AR=gcc-ar' 'RANLIB=gcc-ranlib' '--prefix=/var/lib/jenkins/workspace/Cforall_master@tmp' DRIVER_DIR=/var/lib/jenkins/workspace/Cforall_master@tmp/driver/ ARCHITECTURE=arm64 CONFIGURATION=debug CFA_VERSION=1:0:0' from /var/lib/jenkins/workspace/Cforall_master@tmp / libcfa/arm64-debug/ libcfa/arm64-nodebug/config.data Configuring libcfa (/var/lib/jenkins/workspace/Cforall_master/libcfa/configure) with ''CXX=g++-11' 'CC=gcc-11' 'AR=gcc-ar' 'RANLIB=gcc-ranlib' '--prefix=/var/lib/jenkins/workspace/Cforall_master@tmp' DRIVER_DIR=/var/lib/jenkins/workspace/Cforall_master@tmp/driver/ ARCHITECTURE=arm64 CONFIGURATION=nodebug CFA_VERSION=1:0:0' from /var/lib/jenkins/workspace/Cforall_master@tmp / libcfa/arm64-nodebug/ checking whether make supports nested variables... yes checking for a BSD-compatible install... checking whether make supports nested variables... yes checking for a BSD-compatible install... /usr/bin/install -c checking whether build environment is sane... yes /usr/bin/install -c checking whether build environment is sane... yes checking for a race-free mkdir -p... /usr/bin/mkdir -p checking for gawk... gawk checking whether make sets $(MAKE)... checking for a race-free mkdir -p... /usr/bin/mkdir -p checking for gawk... gawk checking whether make sets $(MAKE)... yes yes checking for distributated build... no checking for distributated build... no checking build system type... checking build system type... aarch64-unknown-linux-gnu checking host system type... aarch64-unknown-linux-gnu checking how to print strings... printf checking whether make supports the include directive... aarch64-unknown-linux-gnu checking host system type... aarch64-unknown-linux-gnu checking how to print strings... printf checking whether make supports the include directive... yes (GNU style) checking for gcc... gcc-11 yes (GNU style) checking for gcc... gcc-11 checking whether the C compiler works... checking whether the C compiler works... yes checking for C compiler default output file name... a.out checking for suffix of executables... yes checking for C compiler default output file name... a.out checking for suffix of executables... checking whether we are cross compiling... checking whether we are cross compiling... no checking for suffix of object files... no checking for suffix of object files... o checking whether the compiler supports GNU C... o checking whether the compiler supports GNU C... yes checking whether gcc-11 accepts -g... yes checking whether gcc-11 accepts -g... yes checking for gcc-11 option to enable C11 features... yes checking for gcc-11 option to enable C11 features... none needed checking whether gcc-11 understands -c and -o together... none needed checking whether gcc-11 understands -c and -o together... yes checking dependency style of gcc-11... yes checking dependency style of gcc-11... gcc3 checking for a sed that does not truncate output... /usr/bin/sed gcc3 checking for a sed that does not truncate output... checking for grep that handles long lines and -e... /usr/bin/grep checking for egrep... /usr/bin/sed /usr/bin/grep -E checking for fgrep... checking for grep that handles long lines and -e... /usr/bin/grep -F checking for ld used by gcc-11... /usr/bin/grep checking for egrep... /usr/bin/grep -E checking for fgrep... /usr/bin/grep -F /usr/bin/ld checking if the linker (/usr/bin/ld) is GNU ld... checking for ld used by gcc-11... yes checking for BSD- or MS-compatible name lister (nm)... /usr/bin/ld checking if the linker (/usr/bin/ld) is GNU ld... /usr/bin/nm -B checking the name lister (/usr/bin/nm -B) interface... yes checking for BSD- or MS-compatible name lister (nm)... /usr/bin/nm -B checking the name lister (/usr/bin/nm -B) interface... BSD nm checking whether ln -s works... yes checking the maximum length of command line arguments... 1572864 BSD nm checking whether ln -s works... yes checking the maximum length of command line arguments... checking how to convert aarch64-unknown-linux-gnu file names to aarch64-unknown-linux-gnu format... func_convert_file_noop checking how to convert aarch64-unknown-linux-gnu file names to toolchain format... func_convert_file_noop checking for /usr/bin/ld option to reload object files... -r checking for file... file checking for objdump... objdump checking how to recognize dependent libraries... pass_all checking for dlltool... no checking how to associate runtime and link libraries... printf %s\n checking for archiver @FILE support... 1572864 checking how to convert aarch64-unknown-linux-gnu file names to aarch64-unknown-linux-gnu format... func_convert_file_noop checking how to convert aarch64-unknown-linux-gnu file names to toolchain format... func_convert_file_noop checking for /usr/bin/ld option to reload object files... -r checking for file... file checking for objdump... objdump checking how to recognize dependent libraries... pass_all checking for dlltool... no checking how to associate runtime and link libraries... printf %s\n checking for archiver @FILE support... @ checking for strip... strip checking for ranlib... gcc-ranlib checking command to parse /usr/bin/nm -B output from gcc-11 object... @ checking for strip... strip checking for ranlib... gcc-ranlib checking command to parse /usr/bin/nm -B output from gcc-11 object... ok checking for sysroot... no checking for a working dd... /usr/bin/dd checking how to truncate binary pipes... /usr/bin/dd bs=4096 count=1 checking for mt... mt checking if mt is a manifest tool... ok checking for sysroot... no checking for a working dd... no checking for stdio.h... /usr/bin/dd checking how to truncate binary pipes... /usr/bin/dd bs=4096 count=1 checking for mt... mt checking if mt is a manifest tool... no checking for stdio.h... yes checking for stdlib.h... yes checking for stdlib.h... yes checking for string.h... yes checking for string.h... yes checking for inttypes.h... yes checking for inttypes.h... yes checking for stdint.h... yes checking for stdint.h... yes checking for strings.h... yes checking for strings.h... yes checking for sys/stat.h... yes checking for sys/stat.h... yes checking for sys/types.h... yes checking for sys/types.h... yes checking for unistd.h... yes checking for unistd.h... yes checking for dlfcn.h... yes checking for dlfcn.h... yes checking for objdir... .libs yes checking for objdir... .libs checking if gcc-11 supports -fno-rtti -fno-exceptions... checking if gcc-11 supports -fno-rtti -fno-exceptions... no checking for gcc-11 option to produce PIC... -fPIC -DPIC checking if gcc-11 PIC flag -fPIC -DPIC works... no checking for gcc-11 option to produce PIC... -fPIC -DPIC checking if gcc-11 PIC flag -fPIC -DPIC works... yes checking if gcc-11 static flag -static works... yes checking if gcc-11 static flag -static works... yes checking if gcc-11 supports -c -o file.o... yes checking if gcc-11 supports -c -o file.o... yes checking if gcc-11 supports -c -o file.o... (cached) yes checking whether the gcc-11 linker (/usr/bin/ld) supports shared libraries... yes checking whether -lc should be explicitly linked in... yes checking if gcc-11 supports -c -o file.o... (cached) yes checking whether the gcc-11 linker (/usr/bin/ld) supports shared libraries... yes checking whether -lc should be explicitly linked in... no checking dynamic linker characteristics... no checking dynamic linker characteristics... GNU/Linux ld.so checking how to hardcode library paths into programs... immediate checking whether stripping libraries is possible... yes checking if libtool supports shared libraries... yes checking whether to build shared libraries... yes checking whether to build static libraries... no GNU/Linux ld.so checking how to hardcode library paths into programs... immediate checking whether stripping libraries is possible... yes checking if libtool supports shared libraries... yes checking whether to build shared libraries... yes checking whether to build static libraries... no checking whether the compiler supports GNU C++... yes checking whether g++-11 accepts -g... checking whether the compiler supports GNU C++... yes checking for g++-11 option to enable C++11 features... yes checking whether g++-11 accepts -g... yes checking for g++-11 option to enable C++11 features... none needed checking dependency style of g++-11... none needed checking dependency style of g++-11... gcc3 checking how to run the C++ preprocessor... gcc3 checking how to run the C++ preprocessor... g++-11 -E g++-11 -E checking for ld used by g++-11... /usr/bin/ld checking if the linker (/usr/bin/ld) is GNU ld... yes checking whether the g++-11 linker (/usr/bin/ld) supports shared libraries... yes checking for ld used by g++-11... /usr/bin/ld checking if the linker (/usr/bin/ld) is GNU ld... yes checking whether the g++-11 linker (/usr/bin/ld) supports shared libraries... yes checking for g++-11 option to produce PIC... -fPIC -DPIC checking if g++-11 PIC flag -fPIC -DPIC works... yes checking if g++-11 static flag -static works... checking for g++-11 option to produce PIC... -fPIC -DPIC checking if g++-11 PIC flag -fPIC -DPIC works... yes checking if g++-11 static flag -static works... yes checking if g++-11 supports -c -o file.o... yes checking if g++-11 supports -c -o file.o... yes checking if g++-11 supports -c -o file.o... (cached) yes checking whether the g++-11 linker (/usr/bin/ld) supports shared libraries... yes checking dynamic linker characteristics... (cached) GNU/Linux ld.so checking how to hardcode library paths into programs... immediate checking for gcc... (cached) gcc-11 yes checking if g++-11 supports -c -o file.o... (cached) yes checking whether the g++-11 linker (/usr/bin/ld) supports shared libraries... yes checking dynamic linker characteristics... (cached) GNU/Linux ld.so checking how to hardcode library paths into programs... immediate checking for gcc... (cached) gcc-11 checking whether the compiler supports GNU C... (cached) yes checking whether gcc-11 accepts -g... (cached) yes checking for gcc-11 option to enable C11 features... (cached) none needed checking whether gcc-11 understands -c and -o together... (cached) yes checking dependency style of gcc-11... (cached) gcc3 checking dependency style of gcc-11... checking whether the compiler supports GNU C... (cached) yes checking whether gcc-11 accepts -g... (cached) yes checking for gcc-11 option to enable C11 features... (cached) none needed checking whether gcc-11 understands -c and -o together... (cached) yes checking dependency style of gcc-11... (cached) gcc3 checking dependency style of gcc-11... gcc3 checking whether make sets $(MAKE)... (cached) yes checking for linux/rseq.h... yes checking for rseq_available in -lrseq... gcc3 checking whether make sets $(MAKE)... (cached) yes checking for linux/rseq.h... no checking for gcc-11 options needed to detect all undeclared functions... yes checking for rseq_available in -lrseq... no checking for gcc-11 options needed to detect all undeclared functions... none needed checking for linux/io_uring.h... yes checking for liburing.h... none needed checking for linux/io_uring.h... no checking whether IORING_OP_NOP is declared... yes checking for liburing.h... yes checking whether IORING_OP_READV is declared... no checking whether IORING_OP_NOP is declared... yes checking whether IORING_OP_WRITEV is declared... yes checking whether IORING_OP_READV is declared... yes checking whether IORING_OP_FSYNC is declared... yes checking whether IORING_OP_WRITEV is declared... yes checking whether IORING_OP_READ_FIXED is declared... yes checking whether IORING_OP_FSYNC is declared... yes checking whether IORING_OP_WRITE_FIXED is declared... yes checking whether IORING_OP_READ_FIXED is declared... yes checking whether IORING_OP_POLL_ADD is declared... yes checking whether IORING_OP_WRITE_FIXED is declared... yes checking whether IORING_OP_POLL_REMOVE is declared... yes checking whether IORING_OP_POLL_ADD is declared... yes checking whether IORING_OP_SYNC_FILE_RANGE is declared... yes checking whether IORING_OP_POLL_REMOVE is declared... yes checking whether IORING_OP_SENDMSG is declared... yes checking whether IORING_OP_SYNC_FILE_RANGE is declared... yes checking whether IORING_OP_RECVMSG is declared... yes checking whether IORING_OP_SENDMSG is declared... yes checking whether IORING_OP_TIMEOUT is declared... yes checking whether IORING_OP_RECVMSG is declared... yes checking whether IORING_OP_TIMEOUT_REMOVE is declared... yes checking whether IORING_OP_TIMEOUT is declared... yes checking whether IORING_OP_ACCEPT is declared... yes checking whether IORING_OP_TIMEOUT_REMOVE is declared... yes checking whether IORING_OP_ASYNC_CANCEL is declared... yes checking whether IORING_OP_ACCEPT is declared... yes checking whether IORING_OP_LINK_TIMEOUT is declared... yes checking whether IORING_OP_ASYNC_CANCEL is declared... yes checking whether IORING_OP_CONNECT is declared... yes checking whether IORING_OP_LINK_TIMEOUT is declared... yes checking whether IORING_OP_FALLOCATE is declared... yes checking whether IORING_OP_CONNECT is declared... yes checking whether IORING_OP_OPENAT is declared... yes checking whether IORING_OP_FALLOCATE is declared... yes checking whether IORING_OP_CLOSE is declared... yes checking whether IORING_OP_OPENAT is declared... yes checking whether IORING_OP_FILES_UPDATE is declared... yes checking whether IORING_OP_CLOSE is declared... yes checking whether IORING_OP_STATX is declared... yes checking whether IORING_OP_FILES_UPDATE is declared... yes checking whether IORING_OP_READ is declared... yes checking whether IORING_OP_STATX is declared... yes checking whether IORING_OP_WRITE is declared... yes checking whether IORING_OP_READ is declared... yes checking whether IORING_OP_FADVISE is declared... yes checking whether IORING_OP_WRITE is declared... yes checking whether IORING_OP_MADVISE is declared... yes checking whether IORING_OP_FADVISE is declared... yes checking whether IORING_OP_SEND is declared... yes checking whether IORING_OP_MADVISE is declared... yes checking whether IORING_OP_RECV is declared... yes checking whether IORING_OP_SEND is declared... yes checking whether IORING_OP_OPENAT2 is declared... yes checking whether IORING_OP_RECV is declared... yes checking whether IORING_OP_EPOLL_CTL is declared... yes checking whether IORING_OP_OPENAT2 is declared... yes checking whether IORING_OP_SPLICE is declared... yes checking whether IORING_OP_EPOLL_CTL is declared... yes checking whether IORING_OP_PROVIDE_BUFFERS is declared... yes yes checking whether IORING_OP_SPLICE is declared... checking whether IORING_OP_REMOVE_BUFFER is declared... yes no checking whether IORING_OP_PROVIDE_BUFFERS is declared... checking whether IORING_OP_TEE is declared... yes yes checking whether IORING_OP_REMOVE_BUFFER is declared... checking whether IOSQE_FIXED_FILE is declared... yes no checking whether IOSQE_IO_DRAIN is declared... checking whether IORING_OP_TEE is declared... yes yes checking whether IOSQE_IO_LINK is declared... checking whether IOSQE_FIXED_FILE is declared... yes yes checking whether IOSQE_IO_HARDLINK is declared... checking whether IOSQE_IO_DRAIN is declared... yes yes checking whether IOSQE_IO_LINK is declared... checking whether IOSQE_ASYNC is declared... yes yes checking whether IOSQE_IO_HARDLINK is declared... checking whether IOSQE_BUFFER_SELECT is declared... yes yes checking whether SPLICE_F_FD_IN_FIXED is declared... checking whether IOSQE_ASYNC is declared... yes yes checking whether IORING_SETUP_ATTACH_WQ is declared... checking whether IOSQE_BUFFER_SELECT is declared... yes yes checking whether SPLICE_F_FD_IN_FIXED is declared... checking whether IORING_REGISTER_IOWQ_MAX_WORKERS is declared... yes checking whether IORING_SETUP_ATTACH_WQ is declared... yes checking for preadv2... yes checking whether IORING_REGISTER_IOWQ_MAX_WORKERS is declared... yes checking for pwritev2... yes checking for preadv2... yes yes checking for pwritev2... checking that generated files are newer than configure... done configure: creating ./config.status yes checking that generated files are newer than configure... done configure: creating ./config.status config.status: creating Makefile config.status: creating src/Makefile config.status: creating prelude/Makefile config.status: creating src/concurrency/io/call.cfa config.status: creating Makefile config.status: creating src/Makefile /var/lib/jenkins/workspace/Cforall_master/libcfa/src/concurrency/io/call.cfa.in:144: SyntaxWarning: invalid escape sequence '\(' sig = re.search("(.*) (.*)\((.*)\)", signature) config.status: creating prelude/defines.hfa config.status: creating prelude/Makefile config.status: executing depfiles commands config.status: creating src/concurrency/io/call.cfa /var/lib/jenkins/workspace/Cforall_master/libcfa/src/concurrency/io/call.cfa.in:144: SyntaxWarning: invalid escape sequence '\(' sig = re.search("(.*) (.*)\((.*)\)", signature) config.status: creating prelude/defines.hfa config.status: executing libtool commands Cforall library configuraton completed. Type "make -j 8 install". config.status: executing depfiles commands config.status: executing libtool commands Cforall library configuraton completed. Type "make -j 8 install". [Pipeline] } [Pipeline] // dir [Pipeline] } [Pipeline] // stage [Pipeline] echo -------- Build : cfa-cpp -------- [Pipeline] stage [Pipeline] { (Build : cfa-cpp) [Pipeline] dir Running in /var/lib/jenkins/workspace/Cforall_master@tmp [Pipeline] { [Pipeline] sh + nproc + make -j 96 --no-print-directory -C driver CXX as.o CXX cc1.o CXX cfa.o CXXLD as CXXLD cc1 CXXLD cfa [Pipeline] sh + nproc + make -j 96 --no-print-directory -C src YACC Parser/parser.cc updating Parser/parser.output updating Parser/parser.hh make all-am CXX main.o CXX CompilationState.o CXX MakeLibCfa.o LEX Parser/lex.cc CXX AST/Attribute.o CXX AST/Copy.o CXX AST/Create.o CXX AST/Decl.o CXX AST/DeclReplacer.o CXX AST/Expr.o CXX AST/GenericSubstitution.o CXX AST/Init.o CXX AST/Inspect.o CXX AST/LinkageSpec.o CXX AST/Node.o CXX AST/Pass.o CXX AST/Print.o CXX AST/Stmt.o CXX AST/SymbolTable.o CXX AST/Type.o CXX AST/TypeEnvironment.o CXX AST/TypeSubstitution.o CXX AST/Util.o CXX CodeGen/CodeGenerator.o CXX CodeGen/GenType.o CXX CodeGen/OperatorTable.o CXX CodeGen/FixMain.o CXX CodeGen/FixNames.o CXX CodeGen/Generate.o CXX CodeGen/LinkOnce.o CXX Concurrency/Actors.o CXX Concurrency/Corun.o CXX Concurrency/Keywords.o CXX Concurrency/Waitfor.o CXX Concurrency/Waituntil.o CXX Common/Assert.o CXX Common/CodeLocationTools.o CXX Common/DeclStats.o CXX Common/Eval.o CXX Common/Examine.o CXX Common/Indenter.o CXX Common/ResolvProtoDump.o CXX Common/SemanticError.o CXX Common/Stats/Counter.o CXX Common/Stats/Heap.o CXX Common/Stats/ResolveTime.o CXX Common/Stats/Stats.o CXX Common/Stats/Time.o CXX Common/Symbol.o CXX Common/UniqueName.o CXX Common/DebugMalloc.o CXX ControlStruct/ExceptDecl.o CXX ControlStruct/ExceptTranslate.o CXX ControlStruct/FixLabels.o CXX ControlStruct/HoistControlDecls.o CXX ControlStruct/LabelGenerator.o CXX ControlStruct/MultiLevelExit.o CXX ControlStruct/TranslateEnumRange.o CXX GenPoly/GenPoly.o CXX GenPoly/Lvalue2.o CXX GenPoly/Box.o CXX GenPoly/FindFunction.o CXX GenPoly/InstantiateGeneric.o CXX GenPoly/Lvalue.o CXX GenPoly/ScrubTypeVars.o CXX GenPoly/Specialize.o CXX InitTweak/GenInit.o CXX InitTweak/InitTweak.o CXX InitTweak/FixGlobalInit.o CXX InitTweak/FixInit.o CXX Parser/DeclarationNode.o CXX Parser/ExpressionNode.o CXX Parser/InitializerNode.o CXX Parser/ParseNode.o CXX Parser/parser.o CXX Parser/RunParser.o CXX Parser/StatementNode.o CXX Parser/TypeData.o CXX Parser/TypedefTable.o CXX ResolvExpr/AdjustExprType.o CXX ResolvExpr/Candidate.o CXX ResolvExpr/CandidateFinder.o CXX ResolvExpr/CastCost.o CXX ResolvExpr/CommonType.o CXX ResolvExpr/ConversionCost.o CXX ResolvExpr/CurrentObject.o CXX ResolvExpr/ExplodedArg.o CXX ResolvExpr/FindOpenVars.o CXX ResolvExpr/PolyCost.o CXX ResolvExpr/PtrsAssignable.o CXX ResolvExpr/PtrsCastable.o CXX ResolvExpr/RenameVars.o CXX ResolvExpr/ResolveTypeof.o CXX ResolvExpr/Resolver.o CXX ResolvExpr/SatisfyAssertions.o CXX ResolvExpr/SpecCost.o CXX ResolvExpr/Unify.o CXX ResolvExpr/CandidatePrinter.o In file included from /usr/include/aarch64-linux-gnu/c++/11/bits/os_defines.h:39, from /usr/include/aarch64-linux-gnu/c++/11/bits/c++config.h:586, from /usr/include/c++/11/cstdio:41, from /var/lib/jenkins/workspace/Cforall_master/src/Parser/parser.yy:41: /usr/include/features.h:415:4: warning: #warning _FORTIFY_SOURCE requires GCC 4.1 or later [-Wcpp] 415 | # warning _FORTIFY_SOURCE requires GCC 4.1 or later | ^~~~~~~ CXX ResolvExpr/EraseWith.o CXX SymTab/FixFunction.o CXX SymTab/GenImplicitCall.o CXX SymTab/Mangler.o CXX SymTab/ManglerCommon.o CXX Tuples/Explode.o CXX Tuples/TupleAssignment.o CXX Tuples/TupleExpansion.o CXX Tuples/Tuples.o CXX Validate/Autogen.o CXX Validate/CheckAssertions.o CXX Validate/CompoundLiteral.o CXX Validate/EliminateTypedef.o CXX Validate/EnumAndPointerDecay.o CXX Validate/FindSpecialDecls.o CXX Validate/FixQualifiedTypes.o CXX Validate/FixReturnTypes.o CXX Validate/ForallPointerDecay.o CXX Validate/GenericParameter.o CXX Validate/HoistStruct.o CXX Validate/HoistTypeDecls.o CXX Validate/ImplementEnumFunc.o CXX Validate/InitializerLength.o CXX Validate/LabelAddressFixer.o CXX Validate/LinkInstanceTypes.o CXX Validate/ReplaceTypedef.o CXX Validate/ReturnCheck.o CXX Validate/VerifyCtorDtorAssign.o CXX Virtual/ExpandCasts.o CXX Virtual/Tables.o CXX Virtual/VirtualDtor.o CXX Parser/lex.o CXXLD ../driver/cfa-cpp [Pipeline] } [Pipeline] // dir [Pipeline] } [Pipeline] // stage [Pipeline] echo -------- Build : libcfa(debug) -------- [Pipeline] stage [Pipeline] { (Build : libcfa(debug)) [Pipeline] dir Running in /var/lib/jenkins/workspace/Cforall_master@tmp [Pipeline] { [Pipeline] sh + nproc + make -j 96 --no-print-directory -C libcfa/arm64-debug Making all in prelude mkdir .deps touch .deps/builtins.Po (CDPATH="${ZSH_VERSION+.}:" && cd /var/lib/jenkins/workspace/Cforall_master/libcfa && /bin/bash '/var/lib/jenkins/workspace/Cforall_master/libcfa/automake/missing' autoheader) rm -f stamp-h1 touch /var/lib/jenkins/workspace/Cforall_master/libcfa/prelude/defines.hfa.in cd .. && /bin/bash ./config.status prelude/defines.hfa config.status: creating prelude/defines.hfa config.status: prelude/defines.hfa is unchanged make all-am GEN gcc-builtins.c GEN builtins.cfa GEN prelude.cfa GEN extras.cfa GEN extras.cfa GEN gcc-builtins.cfa GEN bootloader.c Making all in src CFA common.lo CFA fstream.lo CFA iostream.lo CFA heap.lo CFA iterator.lo CFA limits.lo CFA math.lo CFA memory.lo CFA parseargs.lo CFA parseconfig.lo CFA rational.lo CFA stdlib.lo CFA strstream.lo CFA time.lo CFA assert.lo CC exception.lo CFA interpose.lo CFA prelude-inline.lo CFA startup.lo CC virtual.lo GEN prelude.lo CFA interpose_thread.lo CFA bits/weakso_locks.lo CFA algorithms/range_iterator.lo CFA collections/maybe.lo CFA collections/pair.lo CFA collections/result.lo CFA collections/string.lo CFA collections/string_res.lo CFA collections/vector.lo CFA device/cpu.lo CFA bits/debug.lo CFA concurrency/alarm.lo CFA concurrency/coroutine.lo CFA concurrency/exception.lo CFA concurrency/kernel.lo CFA concurrency/kernel/cluster.lo CFA concurrency/locks.lo CFA concurrency/monitor.lo CFA concurrency/mutex.lo CFA concurrency/select.lo CFA concurrency/thread.lo CFA concurrency/cofor.lo CFA concurrency/clib/cfathread.lo CPPAS concurrency/CtxSwitch-arm64.lo CC concurrency/invoke.lo CFA concurrency/io.lo CFA concurrency/io/setup.lo CFA concurrency/io/call.lo CFA concurrency/kernel/startup.lo CFA concurrency/preemption.lo CFA concurrency/ready_queue.lo CFA concurrency/stats.lo CFA concurrency/pthread.lo /usr/include/linux/io_uring.h:83:43: warning: 'packed' attribute ignored for field of type 'union __io_uring_sqe____anonymous65' [-Wattributes] 83 | } __attribute__((packed)); | ^ CCLD libcfa.la /usr/bin/ld: warning: .libs/common.o: requires executable stack (because the .note.GNU-stack section is executable) /usr/include/linux/io_uring.h:83:43: warning: 'packed' attribute ignored for field of type 'union __io_uring_sqe____anonymous53' [-Wattributes] 83 | } __attribute__((packed)); | ^ /usr/include/linux/io_uring.h:83:43: warning: 'packed' attribute ignored for field of type 'union __io_uring_sqe____anonymous129' [-Wattributes] 83 | } __attribute__((packed)); | ^ /usr/include/linux/io_uring.h:83:43: warning: 'packed' attribute ignored for field of type 'union __io_uring_sqe____anonymous119' [-Wattributes] 83 | } __attribute__((packed)); | ^ /usr/include/linux/io_uring.h:83:43: warning: 'packed' attribute ignored for field of type 'union __io_uring_sqe____anonymous119' [-Wattributes] 83 | } __attribute__((packed)); | ^ /usr/include/linux/io_uring.h:83:43: warning: 'packed' attribute ignored for field of type 'union __io_uring_sqe____anonymous32' [-Wattributes] 83 | } __attribute__((packed)); | ^ /usr/include/linux/io_uring.h:83:43: warning: 'packed' attribute ignored for field of type 'union __io_uring_sqe____anonymous97' [-Wattributes] 83 | } __attribute__((packed)); | ^ CCLD libcfathread.la /usr/bin/ld: warning: concurrency/.libs/alarm.o: requires executable stack (because the .note.GNU-stack section is executable) make[1]: Nothing to be done for 'all-am'. [Pipeline] } [Pipeline] // dir [Pipeline] } [Pipeline] // stage [Pipeline] echo -------- Build : libcfa(nodebug) -------- [Pipeline] stage [Pipeline] { (Build : libcfa(nodebug)) [Pipeline] dir Running in /var/lib/jenkins/workspace/Cforall_master@tmp [Pipeline] { [Pipeline] sh + nproc + make -j 96 --no-print-directory -C libcfa/arm64-nodebug Making all in prelude mkdir .deps touch .deps/builtins.Po cd .. && /bin/bash ./config.status prelude/defines.hfa config.status: creating prelude/defines.hfa config.status: prelude/defines.hfa is unchanged make all-am GEN gcc-builtins.c GEN builtins.cfa GEN prelude.cfa GEN extras.cfa GEN gcc-builtins.cfa GEN extras.cfa GEN bootloader.c Making all in src CFA common.lo CFA fstream.lo CFA iostream.lo CFA heap.lo CFA iterator.lo CFA limits.lo CFA math.lo CFA memory.lo CFA parseargs.lo CFA parseconfig.lo CFA rational.lo CFA stdlib.lo CFA strstream.lo CFA time.lo CFA assert.lo CFA bits/debug.lo CC exception.lo CFA interpose.lo CFA prelude-inline.lo CFA startup.lo CC virtual.lo GEN prelude.lo CFA interpose_thread.lo CFA bits/weakso_locks.lo CFA algorithms/range_iterator.lo CFA collections/maybe.lo CFA collections/pair.lo CFA collections/result.lo CFA collections/string.lo CFA collections/string_res.lo CFA collections/vector.lo CFA device/cpu.lo CFA concurrency/alarm.lo CFA concurrency/coroutine.lo CFA concurrency/exception.lo CFA concurrency/kernel.lo CFA concurrency/kernel/cluster.lo CFA concurrency/locks.lo CFA concurrency/monitor.lo CFA concurrency/mutex.lo CFA concurrency/select.lo CFA concurrency/thread.lo CFA concurrency/cofor.lo CFA concurrency/clib/cfathread.lo CPPAS concurrency/CtxSwitch-arm64.lo CC concurrency/invoke.lo CFA concurrency/io.lo CFA concurrency/io/setup.lo CFA concurrency/io/call.lo CFA concurrency/kernel/startup.lo CFA concurrency/preemption.lo CFA concurrency/ready_queue.lo CFA concurrency/stats.lo CFA concurrency/pthread.lo /var/lib/jenkins/workspace/Cforall_master/libcfa/src/exception.c: In function '__cfaehm_allocate_exception': /var/lib/jenkins/workspace/Cforall_master/libcfa/src/exception.c:142:17: warning: ignoring return value of 'write' declared with attribute 'warn_unused_result' [-Wunused-result] 142 | write( 2, "abort2\n", 7 ); | ^~~~~~~~~~~~~~~~~~~~~~~~~ /var/lib/jenkins/workspace/Cforall_master/libcfa/src/exception.c: In function '__cfaehm_exception_cleanup': /var/lib/jenkins/workspace/Cforall_master/libcfa/src/exception.c:127:17: warning: ignoring return value of 'write' declared with attribute 'warn_unused_result' [-Wunused-result] 127 | write( 2, "abort1\n", 7 ); | ^~~~~~~~~~~~~~~~~~~~~~~~~ /var/lib/jenkins/workspace/Cforall_master/libcfa/src/exception.c: In function '__cfaehm_cancel_stack': /var/lib/jenkins/workspace/Cforall_master/libcfa/src/exception.c:230:9: warning: ignoring return value of 'write' declared with attribute 'warn_unused_result' [-Wunused-result] 230 | write( 2, "abort3\n", 7 ); | ^~~~~~~~~~~~~~~~~~~~~~~~~ /var/lib/jenkins/workspace/Cforall_master/libcfa/src/exception.c: In function '__cfaehm_begin_unwind': /var/lib/jenkins/workspace/Cforall_master/libcfa/src/exception.c:252:17: warning: ignoring return value of 'write' declared with attribute 'warn_unused_result' [-Wunused-result] 252 | write( 2, "abort4\n", 7 ); | ^~~~~~~~~~~~~~~~~~~~~~~~~ /var/lib/jenkins/workspace/Cforall_master/libcfa/src/exception.c:278:17: warning: ignoring return value of 'write' declared with attribute 'warn_unused_result' [-Wunused-result] 278 | write( 2, "abort5\n", 7 ); | ^~~~~~~~~~~~~~~~~~~~~~~~~ /var/lib/jenkins/workspace/Cforall_master/libcfa/src/exception.c: In function '__cfaehm_rethrow_terminate': /var/lib/jenkins/workspace/Cforall_master/libcfa/src/exception.c:308:9: warning: ignoring return value of 'write' declared with attribute 'warn_unused_result' [-Wunused-result] 308 | write( 2, "abort7\n", 7 ); | ^~~~~~~~~~~~~~~~~~~~~~~~~ /var/lib/jenkins/workspace/Cforall_master/libcfa/src/exception.c: In function '__cfaehm_rethrow_adapter': /var/lib/jenkins/workspace/Cforall_master/libcfa/src/exception.c:300:9: warning: ignoring return value of 'write' declared with attribute 'warn_unused_result' [-Wunused-result] 300 | write( 2, "abort6\n", 7 ); | ^~~~~~~~~~~~~~~~~~~~~~~~~ /usr/include/linux/io_uring.h:83:43: warning: 'packed' attribute ignored for field of type 'union __io_uring_sqe____anonymous65' [-Wattributes] 83 | } __attribute__((packed)); | ^ /usr/include/aarch64-linux-gnu/bits/socket2.h:70:94: warning: '_X12_constructorFv_U26__anonymous___SOCKADDR_ARGU26__anonymous___SOCKADDR_ARG_autogen___1' is static but used in inline function 'recvfrom' which is not static 70 | return __recvfrom_chk (__fd, __buf, __n, sz, __flags, __addr, __addr_len); | ^ /usr/include/aarch64-linux-gnu/bits/socket2.h:70:124: warning: '_X11_destructorFv_U26__anonymous___SOCKADDR_ARG_autogen___1' is static but used in inline function 'recvfrom' which is not static 70 | return __recvfrom_chk (__fd, __buf, __n, sz, __flags, __addr, __addr_len); | ^ /usr/include/aarch64-linux-gnu/bits/socket2.h:68:103: warning: '_X12_constructorFv_U26__anonymous___SOCKADDR_ARGU26__anonymous___SOCKADDR_ARG_autogen___1' is static but used in inline function 'recvfrom' which is not static 68 | return __recvfrom_chk_warn (__fd, __buf, __n, sz, __flags, __addr, | ^ /usr/include/aarch64-linux-gnu/bits/socket2.h:68:128: warning: '_X11_destructorFv_U26__anonymous___SOCKADDR_ARG_autogen___1' is static but used in inline function 'recvfrom' which is not static 68 | return __recvfrom_chk_warn (__fd, __buf, __n, sz, __flags, __addr, | ^ /usr/include/aarch64-linux-gnu/bits/socket2.h:66:96: warning: '_X12_constructorFv_U26__anonymous___SOCKADDR_ARGU26__anonymous___SOCKADDR_ARG_autogen___1' is static but used in inline function 'recvfrom' which is not static 66 | return __recvfrom_alias (__fd, __buf, __n, __flags, __addr, __addr_len); | ^ /usr/include/aarch64-linux-gnu/bits/socket2.h:66:128: warning: '_X11_destructorFv_U26__anonymous___SOCKADDR_ARG_autogen___1' is static but used in inline function 'recvfrom' which is not static 66 | return __recvfrom_alias (__fd, __buf, __n, __flags, __addr, __addr_len); | ^ /usr/include/linux/io_uring.h:83:43: warning: 'packed' attribute ignored for field of type 'union __io_uring_sqe____anonymous129' [-Wattributes] 83 | } __attribute__((packed)); | ^ /usr/include/aarch64-linux-gnu/bits/socket2.h:70:95: warning: '_X12_constructorFv_U26__anonymous___SOCKADDR_ARGU26__anonymous___SOCKADDR_ARG_autogen___1' is static but used in inline function 'recvfrom' which is not static 70 | return __recvfrom_chk (__fd, __buf, __n, sz, __flags, __addr, __addr_len); | ^ /usr/include/aarch64-linux-gnu/bits/socket2.h:70:125: warning: '_X11_destructorFv_U26__anonymous___SOCKADDR_ARG_autogen___1' is static but used in inline function 'recvfrom' which is not static 70 | return __recvfrom_chk (__fd, __buf, __n, sz, __flags, __addr, __addr_len); | ^ /usr/include/aarch64-linux-gnu/bits/socket2.h:68:104: warning: '_X12_constructorFv_U26__anonymous___SOCKADDR_ARGU26__anonymous___SOCKADDR_ARG_autogen___1' is static but used in inline function 'recvfrom' which is not static 68 | return __recvfrom_chk_warn (__fd, __buf, __n, sz, __flags, __addr, | ^ /usr/include/aarch64-linux-gnu/bits/socket2.h:68:129: warning: '_X11_destructorFv_U26__anonymous___SOCKADDR_ARG_autogen___1' is static but used in inline function 'recvfrom' which is not static 68 | return __recvfrom_chk_warn (__fd, __buf, __n, sz, __flags, __addr, | ^ /usr/include/aarch64-linux-gnu/bits/socket2.h:66:97: warning: '_X12_constructorFv_U26__anonymous___SOCKADDR_ARGU26__anonymous___SOCKADDR_ARG_autogen___1' is static but used in inline function 'recvfrom' which is not static 66 | return __recvfrom_alias (__fd, __buf, __n, __flags, __addr, __addr_len); | ^ /usr/include/aarch64-linux-gnu/bits/socket2.h:66:129: warning: '_X11_destructorFv_U26__anonymous___SOCKADDR_ARG_autogen___1' is static but used in inline function 'recvfrom' which is not static 66 | return __recvfrom_alias (__fd, __buf, __n, __flags, __addr, __addr_len); | ^ /usr/include/linux/io_uring.h:83:43: warning: 'packed' attribute ignored for field of type 'union __io_uring_sqe____anonymous53' [-Wattributes] 83 | } __attribute__((packed)); | ^ /usr/include/linux/io_uring.h:83:43: warning: 'packed' attribute ignored for field of type 'union __io_uring_sqe____anonymous119' [-Wattributes] 83 | } __attribute__((packed)); | ^ /usr/include/aarch64-linux-gnu/bits/socket2.h:70:95: warning: '_X12_constructorFv_U26__anonymous___SOCKADDR_ARGU26__anonymous___SOCKADDR_ARG_autogen___1' is static but used in inline function 'recvfrom' which is not static 70 | return __recvfrom_chk (__fd, __buf, __n, sz, __flags, __addr, __addr_len); | ^ /usr/include/aarch64-linux-gnu/bits/socket2.h:70:125: warning: '_X11_destructorFv_U26__anonymous___SOCKADDR_ARG_autogen___1' is static but used in inline function 'recvfrom' which is not static 70 | return __recvfrom_chk (__fd, __buf, __n, sz, __flags, __addr, __addr_len); | ^ /usr/include/aarch64-linux-gnu/bits/socket2.h:68:104: warning: '_X12_constructorFv_U26__anonymous___SOCKADDR_ARGU26__anonymous___SOCKADDR_ARG_autogen___1' is static but used in inline function 'recvfrom' which is not static 68 | return __recvfrom_chk_warn (__fd, __buf, __n, sz, __flags, __addr, | ^ /usr/include/aarch64-linux-gnu/bits/socket2.h:68:129: warning: '_X11_destructorFv_U26__anonymous___SOCKADDR_ARG_autogen___1' is static but used in inline function 'recvfrom' which is not static 68 | return __recvfrom_chk_warn (__fd, __buf, __n, sz, __flags, __addr, | ^ /usr/include/aarch64-linux-gnu/bits/socket2.h:66:97: warning: '_X12_constructorFv_U26__anonymous___SOCKADDR_ARGU26__anonymous___SOCKADDR_ARG_autogen___1' is static but used in inline function 'recvfrom' which is not static 66 | return __recvfrom_alias (__fd, __buf, __n, __flags, __addr, __addr_len); | ^ /usr/include/aarch64-linux-gnu/bits/socket2.h:66:129: warning: '_X11_destructorFv_U26__anonymous___SOCKADDR_ARG_autogen___1' is static but used in inline function 'recvfrom' which is not static 66 | return __recvfrom_alias (__fd, __buf, __n, __flags, __addr, __addr_len); | ^ /usr/include/aarch64-linux-gnu/bits/socket2.h:70:95: warning: '_X12_constructorFv_U26__anonymous___SOCKADDR_ARGU26__anonymous___SOCKADDR_ARG_autogen___1' is static but used in inline function 'recvfrom' which is not static 70 | return __recvfrom_chk (__fd, __buf, __n, sz, __flags, __addr, __addr_len); | ^ /usr/include/aarch64-linux-gnu/bits/socket2.h:70:125: warning: '_X11_destructorFv_U26__anonymous___SOCKADDR_ARG_autogen___1' is static but used in inline function 'recvfrom' which is not static 70 | return __recvfrom_chk (__fd, __buf, __n, sz, __flags, __addr, __addr_len); | ^ /usr/include/aarch64-linux-gnu/bits/socket2.h:68:104: warning: '_X12_constructorFv_U26__anonymous___SOCKADDR_ARGU26__anonymous___SOCKADDR_ARG_autogen___1' is static but used in inline function 'recvfrom' which is not static 68 | return __recvfrom_chk_warn (__fd, __buf, __n, sz, __flags, __addr, | ^ /usr/include/aarch64-linux-gnu/bits/socket2.h:68:129: warning: '_X11_destructorFv_U26__anonymous___SOCKADDR_ARG_autogen___1' is static but used in inline function 'recvfrom' which is not static 68 | return __recvfrom_chk_warn (__fd, __buf, __n, sz, __flags, __addr, | ^ /usr/include/aarch64-linux-gnu/bits/socket2.h:66:97: warning: '_X12_constructorFv_U26__anonymous___SOCKADDR_ARGU26__anonymous___SOCKADDR_ARG_autogen___1' is static but used in inline function 'recvfrom' which is not static 66 | return __recvfrom_alias (__fd, __buf, __n, __flags, __addr, __addr_len); | ^ /usr/include/aarch64-linux-gnu/bits/socket2.h:66:129: warning: '_X11_destructorFv_U26__anonymous___SOCKADDR_ARG_autogen___1' is static but used in inline function 'recvfrom' which is not static 66 | return __recvfrom_alias (__fd, __buf, __n, __flags, __addr, __addr_len); | ^ /usr/include/linux/io_uring.h:83:43: warning: 'packed' attribute ignored for field of type 'union __io_uring_sqe____anonymous119' [-Wattributes] 83 | } __attribute__((packed)); | ^ /usr/include/aarch64-linux-gnu/bits/socket2.h:70:95: warning: '_X12_constructorFv_U26__anonymous___SOCKADDR_ARGU26__anonymous___SOCKADDR_ARG_autogen___1' is static but used in inline function 'recvfrom' which is not static 70 | return __recvfrom_chk (__fd, __buf, __n, sz, __flags, __addr, __addr_len); | ^ /usr/include/aarch64-linux-gnu/bits/socket2.h:70:125: warning: '_X11_destructorFv_U26__anonymous___SOCKADDR_ARG_autogen___1' is static but used in inline function 'recvfrom' which is not static 70 | return __recvfrom_chk (__fd, __buf, __n, sz, __flags, __addr, __addr_len); | ^ /usr/include/aarch64-linux-gnu/bits/socket2.h:68:104: warning: '_X12_constructorFv_U26__anonymous___SOCKADDR_ARGU26__anonymous___SOCKADDR_ARG_autogen___1' is static but used in inline function 'recvfrom' which is not static 68 | return __recvfrom_chk_warn (__fd, __buf, __n, sz, __flags, __addr, | ^ /usr/include/aarch64-linux-gnu/bits/socket2.h:68:129: warning: '_X11_destructorFv_U26__anonymous___SOCKADDR_ARG_autogen___1' is static but used in inline function 'recvfrom' which is not static 68 | return __recvfrom_chk_warn (__fd, __buf, __n, sz, __flags, __addr, | ^ /usr/include/aarch64-linux-gnu/bits/socket2.h:66:97: warning: '_X12_constructorFv_U26__anonymous___SOCKADDR_ARGU26__anonymous___SOCKADDR_ARG_autogen___1' is static but used in inline function 'recvfrom' which is not static 66 | return __recvfrom_alias (__fd, __buf, __n, __flags, __addr, __addr_len); | ^ /usr/include/aarch64-linux-gnu/bits/socket2.h:66:129: warning: '_X11_destructorFv_U26__anonymous___SOCKADDR_ARG_autogen___1' is static but used in inline function 'recvfrom' which is not static 66 | return __recvfrom_alias (__fd, __buf, __n, __flags, __addr, __addr_len); | ^ /usr/include/linux/io_uring.h:83:43: warning: 'packed' attribute ignored for field of type 'union __io_uring_sqe____anonymous32' [-Wattributes] 83 | } __attribute__((packed)); | ^ CCLD libcfa.la /usr/include/aarch64-linux-gnu/bits/socket2.h:70:94: warning: '_X12_constructorFv_U26__anonymous___SOCKADDR_ARGU26__anonymous___SOCKADDR_ARG_autogen___1' is static but used in inline function 'recvfrom' which is not static 70 | return __recvfrom_chk (__fd, __buf, __n, sz, __flags, __addr, __addr_len); | ^ /usr/include/aarch64-linux-gnu/bits/socket2.h:70:124: warning: '_X11_destructorFv_U26__anonymous___SOCKADDR_ARG_autogen___1' is static but used in inline function 'recvfrom' which is not static 70 | return __recvfrom_chk (__fd, __buf, __n, sz, __flags, __addr, __addr_len); | ^ /usr/include/aarch64-linux-gnu/bits/socket2.h:68:103: warning: '_X12_constructorFv_U26__anonymous___SOCKADDR_ARGU26__anonymous___SOCKADDR_ARG_autogen___1' is static but used in inline function 'recvfrom' which is not static 68 | return __recvfrom_chk_warn (__fd, __buf, __n, sz, __flags, __addr, | ^ /usr/include/aarch64-linux-gnu/bits/socket2.h:68:128: warning: '_X11_destructorFv_U26__anonymous___SOCKADDR_ARG_autogen___1' is static but used in inline function 'recvfrom' which is not static 68 | return __recvfrom_chk_warn (__fd, __buf, __n, sz, __flags, __addr, | ^ /usr/include/aarch64-linux-gnu/bits/socket2.h:66:96: warning: '_X12_constructorFv_U26__anonymous___SOCKADDR_ARGU26__anonymous___SOCKADDR_ARG_autogen___1' is static but used in inline function 'recvfrom' which is not static 66 | return __recvfrom_alias (__fd, __buf, __n, __flags, __addr, __addr_len); | ^ /usr/include/aarch64-linux-gnu/bits/socket2.h:66:128: warning: '_X11_destructorFv_U26__anonymous___SOCKADDR_ARG_autogen___1' is static but used in inline function 'recvfrom' which is not static 66 | return __recvfrom_alias (__fd, __buf, __n, __flags, __addr, __addr_len); | ^ /usr/bin/ld: warning: .libs/common.o: requires executable stack (because the .note.GNU-stack section is executable) /usr/include/linux/io_uring.h:83:43: warning: 'packed' attribute ignored for field of type 'union __io_uring_sqe____anonymous97' [-Wattributes] 83 | } __attribute__((packed)); | ^ /usr/include/aarch64-linux-gnu/bits/socket2.h:70:95: warning: '_X12_constructorFv_U26__anonymous___SOCKADDR_ARGU26__anonymous___SOCKADDR_ARG_autogen___1' is static but used in inline function 'recvfrom' which is not static 70 | return __recvfrom_chk (__fd, __buf, __n, sz, __flags, __addr, __addr_len); | ^ /usr/include/aarch64-linux-gnu/bits/socket2.h:70:125: warning: '_X11_destructorFv_U26__anonymous___SOCKADDR_ARG_autogen___1' is static but used in inline function 'recvfrom' which is not static 70 | return __recvfrom_chk (__fd, __buf, __n, sz, __flags, __addr, __addr_len); | ^ /usr/include/aarch64-linux-gnu/bits/socket2.h:68:104: warning: '_X12_constructorFv_U26__anonymous___SOCKADDR_ARGU26__anonymous___SOCKADDR_ARG_autogen___1' is static but used in inline function 'recvfrom' which is not static 68 | return __recvfrom_chk_warn (__fd, __buf, __n, sz, __flags, __addr, | ^ /usr/include/aarch64-linux-gnu/bits/socket2.h:68:129: warning: '_X11_destructorFv_U26__anonymous___SOCKADDR_ARG_autogen___1' is static but used in inline function 'recvfrom' which is not static 68 | return __recvfrom_chk_warn (__fd, __buf, __n, sz, __flags, __addr, | ^ /usr/include/aarch64-linux-gnu/bits/socket2.h:66:97: warning: '_X12_constructorFv_U26__anonymous___SOCKADDR_ARGU26__anonymous___SOCKADDR_ARG_autogen___1' is static but used in inline function 'recvfrom' which is not static 66 | return __recvfrom_alias (__fd, __buf, __n, __flags, __addr, __addr_len); | ^ /usr/include/aarch64-linux-gnu/bits/socket2.h:66:129: warning: '_X11_destructorFv_U26__anonymous___SOCKADDR_ARG_autogen___1' is static but used in inline function 'recvfrom' which is not static 66 | return __recvfrom_alias (__fd, __buf, __n, __flags, __addr, __addr_len); | ^ CCLD libcfathread.la /usr/bin/ld: warning: concurrency/.libs/coroutine.o: requires executable stack (because the .note.GNU-stack section is executable) make[1]: Nothing to be done for 'all-am'. [Pipeline] } [Pipeline] // dir [Pipeline] } [Pipeline] // stage [Pipeline] echo -------- Build : install -------- [Pipeline] stage [Pipeline] { (Build : install) [Pipeline] dir Running in /var/lib/jenkins/workspace/Cforall_master@tmp [Pipeline] { [Pipeline] sh + nproc + make -j 96 --no-print-directory install Making install in driver make install-exec-hook /usr/bin/install -c cfa '/var/lib/jenkins/workspace/Cforall_master@tmp/bin//cfa' /usr/bin/mkdir -p '/var/lib/jenkins/workspace/Cforall_master@tmp/lib/cfa/' /bin/bash ../libtool --mode=install /usr/bin/install -c as cc1 '/var/lib/jenkins/workspace/Cforall_master@tmp/lib/cfa/' libtool: install: /usr/bin/install -c as /var/lib/jenkins/workspace/Cforall_master@tmp/lib/cfa/as libtool: install: /usr/bin/install -c cc1 /var/lib/jenkins/workspace/Cforall_master@tmp/lib/cfa/cc1 Making install in src make install-am make[3]: Nothing to be done for 'install-exec-am'. /usr/bin/mkdir -p '/var/lib/jenkins/workspace/Cforall_master@tmp/lib/cfa/' /bin/bash ../libtool --mode=install /usr/bin/install -c ../driver/cfa-cpp '/var/lib/jenkins/workspace/Cforall_master@tmp/lib/cfa/' libtool: install: /usr/bin/install -c ../driver/cfa-cpp /var/lib/jenkins/workspace/Cforall_master@tmp/lib/cfa/cfa-cpp Making install in . (CDPATH="${ZSH_VERSION+.}:" && cd /var/lib/jenkins/workspace/Cforall_master && /bin/bash '/var/lib/jenkins/workspace/Cforall_master/automake/missing' autoheader) rm -f stamp-h1 touch /var/lib/jenkins/workspace/Cforall_master/src/config.h.in cd . && /bin/bash ./config.status config.h config.status: creating config.h config.status: config.h is unchanged make[2]: Nothing to be done for 'install-exec-am'. /usr/bin/mkdir -p '/var/lib/jenkins/workspace/Cforall_master@tmp/share/man/man1' /usr/bin/install -c -m 644 /var/lib/jenkins/workspace/Cforall_master/doc/man/cfa.1 '/var/lib/jenkins/workspace/Cforall_master@tmp/share/man/man1' Making install in libcfa/arm64-debug Making install in prelude make[3]: Nothing to be done for 'install-exec-am'. /usr/bin/mkdir -p '/var/lib/jenkins/workspace/Cforall_master@tmp/lib/cfa/arm64-debug/' /usr/bin/install -c -m 644 gcc-builtins.cfa builtins.cfa extras.cfa prelude.cfa bootloader.c defines.hfa '/var/lib/jenkins/workspace/Cforall_master@tmp/lib/cfa/arm64-debug/' Making install in src /usr/bin/mkdir -p '/var/lib/jenkins/workspace/Cforall_master@tmp/lib/cfa/arm64-debug/' /bin/bash ../libtool --mode=install /usr/bin/install -c libcfa.la libcfathread.la '/var/lib/jenkins/workspace/Cforall_master@tmp/lib/cfa/arm64-debug/' /usr/bin/mkdir -p '/var/lib/jenkins/workspace/Cforall_master@tmp/include/cfa/' /usr/bin/mkdir -p '/var/lib/jenkins/workspace/Cforall_master@tmp/include/cfa//stdhdr/sys' /usr/bin/install -c -m 644 /var/lib/jenkins/workspace/Cforall_master/libcfa/src/stdhdr/sys/mman.h /var/lib/jenkins/workspace/Cforall_master/libcfa/src/stdhdr/sys/time.h /var/lib/jenkins/workspace/Cforall_master/libcfa/src/stdhdr/sys/socket.h '/var/lib/jenkins/workspace/Cforall_master@tmp/include/cfa//stdhdr/sys' /usr/bin/mkdir -p '/var/lib/jenkins/workspace/Cforall_master@tmp/include/cfa//algorithms' /usr/bin/install -c -m 644 /var/lib/jenkins/workspace/Cforall_master/libcfa/src/algorithms/range_iterator.hfa '/var/lib/jenkins/workspace/Cforall_master@tmp/include/cfa//algorithms' /usr/bin/mkdir -p '/var/lib/jenkins/workspace/Cforall_master@tmp/include/cfa//concurrency/kernel' /usr/bin/install -c -m 644 /var/lib/jenkins/workspace/Cforall_master/libcfa/src/concurrency/kernel/cluster.hfa /var/lib/jenkins/workspace/Cforall_master/libcfa/src/concurrency/kernel/fwd.hfa '/var/lib/jenkins/workspace/Cforall_master@tmp/include/cfa//concurrency/kernel' /usr/bin/install -c -m 644 /var/lib/jenkins/workspace/Cforall_master/libcfa/src/common.hfa /var/lib/jenkins/workspace/Cforall_master/libcfa/src/fstream.hfa /var/lib/jenkins/workspace/Cforall_master/libcfa/src/heap.hfa /var/lib/jenkins/workspace/Cforall_master/libcfa/src/iostream.hfa /var/lib/jenkins/workspace/Cforall_master/libcfa/src/iterator.hfa /var/lib/jenkins/workspace/Cforall_master/libcfa/src/limits.hfa /var/lib/jenkins/workspace/Cforall_master/libcfa/src/math.hfa /var/lib/jenkins/workspace/Cforall_master/libcfa/src/memory.hfa /var/lib/jenkins/workspace/Cforall_master/libcfa/src/parseargs.hfa /var/lib/jenkins/workspace/Cforall_master/libcfa/src/parseconfig.hfa /var/lib/jenkins/workspace/Cforall_master/libcfa/src/rational.hfa /var/lib/jenkins/workspace/Cforall_master/libcfa/src/stdlib.hfa /var/lib/jenkins/workspace/Cforall_master/libcfa/src/strstream.hfa /var/lib/jenkins/workspace/Cforall_master/libcfa/src/time.hfa /var/lib/jenkins/workspace/Cforall_master/libcfa/src/Exception.hfa /var/lib/jenkins/workspace/Cforall_master/libcfa/src/bitmanip.hfa /var/lib/jenkins/workspace/Cforall_master/libcfa/src/clock.hfa /var/lib/jenkins/workspace/Cforall_master/libcfa/src/exception.hfa /var/lib/jenkins/workspace/Cforall_master/libcfa/src/exception.h /var/lib/jenkins/workspace/Cforall_master/libcfa/src/gmp.hfa /var/lib/jenkins/workspace/Cforall_master/libcfa/src/math.trait.hfa /var/lib/jenkins/workspace/Cforall_master/libcfa/src/raii.hfa /var/lib/jenkins/workspace/Cforall_master/libcfa/src/time_t.hfa /var/lib/jenkins/workspace/Cforall_master/libcfa/src/virtual_dtor.hfa '/var/lib/jenkins/workspace/Cforall_master@tmp/include/cfa//.' /usr/bin/mkdir -p '/var/lib/jenkins/workspace/Cforall_master@tmp/include/cfa//concurrency' /usr/bin/install -c -m 644 /var/lib/jenkins/workspace/Cforall_master/libcfa/src/concurrency/iofwd.hfa /var/lib/jenkins/workspace/Cforall_master/libcfa/src/concurrency/barrier.hfa /var/lib/jenkins/workspace/Cforall_master/libcfa/src/concurrency/alarm.hfa /var/lib/jenkins/workspace/Cforall_master/libcfa/src/concurrency/coroutine.hfa /var/lib/jenkins/workspace/Cforall_master/libcfa/src/concurrency/exception.hfa /var/lib/jenkins/workspace/Cforall_master/libcfa/src/concurrency/kernel.hfa /var/lib/jenkins/workspace/Cforall_master/libcfa/src/concurrency/locks.hfa /var/lib/jenkins/workspace/Cforall_master/libcfa/src/concurrency/monitor.hfa /var/lib/jenkins/workspace/Cforall_master/libcfa/src/concurrency/mutex.hfa /var/lib/jenkins/workspace/Cforall_master/libcfa/src/concurrency/select.hfa /var/lib/jenkins/workspace/Cforall_master/libcfa/src/concurrency/thread.hfa /var/lib/jenkins/workspace/Cforall_master/libcfa/src/concurrency/cofor.hfa /var/lib/jenkins/workspace/Cforall_master/libcfa/src/concurrency/invoke.h /var/lib/jenkins/workspace/Cforall_master/libcfa/src/concurrency/future.hfa /var/lib/jenkins/workspace/Cforall_master/libcfa/src/concurrency/once.hfa /var/lib/jenkins/workspace/Cforall_master/libcfa/src/concurrency/mutex_stmt.hfa /var/lib/jenkins/workspace/Cforall_master/libcfa/src/concurrency/channel.hfa /var/lib/jenkins/workspace/Cforall_master/libcfa/src/concurrency/actor.hfa '/var/lib/jenkins/workspace/Cforall_master@tmp/include/cfa//concurrency' /usr/bin/mkdir -p '/var/lib/jenkins/workspace/Cforall_master@tmp/include/cfa//concurrency/clib' /usr/bin/install -c -m 644 /var/lib/jenkins/workspace/Cforall_master/libcfa/src/concurrency/clib/cfathread.h '/var/lib/jenkins/workspace/Cforall_master@tmp/include/cfa//concurrency/clib' /usr/bin/mkdir -p '/var/lib/jenkins/workspace/Cforall_master@tmp/include/cfa//device' /usr/bin/install -c -m 644 /var/lib/jenkins/workspace/Cforall_master/libcfa/src/device/cpu.hfa '/var/lib/jenkins/workspace/Cforall_master@tmp/include/cfa//device' /usr/bin/mkdir -p '/var/lib/jenkins/workspace/Cforall_master@tmp/include/cfa//stdhdr/libltdl' /usr/bin/install -c -m 644 /var/lib/jenkins/workspace/Cforall_master/libcfa/src/stdhdr/libltdl/lt_dlloader.h '/var/lib/jenkins/workspace/Cforall_master@tmp/include/cfa//stdhdr/libltdl' /usr/bin/mkdir -p '/var/lib/jenkins/workspace/Cforall_master@tmp/include/cfa//vec' /usr/bin/install -c -m 644 /var/lib/jenkins/workspace/Cforall_master/libcfa/src/vec/vec.hfa /var/lib/jenkins/workspace/Cforall_master/libcfa/src/vec/vec2.hfa /var/lib/jenkins/workspace/Cforall_master/libcfa/src/vec/vec3.hfa /var/lib/jenkins/workspace/Cforall_master/libcfa/src/vec/vec4.hfa '/var/lib/jenkins/workspace/Cforall_master@tmp/include/cfa//vec' libtool: install: /usr/bin/install -c .libs/libcfa.so.1.0.0 /var/lib/jenkins/workspace/Cforall_master@tmp/lib/cfa/arm64-debug/libcfa.so.1.0.0 /usr/bin/mkdir -p '/var/lib/jenkins/workspace/Cforall_master@tmp/include/cfa//bits' /usr/bin/install -c -m 644 /var/lib/jenkins/workspace/Cforall_master/libcfa/src/bits/weakso_locks.hfa /var/lib/jenkins/workspace/Cforall_master/libcfa/src/bits/algorithm.hfa /var/lib/jenkins/workspace/Cforall_master/libcfa/src/bits/align.hfa /var/lib/jenkins/workspace/Cforall_master/libcfa/src/bits/collections.hfa /var/lib/jenkins/workspace/Cforall_master/libcfa/src/bits/debug.hfa /var/lib/jenkins/workspace/Cforall_master/libcfa/src/bits/defs.hfa /var/lib/jenkins/workspace/Cforall_master/libcfa/src/bits/locks.hfa /var/lib/jenkins/workspace/Cforall_master/libcfa/src/bits/collection.hfa /var/lib/jenkins/workspace/Cforall_master/libcfa/src/bits/stack.hfa /var/lib/jenkins/workspace/Cforall_master/libcfa/src/bits/queue.hfa /var/lib/jenkins/workspace/Cforall_master/libcfa/src/bits/sequence.hfa /var/lib/jenkins/workspace/Cforall_master/libcfa/src/bits/atomic.hfa /var/lib/jenkins/workspace/Cforall_master/libcfa/src/bits/random.hfa '/var/lib/jenkins/workspace/Cforall_master@tmp/include/cfa//bits' /usr/bin/mkdir -p '/var/lib/jenkins/workspace/Cforall_master@tmp/include/cfa//stdhdr' libtool: install: (cd /var/lib/jenkins/workspace/Cforall_master@tmp/lib/cfa/arm64-debug && { ln -s -f libcfa.so.1.0.0 libcfa.so.1 || { rm -f libcfa.so.1 && ln -s libcfa.so.1.0.0 libcfa.so.1; }; }) /usr/bin/install -c -m 644 /var/lib/jenkins/workspace/Cforall_master/libcfa/src/stdhdr/stdalign.h /var/lib/jenkins/workspace/Cforall_master/libcfa/src/stdhdr/stdio.h /var/lib/jenkins/workspace/Cforall_master/libcfa/src/stdhdr/malloc.h /var/lib/jenkins/workspace/Cforall_master/libcfa/src/stdhdr/time.h /var/lib/jenkins/workspace/Cforall_master/libcfa/src/stdhdr/signal.h /var/lib/jenkins/workspace/Cforall_master/libcfa/src/stdhdr/stdbool.h /var/lib/jenkins/workspace/Cforall_master/libcfa/src/stdhdr/unistd.h /var/lib/jenkins/workspace/Cforall_master/libcfa/src/stdhdr/stdatomic.h /var/lib/jenkins/workspace/Cforall_master/libcfa/src/stdhdr/stdint.h /var/lib/jenkins/workspace/Cforall_master/libcfa/src/stdhdr/gmp.h /var/lib/jenkins/workspace/Cforall_master/libcfa/src/stdhdr/locale.h /var/lib/jenkins/workspace/Cforall_master/libcfa/src/stdhdr/string.h /var/lib/jenkins/workspace/Cforall_master/libcfa/src/stdhdr/fenv.h /var/lib/jenkins/workspace/Cforall_master/libcfa/src/stdhdr/wchar.h /var/lib/jenkins/workspace/Cforall_master/libcfa/src/stdhdr/tgmath.h /var/lib/jenkins/workspace/Cforall_master/libcfa/src/stdhdr/math.h /var/lib/jenkins/workspace/Cforall_master/libcfa/src/stdhdr/pthread.h /var/lib/jenkins/workspace/Cforall_master/libcfa/src/stdhdr/complex.h /var/lib/jenkins/workspace/Cforall_master/libcfa/src/stdhdr/wctype.h /var/lib/jenkins/workspace/Cforall_master/libcfa/src/stdhdr/unwind.h /var/lib/jenkins/workspace/Cforall_master/libcfa/src/stdhdr/float.h /var/lib/jenkins/workspace/Cforall_master/libcfa/src/stdhdr/stdarg.h /var/lib/jenkins/workspace/Cforall_master/libcfa/src/stdhdr/stdlib.h /var/lib/jenkins/workspace/Cforall_master/libcfa/src/stdhdr/iso646.h /var/lib/jenkins/workspace/Cforall_master/libcfa/src/stdhdr/stddef.h /var/lib/jenkins/workspace/Cforall_master/libcfa/src/stdhdr/stdnoreturn.h /var/lib/jenkins/workspace/Cforall_master/libcfa/src/stdhdr/assert.h /var/lib/jenkins/workspace/Cforall_master/libcfa/src/stdhdr/ctype.h /var/lib/jenkins/workspace/Cforall_master/libcfa/src/stdhdr/errno.h /var/lib/jenkins/workspace/Cforall_master/libcfa/src/stdhdr/threads.h /var/lib/jenkins/workspace/Cforall_master/libcfa/src/stdhdr/uchar.h /var/lib/jenkins/workspace/Cforall_master/libcfa/src/stdhdr/inttypes.h /var/lib/jenkins/workspace/Cforall_master/libcfa/src/stdhdr/limits.h /var/lib/jenkins/workspace/Cforall_master/libcfa/src/stdhdr/setjmp.h '/var/lib/jenkins/workspace/Cforall_master@tmp/include/cfa//stdhdr' /usr/bin/mkdir -p '/var/lib/jenkins/workspace/Cforall_master@tmp/include/cfa//collections' libtool: install: (cd /var/lib/jenkins/workspace/Cforall_master@tmp/lib/cfa/arm64-debug && { ln -s -f libcfa.so.1.0.0 libcfa.so || { rm -f libcfa.so && ln -s libcfa.so.1.0.0 libcfa.so; }; }) /usr/bin/install -c -m 644 /var/lib/jenkins/workspace/Cforall_master/libcfa/src/collections/maybe.hfa /var/lib/jenkins/workspace/Cforall_master/libcfa/src/collections/pair.hfa /var/lib/jenkins/workspace/Cforall_master/libcfa/src/collections/result.hfa /var/lib/jenkins/workspace/Cforall_master/libcfa/src/collections/string.hfa /var/lib/jenkins/workspace/Cforall_master/libcfa/src/collections/string_res.hfa /var/lib/jenkins/workspace/Cforall_master/libcfa/src/collections/vector.hfa /var/lib/jenkins/workspace/Cforall_master/libcfa/src/collections/array.hfa /var/lib/jenkins/workspace/Cforall_master/libcfa/src/collections/list.hfa /var/lib/jenkins/workspace/Cforall_master/libcfa/src/collections/list2.hfa /var/lib/jenkins/workspace/Cforall_master/libcfa/src/collections/lockfree.hfa /var/lib/jenkins/workspace/Cforall_master/libcfa/src/collections/string_sharectx.hfa /var/lib/jenkins/workspace/Cforall_master/libcfa/src/collections/vector2.hfa '/var/lib/jenkins/workspace/Cforall_master@tmp/include/cfa//collections' libtool: install: /usr/bin/install -c .libs/libcfa.lai /var/lib/jenkins/workspace/Cforall_master@tmp/lib/cfa/arm64-debug/libcfa.la libtool: install: /usr/bin/install -c .libs/libcfathread.so.1.0.0 /var/lib/jenkins/workspace/Cforall_master@tmp/lib/cfa/arm64-debug/libcfathread.so.1.0.0 libtool: install: (cd /var/lib/jenkins/workspace/Cforall_master@tmp/lib/cfa/arm64-debug && { ln -s -f libcfathread.so.1.0.0 libcfathread.so.1 || { rm -f libcfathread.so.1 && ln -s libcfathread.so.1.0.0 libcfathread.so.1; }; }) libtool: install: (cd /var/lib/jenkins/workspace/Cforall_master@tmp/lib/cfa/arm64-debug && { ln -s -f libcfathread.so.1.0.0 libcfathread.so || { rm -f libcfathread.so && ln -s libcfathread.so.1.0.0 libcfathread.so; }; }) libtool: install: /usr/bin/install -c .libs/libcfathread.lai /var/lib/jenkins/workspace/Cforall_master@tmp/lib/cfa/arm64-debug/libcfathread.la libtool: warning: remember to run 'libtool --finish /var/lib/jenkins/workspace/Cforall_master@tmp/lib/cfa/arm64-debug/' make[3]: Nothing to be done for 'install-exec-am'. make[3]: Nothing to be done for 'install-data-am'. Making install in libcfa/arm64-nodebug Making install in prelude make[3]: Nothing to be done for 'install-exec-am'. /usr/bin/mkdir -p '/var/lib/jenkins/workspace/Cforall_master@tmp/lib/cfa/arm64-nodebug/' /usr/bin/install -c -m 644 gcc-builtins.cfa builtins.cfa extras.cfa prelude.cfa bootloader.c defines.hfa '/var/lib/jenkins/workspace/Cforall_master@tmp/lib/cfa/arm64-nodebug/' Making install in src /usr/bin/mkdir -p '/var/lib/jenkins/workspace/Cforall_master@tmp/lib/cfa/arm64-nodebug/' /bin/bash ../libtool --mode=install /usr/bin/install -c libcfa.la libcfathread.la '/var/lib/jenkins/workspace/Cforall_master@tmp/lib/cfa/arm64-nodebug/' /usr/bin/mkdir -p '/var/lib/jenkins/workspace/Cforall_master@tmp/include/cfa/' /usr/bin/mkdir -p '/var/lib/jenkins/workspace/Cforall_master@tmp/include/cfa//stdhdr/sys' /usr/bin/install -c -m 644 /var/lib/jenkins/workspace/Cforall_master/libcfa/src/stdhdr/sys/mman.h /var/lib/jenkins/workspace/Cforall_master/libcfa/src/stdhdr/sys/time.h /var/lib/jenkins/workspace/Cforall_master/libcfa/src/stdhdr/sys/socket.h '/var/lib/jenkins/workspace/Cforall_master@tmp/include/cfa//stdhdr/sys' /usr/bin/mkdir -p '/var/lib/jenkins/workspace/Cforall_master@tmp/include/cfa//algorithms' /usr/bin/install -c -m 644 /var/lib/jenkins/workspace/Cforall_master/libcfa/src/algorithms/range_iterator.hfa '/var/lib/jenkins/workspace/Cforall_master@tmp/include/cfa//algorithms' /usr/bin/mkdir -p '/var/lib/jenkins/workspace/Cforall_master@tmp/include/cfa//concurrency/kernel' /usr/bin/install -c -m 644 /var/lib/jenkins/workspace/Cforall_master/libcfa/src/concurrency/kernel/cluster.hfa /var/lib/jenkins/workspace/Cforall_master/libcfa/src/concurrency/kernel/fwd.hfa '/var/lib/jenkins/workspace/Cforall_master@tmp/include/cfa//concurrency/kernel' /usr/bin/install -c -m 644 /var/lib/jenkins/workspace/Cforall_master/libcfa/src/common.hfa /var/lib/jenkins/workspace/Cforall_master/libcfa/src/fstream.hfa /var/lib/jenkins/workspace/Cforall_master/libcfa/src/heap.hfa /var/lib/jenkins/workspace/Cforall_master/libcfa/src/iostream.hfa /var/lib/jenkins/workspace/Cforall_master/libcfa/src/iterator.hfa /var/lib/jenkins/workspace/Cforall_master/libcfa/src/limits.hfa /var/lib/jenkins/workspace/Cforall_master/libcfa/src/math.hfa /var/lib/jenkins/workspace/Cforall_master/libcfa/src/memory.hfa /var/lib/jenkins/workspace/Cforall_master/libcfa/src/parseargs.hfa /var/lib/jenkins/workspace/Cforall_master/libcfa/src/parseconfig.hfa /var/lib/jenkins/workspace/Cforall_master/libcfa/src/rational.hfa /var/lib/jenkins/workspace/Cforall_master/libcfa/src/stdlib.hfa /var/lib/jenkins/workspace/Cforall_master/libcfa/src/strstream.hfa /var/lib/jenkins/workspace/Cforall_master/libcfa/src/time.hfa /var/lib/jenkins/workspace/Cforall_master/libcfa/src/Exception.hfa /var/lib/jenkins/workspace/Cforall_master/libcfa/src/bitmanip.hfa /var/lib/jenkins/workspace/Cforall_master/libcfa/src/clock.hfa /var/lib/jenkins/workspace/Cforall_master/libcfa/src/exception.hfa /var/lib/jenkins/workspace/Cforall_master/libcfa/src/exception.h /var/lib/jenkins/workspace/Cforall_master/libcfa/src/gmp.hfa /var/lib/jenkins/workspace/Cforall_master/libcfa/src/math.trait.hfa /var/lib/jenkins/workspace/Cforall_master/libcfa/src/raii.hfa /var/lib/jenkins/workspace/Cforall_master/libcfa/src/time_t.hfa /var/lib/jenkins/workspace/Cforall_master/libcfa/src/virtual_dtor.hfa '/var/lib/jenkins/workspace/Cforall_master@tmp/include/cfa//.' /usr/bin/mkdir -p '/var/lib/jenkins/workspace/Cforall_master@tmp/include/cfa//concurrency' /usr/bin/install -c -m 644 /var/lib/jenkins/workspace/Cforall_master/libcfa/src/concurrency/iofwd.hfa /var/lib/jenkins/workspace/Cforall_master/libcfa/src/concurrency/barrier.hfa /var/lib/jenkins/workspace/Cforall_master/libcfa/src/concurrency/alarm.hfa /var/lib/jenkins/workspace/Cforall_master/libcfa/src/concurrency/coroutine.hfa /var/lib/jenkins/workspace/Cforall_master/libcfa/src/concurrency/exception.hfa /var/lib/jenkins/workspace/Cforall_master/libcfa/src/concurrency/kernel.hfa /var/lib/jenkins/workspace/Cforall_master/libcfa/src/concurrency/locks.hfa /var/lib/jenkins/workspace/Cforall_master/libcfa/src/concurrency/monitor.hfa /var/lib/jenkins/workspace/Cforall_master/libcfa/src/concurrency/mutex.hfa /var/lib/jenkins/workspace/Cforall_master/libcfa/src/concurrency/select.hfa /var/lib/jenkins/workspace/Cforall_master/libcfa/src/concurrency/thread.hfa /var/lib/jenkins/workspace/Cforall_master/libcfa/src/concurrency/cofor.hfa /var/lib/jenkins/workspace/Cforall_master/libcfa/src/concurrency/invoke.h /var/lib/jenkins/workspace/Cforall_master/libcfa/src/concurrency/future.hfa /var/lib/jenkins/workspace/Cforall_master/libcfa/src/concurrency/once.hfa /var/lib/jenkins/workspace/Cforall_master/libcfa/src/concurrency/mutex_stmt.hfa /var/lib/jenkins/workspace/Cforall_master/libcfa/src/concurrency/channel.hfa /var/lib/jenkins/workspace/Cforall_master/libcfa/src/concurrency/actor.hfa '/var/lib/jenkins/workspace/Cforall_master@tmp/include/cfa//concurrency' /usr/bin/mkdir -p '/var/lib/jenkins/workspace/Cforall_master@tmp/include/cfa//concurrency/clib' /usr/bin/install -c -m 644 /var/lib/jenkins/workspace/Cforall_master/libcfa/src/concurrency/clib/cfathread.h '/var/lib/jenkins/workspace/Cforall_master@tmp/include/cfa//concurrency/clib' /usr/bin/mkdir -p '/var/lib/jenkins/workspace/Cforall_master@tmp/include/cfa//device' /usr/bin/install -c -m 644 /var/lib/jenkins/workspace/Cforall_master/libcfa/src/device/cpu.hfa '/var/lib/jenkins/workspace/Cforall_master@tmp/include/cfa//device' /usr/bin/mkdir -p '/var/lib/jenkins/workspace/Cforall_master@tmp/include/cfa//stdhdr/libltdl' /usr/bin/install -c -m 644 /var/lib/jenkins/workspace/Cforall_master/libcfa/src/stdhdr/libltdl/lt_dlloader.h '/var/lib/jenkins/workspace/Cforall_master@tmp/include/cfa//stdhdr/libltdl' /usr/bin/mkdir -p '/var/lib/jenkins/workspace/Cforall_master@tmp/include/cfa//vec' /usr/bin/install -c -m 644 /var/lib/jenkins/workspace/Cforall_master/libcfa/src/vec/vec.hfa /var/lib/jenkins/workspace/Cforall_master/libcfa/src/vec/vec2.hfa /var/lib/jenkins/workspace/Cforall_master/libcfa/src/vec/vec3.hfa /var/lib/jenkins/workspace/Cforall_master/libcfa/src/vec/vec4.hfa '/var/lib/jenkins/workspace/Cforall_master@tmp/include/cfa//vec' /usr/bin/mkdir -p '/var/lib/jenkins/workspace/Cforall_master@tmp/include/cfa//bits' libtool: install: /usr/bin/install -c .libs/libcfa.so.1.0.0 /var/lib/jenkins/workspace/Cforall_master@tmp/lib/cfa/arm64-nodebug/libcfa.so.1.0.0 /usr/bin/install -c -m 644 /var/lib/jenkins/workspace/Cforall_master/libcfa/src/bits/weakso_locks.hfa /var/lib/jenkins/workspace/Cforall_master/libcfa/src/bits/algorithm.hfa /var/lib/jenkins/workspace/Cforall_master/libcfa/src/bits/align.hfa /var/lib/jenkins/workspace/Cforall_master/libcfa/src/bits/collections.hfa /var/lib/jenkins/workspace/Cforall_master/libcfa/src/bits/debug.hfa /var/lib/jenkins/workspace/Cforall_master/libcfa/src/bits/defs.hfa /var/lib/jenkins/workspace/Cforall_master/libcfa/src/bits/locks.hfa /var/lib/jenkins/workspace/Cforall_master/libcfa/src/bits/collection.hfa /var/lib/jenkins/workspace/Cforall_master/libcfa/src/bits/stack.hfa /var/lib/jenkins/workspace/Cforall_master/libcfa/src/bits/queue.hfa /var/lib/jenkins/workspace/Cforall_master/libcfa/src/bits/sequence.hfa /var/lib/jenkins/workspace/Cforall_master/libcfa/src/bits/atomic.hfa /var/lib/jenkins/workspace/Cforall_master/libcfa/src/bits/random.hfa '/var/lib/jenkins/workspace/Cforall_master@tmp/include/cfa//bits' /usr/bin/mkdir -p '/var/lib/jenkins/workspace/Cforall_master@tmp/include/cfa//stdhdr' /usr/bin/install -c -m 644 /var/lib/jenkins/workspace/Cforall_master/libcfa/src/stdhdr/stdalign.h /var/lib/jenkins/workspace/Cforall_master/libcfa/src/stdhdr/stdio.h /var/lib/jenkins/workspace/Cforall_master/libcfa/src/stdhdr/malloc.h /var/lib/jenkins/workspace/Cforall_master/libcfa/src/stdhdr/time.h /var/lib/jenkins/workspace/Cforall_master/libcfa/src/stdhdr/signal.h /var/lib/jenkins/workspace/Cforall_master/libcfa/src/stdhdr/stdbool.h /var/lib/jenkins/workspace/Cforall_master/libcfa/src/stdhdr/unistd.h /var/lib/jenkins/workspace/Cforall_master/libcfa/src/stdhdr/stdatomic.h /var/lib/jenkins/workspace/Cforall_master/libcfa/src/stdhdr/stdint.h /var/lib/jenkins/workspace/Cforall_master/libcfa/src/stdhdr/gmp.h /var/lib/jenkins/workspace/Cforall_master/libcfa/src/stdhdr/locale.h /var/lib/jenkins/workspace/Cforall_master/libcfa/src/stdhdr/string.h /var/lib/jenkins/workspace/Cforall_master/libcfa/src/stdhdr/fenv.h /var/lib/jenkins/workspace/Cforall_master/libcfa/src/stdhdr/wchar.h /var/lib/jenkins/workspace/Cforall_master/libcfa/src/stdhdr/tgmath.h /var/lib/jenkins/workspace/Cforall_master/libcfa/src/stdhdr/math.h /var/lib/jenkins/workspace/Cforall_master/libcfa/src/stdhdr/pthread.h /var/lib/jenkins/workspace/Cforall_master/libcfa/src/stdhdr/complex.h /var/lib/jenkins/workspace/Cforall_master/libcfa/src/stdhdr/wctype.h /var/lib/jenkins/workspace/Cforall_master/libcfa/src/stdhdr/unwind.h /var/lib/jenkins/workspace/Cforall_master/libcfa/src/stdhdr/float.h /var/lib/jenkins/workspace/Cforall_master/libcfa/src/stdhdr/stdarg.h /var/lib/jenkins/workspace/Cforall_master/libcfa/src/stdhdr/stdlib.h /var/lib/jenkins/workspace/Cforall_master/libcfa/src/stdhdr/iso646.h /var/lib/jenkins/workspace/Cforall_master/libcfa/src/stdhdr/stddef.h /var/lib/jenkins/workspace/Cforall_master/libcfa/src/stdhdr/stdnoreturn.h /var/lib/jenkins/workspace/Cforall_master/libcfa/src/stdhdr/assert.h /var/lib/jenkins/workspace/Cforall_master/libcfa/src/stdhdr/ctype.h /var/lib/jenkins/workspace/Cforall_master/libcfa/src/stdhdr/errno.h /var/lib/jenkins/workspace/Cforall_master/libcfa/src/stdhdr/threads.h /var/lib/jenkins/workspace/Cforall_master/libcfa/src/stdhdr/uchar.h /var/lib/jenkins/workspace/Cforall_master/libcfa/src/stdhdr/inttypes.h /var/lib/jenkins/workspace/Cforall_master/libcfa/src/stdhdr/limits.h /var/lib/jenkins/workspace/Cforall_master/libcfa/src/stdhdr/setjmp.h '/var/lib/jenkins/workspace/Cforall_master@tmp/include/cfa//stdhdr' libtool: install: (cd /var/lib/jenkins/workspace/Cforall_master@tmp/lib/cfa/arm64-nodebug && { ln -s -f libcfa.so.1.0.0 libcfa.so.1 || { rm -f libcfa.so.1 && ln -s libcfa.so.1.0.0 libcfa.so.1; }; }) /usr/bin/mkdir -p '/var/lib/jenkins/workspace/Cforall_master@tmp/include/cfa//collections' /usr/bin/install -c -m 644 /var/lib/jenkins/workspace/Cforall_master/libcfa/src/collections/maybe.hfa /var/lib/jenkins/workspace/Cforall_master/libcfa/src/collections/pair.hfa /var/lib/jenkins/workspace/Cforall_master/libcfa/src/collections/result.hfa /var/lib/jenkins/workspace/Cforall_master/libcfa/src/collections/string.hfa /var/lib/jenkins/workspace/Cforall_master/libcfa/src/collections/string_res.hfa /var/lib/jenkins/workspace/Cforall_master/libcfa/src/collections/vector.hfa /var/lib/jenkins/workspace/Cforall_master/libcfa/src/collections/array.hfa /var/lib/jenkins/workspace/Cforall_master/libcfa/src/collections/list.hfa /var/lib/jenkins/workspace/Cforall_master/libcfa/src/collections/list2.hfa /var/lib/jenkins/workspace/Cforall_master/libcfa/src/collections/lockfree.hfa /var/lib/jenkins/workspace/Cforall_master/libcfa/src/collections/string_sharectx.hfa /var/lib/jenkins/workspace/Cforall_master/libcfa/src/collections/vector2.hfa '/var/lib/jenkins/workspace/Cforall_master@tmp/include/cfa//collections' libtool: install: (cd /var/lib/jenkins/workspace/Cforall_master@tmp/lib/cfa/arm64-nodebug && { ln -s -f libcfa.so.1.0.0 libcfa.so || { rm -f libcfa.so && ln -s libcfa.so.1.0.0 libcfa.so; }; }) libtool: install: /usr/bin/install -c .libs/libcfa.lai /var/lib/jenkins/workspace/Cforall_master@tmp/lib/cfa/arm64-nodebug/libcfa.la libtool: install: /usr/bin/install -c .libs/libcfathread.so.1.0.0 /var/lib/jenkins/workspace/Cforall_master@tmp/lib/cfa/arm64-nodebug/libcfathread.so.1.0.0 libtool: install: (cd /var/lib/jenkins/workspace/Cforall_master@tmp/lib/cfa/arm64-nodebug && { ln -s -f libcfathread.so.1.0.0 libcfathread.so.1 || { rm -f libcfathread.so.1 && ln -s libcfathread.so.1.0.0 libcfathread.so.1; }; }) libtool: install: (cd /var/lib/jenkins/workspace/Cforall_master@tmp/lib/cfa/arm64-nodebug && { ln -s -f libcfathread.so.1.0.0 libcfathread.so || { rm -f libcfathread.so && ln -s libcfathread.so.1.0.0 libcfathread.so; }; }) libtool: install: /usr/bin/install -c .libs/libcfathread.lai /var/lib/jenkins/workspace/Cforall_master@tmp/lib/cfa/arm64-nodebug/libcfathread.la libtool: warning: remember to run 'libtool --finish /var/lib/jenkins/workspace/Cforall_master@tmp/lib/cfa/arm64-nodebug/' make[3]: Nothing to be done for 'install-exec-am'. make[3]: Nothing to be done for 'install-data-am'. [Pipeline] } [Pipeline] // dir [Pipeline] } [Pipeline] // stage [Pipeline] sh + free -h total used free shared buff/cache available Mem: 502Gi 7.8Gi 489Gi 3.5Mi 7.4Gi 494Gi Swap: 127Gi 0B 127Gi [Pipeline] sh + ulimit -a time(seconds) unlimited file(blocks) unlimited data(kbytes) unlimited stack(kbytes) 8192 coredump(blocks) 0 memory(kbytes) unlimited locked memory(kbytes) 65876424 process 2058179 nofiles 1048576 vmemory(kbytes) unlimited locks unlimited rtprio 0 [Pipeline] echo -------- Test: Debug -------- [Pipeline] stage [Pipeline] { (Test: Debug) [Pipeline] dir Running in /var/lib/jenkins/workspace/Cforall_master@tmp [Pipeline] { [Pipeline] sh + nproc + make -j 96 --no-print-directory -C tests timeout=600 global-timeout=14400 tests debug=yes archive-errors=/var/lib/jenkins/workspace/Cforall_master@tmp/tests/crashes/full-debug Running 375 tests on 96 cores (arm64 - debug) array-ERR2 PASSED C 0:00.132 - R n/a array-ERR3 PASSED C 0:00.139 - R n/a ...ollections/language-dim-mismatch PASSED C 0:00.376 - R n/a concurrency/mainError PASSED C 0:00.601 - R n/a concurrency/keywordErrors PASSED C 0:00.648 - R n/a array-collections/symtab-collision PASSED C 0:00.954 - R n/a array-collections/safety-summary PASSED C 0:01.024 - R n/a castError PASSED C 0:01.055 - R n/a concurrency/ctor-check PASSED C 0:01.233 - R n/a array-ERR1 PASSED C 0:01.531 - R n/a attr-priority PASSED C 0:01.546 - R 0:00.007 castReturn PASSED C 0:01.591 - R 0:00.079 array-collections/c-dependent PASSED C 0:01.714 - R 0:00.122 cast PASSED C 0:01.770 - R 0:00.125 array-collections/array-raii-c PASSED C 0:02.050 - R 0:00.027 array-collections/dimexpr-match-c PASSED C 0:02.055 - R 0:00.045 builtins/sync PASSED C 0:02.039 - R 0:00.126 array PASSED C 0:02.119 - R 0:00.075 array-collections/array-sbscr-types PASSED C 0:02.741 - R 0:00.070 concurrency/clib_tls PASSED C 0:02.680 - R 0:00.129 ...ns/vector-err-retn-perm-it-byval PASSED C 0:02.978 - R n/a concurrency/clib PASSED C 0:02.734 - R 0:00.270 array-collections/dimexpr-match-cfa PASSED C 0:03.022 - R 0:00.027 array-collections/array-basic PASSED C 0:03.106 - R 0:00.040 array-collections/boxed PASSED C 0:03.225 - R 0:00.024 ...ns/vector-err-pass-perm-it-byval PASSED C 0:03.300 - R n/a collections/string-operator-ERR11 PASSED C 0:05.436 - R n/a collections/string-operator-ERR16 PASSED C 0:05.530 - R n/a collections/string-operator-ERR09 PASSED C 0:05.595 - R n/a collections/string-operator-ERR13 PASSED C 0:05.736 - R n/a collections/string-operator-ERR15 PASSED C 0:05.761 - R n/a ...urrency/pthread/pthread_key_test PASSED C 0:03.916 - R 0:00.037 alloc-ERROR PASSED C 0:05.930 - R n/a avl_test PASSED C 0:05.925 - R 0:00.025 collections/vector-demo PASSED C 0:06.165 - R 0:00.023 algorithms/range_test PASSED C 0:06.758 - R 0:00.022 complex PASSED C 0:07.194 - R 0:00.027 array-collections/array-raii-cfa PASSED C 0:07.400 - R 0:00.022 collections/string-gc PASSED C 0:07.474 - R 0:00.038 array-collections/accordion PASSED C 0:07.493 - R 0:00.022 concurrency/cluster PASSED C 0:08.449 - R 0:00.076 collections/string-istream PASSED C 0:08.639 - R 0:00.037 concurrency/futures/abandon PASSED C 0:08.907 - R 0:00.126 collections/stack PASSED C 0:09.463 - R 0:00.041 concurrency/park/start_parked PASSED C 0:08.560 - R 0:00.126 collections/multi_list PASSED C 0:09.712 - R 0:00.025 concurrency/park/contention PASSED C 0:08.714 - R 0:00.375 collections/string-compare PASSED C 0:09.779 - R 0:00.022 collections/string-ostream PASSED C 0:09.989 - R 0:00.039 collections/queue PASSED C 0:10.411 - R 0:00.075 concurrency/futures/basic PASSED C 0:10.217 - R 0:00.273 collections/string-operator PASSED C 0:10.457 - R 0:00.125 collections/sequence PASSED C 0:10.745 - R 0:00.023 collections/string-ctx-manage PASSED C 0:10.696 - R 0:00.126 collections/string-istream-manip PASSED C 0:11.128 - R 0:00.227 concurrency/cofor PASSED C 0:11.258 - R 0:00.069 concurrency/examples/gortn PASSED C 0:11.906 - R 0:00.038 concurrency/join PASSED C 0:11.961 - R 0:00.044 ...ections/string-overwrite-noshare PASSED C 0:12.176 - R 0:00.073 concurrency/examples/matrixSum PASSED C 0:12.163 - R 0:00.125 concurrency/migrate PASSED C 0:12.267 - R 0:00.169 collections/string-overwrite PASSED C 0:12.264 - R 0:00.223 concurrency/coroutineYield PASSED C 0:12.361 - R 0:00.173 concurrency/examples/datingService PASSED C 0:12.434 - R 0:00.174 const-init PASSED C 0:01.559 - R 0:00.022 concurrency/park/force_preempt PASSED C 0:11.933 - R 0:00.426 ...rrency/pthread/pthread_attr_test PASSED C 0:11.974 - R 0:00.038 alloc PASSED C 0:13.408 - R 0:00.127 ...pthread/pthread_demo_create_join PASSED C 0:11.908 - R 0:00.042 ...rrency/pthread/pthread_cond_test PASSED C 0:12.054 - R 0:00.043 ...rrency/pthread/pthread_once_test PASSED C 0:12.113 - R 0:00.070 ...ions/string-api-coverage-noshare PASSED C 0:14.137 - R 0:00.045 collections/string-api-coverage PASSED C 0:14.213 - R 0:00.043 const-ref PASSED C 0:02.228 - R 0:00.127 concurrency/futures/wait_any PASSED C 0:14.621 - R 0:00.124 concurrency/barrier/last PASSED C 0:14.459 - R 0:00.336 concurrency/once PASSED C 0:14.136 - R 0:00.279 concurrency/waitfor/parse PASSED C 0:07.576 - R 0:00.071 concurrency/examples/quickSort PASSED C 0:14.960 - R 0:00.189 concurrency/barrier/order PASSED C 0:14.909 - R 0:00.278 concurrency/signal/disjoint FAILED with code -6 C 0:12.686 - R 0:00.225 ERROR Eager signal 2 Cforall Runtime error (UNIX pid:3220032): Stack back trace for: /var/lib/jenkins/workspace/Cforall_master@tmp/libcfa/arm64-debug/src/.libs/libcfa.so.1 (0) /var/lib/jenkins/workspace/Cforall_master@tmp/libcfa/arm64-debug/src/.libs/libcfa.so.1 : + 0xed3cc [0xfffff7e5d3cc] (1) /var/lib/jenkins/workspace/Cforall_master@tmp/libcfa/arm64-debug/src/.libs/libcfa.so.1 : __cabi_abort + 0 [0xfffff7e5cc0c] (2) /var/lib/jenkins/workspace/Cforall_master@tmp/libcfa/arm64-debug/src/.libs/libcfa.so.1 : _X4endsFv_S8ofstream__1 + 0x88 [0xfffff7dae830] (3) /var/lib/jenkins/workspace/Cforall_master@tmp/libcfa/arm64-debug/src/.libs/libcfa.so.1 : _X15_operator_bitorQ1_0_0_1__X19basic_ostream_tableKS18basic_ostream_data_BD0__Fv_BD0i__1 + 0x38 [0xfffff7db9cb4] (4) /var/lib/jenkins/workspace/Cforall_master@tmp/tests/concurrency/signal/disjoint : _X5logicFv_XS8global_t__1 + 0x160 [0xaaaaaaaa4fe8] warning: Can't open file anon_inode:[io_uring] which was expanded to anon_inode:[io_uring] during file-backed mapping note processing [New LWP 3220063] [New LWP 3220032] [New LWP 3220053] [Thread debugging using libthread_db enabled] Using host libthread_db library "/lib/aarch64-linux-gnu/libthread_db.so.1". Core was generated by `/var/lib/jenkins/workspace/Cforall_master@tmp/tests/concurrency/signal/disjoint'. Program terminated with signal SIGABRT, Aborted. #0 __pthread_kill_implementation (threadid=187649985492928, signo=signo@entry=6, no_tid=no_tid@entry=0) at ./nptl/pthread_kill.c:44 warning: 44 ./nptl/pthread_kill.c: No such file or directory [Current thread is 1 (Thread 0xaaaaaaba37c0 (LWP 3220063))] ----- #0 __pthread_kill_implementation (threadid=187649985492928, signo=signo@entry=6, no_tid=no_tid@entry=0) at ./nptl/pthread_kill.c:44 #1 0x0000fffff7b47540 in __pthread_kill_internal (signo=6, threadid=) at ./nptl/pthread_kill.c:78 #2 0x0000fffff7afcb3c in __GI_raise (sig=sig@entry=6) at ../sysdeps/posix/raise.c:26 #3 0x0000fffff7ae7e00 in __GI_abort () at ./stdlib/abort.c:79 #4 0x0000fffff7e5d144 in _X7__abortFv_bPKcY17__builtin_va_list__1 (_X11signalAbortb_1=true, _X3fmtPKc_1=0xfffff7e7d830 "Application interrupted by signal: %s.\n", _X4argsY17__builtin_va_list_1=...) at /var/lib/jenkins/workspace/Cforall_master/libcfa/src/interpose.cfa:263 #5 0x0000fffff7e5d3cc in _X5abortFv_bPKc__1 (_X11signalAbortb_1=true, _X3fmtPKc_1=0xfffff7e7d830 "Application interrupted by signal: %s.\n") at /var/lib/jenkins/workspace/Cforall_master/libcfa/src/interpose.cfa:301 #6 0x0000fffff7e5d590 in _X15sigHandler_termFv_iPS21__anonymous_siginfo_tPS10ucontext_t__1 (_X3sigi_1=6, _X3sfpPS21__anonymous_siginfo_t_1=0xaaaaaac00960, _X3cxtPS10ucontext_t_1=0xaaaaaac009e0) at /var/lib/jenkins/workspace/Cforall_master/libcfa/src/interpose.cfa:337 #7 #8 __pthread_kill_implementation (threadid=187649985492928, signo=signo@entry=6, no_tid=no_tid@entry=0) at ./nptl/pthread_kill.c:44 #9 0x0000fffff7b47540 in __pthread_kill_internal (signo=6, threadid=) at ./nptl/pthread_kill.c:78 #10 0x0000fffff7afcb3c in __GI_raise (sig=sig@entry=6) at ../sysdeps/posix/raise.c:26 #11 0x0000fffff7ae7e00 in __GI_abort () at ./stdlib/abort.c:79 #12 0x0000fffff7e5d274 in _X7__abortFv_bPKcY17__builtin_va_list__1 (_X11signalAbortb_1=false, _X3fmtPKc_1=0xfffff7e7d590 "%s", _X4argsY17__builtin_va_list_1=...) at /var/lib/jenkins/workspace/Cforall_master/libcfa/src/interpose.cfa:286 #13 0x0000fffff7e5d3cc in _X5abortFv_bPKc__1 (_X11signalAbortb_1=false, _X3fmtPKc_1=0xfffff7e7d590 "%s") at /var/lib/jenkins/workspace/Cforall_master/libcfa/src/interpose.cfa:301 #14 0x0000fffff7e5cc0c in abort () at /var/lib/jenkins/workspace/Cforall_master/libcfa/src/interpose.cfa:176 #15 0x0000fffff7dae830 in _X4endsFv_S8ofstream__1 (_X2osS8ofstream_1=0xfffff7ec1368 <_X9abortFileS8ofstream_1>) at /var/lib/jenkins/workspace/Cforall_master/libcfa/src/fstream.cfa:106 #16 0x0000fffff7db9cb4 in _X15_operator_bitorQ1_0_0_1__X19basic_ostream_tableKS18basic_ostream_data_BD0__Fv_BD0i__1 (_X19basic_ostream_tableKS18basic_ostream_data_Y6ostype__1=0xfffff7ec13d8 <_X19ofstream_basic_dataS18basic_ostream_data_S8ofstream__1>, _X2osY6ostype_1=0xfffff7ec1368 <_X9abortFileS8ofstream_1>, _X1ti_1=2) at /var/lib/jenkins/workspace/Cforall_master/libcfa/src/iostream.cfa:91 #17 0x0000aaaaaaaa4fe8 in _X5logicFv_XS8global_t__1 (_X1aXS8global_t_1=0xaaaaaaac0328 <_X7globalsS13__anonymous66_1>) at concurrency/signal/disjoint.cfa:115 #18 0x0000aaaaaaaa5100 in _X4mainFv_S9Signaller__1 (__anonymous_object2552=0xffffffffced0) at concurrency/signal/disjoint.cfa:126 #19 0x0000fffff7f3076c in __cfactx_invoke_thread (main=0xaaaaaaaa50e4 <_X4mainFv_S9Signaller__1>, this=0xffffffffced0) at /var/lib/jenkins/workspace/Cforall_master/libcfa/src/concurrency/invoke.c:87 #20 0x0000fffff7f30748 in __cfactx_coroutine_unwind (storage=0x0, cor=0x0) at /var/lib/jenkins/workspace/Cforall_master/libcfa/src/concurrency/invoke.c:76 #21 0x0000aaaaaac01fe0 in ?? () Backtrace stopped: previous frame inner to this frame (corrupt stack?) ----- Id Target Id Frame * 1 Thread 0xaaaaaaba37c0 (LWP 3220063) __pthread_kill_implementation (threadid=187649985492928, signo=signo@entry=6, no_tid=no_tid@entry=0) at ./nptl/pthread_kill.c:44 2 Thread 0xfffff7fe9dc0 (LWP 3220032) 0x0000fffff7ba7acc in __GI_mprotect () at ../sysdeps/unix/syscall-template.S:120 3 Thread 0xaaaaaab137c0 (LWP 3220053) 0x0000fffff7afda18 in __GI___sigtimedwait (set=0xaaaaaab12df8, info=0xaaaaaab12e78, timeout=0x0) at ../sysdeps/unix/sysv/linux/sigtimedwait.c:31 Archiving concurrency/signal/disjoint (executable and core) to crashes/full-debug/concurrency/signal/disjoint ctrl-flow/labelledExit PASSED C 0:01.605 - R 0:00.075 concurrency/suspend_then PASSED C 0:12.812 - R 0:00.180 concurrency/readyQ/leader_spin PASSED C 0:12.307 - R 0:01.589 ctrl-flow/loop-inc PASSED C 0:01.748 - R 0:00.122 concurrency/signal/wait PASSED C 0:12.667 - R 0:00.973 concurrency/sleep PASSED C 0:12.475 - R 0:01.178 concurrency/barrier/generation PASSED C 0:15.061 - R 0:01.734 enum PASSED C 0:01.673 - R 0:00.134 enum_tests/lvalue PASSED C 0:01.051 - R n/a ...ency/unified_locking/exp_backoff PASSED C 0:14.080 - R 0:00.227 .../unified_locking/fast_block_lock PASSED C 0:14.140 - R 0:00.121 alloc2 PASSED C 0:17.590 - R 0:00.044 concurrency/thread PASSED C 0:14.524 - R 0:00.076 errors/declaration PASSED C 0:00.124 - R n/a designations PASSED C 0:02.960 - R 0:00.039 errors/signature PASSED C 0:00.181 - R n/a errors/scope-type PASSED C 0:00.241 - R n/a concurrency/mutexstmt/monitors PASSED C 0:09.716 - R 0:08.115 enum_tests/inc-dec PASSED C 0:01.889 - R 0:00.078 .../unified_locking/block_spin_lock PASSED C 0:14.616 - R 0:00.323 ...ncy/unified_locking/timeout_lock PASSED C 0:10.746 - R 0:01.385 concurrency/waitfor/else PASSED C 0:10.830 - R 0:00.073 concurrency/mutexstmt/tuple PASSED C 0:17.970 - R 0:00.037 concurrency/actors/poison PASSED C 0:18.051 - R 0:00.175 concurrency/lockfree_stack PASSED C 0:13.176 - R 0:05.193 concurrency/actors/inline PASSED C 0:18.280 - R 0:00.123 ...cy/unified_locking/pthread_locks PASSED C 0:11.562 - R 0:01.129 errors/scope PASSED C 0:00.839 - R n/a enum_tests/funcEnum PASSED C 0:02.851 - R 0:00.039 concurrency/futures/typed PASSED C 0:18.388 - R 0:00.372 concurrency/actors/pingpong PASSED C 0:18.693 - R 0:00.180 concurrency/actors/executor PASSED C 0:18.759 - R 0:00.133 copyfile PASSED C 0:06.878 - R 0:00.071 concurrency/actors/types PASSED C 0:19.014 - R 0:00.171 eval PASSED C 0:01.480 - R 0:00.037 concurrency/actors/static PASSED C 0:19.348 - R 0:00.326 enum_tests/structEnum PASSED C 0:02.568 - R 0:00.068 concurrency/actors/matrixMultiply PASSED C 0:18.626 - R 0:01.177 concurrency/waitfor/barge PASSED C 0:12.478 - R 0:01.233 concurrency/readyQ/barrier_sleeper PASSED C 0:16.618 - R 0:01.224 concurrency/actors/inherit PASSED C 0:19.914 - R 0:00.072 concurrency/signal/block PASSED C 0:12.554 - R 0:05.251 ...urrency/waitfor/lexical_priority PASSED C 0:12.619 - R 0:00.070 exceptions/try-ctrl-flow PASSED C 0:00.603 - R n/a ctrl-flow/fallthrough PASSED C 0:06.820 - R 0:00.039 counter PASSED C 0:07.292 - R 0:00.037 exceptions/type-check PASSED C 0:00.745 - R n/a ctrl-flow/loop_else PASSED C 0:06.278 - R 0:00.073 configs/parseconfig PASSED C 0:09.713 - R 0:00.177 ctrl-flow/goto PASSED C 0:07.159 - R 0:00.039 ...nified_locking/simple_owner_lock PASSED C 0:14.599 - R 0:00.424 ...fied_locking/mcs_block_spin_lock PASSED C 0:15.113 - R 0:00.172 ctrl-flow/ifwhileCtl PASSED C 0:07.238 - R 0:00.036 configs/usage PASSED C 0:09.600 - R 0:00.071 coroutine/fmtLines PASSED C 0:08.482 - R 0:00.120 coroutine/devicedriver PASSED C 0:08.760 - R 0:00.071 coroutine/fibonacci PASSED C 0:08.726 - R 0:00.075 exceptions/try-leave-catch PASSED C 0:01.582 - R 0:00.119 ctrl-flow/break-misc PASSED C 0:08.081 - R 0:00.038 coroutine/pingpong PASSED C 0:08.877 - R 0:00.071 exceptions/message PASSED C 0:03.107 - R 0:00.041 configs/parsebools PASSED C 0:10.745 - R 0:00.224 enum_tests/anonymous PASSED C 0:06.674 - R 0:00.041 concurrency/waitfor/statment PASSED C 0:13.357 - R 0:00.122 coroutine/runningTotal PASSED C 0:09.046 - R 0:00.070 ...rrency/pthread/pthread_demo_lock PASSED C 0:12.045 - R 0:08.416 global-monomorph PASSED C 0:01.538 - R 0:00.039 init1-ERROR PASSED C 0:00.790 - R n/a concurrency/waituntil/timeout PASSED C 0:07.984 - R 0:03.893 identFuncDeclarator PASSED C 0:01.535 - R 0:00.042 expression PASSED C 0:02.396 - R 0:00.130 identParamDeclarator PASSED C 0:01.638 - R 0:00.021 coroutine/raii PASSED C 0:10.002 - R 0:00.074 concurrency/waitfor/when PASSED C 0:13.674 - R 0:00.523 ctrl-flow/loop_else-WRN1 PASSED C 0:08.589 - R 0:00.005 init1 PASSED C 0:01.670 - R 0:00.036 ctrl-flow/loopctrl PASSED C 0:08.636 - R 0:00.125 enum_tests/enumInlineValue PASSED C 0:07.936 - R 0:00.038 enum_tests/input PASSED C 0:07.666 - R 0:00.045 coroutine/prodcons PASSED C 0:11.198 - R 0:00.072 enum_tests/stringEnum PASSED C 0:07.129 - R 0:00.037 include/vector-sequence PASSED C 0:02.598 - R 0:00.039 enum_tests/voidEnum PASSED C 0:06.656 - R 0:00.042 concurrency/waitfor/recurse PASSED C 0:12.187 - R 0:04.553 enum_tests/typedIntEnum PASSED C 0:07.224 - R 0:00.076 include/vector-collections PASSED C 0:03.208 - R 0:00.127 limits PASSED C 0:01.704 - R 0:00.037 exceptions/conditional PASSED C 0:07.041 - R 0:00.074 div PASSED C 0:10.033 - R 0:00.036 exceptions/data-except PASSED C 0:07.197 - R 0:00.077 enum_tests/position PASSED C 0:09.028 - R 0:00.076 device/cpu PASSED C 0:10.821 - R 0:00.224 exceptions/defaults PASSED C 0:07.735 - R 0:00.041 exceptions/polymorphic PASSED C 0:07.207 - R 0:00.022 concurrency/channels/daisy_chain PASSED C 0:15.984 - R 0:10.061 linking/nostdlib PASSED C 0:02.055 - R 0:00.129 linkonce PASSED C 0:01.799 - R 0:00.042 concurrency/channels/hot_potato PASSED C 0:16.060 - R 0:10.121 nested-types-ERR1 PASSED C 0:00.195 - R n/a concurrency/waitfor/dtor PASSED C 0:12.098 - R 0:07.457 nested-types-ERR2 PASSED C 0:00.280 - R n/a exceptions/terminate PASSED C 0:07.286 - R 0:00.039 concurrency/channels/contend PASSED C 0:16.346 - R 0:10.124 exceptions/trash PASSED C 0:06.973 - R 0:00.126 exceptions/finally PASSED C 0:08.020 - R 0:00.074 exceptions/resume PASSED C 0:07.604 - R 0:00.072 exceptions/conditional-threads PASSED C 0:08.549 - R 0:00.038 opt-params PASSED C 0:00.128 - R n/a exceptions/interact PASSED C 0:08.061 - R 0:00.124 enum_tests/planet PASSED C 0:10.316 - R 0:00.038 concurrency/channels/zero_size PASSED C 0:16.587 - R 0:10.278 concurrency/channels/ping_pong PASSED C 0:16.931 - R 0:10.074 fstream_test PASSED C 0:06.944 - R 0:00.038 exceptions/finally-threads PASSED C 0:08.638 - R 0:00.073 maybe PASSED C 0:01.839 - R 0:00.023 exceptions/virtual-poly PASSED C 0:07.087 - R 0:00.126 polybits PASSED C 0:00.374 - R n/a concurrency/channels/pub_sub PASSED C 0:17.347 - R 0:10.164 generator/fibonacci PASSED C 0:07.066 - R 0:00.041 nested-types PASSED C 0:01.617 - R 0:00.039 genericUnion PASSED C 0:06.916 - R 0:00.128 identity PASSED C 0:06.581 - R 0:00.045 generator/suspend_then PASSED C 0:07.033 - R 0:00.073 linking/exception-nothreads PASSED C 0:04.464 - R 0:00.038 exceptions/resume-threads PASSED C 0:08.807 - R 0:00.074 nowarn/zero-thunk PASSED C 0:01.477 - R 0:00.036 exceptions/cancel/coroutine PASSED C 0:09.920 - R 0:00.069 numericConstants PASSED C 0:01.474 - R 0:00.042 nowarn/no-autogen PASSED C 0:01.661 - R 0:00.039 include/stdincludes PASSED C 0:06.779 - R 0:00.046 nowarn/unused PASSED C 0:01.614 - R 0:00.037 hello PASSED C 0:07.112 - R 0:00.037 operators PASSED C 0:01.506 - R 0:00.037 nowarn/array PASSED C 0:01.833 - R 0:00.122 nowarn/printf-sizeof PASSED C 0:01.738 - R 0:00.038 nowarn/exception PASSED C 0:01.867 - R 0:00.042 poly-bare-assn PASSED C 0:01.570 - R 0:00.041 poly-many-arsz PASSED C 0:01.526 - R 0:00.037 concurrency/channels/churn PASSED C 0:18.115 - R 0:10.105 concurrency/preempt PASSED C 0:13.883 - R 0:13.369 poly-selection PASSED C 0:01.416 - R 0:00.036 raii/ctor-autogen-ERR1 PASSED C 0:00.838 - R n/a forall PASSED C 0:08.380 - R 0:00.077 concurrency/channels/big_elems PASSED C 0:16.409 - R 0:12.088 poly-o-cycle PASSED C 0:01.739 - R 0:00.127 poly-d-cycle PASSED C 0:01.845 - R 0:00.126 exceptions/defaults-threads PASSED C 0:10.380 - R 0:00.252 poly-self-cycle PASSED C 0:01.746 - R 0:00.151 concurrency/waituntil/basic_else PASSED C 0:18.911 - R 0:00.360 include/vector-fstream PASSED C 0:07.119 - R 0:00.256 raii/partial-ERR1 PASSED C 0:00.971 - R n/a exceptions/virtual-cast PASSED C 0:09.023 - R 0:00.169 typedefRedef-ERR1 PASSED C 0:00.242 - R n/a poly-member PASSED C 0:02.240 - R 0:00.203 quasiKeyword PASSED C 0:01.875 - R 0:00.103 generator/fmtLines PASSED C 0:08.503 - R 0:00.151 io/eofType PASSED C 0:07.154 - R 0:00.022 concurrency/futures/future_except PASSED C 0:29.288 - R 0:00.069 exceptions/fibonacci_nonlocal PASSED C 0:11.121 - R 0:00.038 var-assert PASSED C 0:00.256 - R n/a raii/typeof-member PASSED C 0:01.555 - R 0:00.040 exceptions/terminate-threads PASSED C 0:10.252 - R 0:00.128 raii/init_once PASSED C 0:01.744 - R 0:00.118 raii/partial PASSED C 0:01.709 - R 0:00.021 raii/ctor-autogen PASSED C 0:02.379 - R 0:00.024 smart-pointers PASSED C 0:01.733 - R 0:00.039 exceptions/cancel/thread PASSED C 0:11.923 - R 0:00.039 switch PASSED C 0:01.545 - R 0:00.074 simpleGenericTriple PASSED C 0:01.873 - R 0:00.024 result PASSED C 0:02.072 - R 0:00.122 tuple/tupleFunction PASSED C 0:01.890 - R 0:00.040 tuple/tupleCast PASSED C 0:01.967 - R 0:00.073 typedefRedef PASSED C 0:01.630 - R 0:00.076 function-operator PASSED C 0:10.238 - R 0:00.041 tuple/tupleMember PASSED C 0:01.948 - R 0:00.075 withconflict PASSED C 0:00.805 - R n/a tuple/tuplePolymorphism PASSED C 0:02.184 - R 0:00.043 typeof PASSED C 0:01.795 - R 0:00.122 meta/fork+exec PASSED C 0:05.096 - R 0:00.172 variableDeclarator PASSED C 0:01.781 - R 0:00.041 exceptions/cor_resumer PASSED C 0:12.856 - R 0:00.178 voidPtr PASSED C 0:01.489 - R 0:00.041 warnings/self-assignment PASSED C 0:01.417 - R 0:00.005 KRfunctions PASSED C 0:01.370 - R 0:00.002 linking/mangling/anon PASSED C 0:07.598 - R 0:00.043 literals PASSED C 0:06.817 - R 0:00.074 ...collections/dimexpr-match-c-ERRS PASSED C 0:01.042 - R n/a linking/exception-withthreads PASSED C 0:08.241 - R 0:00.071 list/dlist-insert-remove PASSED C 0:07.475 - R 0:00.070 exceptions/pingpong_nonlocal PASSED C 0:13.243 - R 0:00.072 errors/completeType PASSED C 0:00.916 - R n/a raii/memberCtors-ERR1 PASSED C 0:04.475 - R n/a ...llections/dimexpr-match-cfa-ERRS PASSED C 0:01.681 - R n/a attributes PASSED C 0:01.662 - R 0:00.003 io/manipulatorsOutput4 PASSED C 0:09.689 - R 0:00.120 declarationSpecifier PASSED C 0:01.540 - R 0:00.002 ...rrency/examples/boundedBufferINT PASSED C 0:12.309 - R 0:20.413 raii/dtor-early-exit-ERR2 PASSED C 0:05.220 - R n/a extension PASSED C 0:01.377 - R 0:00.005 io/manipulatorsInput-uchunk PASSED C 0:10.225 - R 0:00.223 functions PASSED C 0:01.490 - R 0:00.002 list/dlist2-insert-remove PASSED C 0:08.446 - R 0:00.225 linking/weakso_nothd PASSED C 0:09.091 - R 0:00.024 io/io PASSED C 0:11.098 - R 0:00.041 gccExtensions PASSED C 0:01.399 - R 0:00.002 linking/io-acquire PASSED C 0:09.601 - R 0:00.024 arithmeticConversions PASSED C 0:02.859 - R 0:00.039 raii/dtor-early-exit-ERR1 PASSED C 0:05.884 - R n/a concurrency/waituntil/one_chan PASSED C 0:12.876 - R 0:10.262 meta/arch PASSED C 0:00.976 - R n/a collections/atomic_mpsc PASSED C 0:12.535 - R 0:21.225 tuple/tupleVariadic PASSED C 0:05.120 - R 0:00.024 polymorphism PASSED C 0:06.930 - R 0:00.023 zero_one-ERR1 PASSED C 0:04.399 - R n/a linking/nothreads PASSED C 0:10.386 - R 0:00.027 meta/dumpable PASSED C 0:09.049 - R 0:00.022 raii/globals PASSED C 0:06.818 - R 0:00.038 raii/boxed-types PASSED C 0:07.486 - R 0:00.021 raii/memberCtors PASSED C 0:07.091 - R 0:00.021 quotedKeyword PASSED C 0:07.779 - R 0:00.022 shortCircuit PASSED C 0:06.906 - R 0:00.037 malloc PASSED C 0:09.842 - R 0:00.039 references PASSED C 0:07.059 - R 0:00.037 concurrency/preempt2 PASSED C 0:12.426 - R 0:21.632 strstream PASSED C 0:07.054 - R 0:00.037 tuplearray PASSED C 0:06.802 - R 0:00.019 tuple/tupleAssign PASSED C 0:07.361 - R 0:00.037 sizeof PASSED C 0:07.745 - R 0:00.023 io/io-acquire PASSED C 0:13.331 - R 0:00.218 userLiterals PASSED C 0:07.062 - R 0:00.021 raii/dtor-early-exit PASSED C 0:08.813 - R 0:00.038 linking/withthreads PASSED C 0:12.107 - R 0:00.120 io/io-acquire-in PASSED C 0:13.918 - R 0:00.221 concurrency/waituntil/channel_close PASSED C 0:16.915 - R 0:10.120 time PASSED C 0:08.710 - R 0:00.036 io/io-acquire2 PASSED C 0:14.464 - R 0:00.269 searchsort PASSED C 0:09.228 - R 0:00.036 sum PASSED C 0:09.457 - R 0:00.019 io/io-acquire-out PASSED C 0:15.007 - R 0:00.169 vector PASSED C 0:08.502 - R 0:00.039 swap PASSED C 0:09.496 - R 0:00.038 concurrency/actors/dynamic PASSED C 0:18.230 - R 0:19.813 minmax PASSED C 0:12.101 - R 0:00.035 zero_one PASSED C 0:08.349 - R 0:00.019 io/many_read PASSED C 0:15.562 - R 0:00.035 concurrency/waituntil/futures PASSED C 0:28.879 - R 0:00.035 vector_math/vec2_double PASSED C 0:09.720 - R 0:00.020 io/comp_fair PASSED C 0:16.586 - R 0:00.520 vector_math/vec2_uint PASSED C 0:09.865 - R 0:00.036 abs PASSED C 0:08.901 - R 0:00.036 ...collections/array-md-sbscr-cases PASSED C 0:08.812 - R 0:00.037 io/away_fair PASSED C 0:17.892 - R 0:00.320 ato PASSED C 0:09.718 - R 0:00.035 io/manipulatorsInput PASSED C 0:08.450 - R 0:00.035 gmp PASSED C 0:08.577 - R 0:00.036 random PASSED C 0:08.576 - R 0:00.020 ...rrency/examples/boundedBufferEXT PASSED C 0:12.777 - R 0:28.753 io/comp_basic PASSED C 0:19.495 - R 0:00.268 exceptions/cardgame PASSED C 0:10.449 - R 0:00.068 exceptions/hotpotato_checked PASSED C 0:10.486 - R 0:00.067 vector_math/vec2_ldouble PASSED C 0:09.171 - R 0:00.021 bitmanip1 PASSED C 0:11.513 - R 0:00.069 vector_math/vec3_int PASSED C 0:13.000 - R 0:00.037 io/manipulatorsOutput2 PASSED C 0:10.338 - R 0:00.035 exceptions/hotpotato PASSED C 0:11.589 - R 0:00.119 bitmanip2 PASSED C 0:12.196 - R 0:00.118 vector_math/vec2_int PASSED C 0:13.866 - R 0:00.036 bitmanip3 PASSED C 0:12.356 - R 0:00.068 vector_math/vec2_float PASSED C 0:14.473 - R 0:00.067 vector_math/vec3_float PASSED C 0:14.543 - R 0:00.035 vector_math/vec4_float PASSED C 0:14.681 - R 0:00.035 vector_math/vec4_int PASSED C 0:15.074 - R 0:00.067 concurrency/unified_locking/mcs PASSED C 0:15.233 - R 0:24.267 math PASSED C 0:12.715 - R 0:00.034 include/includes PASSED C 0:24.339 - R 0:00.035 mathX PASSED C 0:13.672 - R 0:00.036 io/manipulatorsOutput1 PASSED C 0:14.240 - R 0:00.035 io/io-acquire-no-io PASSED C 0:12.764 - R 0:11.311 io/manipulatorsOutput3 PASSED C 0:14.148 - R 0:00.119 PRNG PASSED C 0:15.975 - R 0:02.176 heap PASSED C 0:09.685 - R 0:18.633 concurrency/waituntil/channels PASSED C 0:14.105 - R 0:27.059 concurrency/waituntil/repeat_close PASSED C 0:13.820 - R 0:30.165 rational PASSED C 0:27.025 - R 0:00.036 ...ency/unified_locking/futex_mutex PASSED C 0:14.089 - R 0:39.163 concurrency/waituntil/all_types PASSED C 0:33.465 - R 0:20.001 ...ency/waituntil/channel_zero_size PASSED C 0:12.926 - R 0:42.505 ...urrency/unified_locking/mcs_spin PASSED C 0:13.939 - R 0:49.608 concurrency/monitor PASSED C 0:12.053 - R 1:00.260 .../unified_locking/spin_queue_lock PASSED C 0:15.148 - R 0:52.136 concurrency/multi-monitor PASSED C 0:11.983 - R 1:07.958 concurrency/waituntil/locks PASSED C 0:15.511 - R 1:08.668 concurrency/unified_locking/locks PASSED C 0:14.887 - R 1:24.248 concurrency/mutexstmt/locks PASSED C 0:12.261 - R 2:19.115 374 passes, 1 failures, 0 timeouts, 0 cancelled, 0 other Tests took 2:32.307 make: *** [Makefile:986: all-local] Error 1 [Pipeline] } [Pipeline] // dir [Pipeline] } [Pipeline] // stage [Pipeline] echo Archiving core dumps [Pipeline] dir Running in /var/lib/jenkins/workspace/Cforall_master@tmp [Pipeline] { [Pipeline] fileExists [Pipeline] sh + /var/lib/jenkins/workspace/Cforall_master/tools/jenkins/archive-gen.sh [Pipeline] archiveArtifacts Archiving artifacts Recording fingerprints [Pipeline] } [Pipeline] // dir [Pipeline] } [Pipeline] // wrap [Pipeline] } [Pipeline] // node [Pipeline] echo hudson.AbortException: script returned exit code 2 [Pipeline] node Running on Brokk 5 in /var/lib/jenkins/workspace/Cforall_master_2 [Pipeline] { [Pipeline] echo Notifying users of result [Pipeline] echo Reusing previously constructed message [Pipeline] echo Would send email to: cforall@lists.uwaterloo.ca [Pipeline] echo With title: [cforall git][BUILD# 3657 - FAILURE] - branch master [Pipeline] echo Content:

This is an automated email from the Jenkins build machine. It was generated because of a git hooks/post-receive script following a ref change which was pushed to the C∀ repository.

- Status --------------------------------------------------------------

BUILD# 3657 - FAILURE

Check console output at https://cforall.uwaterloo.ca/jenkins/job/Cforall/job/master/3657/ to view the results.

- Changes -------------------------------------------------------------

The branch master has been updated.
      from  4ff8cb209307cd30c3626d4fbe3cc2d2ce4219ea (commit)

- Log -----------------------------------------------------------------


-----------------------------------------------------------------------

Summary of changes:

[Pipeline] } [Pipeline] // node [Pipeline] echo Build Completed [Pipeline] End of Pipeline ERROR: script returned exit code 2 Finished: FAILURE [Pipeline] error [Pipeline] } Failed in branch gcc_11_arm64_new Build Cforall » master #3651 completed: SUCCESS [Pipeline] echo SUCCESS [Pipeline] } Build Cforall » master #3655 completed: SUCCESS [Pipeline] echo SUCCESS [Pipeline] } Build Cforall » master #3659 completed: SUCCESS [Pipeline] echo SUCCESS [Pipeline] } Build Cforall » master #3658 completed: SUCCESS [Pipeline] echo SUCCESS [Pipeline] } Build Cforall » master #3650 completed: SUCCESS [Pipeline] echo SUCCESS [Pipeline] } Build Cforall » master #3649 completed: SUCCESS [Pipeline] echo SUCCESS [Pipeline] } [Pipeline] // parallel [Pipeline] } [Pipeline] // stage [Pipeline] } [Pipeline] // wrap [Pipeline] echo error caught [Pipeline] node Running on Brokk 4 in /var/lib/jenkins/workspace/Cforall_Full_Build [Pipeline] { [Pipeline] echo notifying users [Pipeline] emailext Sending email to: cforall@lists.uwaterloo.ca [Pipeline] } [Pipeline] // node [Pipeline] } [Pipeline] // node [Pipeline] End of Pipeline ERROR: FAILURE Finished: FAILURE