Started by timer Running as Jenkins Build User Obtained Jenkins/FullBuild from git cforall@plg.uwaterloo.ca:software/cfa/cfa-cc [Pipeline] Start of Pipeline [Pipeline] node Running on Brokk 3 in /var/lib/jenkins/workspace/Cforall_Full_Build [Pipeline] { [Pipeline] checkout The recommended git tool is: NONE using credential git_key_aug2025 Fetching changes from the remote Git repository Checking out Revision 4ff8cb209307cd30c3626d4fbe3cc2d2ce4219ea (refs/remotes/origin/master) Commit message: "fix Mesa citation" > git rev-parse --resolve-git-dir /var/lib/jenkins/workspace/Cforall_Full_Build/.git # timeout=10 > git config remote.origin.url cforall@plg.uwaterloo.ca:software/cfa/cfa-cc # timeout=10 Fetching upstream changes from cforall@plg.uwaterloo.ca:software/cfa/cfa-cc > git --version # timeout=10 > git --version # 'git version 2.43.0' using GIT_SSH to set credentials Git key use to connect to the cforall git repo (August 2025) Verifying host key using known hosts file > git fetch --tags --force --progress -- cforall@plg.uwaterloo.ca:software/cfa/cfa-cc +refs/heads/*:refs/remotes/origin/* # timeout=10 > git rev-parse refs/remotes/origin/master^{commit} # timeout=10 > git config core.sparsecheckout # timeout=10 > git checkout -f 4ff8cb209307cd30c3626d4fbe3cc2d2ce4219ea # timeout=10 > git rev-list --no-walk 4ff8cb209307cd30c3626d4fbe3cc2d2ce4219ea # timeout=10 [Pipeline] wrap [Pipeline] { [Pipeline] stage [Pipeline] { (Build) [Pipeline] parallel [Pipeline] { (Branch: gcc_10_x86_new) [Pipeline] { (Branch: gcc_11_x86_new) [Pipeline] { (Branch: gcc_12_x86_new) [Pipeline] { (Branch: gcc_9_x64_new) [Pipeline] { (Branch: gcc_10_x64_new) [Pipeline] { (Branch: gcc_11_x64_new) [Pipeline] { (Branch: gcc_12_x64_new) [Pipeline] { (Branch: gcc_10_arm64_new) [Pipeline] { (Branch: gcc_11_arm64_new) [Pipeline] { (Branch: gcc_12_arm64_new) [Pipeline] { (Branch: clang_x64_new) [Pipeline] sleep Sleeping for 1 min 0 sec [Pipeline] sleep No need to sleep any longer [Pipeline] sleep Sleeping for 3 min 0 sec [Pipeline] sleep Sleeping for 4 min 0 sec [Pipeline] sleep Sleeping for 3 min 0 sec [Pipeline] sleep Sleeping for 2 min 0 sec [Pipeline] sleep Sleeping for 2 min 0 sec [Pipeline] sleep Sleeping for 2 min 0 sec [Pipeline] sleep Sleeping for 1 min 0 sec [Pipeline] sleep No need to sleep any longer [Pipeline] sleep Sleeping for 3 min 0 sec [Pipeline] build Scheduling project: Cforall » master [Pipeline] build Scheduling project: Cforall » master Starting building: Cforall » master #3605 Starting building: Cforall » master #3606 [Pipeline] build Scheduling project: Cforall » master [Pipeline] build Scheduling project: Cforall » master Starting building: Cforall » master #3607 Starting building: Cforall » master #3608 [Pipeline] build Scheduling project: Cforall » master [Pipeline] build Scheduling project: Cforall » master [Pipeline] build Scheduling project: Cforall » master Starting building: Cforall » master #3609 Starting building: Cforall » master #3610 Starting building: Cforall » master #3611 [Pipeline] build Scheduling project: Cforall » master [Pipeline] build Scheduling project: Cforall » master [Pipeline] build Scheduling project: Cforall » master Starting building: Cforall » master #3612 Starting building: Cforall » master #3614 Starting building: Cforall » master #3613 [Pipeline] build Scheduling project: Cforall » master Starting building: Cforall » master #3615 Build Cforall » master #3606 completed: SUCCESS [Pipeline] echo SUCCESS [Pipeline] } Build Cforall » master #3605 completed: SUCCESS [Pipeline] echo SUCCESS [Pipeline] } Build Cforall » master #3609 completed: SUCCESS [Pipeline] echo SUCCESS [Pipeline] } Build Cforall » master #3615 completed: FAILURE [Pipeline] echo FAILURE [Pipeline] sh + wget -q -O - https://cforall.uwaterloo.ca/jenkins/job/Cforall/job/master/3615/consoleText Started by upstream project "Cforall_Full_Build" build number 409 originally caused by: Started by timer Running as Jenkins Build User > git rev-parse --resolve-git-dir /var/lib/jenkins/caches/git-914b6fdde163b7e17ee75d99ca23f18a/.git # timeout=10 Setting origin to cforall@plg.uwaterloo.ca:software/cfa/cfa-cc > git config remote.origin.url cforall@plg.uwaterloo.ca:software/cfa/cfa-cc # timeout=10 Fetching origin... Fetching upstream changes from origin > git --version # timeout=10 > git --version # 'git version 2.43.0' > git config --get remote.origin.url # timeout=10 using GIT_SSH to set credentials Git key use to connect to the cforall git repo (August 2025) Verifying host key using known hosts file > git fetch --no-tags --force --progress -- origin +refs/heads/*:refs/remotes/origin/* # timeout=10 Seen branch in repository origin/ADT Seen branch in repository origin/aaron-thesis Seen branch in repository origin/arm-eh Seen branch in repository origin/ast-experimental Seen branch in repository origin/cleanup-dtors Seen branch in repository origin/ctor Seen branch in repository origin/deferred_resn Seen branch in repository origin/demangler Seen branch in repository origin/enum Seen branch in repository origin/forall-pointer-decay Seen branch in repository origin/gc_noraii Seen branch in repository origin/jacob/cs343-translation Seen branch in repository origin/jenkins-sandbox Seen branch in repository origin/master Seen branch in repository origin/memory Seen branch in repository origin/new-ast Seen branch in repository origin/new-ast-unique-expr Seen branch in repository origin/new-env Seen branch in repository origin/no_list Seen branch in repository origin/persistent-indexer Seen branch in repository origin/pthread-emulation Seen branch in repository origin/qualifiedEnum Seen branch in repository origin/resolv-new Seen branch in repository origin/string Seen branch in repository origin/stuck-waitfor-destruct Seen branch in repository origin/with_gc Seen 26 remote branches Obtained Jenkinsfile from 4ff8cb209307cd30c3626d4fbe3cc2d2ce4219ea [Pipeline] Start of Pipeline [Pipeline] node Running on Brokk 1 in /var/lib/jenkins/workspace/Cforall_master [Pipeline] { [Pipeline] wrap [Pipeline] { [Pipeline] properties WARNING: Unknown parameter(s) found for class type 'hudson.model.ChoiceParameterDefinition': defaultValue WARNING: Unknown parameter(s) found for class type 'hudson.model.ChoiceParameterDefinition': defaultValue [Pipeline] checkout The recommended git tool is: NONE using credential git_key_aug2025 Fetching changes from the remote Git repository Cleaning workspace Fetching without tags Checking out Revision 4ff8cb209307cd30c3626d4fbe3cc2d2ce4219ea (master) Commit message: "fix Mesa citation" [Pipeline] load [Pipeline] { (Jenkins/tools.groovy) [Pipeline] } [Pipeline] // load [Pipeline] echo Compiler : gcc-9 (g++-9/gcc-9) Architecture : x64 Arc Flags : --host=x86_64 Run All Tests : true Run Benchmark : true Build Documentation : false Publish : true Silent : true [Pipeline] } [Pipeline] // wrap [Pipeline] } > git rev-parse --resolve-git-dir /var/lib/jenkins/workspace/Cforall_master/.git # timeout=10 > git config remote.origin.url cforall@plg.uwaterloo.ca:software/cfa/cfa-cc # timeout=10 > git rev-parse --verify HEAD # timeout=10 Resetting working tree > git reset --hard # timeout=10 > git clean -fdx # timeout=10 Fetching upstream changes from cforall@plg.uwaterloo.ca:software/cfa/cfa-cc > git --version # timeout=10 > git --version # 'git version 2.43.0' using GIT_SSH to set credentials Git key use to connect to the cforall git repo (August 2025) Verifying host key using known hosts file > git fetch --no-tags --force --progress -- cforall@plg.uwaterloo.ca:software/cfa/cfa-cc +refs/heads/*:refs/remotes/origin/* # timeout=10 > git config core.sparsecheckout # timeout=10 > git checkout -f 4ff8cb209307cd30c3626d4fbe3cc2d2ce4219ea # timeout=10 > git rev-list --no-walk 4ff8cb209307cd30c3626d4fbe3cc2d2ce4219ea # timeout=10 [Pipeline] // node [Pipeline] node Running on Brokk 1 in /var/lib/jenkins/workspace/Cforall_master [Pipeline] { [Pipeline] wrap [Pipeline] { [Pipeline] pwd [Pipeline] pwd [Pipeline] echo -------- Cleanup -------- [Pipeline] stage [Pipeline] { (Cleanup) [Pipeline] dir Running in /var/lib/jenkins/workspace/Cforall_master@tmp [Pipeline] { [Pipeline] deleteDir [Pipeline] } [Pipeline] // dir [Pipeline] } [Pipeline] // stage [Pipeline] echo -------- Checkout -------- [Pipeline] stage [Pipeline] { (Checkout) [Pipeline] checkout The recommended git tool is: NONE using credential git_key_aug2025 Fetching changes from the remote Git repository Cleaning workspace Fetching without tags > git rev-parse --resolve-git-dir /var/lib/jenkins/workspace/Cforall_master/.git # timeout=10 > git config remote.origin.url cforall@plg.uwaterloo.ca:software/cfa/cfa-cc # timeout=10 > git rev-parse --verify HEAD # timeout=10 Resetting working tree > git reset --hard # timeout=10 > git clean -fdx # timeout=10 Fetching upstream changes from cforall@plg.uwaterloo.ca:software/cfa/cfa-cc > git --version # timeout=10 > git --version # 'git version 2.43.0' using GIT_SSH to set credentials Git key use to connect to the cforall git repo (August 2025) Verifying host key using known hosts file > git fetch --no-tags --force --progress -- cforall@plg.uwaterloo.ca:software/cfa/cfa-cc +refs/heads/*:refs/remotes/origin/* # timeout=10 Checking out Revision 4ff8cb209307cd30c3626d4fbe3cc2d2ce4219ea (master) Commit message: "fix Mesa citation" [Pipeline] echo Constructing new git message [Pipeline] sh + git rev-list 4ff8cb209307cd30c3626d4fbe3cc2d2ce4219ea..4ff8cb209307cd30c3626d4fbe3cc2d2ce4219ea [Pipeline] sh + git cat-file -t 4ff8cb209307cd30c3626d4fbe3cc2d2ce4219ea [Pipeline] sh > git config core.sparsecheckout # timeout=10 > git checkout -f 4ff8cb209307cd30c3626d4fbe3cc2d2ce4219ea # timeout=10 + git rev-list --format=short 4ff8cb209307cd30c3626d4fbe3cc2d2ce4219ea...4ff8cb209307cd30c3626d4fbe3cc2d2ce4219ea [Pipeline] sh + git diff --stat --color 4ff8cb209307cd30c3626d4fbe3cc2d2ce4219ea 4ff8cb209307cd30c3626d4fbe3cc2d2ce4219ea [Pipeline] echo

- Changes -------------------------------------------------------------

The branch master has been updated.
      from  4ff8cb209307cd30c3626d4fbe3cc2d2ce4219ea (commit)

- Log -----------------------------------------------------------------


-----------------------------------------------------------------------

Summary of changes:

[Pipeline] } [Pipeline] // stage [Pipeline] echo -------- Build : configure -------- [Pipeline] stage [Pipeline] { (Build : configure) [Pipeline] dir Running in /var/lib/jenkins/workspace/Cforall_master [Pipeline] { [Pipeline] sh + ./autogen.sh Running aclocal in root Running libtoolize in root libtoolize: putting auxiliary files in AC_CONFIG_AUX_DIR, 'automake'. libtoolize: linking file 'automake/ltmain.sh' libtoolize: putting macros in AC_CONFIG_MACRO_DIRS, 'automake'. libtoolize: linking file 'automake/libtool.m4' libtoolize: linking file 'automake/ltoptions.m4' libtoolize: linking file 'automake/ltsugar.m4' libtoolize: linking file 'automake/ltversion.m4' libtoolize: linking file 'automake/lt~obsolete.m4' Running autoconf in root Running automake in root configure.ac:223: installing 'automake/compile' configure.ac:138: installing 'automake/config.guess' configure.ac:138: installing 'automake/config.sub' configure.ac:17: installing 'automake/install-sh' benchmark/Makefile.am: installing 'automake/depcomp' parallel-tests: installing 'automake/test-driver' configure.ac: installing 'automake/ylwrap' Running aclocal in libcfa Running libtoolize in libcfa libtoolize: putting auxiliary files in AC_CONFIG_AUX_DIR, 'automake'. libtoolize: linking file 'automake/ltmain.sh' libtoolize: putting macros in AC_CONFIG_MACRO_DIRS, 'automake'. libtoolize: linking file 'automake/libtool.m4' libtoolize: linking file 'automake/ltoptions.m4' libtoolize: linking file 'automake/ltsugar.m4' libtoolize: linking file 'automake/ltversion.m4' libtoolize: linking file 'automake/lt~obsolete.m4' Running autoconf in libcfa Running automake in libcfa configure.ac:119: installing 'automake/compile' configure.ac:119: installing 'automake/config.guess' configure.ac:119: installing 'automake/config.sub' configure.ac:12: installing 'automake/install-sh' src/Makefile.am: installing 'automake/depcomp' [Pipeline] } [Pipeline] // dir [Pipeline] dir Running in /var/lib/jenkins/workspace/Cforall_master@tmp [Pipeline] { [Pipeline] sh + /var/lib/jenkins/workspace/Cforall_master/configure CXX=g++-9 CC=gcc-9 --host=x86_64 AR=gcc-ar RANLIB=gcc-ranlib --with-target-hosts=host:debug,host:nodebug --quiet --prefix=/var/lib/jenkins/workspace/Cforall_master@tmp [Pipeline] sh + nproc + make -j 16 --no-print-directory configure-libcfa libcfa/x64-debug/config.data Configuring libcfa (/var/lib/jenkins/workspace/Cforall_master/libcfa/configure) with ''CXX=g++-9' 'CC=gcc-9' 'AR=gcc-ar' 'RANLIB=gcc-ranlib' '--prefix=/var/lib/jenkins/workspace/Cforall_master@tmp' DRIVER_DIR=/var/lib/jenkins/workspace/Cforall_master@tmp/driver/ ARCHITECTURE=x64 CONFIGURATION=debug CFA_VERSION=1:0:0' from /var/lib/jenkins/workspace/Cforall_master@tmp / libcfa/x64-debug/ libcfa/x64-nodebug/config.data Configuring libcfa (/var/lib/jenkins/workspace/Cforall_master/libcfa/configure) with ''CXX=g++-9' 'CC=gcc-9' 'AR=gcc-ar' 'RANLIB=gcc-ranlib' '--prefix=/var/lib/jenkins/workspace/Cforall_master@tmp' DRIVER_DIR=/var/lib/jenkins/workspace/Cforall_master@tmp/driver/ ARCHITECTURE=x64 CONFIGURATION=nodebug CFA_VERSION=1:0:0' from /var/lib/jenkins/workspace/Cforall_master@tmp / libcfa/x64-nodebug/ checking whether make supports nested variables... yes checking for a BSD-compatible install... checking whether make supports nested variables... yes checking for a BSD-compatible install... /usr/bin/install -c checking whether build environment is sane... /usr/bin/install -c checking whether build environment is sane... yes yes checking for a race-free mkdir -p... /usr/bin/mkdir -p checking for gawk... gawk checking whether make sets $(MAKE)... checking for a race-free mkdir -p... /usr/bin/mkdir -p checking for gawk... gawk checking whether make sets $(MAKE)... yes yes checking for distributated build... no checking for distributated build... no checking build system type... checking build system type... x86_64-pc-linux-gnu checking host system type... x86_64-pc-linux-gnu checking how to print strings... printf checking whether make supports the include directive... x86_64-pc-linux-gnu checking host system type... x86_64-pc-linux-gnu checking how to print strings... printf checking whether make supports the include directive... yes (GNU style) checking for gcc... gcc-9 yes (GNU style) checking for gcc... gcc-9 checking whether the C compiler works... checking whether the C compiler works... yes checking for C compiler default output file name... a.out checking for suffix of executables... yes checking for C compiler default output file name... a.out checking for suffix of executables... checking whether we are cross compiling... checking whether we are cross compiling... no checking for suffix of object files... no checking for suffix of object files... o checking whether the compiler supports GNU C... o checking whether the compiler supports GNU C... yes checking whether gcc-9 accepts -g... yes checking whether gcc-9 accepts -g... yes checking for gcc-9 option to enable C11 features... yes checking for gcc-9 option to enable C11 features... none needed checking whether gcc-9 understands -c and -o together... none needed checking whether gcc-9 understands -c and -o together... yes checking dependency style of gcc-9... yes checking dependency style of gcc-9... gcc3 checking for a sed that does not truncate output... /usr/bin/sed checking for grep that handles long lines and -e... /usr/bin/grep checking for egrep... gcc3 checking for a sed that does not truncate output... /usr/bin/grep -E checking for fgrep... /usr/bin/grep -F checking for ld used by gcc-9... /usr/bin/sed checking for grep that handles long lines and -e... /usr/bin/grep checking for egrep... /usr/bin/ld checking if the linker (/usr/bin/ld) is GNU ld... /usr/bin/grep -E checking for fgrep... /usr/bin/grep -F yes checking for BSD- or MS-compatible name lister (nm)... checking for ld used by gcc-9... /usr/bin/nm -B checking the name lister (/usr/bin/nm -B) interface... /usr/bin/ld checking if the linker (/usr/bin/ld) is GNU ld... yes checking for BSD- or MS-compatible name lister (nm)... /usr/bin/nm -B checking the name lister (/usr/bin/nm -B) interface... BSD nm checking whether ln -s works... yes checking the maximum length of command line arguments... 1572864 checking how to convert x86_64-pc-linux-gnu file names to x86_64-pc-linux-gnu format... BSD nm checking whether ln -s works... func_convert_file_noop yes checking the maximum length of command line arguments... checking how to convert x86_64-pc-linux-gnu file names to toolchain format... func_convert_file_noop checking for /usr/bin/ld option to reload object files... -r checking for file... file checking for objdump... objdump checking how to recognize dependent libraries... pass_all checking for dlltool... no checking how to associate runtime and link libraries... printf %s\n checking for archiver @FILE support... 1572864 checking how to convert x86_64-pc-linux-gnu file names to x86_64-pc-linux-gnu format... func_convert_file_noop checking how to convert x86_64-pc-linux-gnu file names to toolchain format... func_convert_file_noop checking for /usr/bin/ld option to reload object files... -r checking for file... file checking for objdump... objdump checking how to recognize dependent libraries... pass_all checking for dlltool... no checking how to associate runtime and link libraries... printf %s\n checking for archiver @FILE support... @ checking for strip... strip checking for ranlib... gcc-ranlib checking command to parse /usr/bin/nm -B output from gcc-9 object... @ checking for strip... strip checking for ranlib... gcc-ranlib checking command to parse /usr/bin/nm -B output from gcc-9 object... ok checking for sysroot... no checking for a working dd... /usr/bin/dd checking how to truncate binary pipes... /usr/bin/dd bs=4096 count=1 checking for mt... mt checking if mt is a manifest tool... ok checking for sysroot... no checking for a working dd... no checking for stdio.h... /usr/bin/dd checking how to truncate binary pipes... /usr/bin/dd bs=4096 count=1 yes checking for stdlib.h... checking for mt... mt checking if mt is a manifest tool... no checking for stdio.h... yes checking for string.h... yes checking for stdlib.h... yes checking for inttypes.h... yes checking for string.h... yes checking for stdint.h... yes checking for inttypes.h... yes yes checking for stdint.h... checking for strings.h... yes checking for strings.h... yes checking for sys/stat.h... yes checking for sys/stat.h... yes checking for sys/types.h... yes checking for sys/types.h... yes checking for unistd.h... yes checking for unistd.h... yes checking for dlfcn.h... yes checking for dlfcn.h... yes checking for objdir... .libs yes checking for objdir... .libs checking if gcc-9 supports -fno-rtti -fno-exceptions... no checking for gcc-9 option to produce PIC... -fPIC -DPIC checking if gcc-9 PIC flag -fPIC -DPIC works... checking if gcc-9 supports -fno-rtti -fno-exceptions... yes checking if gcc-9 static flag -static works... no checking for gcc-9 option to produce PIC... -fPIC -DPIC checking if gcc-9 PIC flag -fPIC -DPIC works... yes checking if gcc-9 static flag -static works... yes checking if gcc-9 supports -c -o file.o... yes checking if gcc-9 supports -c -o file.o... yes checking if gcc-9 supports -c -o file.o... (cached) yes checking whether the gcc-9 linker (/usr/bin/ld -m elf_x86_64) supports shared libraries... yes checking whether -lc should be explicitly linked in... yes checking if gcc-9 supports -c -o file.o... (cached) yes checking whether the gcc-9 linker (/usr/bin/ld -m elf_x86_64) supports shared libraries... yes checking whether -lc should be explicitly linked in... no checking dynamic linker characteristics... no checking dynamic linker characteristics... GNU/Linux ld.so checking how to hardcode library paths into programs... immediate checking whether stripping libraries is possible... yes checking if libtool supports shared libraries... yes checking whether to build shared libraries... yes checking whether to build static libraries... no GNU/Linux ld.so checking how to hardcode library paths into programs... immediate checking whether stripping libraries is possible... yes checking if libtool supports shared libraries... yes checking whether to build shared libraries... yes checking whether to build static libraries... no checking whether the compiler supports GNU C++... yes checking whether g++-9 accepts -g... checking whether the compiler supports GNU C++... yes yes checking whether g++-9 accepts -g... checking for g++-9 option to enable C++11 features... yes checking for g++-9 option to enable C++11 features... none needed checking dependency style of g++-9... none needed checking dependency style of g++-9... gcc3 checking how to run the C++ preprocessor... gcc3 checking how to run the C++ preprocessor... g++-9 -E g++-9 -E checking for ld used by g++-9... /usr/bin/ld -m elf_x86_64 checking if the linker (/usr/bin/ld -m elf_x86_64) is GNU ld... yes checking whether the g++-9 linker (/usr/bin/ld -m elf_x86_64) supports shared libraries... yes checking for ld used by g++-9... /usr/bin/ld -m elf_x86_64 checking if the linker (/usr/bin/ld -m elf_x86_64) is GNU ld... yes checking whether the g++-9 linker (/usr/bin/ld -m elf_x86_64) supports shared libraries... yes checking for g++-9 option to produce PIC... -fPIC -DPIC checking if g++-9 PIC flag -fPIC -DPIC works... checking for g++-9 option to produce PIC... -fPIC -DPIC checking if g++-9 PIC flag -fPIC -DPIC works... yes checking if g++-9 static flag -static works... yes checking if g++-9 static flag -static works... yes checking if g++-9 supports -c -o file.o... yes checking if g++-9 supports -c -o file.o... (cached) yes checking whether the g++-9 linker (/usr/bin/ld -m elf_x86_64) supports shared libraries... yes checking dynamic linker characteristics... (cached) GNU/Linux ld.so checking how to hardcode library paths into programs... immediate yes checking if g++-9 supports -c -o file.o... checking for gcc... (cached) gcc-9 yes checking if g++-9 supports -c -o file.o... (cached) yes checking whether the g++-9 linker (/usr/bin/ld -m elf_x86_64) supports shared libraries... yes checking dynamic linker characteristics... (cached) checking whether the compiler supports GNU C... (cached) yes checking whether gcc-9 accepts -g... (cached) yes checking for gcc-9 option to enable C11 features... (cached) none needed checking whether gcc-9 understands -c and -o together... (cached) yes checking dependency style of gcc-9... (cached) gcc3 checking dependency style of gcc-9... GNU/Linux ld.so checking how to hardcode library paths into programs... immediate checking for gcc... (cached) gcc-9 gcc3 checking whether make sets $(MAKE)... (cached) yes checking for linux/rseq.h... checking whether the compiler supports GNU C... (cached) yes checking whether gcc-9 accepts -g... (cached) yes checking for gcc-9 option to enable C11 features... (cached) none needed checking whether gcc-9 understands -c and -o together... (cached) yes checking dependency style of gcc-9... (cached) gcc3 checking dependency style of gcc-9... yes checking for rseq_available in -lrseq... gcc3 checking whether make sets $(MAKE)... (cached) yes checking for linux/rseq.h... no checking for gcc-9 options needed to detect all undeclared functions... yes checking for rseq_available in -lrseq... none needed checking for linux/io_uring.h... no checking for gcc-9 options needed to detect all undeclared functions... yes checking for liburing.h... none needed checking for linux/io_uring.h... no checking whether IORING_OP_NOP is declared... yes checking for liburing.h... yes checking whether IORING_OP_READV is declared... no checking whether IORING_OP_NOP is declared... yes checking whether IORING_OP_WRITEV is declared... yes checking whether IORING_OP_READV is declared... yes checking whether IORING_OP_FSYNC is declared... yes checking whether IORING_OP_WRITEV is declared... yes checking whether IORING_OP_READ_FIXED is declared... yes checking whether IORING_OP_FSYNC is declared... yes checking whether IORING_OP_WRITE_FIXED is declared... yes checking whether IORING_OP_READ_FIXED is declared... yes checking whether IORING_OP_POLL_ADD is declared... yes checking whether IORING_OP_WRITE_FIXED is declared... yes checking whether IORING_OP_POLL_REMOVE is declared... yes checking whether IORING_OP_POLL_ADD is declared... yes checking whether IORING_OP_SYNC_FILE_RANGE is declared... yes checking whether IORING_OP_POLL_REMOVE is declared... yes checking whether IORING_OP_SENDMSG is declared... yes checking whether IORING_OP_SYNC_FILE_RANGE is declared... yes checking whether IORING_OP_RECVMSG is declared... yes checking whether IORING_OP_SENDMSG is declared... yes checking whether IORING_OP_TIMEOUT is declared... yes checking whether IORING_OP_RECVMSG is declared... yes checking whether IORING_OP_TIMEOUT_REMOVE is declared... yes checking whether IORING_OP_TIMEOUT is declared... yes checking whether IORING_OP_ACCEPT is declared... yes checking whether IORING_OP_TIMEOUT_REMOVE is declared... yes checking whether IORING_OP_ASYNC_CANCEL is declared... yes checking whether IORING_OP_ACCEPT is declared... yes checking whether IORING_OP_LINK_TIMEOUT is declared... yes checking whether IORING_OP_ASYNC_CANCEL is declared... yes checking whether IORING_OP_CONNECT is declared... yes checking whether IORING_OP_LINK_TIMEOUT is declared... yes checking whether IORING_OP_FALLOCATE is declared... yes checking whether IORING_OP_CONNECT is declared... yes checking whether IORING_OP_OPENAT is declared... yes yes checking whether IORING_OP_CLOSE is declared... checking whether IORING_OP_FALLOCATE is declared... yes checking whether IORING_OP_FILES_UPDATE is declared... yes checking whether IORING_OP_OPENAT is declared... yes checking whether IORING_OP_STATX is declared... yes checking whether IORING_OP_CLOSE is declared... yes checking whether IORING_OP_READ is declared... yes checking whether IORING_OP_FILES_UPDATE is declared... yes checking whether IORING_OP_WRITE is declared... yes checking whether IORING_OP_STATX is declared... yes checking whether IORING_OP_FADVISE is declared... yes checking whether IORING_OP_READ is declared... yes checking whether IORING_OP_MADVISE is declared... yes checking whether IORING_OP_WRITE is declared... yes checking whether IORING_OP_SEND is declared... yes checking whether IORING_OP_FADVISE is declared... yes checking whether IORING_OP_RECV is declared... yes checking whether IORING_OP_MADVISE is declared... yes checking whether IORING_OP_OPENAT2 is declared... yes checking whether IORING_OP_SEND is declared... yes checking whether IORING_OP_EPOLL_CTL is declared... yes checking whether IORING_OP_RECV is declared... yes checking whether IORING_OP_SPLICE is declared... yes checking whether IORING_OP_OPENAT2 is declared... yes checking whether IORING_OP_PROVIDE_BUFFERS is declared... yes checking whether IORING_OP_EPOLL_CTL is declared... yes checking whether IORING_OP_REMOVE_BUFFER is declared... yes checking whether IORING_OP_SPLICE is declared... no checking whether IORING_OP_TEE is declared... yes checking whether IORING_OP_PROVIDE_BUFFERS is declared... yes checking whether IOSQE_FIXED_FILE is declared... yes checking whether IORING_OP_REMOVE_BUFFER is declared... yes checking whether IOSQE_IO_DRAIN is declared... no checking whether IORING_OP_TEE is declared... yes checking whether IOSQE_IO_LINK is declared... yes checking whether IOSQE_FIXED_FILE is declared... yes checking whether IOSQE_IO_HARDLINK is declared... yes checking whether IOSQE_IO_DRAIN is declared... yes checking whether IOSQE_ASYNC is declared... yes checking whether IOSQE_IO_LINK is declared... yes checking whether IOSQE_BUFFER_SELECT is declared... yes checking whether IOSQE_IO_HARDLINK is declared... yes checking whether SPLICE_F_FD_IN_FIXED is declared... yes checking whether IOSQE_ASYNC is declared... yes checking whether IORING_SETUP_ATTACH_WQ is declared... yes checking whether IOSQE_BUFFER_SELECT is declared... yes checking whether IORING_REGISTER_IOWQ_MAX_WORKERS is declared... yes checking whether SPLICE_F_FD_IN_FIXED is declared... yes checking for preadv2... yes checking whether IORING_SETUP_ATTACH_WQ is declared... yes yes checking for pwritev2... checking whether IORING_REGISTER_IOWQ_MAX_WORKERS is declared... yes checking for preadv2... yes checking that generated files are newer than configure... done configure: creating ./config.status yes checking for pwritev2... yes checking that generated files are newer than configure... done configure: creating ./config.status config.status: creating Makefile config.status: creating src/Makefile config.status: creating prelude/Makefile config.status: creating src/concurrency/io/call.cfa config.status: creating Makefile /var/lib/jenkins/workspace/Cforall_master/libcfa/src/concurrency/io/call.cfa.in:144: SyntaxWarning: invalid escape sequence '\(' sig = re.search("(.*) (.*)\((.*)\)", signature) config.status: creating prelude/defines.hfa config.status: creating src/Makefile config.status: executing depfiles commands config.status: creating prelude/Makefile config.status: creating src/concurrency/io/call.cfa config.status: executing libtool commands /var/lib/jenkins/workspace/Cforall_master/libcfa/src/concurrency/io/call.cfa.in:144: SyntaxWarning: invalid escape sequence '\(' sig = re.search("(.*) (.*)\((.*)\)", signature) Cforall library configuraton completed. Type "make -j 8 install". config.status: creating prelude/defines.hfa config.status: executing depfiles commands config.status: executing libtool commands Cforall library configuraton completed. Type "make -j 8 install". [Pipeline] } [Pipeline] // dir [Pipeline] } [Pipeline] // stage [Pipeline] echo -------- Build : cfa-cpp -------- [Pipeline] stage [Pipeline] { (Build : cfa-cpp) [Pipeline] dir Running in /var/lib/jenkins/workspace/Cforall_master@tmp [Pipeline] { [Pipeline] sh + nproc + make -j 16 --no-print-directory -C driver CXX as.o CXX cc1.o CXX cfa.o CXXLD as CXXLD cc1 CXXLD cfa [Pipeline] sh + nproc + make -j 16 --no-print-directory -C src YACC Parser/parser.cc updating Parser/parser.output updating Parser/parser.hh make all-am CXX CompilationState.o CXX main.o CXX MakeLibCfa.o LEX Parser/lex.cc CXX AST/Attribute.o CXX AST/Copy.o CXX AST/Create.o CXX AST/Decl.o CXX AST/DeclReplacer.o CXX AST/Expr.o CXX AST/GenericSubstitution.o CXX AST/Init.o CXX AST/Inspect.o CXX AST/LinkageSpec.o CXX AST/Node.o CXX AST/Pass.o CXX AST/Print.o CXX AST/Stmt.o CXX AST/SymbolTable.o CXX AST/Type.o CXX AST/TypeEnvironment.o CXX AST/TypeSubstitution.o CXX AST/Util.o CXX CodeGen/CodeGenerator.o CXX CodeGen/GenType.o CXX CodeGen/OperatorTable.o CXX CodeGen/FixMain.o CXX CodeGen/FixNames.o CXX CodeGen/Generate.o CXX CodeGen/LinkOnce.o CXX Concurrency/Actors.o CXX Concurrency/Corun.o CXX Concurrency/Keywords.o CXX Concurrency/Waitfor.o CXX Concurrency/Waituntil.o CXX Common/Assert.o CXX Common/CodeLocationTools.o CXX Common/DeclStats.o CXX Common/Eval.o CXX Common/Examine.o CXX Common/Indenter.o CXX Common/ResolvProtoDump.o CXX Common/SemanticError.o CXX Common/Stats/Counter.o CXX Common/Stats/Heap.o CXX Common/Stats/ResolveTime.o CXX Common/Stats/Stats.o CXX Common/Stats/Time.o CXX Common/Symbol.o CXX Common/UniqueName.o CXX Common/DebugMalloc.o CXX ControlStruct/ExceptDecl.o CXX ControlStruct/ExceptTranslate.o CXX ControlStruct/FixLabels.o CXX ControlStruct/HoistControlDecls.o CXX ControlStruct/LabelGenerator.o CXX ControlStruct/MultiLevelExit.o CXX ControlStruct/TranslateEnumRange.o CXX GenPoly/GenPoly.o CXX GenPoly/Lvalue2.o CXX GenPoly/Box.o CXX GenPoly/FindFunction.o CXX GenPoly/InstantiateGeneric.o CXX GenPoly/Lvalue.o CXX GenPoly/ScrubTypeVars.o CXX GenPoly/Specialize.o CXX InitTweak/GenInit.o CXX InitTweak/InitTweak.o CXX InitTweak/FixGlobalInit.o CXX InitTweak/FixInit.o CXX Parser/DeclarationNode.o CXX Parser/ExpressionNode.o CXX Parser/InitializerNode.o CXX Parser/lex.o CXX Parser/ParseNode.o CXX Parser/parser.o CXX Parser/RunParser.o In file included from /usr/include/x86_64-linux-gnu/c++/9/bits/os_defines.h:39, from /usr/include/x86_64-linux-gnu/c++/9/bits/c++config.h:528, from /usr/include/c++/9/cstdio:41, from /var/lib/jenkins/workspace/Cforall_master/src/Parser/parser.yy:41: /usr/include/features.h:415:4: warning: #warning _FORTIFY_SOURCE requires GCC 4.1 or later [-Wcpp] 415 | # warning _FORTIFY_SOURCE requires GCC 4.1 or later | ^~~~~~~ CXX Parser/StatementNode.o CXX Parser/TypeData.o CXX Parser/TypedefTable.o CXX ResolvExpr/AdjustExprType.o CXX ResolvExpr/Candidate.o CXX ResolvExpr/CandidateFinder.o CXX ResolvExpr/CastCost.o CXX ResolvExpr/CommonType.o CXX ResolvExpr/ConversionCost.o CXX ResolvExpr/CurrentObject.o CXX ResolvExpr/ExplodedArg.o CXX ResolvExpr/FindOpenVars.o CXX ResolvExpr/PolyCost.o CXX ResolvExpr/PtrsAssignable.o CXX ResolvExpr/PtrsCastable.o CXX ResolvExpr/RenameVars.o CXX ResolvExpr/Resolver.o CXX ResolvExpr/ResolveTypeof.o CXX ResolvExpr/SatisfyAssertions.o CXX ResolvExpr/SpecCost.o CXX ResolvExpr/Unify.o CXX ResolvExpr/CandidatePrinter.o CXX ResolvExpr/EraseWith.o CXX SymTab/FixFunction.o CXX SymTab/GenImplicitCall.o CXX SymTab/Mangler.o CXX SymTab/ManglerCommon.o CXX Tuples/Explode.o CXX Tuples/TupleAssignment.o CXX Tuples/TupleExpansion.o CXX Tuples/Tuples.o CXX Validate/Autogen.o CXX Validate/CheckAssertions.o CXX Validate/CompoundLiteral.o CXX Validate/EliminateTypedef.o CXX Validate/EnumAndPointerDecay.o CXX Validate/FindSpecialDecls.o CXX Validate/FixQualifiedTypes.o CXX Validate/FixReturnTypes.o CXX Validate/ForallPointerDecay.o CXX Validate/GenericParameter.o CXX Validate/HoistStruct.o CXX Validate/HoistTypeDecls.o CXX Validate/ImplementEnumFunc.o CXX Validate/InitializerLength.o CXX Validate/LabelAddressFixer.o CXX Validate/LinkInstanceTypes.o CXX Validate/ReplaceTypedef.o CXX Validate/ReturnCheck.o CXX Validate/VerifyCtorDtorAssign.o CXX Virtual/ExpandCasts.o CXX Virtual/Tables.o CXX Virtual/VirtualDtor.o CXXLD ../driver/cfa-cpp [Pipeline] } [Pipeline] // dir [Pipeline] } [Pipeline] // stage [Pipeline] echo -------- Build : libcfa(debug) -------- [Pipeline] stage [Pipeline] { (Build : libcfa(debug)) [Pipeline] dir Running in /var/lib/jenkins/workspace/Cforall_master@tmp [Pipeline] { [Pipeline] sh + nproc + make -j 16 --no-print-directory -C libcfa/x64-debug Making all in prelude mkdir .deps touch .deps/builtins.Po (CDPATH="${ZSH_VERSION+.}:" && cd /var/lib/jenkins/workspace/Cforall_master/libcfa && /bin/bash '/var/lib/jenkins/workspace/Cforall_master/libcfa/automake/missing' autoheader) rm -f stamp-h1 touch /var/lib/jenkins/workspace/Cforall_master/libcfa/prelude/defines.hfa.in cd .. && /bin/bash ./config.status prelude/defines.hfa config.status: creating prelude/defines.hfa config.status: prelude/defines.hfa is unchanged make all-am GEN gcc-builtins.c GEN builtins.cfa GEN prelude.cfa GEN extras.cfa GEN extras.cfa GEN gcc-builtins.cfa GEN bootloader.c Making all in src CFA fstream.lo CFA common.lo CFA iostream.lo CFA heap.lo CFA limits.lo CFA iterator.lo CFA math.lo CFA memory.lo CFA parseargs.lo CFA parseconfig.lo CFA rational.lo CFA stdlib.lo CFA strstream.lo CFA time.lo CFA assert.lo CFA bits/debug.lo CC exception.lo CFA interpose.lo CFA prelude-inline.lo CFA startup.lo CC virtual.lo GEN prelude.lo CFA concurrency/locks.lo CFA concurrency/monitor.lo CFA concurrency/mutex.lo CFA concurrency/select.lo CFA concurrency/thread.lo CFA concurrency/cofor.lo CFA interpose_thread.lo CPPAS concurrency/CtxSwitch-x64.lo CC concurrency/invoke.lo CFA concurrency/io.lo CFA concurrency/kernel/startup.lo CFA concurrency/preemption.lo CFA concurrency/ready_queue.lo CFA concurrency/stats.lo CFA concurrency/pthread.lo CFA bits/weakso_locks.lo CFA algorithms/range_iterator.lo CFA collections/maybe.lo CFA collections/pair.lo CFA collections/result.lo CFA collections/string.lo CFA collections/string_res.lo CFA collections/vector.lo CFA device/cpu.lo CFA concurrency/alarm.lo CFA concurrency/coroutine.lo CFA concurrency/exception.lo CFA concurrency/kernel.lo CFA concurrency/kernel/cluster.lo CFA concurrency/clib/cfathread.lo CFA concurrency/io/setup.lo CFA concurrency/io/call.lo /usr/include/linux/io_uring.h:83:36: warning: 'packed' attribute ignored for field of type 'union __io_uring_sqe____anonymous131' [-Wattributes] 83 | } __attribute__((packed)); | ^ /usr/include/linux/io_uring.h:83:36: warning: 'packed' attribute ignored for field of type 'union __io_uring_sqe____anonymous55' [-Wattributes] 83 | } __attribute__((packed)); | ^ CCLD libcfa.la /usr/bin/ld: warning: .libs/common.o: requires executable stack (because the .note.GNU-stack section is executable) /usr/bin/ld: .libs/exception.o: warning: relocation against `__gcfa_personality_v0' in read-only section `.rodata' /usr/bin/ld: warning: creating DT_TEXTREL in a shared object /usr/include/linux/io_uring.h:83:36: warning: 'packed' attribute ignored for field of type 'union __io_uring_sqe____anonymous65' [-Wattributes] 83 | } __attribute__((packed)); | ^ /usr/include/linux/io_uring.h:83:36: warning: 'packed' attribute ignored for field of type 'union __io_uring_sqe____anonymous121' [-Wattributes] 83 | } __attribute__((packed)); | ^ /usr/include/linux/io_uring.h:83:36: warning: 'packed' attribute ignored for field of type 'union __io_uring_sqe____anonymous121' [-Wattributes] 83 | } __attribute__((packed)); | ^ /usr/include/linux/io_uring.h:83:36: warning: 'packed' attribute ignored for field of type 'union __io_uring_sqe____anonymous32' [-Wattributes] 83 | } __attribute__((packed)); | ^ /usr/include/linux/io_uring.h:83:36: warning: 'packed' attribute ignored for field of type 'union __io_uring_sqe____anonymous97' [-Wattributes] 83 | } __attribute__((packed)); | ^ CCLD libcfathread.la /usr/bin/ld: warning: concurrency/.libs/alarm.o: requires executable stack (because the .note.GNU-stack section is executable) make[1]: Nothing to be done for 'all-am'. [Pipeline] } [Pipeline] // dir [Pipeline] } [Pipeline] // stage [Pipeline] echo -------- Build : libcfa(nodebug) -------- [Pipeline] stage [Pipeline] { (Build : libcfa(nodebug)) [Pipeline] dir Running in /var/lib/jenkins/workspace/Cforall_master@tmp [Pipeline] { [Pipeline] sh + nproc + make -j 16 --no-print-directory -C libcfa/x64-nodebug Making all in prelude mkdir .deps touch .deps/builtins.Po cd .. && /bin/bash ./config.status prelude/defines.hfa config.status: creating prelude/defines.hfa config.status: prelude/defines.hfa is unchanged make all-am GEN gcc-builtins.c GEN builtins.cfa GEN prelude.cfa GEN extras.cfa GEN gcc-builtins.cfa GEN extras.cfa GEN bootloader.c Making all in src CFA common.lo CFA fstream.lo CFA heap.lo CFA iostream.lo CFA iterator.lo CFA limits.lo CFA math.lo CFA memory.lo CFA parseargs.lo CFA parseconfig.lo CFA rational.lo CFA stdlib.lo CFA strstream.lo CFA time.lo CFA assert.lo CFA bits/debug.lo CC exception.lo /var/lib/jenkins/workspace/Cforall_master/libcfa/src/exception.c: In function '__cfaehm_allocate_exception': /var/lib/jenkins/workspace/Cforall_master/libcfa/src/exception.c:142:3: warning: ignoring return value of 'write', declared with attribute warn_unused_result [-Wunused-result] 142 | write( 2, "abort2\n", 7 ); | ^~~~~~~~~~~~~~~~~~~~~~~~~ /var/lib/jenkins/workspace/Cforall_master/libcfa/src/exception.c: In function '__cfaehm_exception_cleanup': /var/lib/jenkins/workspace/Cforall_master/libcfa/src/exception.c:127:3: warning: ignoring return value of 'write', declared with attribute warn_unused_result [-Wunused-result] 127 | write( 2, "abort1\n", 7 ); | ^~~~~~~~~~~~~~~~~~~~~~~~~ /var/lib/jenkins/workspace/Cforall_master/libcfa/src/exception.c: In function '__cfaehm_cancel_stack': /var/lib/jenkins/workspace/Cforall_master/libcfa/src/exception.c:230:2: warning: ignoring return value of 'write', declared with attribute warn_unused_result [-Wunused-result] 230 | write( 2, "abort3\n", 7 ); | ^~~~~~~~~~~~~~~~~~~~~~~~~ /var/lib/jenkins/workspace/Cforall_master/libcfa/src/exception.c: In function '__cfaehm_begin_unwind': /var/lib/jenkins/workspace/Cforall_master/libcfa/src/exception.c:252:3: warning: ignoring return value of 'write', declared with attribute warn_unused_result [-Wunused-result] 252 | write( 2, "abort4\n", 7 ); | ^~~~~~~~~~~~~~~~~~~~~~~~~ /var/lib/jenkins/workspace/Cforall_master/libcfa/src/exception.c:278:3: warning: ignoring return value of 'write', declared with attribute warn_unused_result [-Wunused-result] 278 | write( 2, "abort5\n", 7 ); | ^~~~~~~~~~~~~~~~~~~~~~~~~ /var/lib/jenkins/workspace/Cforall_master/libcfa/src/exception.c: In function '__cfaehm_rethrow_terminate': /var/lib/jenkins/workspace/Cforall_master/libcfa/src/exception.c:308:2: warning: ignoring return value of 'write', declared with attribute warn_unused_result [-Wunused-result] 308 | write( 2, "abort7\n", 7 ); | ^~~~~~~~~~~~~~~~~~~~~~~~~ /var/lib/jenkins/workspace/Cforall_master/libcfa/src/exception.c: In function '__cfaehm_rethrow_adapter': /var/lib/jenkins/workspace/Cforall_master/libcfa/src/exception.c:300:2: warning: ignoring return value of 'write', declared with attribute warn_unused_result [-Wunused-result] 300 | write( 2, "abort6\n", 7 ); | ^~~~~~~~~~~~~~~~~~~~~~~~~ CFA interpose.lo CFA prelude-inline.lo CFA startup.lo CC virtual.lo GEN prelude.lo CFA concurrency/locks.lo CFA concurrency/monitor.lo CFA concurrency/mutex.lo CFA concurrency/select.lo CFA concurrency/thread.lo CFA concurrency/cofor.lo CFA interpose_thread.lo CPPAS concurrency/CtxSwitch-x64.lo CC concurrency/invoke.lo CFA concurrency/io.lo CFA concurrency/kernel/startup.lo CFA concurrency/preemption.lo CFA concurrency/ready_queue.lo CFA concurrency/stats.lo CFA concurrency/pthread.lo CFA bits/weakso_locks.lo CFA algorithms/range_iterator.lo CFA collections/maybe.lo CFA collections/pair.lo CFA collections/result.lo CFA collections/string.lo CFA collections/string_res.lo CFA collections/vector.lo CFA device/cpu.lo CFA concurrency/alarm.lo CFA concurrency/coroutine.lo CFA concurrency/exception.lo CFA concurrency/kernel.lo CFA concurrency/kernel/cluster.lo CFA concurrency/clib/cfathread.lo CFA concurrency/io/setup.lo CFA concurrency/io/call.lo /usr/include/linux/io_uring.h:83:36: warning: 'packed' attribute ignored for field of type 'union __io_uring_sqe____anonymous55' [-Wattributes] 83 | } __attribute__((packed)); | ^ /usr/include/linux/io_uring.h:83:36: warning: 'packed' attribute ignored for field of type 'union __io_uring_sqe____anonymous131' [-Wattributes] 83 | } __attribute__((packed)); | ^ /usr/include/x86_64-linux-gnu/bits/socket2.h:70:95: warning: '_X12_constructorFv_U26__anonymous___SOCKADDR_ARGU26__anonymous___SOCKADDR_ARG_autogen___1' is static but used in inline function 'recvfrom' which is not static 70 | return __recvfrom_chk (__fd, __buf, __n, sz, __flags, __addr, __addr_len); | ^ /usr/include/x86_64-linux-gnu/bits/socket2.h:70:125: warning: '_X11_destructorFv_U26__anonymous___SOCKADDR_ARG_autogen___1' is static but used in inline function 'recvfrom' which is not static 70 | return __recvfrom_chk (__fd, __buf, __n, sz, __flags, __addr, __addr_len); | ^ /usr/include/x86_64-linux-gnu/bits/socket2.h:68:104: warning: '_X12_constructorFv_U26__anonymous___SOCKADDR_ARGU26__anonymous___SOCKADDR_ARG_autogen___1' is static but used in inline function 'recvfrom' which is not static 68 | return __recvfrom_chk_warn (__fd, __buf, __n, sz, __flags, __addr, | ^ /usr/include/x86_64-linux-gnu/bits/socket2.h:68:129: warning: '_X11_destructorFv_U26__anonymous___SOCKADDR_ARG_autogen___1' is static but used in inline function 'recvfrom' which is not static 68 | return __recvfrom_chk_warn (__fd, __buf, __n, sz, __flags, __addr, | ^ /usr/include/x86_64-linux-gnu/bits/socket2.h:66:97: warning: '_X12_constructorFv_U26__anonymous___SOCKADDR_ARGU26__anonymous___SOCKADDR_ARG_autogen___1' is static but used in inline function 'recvfrom' which is not static 66 | return __recvfrom_alias (__fd, __buf, __n, __flags, __addr, __addr_len); | ^ /usr/include/x86_64-linux-gnu/bits/socket2.h:66:129: warning: '_X11_destructorFv_U26__anonymous___SOCKADDR_ARG_autogen___1' is static but used in inline function 'recvfrom' which is not static 66 | return __recvfrom_alias (__fd, __buf, __n, __flags, __addr, __addr_len); | ^ /usr/include/x86_64-linux-gnu/bits/socket2.h:70:95: warning: '_X12_constructorFv_U26__anonymous___SOCKADDR_ARGU26__anonymous___SOCKADDR_ARG_autogen___1' is static but used in inline function 'recvfrom' which is not static 70 | return __recvfrom_chk (__fd, __buf, __n, sz, __flags, __addr, __addr_len); | ^ /usr/include/x86_64-linux-gnu/bits/socket2.h:70:125: warning: '_X11_destructorFv_U26__anonymous___SOCKADDR_ARG_autogen___1' is static but used in inline function 'recvfrom' which is not static 70 | return __recvfrom_chk (__fd, __buf, __n, sz, __flags, __addr, __addr_len); | ^ /usr/include/x86_64-linux-gnu/bits/socket2.h:68:104: warning: '_X12_constructorFv_U26__anonymous___SOCKADDR_ARGU26__anonymous___SOCKADDR_ARG_autogen___1' is static but used in inline function 'recvfrom' which is not static 68 | return __recvfrom_chk_warn (__fd, __buf, __n, sz, __flags, __addr, | ^ /usr/include/x86_64-linux-gnu/bits/socket2.h:68:129: warning: '_X11_destructorFv_U26__anonymous___SOCKADDR_ARG_autogen___1' is static but used in inline function 'recvfrom' which is not static 68 | return __recvfrom_chk_warn (__fd, __buf, __n, sz, __flags, __addr, | ^ /usr/include/x86_64-linux-gnu/bits/socket2.h:66:97: warning: '_X12_constructorFv_U26__anonymous___SOCKADDR_ARGU26__anonymous___SOCKADDR_ARG_autogen___1' is static but used in inline function 'recvfrom' which is not static 66 | return __recvfrom_alias (__fd, __buf, __n, __flags, __addr, __addr_len); | ^ /usr/include/x86_64-linux-gnu/bits/socket2.h:66:129: warning: '_X11_destructorFv_U26__anonymous___SOCKADDR_ARG_autogen___1' is static but used in inline function 'recvfrom' which is not static 66 | return __recvfrom_alias (__fd, __buf, __n, __flags, __addr, __addr_len); | ^ CCLD libcfa.la /usr/bin/ld: warning: .libs/common.o: requires executable stack (because the .note.GNU-stack section is executable) /usr/bin/ld: .libs/exception.o: warning: relocation against `__gcfa_personality_v0' in read-only section `.rodata' /usr/bin/ld: warning: creating DT_TEXTREL in a shared object /usr/include/linux/io_uring.h:83:36: warning: 'packed' attribute ignored for field of type 'union __io_uring_sqe____anonymous65' [-Wattributes] 83 | } __attribute__((packed)); | ^ /usr/include/x86_64-linux-gnu/bits/socket2.h:70:94: warning: '_X12_constructorFv_U26__anonymous___SOCKADDR_ARGU26__anonymous___SOCKADDR_ARG_autogen___1' is static but used in inline function 'recvfrom' which is not static 70 | return __recvfrom_chk (__fd, __buf, __n, sz, __flags, __addr, __addr_len); | ^ /usr/include/x86_64-linux-gnu/bits/socket2.h:70:124: warning: '_X11_destructorFv_U26__anonymous___SOCKADDR_ARG_autogen___1' is static but used in inline function 'recvfrom' which is not static 70 | return __recvfrom_chk (__fd, __buf, __n, sz, __flags, __addr, __addr_len); | ^ /usr/include/x86_64-linux-gnu/bits/socket2.h:68:103: warning: '_X12_constructorFv_U26__anonymous___SOCKADDR_ARGU26__anonymous___SOCKADDR_ARG_autogen___1' is static but used in inline function 'recvfrom' which is not static 68 | return __recvfrom_chk_warn (__fd, __buf, __n, sz, __flags, __addr, | ^ /usr/include/x86_64-linux-gnu/bits/socket2.h:68:128: warning: '_X11_destructorFv_U26__anonymous___SOCKADDR_ARG_autogen___1' is static but used in inline function 'recvfrom' which is not static 68 | return __recvfrom_chk_warn (__fd, __buf, __n, sz, __flags, __addr, | ^ /usr/include/x86_64-linux-gnu/bits/socket2.h:66:96: warning: '_X12_constructorFv_U26__anonymous___SOCKADDR_ARGU26__anonymous___SOCKADDR_ARG_autogen___1' is static but used in inline function 'recvfrom' which is not static 66 | return __recvfrom_alias (__fd, __buf, __n, __flags, __addr, __addr_len); | ^ /usr/include/x86_64-linux-gnu/bits/socket2.h:66:128: warning: '_X11_destructorFv_U26__anonymous___SOCKADDR_ARG_autogen___1' is static but used in inline function 'recvfrom' which is not static 66 | return __recvfrom_alias (__fd, __buf, __n, __flags, __addr, __addr_len); | ^ /usr/include/linux/io_uring.h:83:36: warning: 'packed' attribute ignored for field of type 'union __io_uring_sqe____anonymous121' [-Wattributes] 83 | } __attribute__((packed)); | ^ /usr/include/linux/io_uring.h:83:36: warning: 'packed' attribute ignored for field of type 'union __io_uring_sqe____anonymous121' [-Wattributes] 83 | } __attribute__((packed)); | ^ /usr/include/x86_64-linux-gnu/bits/socket2.h:70:95: warning: '_X12_constructorFv_U26__anonymous___SOCKADDR_ARGU26__anonymous___SOCKADDR_ARG_autogen___1' is static but used in inline function 'recvfrom' which is not static 70 | return __recvfrom_chk (__fd, __buf, __n, sz, __flags, __addr, __addr_len); | ^ /usr/include/x86_64-linux-gnu/bits/socket2.h:70:125: warning: '_X11_destructorFv_U26__anonymous___SOCKADDR_ARG_autogen___1' is static but used in inline function 'recvfrom' which is not static 70 | return __recvfrom_chk (__fd, __buf, __n, sz, __flags, __addr, __addr_len); | ^ /usr/include/x86_64-linux-gnu/bits/socket2.h:68:104: warning: '_X12_constructorFv_U26__anonymous___SOCKADDR_ARGU26__anonymous___SOCKADDR_ARG_autogen___1' is static but used in inline function 'recvfrom' which is not static 68 | return __recvfrom_chk_warn (__fd, __buf, __n, sz, __flags, __addr, | ^ /usr/include/x86_64-linux-gnu/bits/socket2.h:68:129: warning: '_X11_destructorFv_U26__anonymous___SOCKADDR_ARG_autogen___1' is static but used in inline function 'recvfrom' which is not static 68 | return __recvfrom_chk_warn (__fd, __buf, __n, sz, __flags, __addr, | ^ /usr/include/x86_64-linux-gnu/bits/socket2.h:66:97: warning: '_X12_constructorFv_U26__anonymous___SOCKADDR_ARGU26__anonymous___SOCKADDR_ARG_autogen___1' is static but used in inline function 'recvfrom' which is not static 66 | return __recvfrom_alias (__fd, __buf, __n, __flags, __addr, __addr_len); | ^ /usr/include/x86_64-linux-gnu/bits/socket2.h:66:129: warning: '_X11_destructorFv_U26__anonymous___SOCKADDR_ARG_autogen___1' is static but used in inline function 'recvfrom' which is not static 66 | return __recvfrom_alias (__fd, __buf, __n, __flags, __addr, __addr_len); | ^ /usr/include/x86_64-linux-gnu/bits/socket2.h:70:95: warning: '_X12_constructorFv_U26__anonymous___SOCKADDR_ARGU26__anonymous___SOCKADDR_ARG_autogen___1' is static but used in inline function 'recvfrom' which is not static 70 | return __recvfrom_chk (__fd, __buf, __n, sz, __flags, __addr, __addr_len); | ^ /usr/include/x86_64-linux-gnu/bits/socket2.h:70:125: warning: '_X11_destructorFv_U26__anonymous___SOCKADDR_ARG_autogen___1' is static but used in inline function 'recvfrom' which is not static 70 | return __recvfrom_chk (__fd, __buf, __n, sz, __flags, __addr, __addr_len); | ^ /usr/include/x86_64-linux-gnu/bits/socket2.h:68:104: warning: '_X12_constructorFv_U26__anonymous___SOCKADDR_ARGU26__anonymous___SOCKADDR_ARG_autogen___1' is static but used in inline function 'recvfrom' which is not static 68 | return __recvfrom_chk_warn (__fd, __buf, __n, sz, __flags, __addr, | ^ /usr/include/x86_64-linux-gnu/bits/socket2.h:68:129: warning: '_X11_destructorFv_U26__anonymous___SOCKADDR_ARG_autogen___1' is static but used in inline function 'recvfrom' which is not static 68 | return __recvfrom_chk_warn (__fd, __buf, __n, sz, __flags, __addr, | ^ /usr/include/x86_64-linux-gnu/bits/socket2.h:66:97: warning: '_X12_constructorFv_U26__anonymous___SOCKADDR_ARGU26__anonymous___SOCKADDR_ARG_autogen___1' is static but used in inline function 'recvfrom' which is not static 66 | return __recvfrom_alias (__fd, __buf, __n, __flags, __addr, __addr_len); | ^ /usr/include/x86_64-linux-gnu/bits/socket2.h:66:129: warning: '_X11_destructorFv_U26__anonymous___SOCKADDR_ARG_autogen___1' is static but used in inline function 'recvfrom' which is not static 66 | return __recvfrom_alias (__fd, __buf, __n, __flags, __addr, __addr_len); | ^ /usr/include/linux/io_uring.h:83:36: warning: 'packed' attribute ignored for field of type 'union __io_uring_sqe____anonymous32' [-Wattributes] 83 | } __attribute__((packed)); | ^ /usr/include/x86_64-linux-gnu/bits/socket2.h:70:94: warning: '_X12_constructorFv_U26__anonymous___SOCKADDR_ARGU26__anonymous___SOCKADDR_ARG_autogen___1' is static but used in inline function 'recvfrom' which is not static 70 | return __recvfrom_chk (__fd, __buf, __n, sz, __flags, __addr, __addr_len); | ^ /usr/include/x86_64-linux-gnu/bits/socket2.h:70:124: warning: '_X11_destructorFv_U26__anonymous___SOCKADDR_ARG_autogen___1' is static but used in inline function 'recvfrom' which is not static 70 | return __recvfrom_chk (__fd, __buf, __n, sz, __flags, __addr, __addr_len); | ^ /usr/include/x86_64-linux-gnu/bits/socket2.h:68:103: warning: '_X12_constructorFv_U26__anonymous___SOCKADDR_ARGU26__anonymous___SOCKADDR_ARG_autogen___1' is static but used in inline function 'recvfrom' which is not static 68 | return __recvfrom_chk_warn (__fd, __buf, __n, sz, __flags, __addr, | ^ /usr/include/x86_64-linux-gnu/bits/socket2.h:68:128: warning: '_X11_destructorFv_U26__anonymous___SOCKADDR_ARG_autogen___1' is static but used in inline function 'recvfrom' which is not static 68 | return __recvfrom_chk_warn (__fd, __buf, __n, sz, __flags, __addr, | ^ /usr/include/x86_64-linux-gnu/bits/socket2.h:66:96: warning: '_X12_constructorFv_U26__anonymous___SOCKADDR_ARGU26__anonymous___SOCKADDR_ARG_autogen___1' is static but used in inline function 'recvfrom' which is not static 66 | return __recvfrom_alias (__fd, __buf, __n, __flags, __addr, __addr_len); | ^ /usr/include/x86_64-linux-gnu/bits/socket2.h:66:128: warning: '_X11_destructorFv_U26__anonymous___SOCKADDR_ARG_autogen___1' is static but used in inline function 'recvfrom' which is not static 66 | return __recvfrom_alias (__fd, __buf, __n, __flags, __addr, __addr_len); | ^ /usr/include/linux/io_uring.h:83:36: warning: 'packed' attribute ignored for field of type 'union __io_uring_sqe____anonymous97' [-Wattributes] 83 | } __attribute__((packed)); | ^ /usr/include/x86_64-linux-gnu/bits/socket2.h:70:95: warning: '_X12_constructorFv_U26__anonymous___SOCKADDR_ARGU26__anonymous___SOCKADDR_ARG_autogen___1' is static but used in inline function 'recvfrom' which is not static 70 | return __recvfrom_chk (__fd, __buf, __n, sz, __flags, __addr, __addr_len); | ^ /usr/include/x86_64-linux-gnu/bits/socket2.h:70:125: warning: '_X11_destructorFv_U26__anonymous___SOCKADDR_ARG_autogen___1' is static but used in inline function 'recvfrom' which is not static 70 | return __recvfrom_chk (__fd, __buf, __n, sz, __flags, __addr, __addr_len); | ^ /usr/include/x86_64-linux-gnu/bits/socket2.h:68:104: warning: '_X12_constructorFv_U26__anonymous___SOCKADDR_ARGU26__anonymous___SOCKADDR_ARG_autogen___1' is static but used in inline function 'recvfrom' which is not static 68 | return __recvfrom_chk_warn (__fd, __buf, __n, sz, __flags, __addr, | ^ /usr/include/x86_64-linux-gnu/bits/socket2.h:68:129: warning: '_X11_destructorFv_U26__anonymous___SOCKADDR_ARG_autogen___1' is static but used in inline function 'recvfrom' which is not static 68 | return __recvfrom_chk_warn (__fd, __buf, __n, sz, __flags, __addr, | ^ /usr/include/x86_64-linux-gnu/bits/socket2.h:66:97: warning: '_X12_constructorFv_U26__anonymous___SOCKADDR_ARGU26__anonymous___SOCKADDR_ARG_autogen___1' is static but used in inline function 'recvfrom' which is not static 66 | return __recvfrom_alias (__fd, __buf, __n, __flags, __addr, __addr_len); | ^ /usr/include/x86_64-linux-gnu/bits/socket2.h:66:129: warning: '_X11_destructorFv_U26__anonymous___SOCKADDR_ARG_autogen___1' is static but used in inline function 'recvfrom' which is not static 66 | return __recvfrom_alias (__fd, __buf, __n, __flags, __addr, __addr_len); | ^ CCLD libcfathread.la /usr/bin/ld: warning: concurrency/.libs/coroutine.o: requires executable stack (because the .note.GNU-stack section is executable) make[1]: Nothing to be done for 'all-am'. [Pipeline] } [Pipeline] // dir [Pipeline] } [Pipeline] // stage [Pipeline] echo -------- Build : install -------- [Pipeline] stage [Pipeline] { (Build : install) [Pipeline] dir Running in /var/lib/jenkins/workspace/Cforall_master@tmp [Pipeline] { [Pipeline] sh + nproc + make -j 16 --no-print-directory install Making install in driver make install-exec-hook /usr/bin/mkdir -p '/var/lib/jenkins/workspace/Cforall_master@tmp/lib/cfa/' /usr/bin/install -c cfa '/var/lib/jenkins/workspace/Cforall_master@tmp/bin//cfa' /bin/bash ../libtool --mode=install /usr/bin/install -c as cc1 '/var/lib/jenkins/workspace/Cforall_master@tmp/lib/cfa/' libtool: install: /usr/bin/install -c as /var/lib/jenkins/workspace/Cforall_master@tmp/lib/cfa/as libtool: install: /usr/bin/install -c cc1 /var/lib/jenkins/workspace/Cforall_master@tmp/lib/cfa/cc1 Making install in src make install-am make[3]: Nothing to be done for 'install-exec-am'. /usr/bin/mkdir -p '/var/lib/jenkins/workspace/Cforall_master@tmp/lib/cfa/' /bin/bash ../libtool --mode=install /usr/bin/install -c ../driver/cfa-cpp '/var/lib/jenkins/workspace/Cforall_master@tmp/lib/cfa/' libtool: install: /usr/bin/install -c ../driver/cfa-cpp /var/lib/jenkins/workspace/Cforall_master@tmp/lib/cfa/cfa-cpp Making install in . (CDPATH="${ZSH_VERSION+.}:" && cd /var/lib/jenkins/workspace/Cforall_master && /bin/bash '/var/lib/jenkins/workspace/Cforall_master/automake/missing' autoheader) rm -f stamp-h1 touch /var/lib/jenkins/workspace/Cforall_master/src/config.h.in cd . && /bin/bash ./config.status config.h config.status: creating config.h config.status: config.h is unchanged make[2]: Nothing to be done for 'install-exec-am'. /usr/bin/mkdir -p '/var/lib/jenkins/workspace/Cforall_master@tmp/share/man/man1' /usr/bin/install -c -m 644 /var/lib/jenkins/workspace/Cforall_master/doc/man/cfa.1 '/var/lib/jenkins/workspace/Cforall_master@tmp/share/man/man1' Making install in libcfa/x64-debug Making install in prelude make[3]: Nothing to be done for 'install-exec-am'. /usr/bin/mkdir -p '/var/lib/jenkins/workspace/Cforall_master@tmp/lib/cfa/x64-debug/' /usr/bin/install -c -m 644 gcc-builtins.cfa builtins.cfa extras.cfa prelude.cfa bootloader.c defines.hfa '/var/lib/jenkins/workspace/Cforall_master@tmp/lib/cfa/x64-debug/' Making install in src /usr/bin/mkdir -p '/var/lib/jenkins/workspace/Cforall_master@tmp/lib/cfa/x64-debug/' /bin/bash ../libtool --mode=install /usr/bin/install -c libcfa.la libcfathread.la '/var/lib/jenkins/workspace/Cforall_master@tmp/lib/cfa/x64-debug/' /usr/bin/mkdir -p '/var/lib/jenkins/workspace/Cforall_master@tmp/include/cfa/' /usr/bin/mkdir -p '/var/lib/jenkins/workspace/Cforall_master@tmp/include/cfa//stdhdr/sys' /usr/bin/install -c -m 644 /var/lib/jenkins/workspace/Cforall_master/libcfa/src/stdhdr/sys/time.h /var/lib/jenkins/workspace/Cforall_master/libcfa/src/stdhdr/sys/mman.h /var/lib/jenkins/workspace/Cforall_master/libcfa/src/stdhdr/sys/socket.h '/var/lib/jenkins/workspace/Cforall_master@tmp/include/cfa//stdhdr/sys' /usr/bin/mkdir -p '/var/lib/jenkins/workspace/Cforall_master@tmp/include/cfa//algorithms' /usr/bin/install -c -m 644 /var/lib/jenkins/workspace/Cforall_master/libcfa/src/algorithms/range_iterator.hfa '/var/lib/jenkins/workspace/Cforall_master@tmp/include/cfa//algorithms' /usr/bin/mkdir -p '/var/lib/jenkins/workspace/Cforall_master@tmp/include/cfa//concurrency/kernel' /usr/bin/install -c -m 644 /var/lib/jenkins/workspace/Cforall_master/libcfa/src/concurrency/kernel/cluster.hfa /var/lib/jenkins/workspace/Cforall_master/libcfa/src/concurrency/kernel/fwd.hfa '/var/lib/jenkins/workspace/Cforall_master@tmp/include/cfa//concurrency/kernel' /usr/bin/install -c -m 644 /var/lib/jenkins/workspace/Cforall_master/libcfa/src/common.hfa /var/lib/jenkins/workspace/Cforall_master/libcfa/src/fstream.hfa /var/lib/jenkins/workspace/Cforall_master/libcfa/src/heap.hfa /var/lib/jenkins/workspace/Cforall_master/libcfa/src/iostream.hfa /var/lib/jenkins/workspace/Cforall_master/libcfa/src/iterator.hfa /var/lib/jenkins/workspace/Cforall_master/libcfa/src/limits.hfa /var/lib/jenkins/workspace/Cforall_master/libcfa/src/math.hfa /var/lib/jenkins/workspace/Cforall_master/libcfa/src/memory.hfa /var/lib/jenkins/workspace/Cforall_master/libcfa/src/parseargs.hfa /var/lib/jenkins/workspace/Cforall_master/libcfa/src/parseconfig.hfa /var/lib/jenkins/workspace/Cforall_master/libcfa/src/rational.hfa /var/lib/jenkins/workspace/Cforall_master/libcfa/src/stdlib.hfa /var/lib/jenkins/workspace/Cforall_master/libcfa/src/strstream.hfa /var/lib/jenkins/workspace/Cforall_master/libcfa/src/time.hfa /var/lib/jenkins/workspace/Cforall_master/libcfa/src/Exception.hfa /var/lib/jenkins/workspace/Cforall_master/libcfa/src/bitmanip.hfa /var/lib/jenkins/workspace/Cforall_master/libcfa/src/clock.hfa /var/lib/jenkins/workspace/Cforall_master/libcfa/src/exception.hfa /var/lib/jenkins/workspace/Cforall_master/libcfa/src/exception.h /var/lib/jenkins/workspace/Cforall_master/libcfa/src/gmp.hfa /var/lib/jenkins/workspace/Cforall_master/libcfa/src/math.trait.hfa /var/lib/jenkins/workspace/Cforall_master/libcfa/src/raii.hfa /var/lib/jenkins/workspace/Cforall_master/libcfa/src/time_t.hfa /var/lib/jenkins/workspace/Cforall_master/libcfa/src/virtual_dtor.hfa '/var/lib/jenkins/workspace/Cforall_master@tmp/include/cfa//.' /usr/bin/mkdir -p '/var/lib/jenkins/workspace/Cforall_master@tmp/include/cfa//concurrency' /usr/bin/install -c -m 644 /var/lib/jenkins/workspace/Cforall_master/libcfa/src/concurrency/iofwd.hfa /var/lib/jenkins/workspace/Cforall_master/libcfa/src/concurrency/barrier.hfa /var/lib/jenkins/workspace/Cforall_master/libcfa/src/concurrency/alarm.hfa /var/lib/jenkins/workspace/Cforall_master/libcfa/src/concurrency/coroutine.hfa /var/lib/jenkins/workspace/Cforall_master/libcfa/src/concurrency/exception.hfa /var/lib/jenkins/workspace/Cforall_master/libcfa/src/concurrency/kernel.hfa /var/lib/jenkins/workspace/Cforall_master/libcfa/src/concurrency/locks.hfa /var/lib/jenkins/workspace/Cforall_master/libcfa/src/concurrency/monitor.hfa /var/lib/jenkins/workspace/Cforall_master/libcfa/src/concurrency/mutex.hfa /var/lib/jenkins/workspace/Cforall_master/libcfa/src/concurrency/select.hfa /var/lib/jenkins/workspace/Cforall_master/libcfa/src/concurrency/thread.hfa /var/lib/jenkins/workspace/Cforall_master/libcfa/src/concurrency/cofor.hfa /var/lib/jenkins/workspace/Cforall_master/libcfa/src/concurrency/invoke.h /var/lib/jenkins/workspace/Cforall_master/libcfa/src/concurrency/future.hfa /var/lib/jenkins/workspace/Cforall_master/libcfa/src/concurrency/once.hfa /var/lib/jenkins/workspace/Cforall_master/libcfa/src/concurrency/mutex_stmt.hfa /var/lib/jenkins/workspace/Cforall_master/libcfa/src/concurrency/channel.hfa /var/lib/jenkins/workspace/Cforall_master/libcfa/src/concurrency/actor.hfa '/var/lib/jenkins/workspace/Cforall_master@tmp/include/cfa//concurrency' /usr/bin/mkdir -p '/var/lib/jenkins/workspace/Cforall_master@tmp/include/cfa//concurrency/clib' /usr/bin/install -c -m 644 /var/lib/jenkins/workspace/Cforall_master/libcfa/src/concurrency/clib/cfathread.h '/var/lib/jenkins/workspace/Cforall_master@tmp/include/cfa//concurrency/clib' /usr/bin/mkdir -p '/var/lib/jenkins/workspace/Cforall_master@tmp/include/cfa//device' /usr/bin/install -c -m 644 /var/lib/jenkins/workspace/Cforall_master/libcfa/src/device/cpu.hfa '/var/lib/jenkins/workspace/Cforall_master@tmp/include/cfa//device' /usr/bin/mkdir -p '/var/lib/jenkins/workspace/Cforall_master@tmp/include/cfa//stdhdr/libltdl' /usr/bin/install -c -m 644 /var/lib/jenkins/workspace/Cforall_master/libcfa/src/stdhdr/libltdl/lt_dlloader.h '/var/lib/jenkins/workspace/Cforall_master@tmp/include/cfa//stdhdr/libltdl' /usr/bin/mkdir -p '/var/lib/jenkins/workspace/Cforall_master@tmp/include/cfa//vec' libtool: install: /usr/bin/install -c .libs/libcfa.so.1.0.0 /var/lib/jenkins/workspace/Cforall_master@tmp/lib/cfa/x64-debug/libcfa.so.1.0.0 /usr/bin/install -c -m 644 /var/lib/jenkins/workspace/Cforall_master/libcfa/src/vec/vec.hfa /var/lib/jenkins/workspace/Cforall_master/libcfa/src/vec/vec2.hfa /var/lib/jenkins/workspace/Cforall_master/libcfa/src/vec/vec3.hfa /var/lib/jenkins/workspace/Cforall_master/libcfa/src/vec/vec4.hfa '/var/lib/jenkins/workspace/Cforall_master@tmp/include/cfa//vec' /usr/bin/mkdir -p '/var/lib/jenkins/workspace/Cforall_master@tmp/include/cfa//bits' /usr/bin/install -c -m 644 /var/lib/jenkins/workspace/Cforall_master/libcfa/src/bits/weakso_locks.hfa /var/lib/jenkins/workspace/Cforall_master/libcfa/src/bits/algorithm.hfa /var/lib/jenkins/workspace/Cforall_master/libcfa/src/bits/align.hfa /var/lib/jenkins/workspace/Cforall_master/libcfa/src/bits/collections.hfa /var/lib/jenkins/workspace/Cforall_master/libcfa/src/bits/debug.hfa /var/lib/jenkins/workspace/Cforall_master/libcfa/src/bits/defs.hfa /var/lib/jenkins/workspace/Cforall_master/libcfa/src/bits/locks.hfa /var/lib/jenkins/workspace/Cforall_master/libcfa/src/bits/collection.hfa /var/lib/jenkins/workspace/Cforall_master/libcfa/src/bits/stack.hfa /var/lib/jenkins/workspace/Cforall_master/libcfa/src/bits/queue.hfa /var/lib/jenkins/workspace/Cforall_master/libcfa/src/bits/sequence.hfa /var/lib/jenkins/workspace/Cforall_master/libcfa/src/bits/atomic.hfa /var/lib/jenkins/workspace/Cforall_master/libcfa/src/bits/random.hfa '/var/lib/jenkins/workspace/Cforall_master@tmp/include/cfa//bits' libtool: install: (cd /var/lib/jenkins/workspace/Cforall_master@tmp/lib/cfa/x64-debug && { ln -s -f libcfa.so.1.0.0 libcfa.so.1 || { rm -f libcfa.so.1 && ln -s libcfa.so.1.0.0 libcfa.so.1; }; }) libtool: install: (cd /var/lib/jenkins/workspace/Cforall_master@tmp/lib/cfa/x64-debug && { ln -s -f libcfa.so.1.0.0 libcfa.so || { rm -f libcfa.so && ln -s libcfa.so.1.0.0 libcfa.so; }; }) /usr/bin/mkdir -p '/var/lib/jenkins/workspace/Cforall_master@tmp/include/cfa//stdhdr' /usr/bin/install -c -m 644 /var/lib/jenkins/workspace/Cforall_master/libcfa/src/stdhdr/iso646.h /var/lib/jenkins/workspace/Cforall_master/libcfa/src/stdhdr/wchar.h /var/lib/jenkins/workspace/Cforall_master/libcfa/src/stdhdr/limits.h /var/lib/jenkins/workspace/Cforall_master/libcfa/src/stdhdr/tgmath.h /var/lib/jenkins/workspace/Cforall_master/libcfa/src/stdhdr/stdbool.h /var/lib/jenkins/workspace/Cforall_master/libcfa/src/stdhdr/errno.h /var/lib/jenkins/workspace/Cforall_master/libcfa/src/stdhdr/stdlib.h /var/lib/jenkins/workspace/Cforall_master/libcfa/src/stdhdr/time.h /var/lib/jenkins/workspace/Cforall_master/libcfa/src/stdhdr/malloc.h /var/lib/jenkins/workspace/Cforall_master/libcfa/src/stdhdr/signal.h /var/lib/jenkins/workspace/Cforall_master/libcfa/src/stdhdr/fenv.h /var/lib/jenkins/workspace/Cforall_master/libcfa/src/stdhdr/stdnoreturn.h /var/lib/jenkins/workspace/Cforall_master/libcfa/src/stdhdr/uchar.h /var/lib/jenkins/workspace/Cforall_master/libcfa/src/stdhdr/complex.h /var/lib/jenkins/workspace/Cforall_master/libcfa/src/stdhdr/unistd.h /var/lib/jenkins/workspace/Cforall_master/libcfa/src/stdhdr/stdalign.h /var/lib/jenkins/workspace/Cforall_master/libcfa/src/stdhdr/unwind.h /var/lib/jenkins/workspace/Cforall_master/libcfa/src/stdhdr/stddef.h /var/lib/jenkins/workspace/Cforall_master/libcfa/src/stdhdr/setjmp.h /var/lib/jenkins/workspace/Cforall_master/libcfa/src/stdhdr/stdatomic.h /var/lib/jenkins/workspace/Cforall_master/libcfa/src/stdhdr/assert.h /var/lib/jenkins/workspace/Cforall_master/libcfa/src/stdhdr/inttypes.h /var/lib/jenkins/workspace/Cforall_master/libcfa/src/stdhdr/threads.h /var/lib/jenkins/workspace/Cforall_master/libcfa/src/stdhdr/stdio.h /var/lib/jenkins/workspace/Cforall_master/libcfa/src/stdhdr/stdint.h /var/lib/jenkins/workspace/Cforall_master/libcfa/src/stdhdr/gmp.h /var/lib/jenkins/workspace/Cforall_master/libcfa/src/stdhdr/string.h /var/lib/jenkins/workspace/Cforall_master/libcfa/src/stdhdr/locale.h /var/lib/jenkins/workspace/Cforall_master/libcfa/src/stdhdr/float.h /var/lib/jenkins/workspace/Cforall_master/libcfa/src/stdhdr/math.h /var/lib/jenkins/workspace/Cforall_master/libcfa/src/stdhdr/ctype.h /var/lib/jenkins/workspace/Cforall_master/libcfa/src/stdhdr/wctype.h /var/lib/jenkins/workspace/Cforall_master/libcfa/src/stdhdr/stdarg.h /var/lib/jenkins/workspace/Cforall_master/libcfa/src/stdhdr/pthread.h '/var/lib/jenkins/workspace/Cforall_master@tmp/include/cfa//stdhdr' /usr/bin/mkdir -p '/var/lib/jenkins/workspace/Cforall_master@tmp/include/cfa//collections' libtool: install: /usr/bin/install -c .libs/libcfa.lai /var/lib/jenkins/workspace/Cforall_master@tmp/lib/cfa/x64-debug/libcfa.la /usr/bin/install -c -m 644 /var/lib/jenkins/workspace/Cforall_master/libcfa/src/collections/maybe.hfa /var/lib/jenkins/workspace/Cforall_master/libcfa/src/collections/pair.hfa /var/lib/jenkins/workspace/Cforall_master/libcfa/src/collections/result.hfa /var/lib/jenkins/workspace/Cforall_master/libcfa/src/collections/string.hfa /var/lib/jenkins/workspace/Cforall_master/libcfa/src/collections/string_res.hfa /var/lib/jenkins/workspace/Cforall_master/libcfa/src/collections/vector.hfa /var/lib/jenkins/workspace/Cforall_master/libcfa/src/collections/array.hfa /var/lib/jenkins/workspace/Cforall_master/libcfa/src/collections/list.hfa /var/lib/jenkins/workspace/Cforall_master/libcfa/src/collections/list2.hfa /var/lib/jenkins/workspace/Cforall_master/libcfa/src/collections/lockfree.hfa /var/lib/jenkins/workspace/Cforall_master/libcfa/src/collections/string_sharectx.hfa /var/lib/jenkins/workspace/Cforall_master/libcfa/src/collections/vector2.hfa '/var/lib/jenkins/workspace/Cforall_master@tmp/include/cfa//collections' libtool: install: /usr/bin/install -c .libs/libcfathread.so.1.0.0 /var/lib/jenkins/workspace/Cforall_master@tmp/lib/cfa/x64-debug/libcfathread.so.1.0.0 libtool: install: (cd /var/lib/jenkins/workspace/Cforall_master@tmp/lib/cfa/x64-debug && { ln -s -f libcfathread.so.1.0.0 libcfathread.so.1 || { rm -f libcfathread.so.1 && ln -s libcfathread.so.1.0.0 libcfathread.so.1; }; }) libtool: install: (cd /var/lib/jenkins/workspace/Cforall_master@tmp/lib/cfa/x64-debug && { ln -s -f libcfathread.so.1.0.0 libcfathread.so || { rm -f libcfathread.so && ln -s libcfathread.so.1.0.0 libcfathread.so; }; }) libtool: install: /usr/bin/install -c .libs/libcfathread.lai /var/lib/jenkins/workspace/Cforall_master@tmp/lib/cfa/x64-debug/libcfathread.la libtool: warning: remember to run 'libtool --finish /var/lib/jenkins/workspace/Cforall_master@tmp/lib/cfa/x64-debug/' make[3]: Nothing to be done for 'install-exec-am'. make[3]: Nothing to be done for 'install-data-am'. Making install in libcfa/x64-nodebug Making install in prelude touch .deps/builtins.Po make[3]: Nothing to be done for 'install-exec-am'. /usr/bin/mkdir -p '/var/lib/jenkins/workspace/Cforall_master@tmp/lib/cfa/x64-nodebug/' /usr/bin/install -c -m 644 gcc-builtins.cfa builtins.cfa extras.cfa prelude.cfa bootloader.c defines.hfa '/var/lib/jenkins/workspace/Cforall_master@tmp/lib/cfa/x64-nodebug/' Making install in src /usr/bin/mkdir -p '/var/lib/jenkins/workspace/Cforall_master@tmp/lib/cfa/x64-nodebug/' /bin/bash ../libtool --mode=install /usr/bin/install -c libcfa.la libcfathread.la '/var/lib/jenkins/workspace/Cforall_master@tmp/lib/cfa/x64-nodebug/' /usr/bin/mkdir -p '/var/lib/jenkins/workspace/Cforall_master@tmp/include/cfa/' /usr/bin/mkdir -p '/var/lib/jenkins/workspace/Cforall_master@tmp/include/cfa//stdhdr/sys' /usr/bin/install -c -m 644 /var/lib/jenkins/workspace/Cforall_master/libcfa/src/stdhdr/sys/time.h /var/lib/jenkins/workspace/Cforall_master/libcfa/src/stdhdr/sys/mman.h /var/lib/jenkins/workspace/Cforall_master/libcfa/src/stdhdr/sys/socket.h '/var/lib/jenkins/workspace/Cforall_master@tmp/include/cfa//stdhdr/sys' /usr/bin/mkdir -p '/var/lib/jenkins/workspace/Cforall_master@tmp/include/cfa//algorithms' /usr/bin/install -c -m 644 /var/lib/jenkins/workspace/Cforall_master/libcfa/src/algorithms/range_iterator.hfa '/var/lib/jenkins/workspace/Cforall_master@tmp/include/cfa//algorithms' /usr/bin/mkdir -p '/var/lib/jenkins/workspace/Cforall_master@tmp/include/cfa//concurrency/kernel' /usr/bin/install -c -m 644 /var/lib/jenkins/workspace/Cforall_master/libcfa/src/concurrency/kernel/cluster.hfa /var/lib/jenkins/workspace/Cforall_master/libcfa/src/concurrency/kernel/fwd.hfa '/var/lib/jenkins/workspace/Cforall_master@tmp/include/cfa//concurrency/kernel' /usr/bin/install -c -m 644 /var/lib/jenkins/workspace/Cforall_master/libcfa/src/common.hfa /var/lib/jenkins/workspace/Cforall_master/libcfa/src/fstream.hfa /var/lib/jenkins/workspace/Cforall_master/libcfa/src/heap.hfa /var/lib/jenkins/workspace/Cforall_master/libcfa/src/iostream.hfa /var/lib/jenkins/workspace/Cforall_master/libcfa/src/iterator.hfa /var/lib/jenkins/workspace/Cforall_master/libcfa/src/limits.hfa /var/lib/jenkins/workspace/Cforall_master/libcfa/src/math.hfa /var/lib/jenkins/workspace/Cforall_master/libcfa/src/memory.hfa /var/lib/jenkins/workspace/Cforall_master/libcfa/src/parseargs.hfa /var/lib/jenkins/workspace/Cforall_master/libcfa/src/parseconfig.hfa /var/lib/jenkins/workspace/Cforall_master/libcfa/src/rational.hfa /var/lib/jenkins/workspace/Cforall_master/libcfa/src/stdlib.hfa /var/lib/jenkins/workspace/Cforall_master/libcfa/src/strstream.hfa /var/lib/jenkins/workspace/Cforall_master/libcfa/src/time.hfa /var/lib/jenkins/workspace/Cforall_master/libcfa/src/Exception.hfa /var/lib/jenkins/workspace/Cforall_master/libcfa/src/bitmanip.hfa /var/lib/jenkins/workspace/Cforall_master/libcfa/src/clock.hfa /var/lib/jenkins/workspace/Cforall_master/libcfa/src/exception.hfa /var/lib/jenkins/workspace/Cforall_master/libcfa/src/exception.h /var/lib/jenkins/workspace/Cforall_master/libcfa/src/gmp.hfa /var/lib/jenkins/workspace/Cforall_master/libcfa/src/math.trait.hfa /var/lib/jenkins/workspace/Cforall_master/libcfa/src/raii.hfa /var/lib/jenkins/workspace/Cforall_master/libcfa/src/time_t.hfa /var/lib/jenkins/workspace/Cforall_master/libcfa/src/virtual_dtor.hfa '/var/lib/jenkins/workspace/Cforall_master@tmp/include/cfa//.' /usr/bin/mkdir -p '/var/lib/jenkins/workspace/Cforall_master@tmp/include/cfa//concurrency' /usr/bin/install -c -m 644 /var/lib/jenkins/workspace/Cforall_master/libcfa/src/concurrency/iofwd.hfa /var/lib/jenkins/workspace/Cforall_master/libcfa/src/concurrency/barrier.hfa /var/lib/jenkins/workspace/Cforall_master/libcfa/src/concurrency/alarm.hfa /var/lib/jenkins/workspace/Cforall_master/libcfa/src/concurrency/coroutine.hfa /var/lib/jenkins/workspace/Cforall_master/libcfa/src/concurrency/exception.hfa /var/lib/jenkins/workspace/Cforall_master/libcfa/src/concurrency/kernel.hfa /var/lib/jenkins/workspace/Cforall_master/libcfa/src/concurrency/locks.hfa /var/lib/jenkins/workspace/Cforall_master/libcfa/src/concurrency/monitor.hfa /var/lib/jenkins/workspace/Cforall_master/libcfa/src/concurrency/mutex.hfa /var/lib/jenkins/workspace/Cforall_master/libcfa/src/concurrency/select.hfa /var/lib/jenkins/workspace/Cforall_master/libcfa/src/concurrency/thread.hfa /var/lib/jenkins/workspace/Cforall_master/libcfa/src/concurrency/cofor.hfa /var/lib/jenkins/workspace/Cforall_master/libcfa/src/concurrency/invoke.h /var/lib/jenkins/workspace/Cforall_master/libcfa/src/concurrency/future.hfa /var/lib/jenkins/workspace/Cforall_master/libcfa/src/concurrency/once.hfa /var/lib/jenkins/workspace/Cforall_master/libcfa/src/concurrency/mutex_stmt.hfa /var/lib/jenkins/workspace/Cforall_master/libcfa/src/concurrency/channel.hfa /var/lib/jenkins/workspace/Cforall_master/libcfa/src/concurrency/actor.hfa '/var/lib/jenkins/workspace/Cforall_master@tmp/include/cfa//concurrency' /usr/bin/mkdir -p '/var/lib/jenkins/workspace/Cforall_master@tmp/include/cfa//concurrency/clib' /usr/bin/install -c -m 644 /var/lib/jenkins/workspace/Cforall_master/libcfa/src/concurrency/clib/cfathread.h '/var/lib/jenkins/workspace/Cforall_master@tmp/include/cfa//concurrency/clib' /usr/bin/mkdir -p '/var/lib/jenkins/workspace/Cforall_master@tmp/include/cfa//device' /usr/bin/install -c -m 644 /var/lib/jenkins/workspace/Cforall_master/libcfa/src/device/cpu.hfa '/var/lib/jenkins/workspace/Cforall_master@tmp/include/cfa//device' /usr/bin/mkdir -p '/var/lib/jenkins/workspace/Cforall_master@tmp/include/cfa//stdhdr/libltdl' /usr/bin/install -c -m 644 /var/lib/jenkins/workspace/Cforall_master/libcfa/src/stdhdr/libltdl/lt_dlloader.h '/var/lib/jenkins/workspace/Cforall_master@tmp/include/cfa//stdhdr/libltdl' /usr/bin/mkdir -p '/var/lib/jenkins/workspace/Cforall_master@tmp/include/cfa//vec' libtool: install: /usr/bin/install -c .libs/libcfa.so.1.0.0 /var/lib/jenkins/workspace/Cforall_master@tmp/lib/cfa/x64-nodebug/libcfa.so.1.0.0 /usr/bin/install -c -m 644 /var/lib/jenkins/workspace/Cforall_master/libcfa/src/vec/vec.hfa /var/lib/jenkins/workspace/Cforall_master/libcfa/src/vec/vec2.hfa /var/lib/jenkins/workspace/Cforall_master/libcfa/src/vec/vec3.hfa /var/lib/jenkins/workspace/Cforall_master/libcfa/src/vec/vec4.hfa '/var/lib/jenkins/workspace/Cforall_master@tmp/include/cfa//vec' /usr/bin/mkdir -p '/var/lib/jenkins/workspace/Cforall_master@tmp/include/cfa//bits' /usr/bin/install -c -m 644 /var/lib/jenkins/workspace/Cforall_master/libcfa/src/bits/weakso_locks.hfa /var/lib/jenkins/workspace/Cforall_master/libcfa/src/bits/algorithm.hfa /var/lib/jenkins/workspace/Cforall_master/libcfa/src/bits/align.hfa /var/lib/jenkins/workspace/Cforall_master/libcfa/src/bits/collections.hfa /var/lib/jenkins/workspace/Cforall_master/libcfa/src/bits/debug.hfa /var/lib/jenkins/workspace/Cforall_master/libcfa/src/bits/defs.hfa /var/lib/jenkins/workspace/Cforall_master/libcfa/src/bits/locks.hfa /var/lib/jenkins/workspace/Cforall_master/libcfa/src/bits/collection.hfa /var/lib/jenkins/workspace/Cforall_master/libcfa/src/bits/stack.hfa /var/lib/jenkins/workspace/Cforall_master/libcfa/src/bits/queue.hfa /var/lib/jenkins/workspace/Cforall_master/libcfa/src/bits/sequence.hfa /var/lib/jenkins/workspace/Cforall_master/libcfa/src/bits/atomic.hfa /var/lib/jenkins/workspace/Cforall_master/libcfa/src/bits/random.hfa '/var/lib/jenkins/workspace/Cforall_master@tmp/include/cfa//bits' libtool: install: (cd /var/lib/jenkins/workspace/Cforall_master@tmp/lib/cfa/x64-nodebug && { ln -s -f libcfa.so.1.0.0 libcfa.so.1 || { rm -f libcfa.so.1 && ln -s libcfa.so.1.0.0 libcfa.so.1; }; }) /usr/bin/mkdir -p '/var/lib/jenkins/workspace/Cforall_master@tmp/include/cfa//stdhdr' libtool: install: (cd /var/lib/jenkins/workspace/Cforall_master@tmp/lib/cfa/x64-nodebug && { ln -s -f libcfa.so.1.0.0 libcfa.so || { rm -f libcfa.so && ln -s libcfa.so.1.0.0 libcfa.so; }; }) /usr/bin/install -c -m 644 /var/lib/jenkins/workspace/Cforall_master/libcfa/src/stdhdr/iso646.h /var/lib/jenkins/workspace/Cforall_master/libcfa/src/stdhdr/wchar.h /var/lib/jenkins/workspace/Cforall_master/libcfa/src/stdhdr/limits.h /var/lib/jenkins/workspace/Cforall_master/libcfa/src/stdhdr/tgmath.h /var/lib/jenkins/workspace/Cforall_master/libcfa/src/stdhdr/stdbool.h /var/lib/jenkins/workspace/Cforall_master/libcfa/src/stdhdr/errno.h /var/lib/jenkins/workspace/Cforall_master/libcfa/src/stdhdr/stdlib.h /var/lib/jenkins/workspace/Cforall_master/libcfa/src/stdhdr/time.h /var/lib/jenkins/workspace/Cforall_master/libcfa/src/stdhdr/malloc.h /var/lib/jenkins/workspace/Cforall_master/libcfa/src/stdhdr/signal.h /var/lib/jenkins/workspace/Cforall_master/libcfa/src/stdhdr/fenv.h /var/lib/jenkins/workspace/Cforall_master/libcfa/src/stdhdr/stdnoreturn.h /var/lib/jenkins/workspace/Cforall_master/libcfa/src/stdhdr/uchar.h /var/lib/jenkins/workspace/Cforall_master/libcfa/src/stdhdr/complex.h /var/lib/jenkins/workspace/Cforall_master/libcfa/src/stdhdr/unistd.h /var/lib/jenkins/workspace/Cforall_master/libcfa/src/stdhdr/stdalign.h /var/lib/jenkins/workspace/Cforall_master/libcfa/src/stdhdr/unwind.h /var/lib/jenkins/workspace/Cforall_master/libcfa/src/stdhdr/stddef.h /var/lib/jenkins/workspace/Cforall_master/libcfa/src/stdhdr/setjmp.h /var/lib/jenkins/workspace/Cforall_master/libcfa/src/stdhdr/stdatomic.h /var/lib/jenkins/workspace/Cforall_master/libcfa/src/stdhdr/assert.h /var/lib/jenkins/workspace/Cforall_master/libcfa/src/stdhdr/inttypes.h /var/lib/jenkins/workspace/Cforall_master/libcfa/src/stdhdr/threads.h /var/lib/jenkins/workspace/Cforall_master/libcfa/src/stdhdr/stdio.h /var/lib/jenkins/workspace/Cforall_master/libcfa/src/stdhdr/stdint.h /var/lib/jenkins/workspace/Cforall_master/libcfa/src/stdhdr/gmp.h /var/lib/jenkins/workspace/Cforall_master/libcfa/src/stdhdr/string.h /var/lib/jenkins/workspace/Cforall_master/libcfa/src/stdhdr/locale.h /var/lib/jenkins/workspace/Cforall_master/libcfa/src/stdhdr/float.h /var/lib/jenkins/workspace/Cforall_master/libcfa/src/stdhdr/math.h /var/lib/jenkins/workspace/Cforall_master/libcfa/src/stdhdr/ctype.h /var/lib/jenkins/workspace/Cforall_master/libcfa/src/stdhdr/wctype.h /var/lib/jenkins/workspace/Cforall_master/libcfa/src/stdhdr/stdarg.h /var/lib/jenkins/workspace/Cforall_master/libcfa/src/stdhdr/pthread.h '/var/lib/jenkins/workspace/Cforall_master@tmp/include/cfa//stdhdr' /usr/bin/mkdir -p '/var/lib/jenkins/workspace/Cforall_master@tmp/include/cfa//collections' /usr/bin/install -c -m 644 /var/lib/jenkins/workspace/Cforall_master/libcfa/src/collections/maybe.hfa /var/lib/jenkins/workspace/Cforall_master/libcfa/src/collections/pair.hfa /var/lib/jenkins/workspace/Cforall_master/libcfa/src/collections/result.hfa /var/lib/jenkins/workspace/Cforall_master/libcfa/src/collections/string.hfa /var/lib/jenkins/workspace/Cforall_master/libcfa/src/collections/string_res.hfa /var/lib/jenkins/workspace/Cforall_master/libcfa/src/collections/vector.hfa /var/lib/jenkins/workspace/Cforall_master/libcfa/src/collections/array.hfa /var/lib/jenkins/workspace/Cforall_master/libcfa/src/collections/list.hfa /var/lib/jenkins/workspace/Cforall_master/libcfa/src/collections/list2.hfa /var/lib/jenkins/workspace/Cforall_master/libcfa/src/collections/lockfree.hfa /var/lib/jenkins/workspace/Cforall_master/libcfa/src/collections/string_sharectx.hfa /var/lib/jenkins/workspace/Cforall_master/libcfa/src/collections/vector2.hfa '/var/lib/jenkins/workspace/Cforall_master@tmp/include/cfa//collections' libtool: install: /usr/bin/install -c .libs/libcfa.lai /var/lib/jenkins/workspace/Cforall_master@tmp/lib/cfa/x64-nodebug/libcfa.la libtool: install: /usr/bin/install -c .libs/libcfathread.so.1.0.0 /var/lib/jenkins/workspace/Cforall_master@tmp/lib/cfa/x64-nodebug/libcfathread.so.1.0.0 libtool: install: (cd /var/lib/jenkins/workspace/Cforall_master@tmp/lib/cfa/x64-nodebug && { ln -s -f libcfathread.so.1.0.0 libcfathread.so.1 || { rm -f libcfathread.so.1 && ln -s libcfathread.so.1.0.0 libcfathread.so.1; }; }) libtool: install: (cd /var/lib/jenkins/workspace/Cforall_master@tmp/lib/cfa/x64-nodebug && { ln -s -f libcfathread.so.1.0.0 libcfathread.so || { rm -f libcfathread.so && ln -s libcfathread.so.1.0.0 libcfathread.so; }; }) libtool: install: /usr/bin/install -c .libs/libcfathread.lai /var/lib/jenkins/workspace/Cforall_master@tmp/lib/cfa/x64-nodebug/libcfathread.la libtool: warning: remember to run 'libtool --finish /var/lib/jenkins/workspace/Cforall_master@tmp/lib/cfa/x64-nodebug/' make[3]: Nothing to be done for 'install-exec-am'. make[3]: Nothing to be done for 'install-data-am'. [Pipeline] } [Pipeline] // dir [Pipeline] } [Pipeline] // stage [Pipeline] sh + free -h total used free shared buff/cache available Mem: 62Gi 1.9Gi 57Gi 4.9Mi 4.3Gi 60Gi Swap: 8.0Gi 0B 8.0Gi [Pipeline] sh + ulimit -a time(seconds) unlimited file(blocks) unlimited data(kbytes) unlimited stack(kbytes) 8192 coredump(blocks) 0 memory(kbytes) unlimited locked memory(kbytes) 8238440 process 257124 nofiles 1048576 vmemory(kbytes) unlimited locks unlimited rtprio 0 [Pipeline] echo -------- Test: Debug -------- [Pipeline] stage [Pipeline] { (Test: Debug) [Pipeline] dir Running in /var/lib/jenkins/workspace/Cforall_master@tmp [Pipeline] { [Pipeline] sh + nproc + make -j 16 --no-print-directory -C tests timeout=600 global-timeout=14400 tests debug=yes archive-errors=/var/lib/jenkins/workspace/Cforall_master@tmp/tests/crashes/full-debug Running 378 tests on 16 cores (x64 - debug) array-ERR2 PASSED C 0:00.065 - R n/a array-ERR3 PASSED C 0:00.069 - R n/a ...ollections/language-dim-mismatch PASSED C 0:00.241 - R n/a array-ERR1 PASSED C 0:01.114 - R n/a array PASSED C 0:01.260 - R 0:00.013 array-collections/c-dependent PASSED C 0:01.343 - R 0:00.006 array-collections/safety-summary PASSED C 0:01.015 - R n/a array-collections/array-raii-c PASSED C 0:01.593 - R 0:00.022 array-collections/dimexpr-match-c PASSED C 0:01.609 - R 0:00.027 array-collections/symtab-collision PASSED C 0:00.767 - R n/a array-collections/array-sbscr-types PASSED C 0:02.105 - R 0:00.023 array-collections/array-basic PASSED C 0:02.280 - R 0:00.024 attr-priority PASSED C 0:01.075 - R 0:00.001 array-collections/boxed PASSED C 0:02.706 - R 0:00.020 castError PASSED C 0:01.112 - R n/a castReturn PASSED C 0:01.208 - R 0:00.007 builtins/sync PASSED C 0:01.781 - R 0:00.020 array-collections/dimexpr-match-cfa PASSED C 0:03.354 - R 0:00.020 cast PASSED C 0:01.928 - R 0:00.034 alloc-ERROR PASSED C 0:06.507 - R n/a array-collections/accordion PASSED C 0:06.643 - R 0:00.018 algorithms/range_test PASSED C 0:07.066 - R 0:00.008 array-collections/array-raii-cfa PASSED C 0:07.070 - R 0:00.007 avl_test PASSED C 0:05.977 - R 0:00.006 collections/stack PASSED C 0:08.336 - R 0:00.006 alloc PASSED C 0:11.275 - R 0:00.010 collections/queue PASSED C 0:09.026 - R 0:00.007 collections/multi_list PASSED C 0:09.621 - R 0:00.007 collections/sequence PASSED C 0:09.319 - R 0:00.006 collections/string-compare PASSED C 0:08.714 - R 0:00.006 collections/string-operator-ERR09 PASSED C 0:04.911 - R n/a collections/string-gc PASSED C 0:06.628 - R 0:00.007 collections/string-ctx-manage PASSED C 0:09.549 - R 0:00.006 collections/string-istream PASSED C 0:07.052 - R 0:00.007 alloc2 PASSED C 0:14.523 - R 0:00.010 collections/string-operator-ERR11 PASSED C 0:04.863 - R n/a ...ns/vector-err-pass-perm-it-byval PASSED C 0:02.817 - R n/a collections/string-operator PASSED C 0:09.057 - R 0:00.008 collections/string-operator-ERR13 PASSED C 0:04.897 - R n/a ...ns/vector-err-retn-perm-it-byval PASSED C 0:02.508 - R n/a collections/string-operator-ERR15 PASSED C 0:04.873 - R n/a collections/string-api-coverage PASSED C 0:13.379 - R 0:00.007 collections/string-istream-manip PASSED C 0:09.600 - R 0:00.011 collections/string-operator-ERR16 PASSED C 0:04.890 - R n/a ...ions/string-api-coverage-noshare PASSED C 0:13.669 - R 0:00.013 collections/vector-demo PASSED C 0:05.197 - R 0:00.007 collections/atomic_mpsc PASSED C 0:11.154 - R 0:07.217 complex PASSED C 0:05.923 - R 0:00.050 collections/string-ostream PASSED C 0:08.449 - R 0:00.013 ...ections/string-overwrite-noshare PASSED C 0:10.532 - R 0:00.011 collections/string-overwrite PASSED C 0:11.224 - R 0:00.011 concurrency/barrier/generation PASSED C 0:12.429 - R 0:00.323 concurrency/barrier/last PASSED C 0:12.364 - R 0:00.053 concurrency/actors/inline PASSED C 0:15.975 - R 0:00.046 concurrency/actors/executor PASSED C 0:16.199 - R 0:00.038 concurrency/actors/inherit PASSED C 0:16.092 - R 0:00.091 concurrency/actors/poison PASSED C 0:15.688 - R 0:00.178 concurrency/actors/pingpong PASSED C 0:15.958 - R 0:00.168 concurrency/actors/static PASSED C 0:15.528 - R 0:00.226 concurrency/actors/matrixMultiply PASSED C 0:15.941 - R 0:00.816 concurrency/barrier/order PASSED C 0:12.491 - R 0:00.076 concurrency/actors/types PASSED C 0:16.382 - R 0:00.041 concurrency/ctor-check PASSED C 0:00.835 - R n/a concurrency/actors/dynamic PASSED C 0:15.423 - R 0:03.132 concurrency/clib PASSED C 0:02.313 - R 0:00.070 concurrency/clib_tls PASSED C 0:02.361 - R 0:00.027 concurrency/cluster PASSED C 0:07.372 - R 0:00.019 concurrency/cofor PASSED C 0:09.105 - R 0:00.116 concurrency/coroutineYield PASSED C 0:10.473 - R 0:00.033 concurrency/channels/churn PASSED C 0:14.091 - R 0:10.068 concurrency/examples/matrixSum PASSED C 0:10.010 - R 0:00.007 concurrency/examples/gortn PASSED C 0:10.164 - R 0:00.009 concurrency/examples/datingService PASSED C 0:10.590 - R 0:00.019 concurrency/channels/big_elems PASSED C 0:14.936 - R 0:10.725 concurrency/keywordErrors PASSED C 0:00.375 - R n/a concurrency/channels/contend PASSED C 0:14.072 - R 0:10.105 concurrency/channels/daisy_chain PASSED C 0:13.673 - R 0:10.026 concurrency/mainError PASSED C 0:00.277 - R n/a concurrency/futures/abandon PASSED C 0:07.477 - R 0:00.070 ...rrency/examples/boundedBufferEXT PASSED C 0:10.624 - R 0:05.835 ...rrency/examples/boundedBufferINT PASSED C 0:10.625 - R 0:05.691 concurrency/futures/basic PASSED C 0:07.654 - R 0:00.065 concurrency/examples/quickSort PASSED C 0:12.190 - R 0:00.011 concurrency/channels/hot_potato PASSED C 0:13.526 - R 0:10.055 concurrency/channels/ping_pong PASSED C 0:13.921 - R 0:10.051 concurrency/join PASSED C 0:10.206 - R 0:00.010 concurrency/channels/zero_size PASSED C 0:13.627 - R 0:10.048 concurrency/channels/pub_sub PASSED C 0:14.600 - R 0:10.043 concurrency/migrate PASSED C 0:10.472 - R 0:00.068 concurrency/futures/wait_any PASSED C 0:13.308 - R 0:00.035 concurrency/lockfree_stack PASSED C 0:10.076 - R 0:02.781 concurrency/mutexstmt/monitors PASSED C 0:08.571 - R 0:01.674 concurrency/park/contention PASSED C 0:08.349 - R 0:00.119 concurrency/futures/typed PASSED C 0:17.014 - R 0:00.318 concurrency/park/start_parked PASSED C 0:07.528 - R 0:00.035 concurrency/mutexstmt/tuple PASSED C 0:13.078 - R 0:00.007 ...urrency/pthread/pthread_key_test PASSED C 0:03.355 - R 0:00.008 concurrency/once PASSED C 0:13.666 - R 0:00.069 concurrency/park/force_preempt PASSED C 0:11.001 - R 0:00.369 ...rrency/pthread/pthread_attr_test PASSED C 0:10.242 - R 0:00.031 ...rrency/pthread/pthread_cond_test PASSED C 0:10.330 - R 0:00.010 ...pthread/pthread_demo_create_join PASSED C 0:10.185 - R 0:00.011 concurrency/monitor PASSED C 0:11.194 - R 0:11.606 concurrency/futures/future_except PASSED C 0:25.797 - R 0:00.039 ...rrency/pthread/pthread_once_test PASSED C 0:10.602 - R 0:00.035 concurrency/multi-monitor PASSED C 0:11.088 - R 0:12.662 concurrency/readyQ/barrier_sleeper PASSED C 0:12.032 - R 0:00.469 concurrency/readyQ/leader_spin PASSED C 0:10.319 - R 0:00.920 ...rrency/pthread/pthread_demo_lock PASSED C 0:10.119 - R 0:06.085 concurrency/signal/block PASSED C 0:11.198 - R 0:00.971 concurrency/signal/wait PASSED C 0:11.094 - R 0:00.167 concurrency/preempt PASSED C 0:11.701 - R 0:11.696 concurrency/suspend_then PASSED C 0:10.955 - R 0:00.035 concurrency/signal/disjoint PASSED C 0:12.078 - R 0:01.778 concurrency/sleep PASSED C 0:11.406 - R 0:01.174 concurrency/thread PASSED C 0:12.772 - R 0:00.009 ...ency/unified_locking/exp_backoff PASSED C 0:12.742 - R 0:00.019 .../unified_locking/fast_block_lock PASSED C 0:12.023 - R 0:00.035 .../unified_locking/block_spin_lock PASSED C 0:13.336 - R 0:01.525 ...cy/unified_locking/pthread_locks PASSED C 0:09.555 - R 0:00.068 concurrency/preempt2 PASSED C 0:11.618 - R 0:20.125 ...fied_locking/mcs_block_spin_lock PASSED C 0:12.098 - R 0:00.066 ...ncy/unified_locking/timeout_lock PASSED C 0:09.701 - R 0:01.119 concurrency/waitfor/barge PASSED C 0:10.337 - R 0:00.266 concurrency/waitfor/parse PASSED C 0:06.285 - R 0:00.021 ...nified_locking/simple_owner_lock PASSED C 0:12.076 - R 0:00.040 concurrency/waitfor/else PASSED C 0:08.707 - R 0:00.035 concurrency/waitfor/dtor PASSED C 0:10.570 - R 0:01.574 concurrency/unified_locking/mcs PASSED C 0:12.052 - R 0:07.295 ...urrency/waitfor/lexical_priority PASSED C 0:10.649 - R 0:00.012 concurrency/waitfor/statment PASSED C 0:10.449 - R 0:00.034 concurrency/waitfor/recurse PASSED C 0:11.040 - R 0:01.119 concurrency/waitfor/when PASSED C 0:11.288 - R 0:00.118 concurrency/waituntil/one_chan PASSED C 0:10.893 - R 0:01.825 concurrency/waituntil/basic_else PASSED C 0:17.344 - R 0:00.012 configs/parsebools PASSED C 0:08.296 - R 0:00.065 concurrency/waituntil/timeout PASSED C 0:06.333 - R 0:03.126 const-init PASSED C 0:00.969 - R 0:00.006 const-ref PASSED C 0:01.111 - R 0:00.012 ...ency/waituntil/channel_zero_size PASSED C 0:11.178 - R 0:07.636 concurrency/waituntil/channels PASSED C 0:10.936 - R 0:07.389 copyfile PASSED C 0:05.501 - R 0:00.007 concurrency/waituntil/channel_close PASSED C 0:13.991 - R 0:10.034 configs/parseconfig PASSED C 0:08.261 - R 0:00.020 configs/usage PASSED C 0:08.418 - R 0:00.035 coroutine/fibonacci PASSED C 0:06.886 - R 0:00.011 coroutine/fmtLines PASSED C 0:06.974 - R 0:00.035 coroutine/devicedriver PASSED C 0:07.641 - R 0:00.021 concurrency/waituntil/futures PASSED C 0:24.207 - R 0:00.010 coroutine/pingpong PASSED C 0:06.891 - R 0:00.010 counter PASSED C 0:05.506 - R 0:00.009 ctrl-flow/fallthrough PASSED C 0:05.724 - R 0:00.007 ctrl-flow/break-misc PASSED C 0:05.887 - R 0:00.016 ...ency/unified_locking/futex_mutex PASSED C 0:12.632 - R 0:37.875 ctrl-flow/labelledExit PASSED C 0:00.931 - R 0:00.007 coroutine/raii PASSED C 0:07.209 - R 0:00.011 coroutine/runningTotal PASSED C 0:07.077 - R 0:00.009 ctrl-flow/goto PASSED C 0:05.459 - R 0:00.012 ctrl-flow/loop-inc PASSED C 0:01.077 - R 0:00.013 coroutine/prodcons PASSED C 0:09.177 - R 0:00.035 enum PASSED C 0:01.120 - R 0:00.005 designations PASSED C 0:02.466 - R 0:00.010 concurrency/waituntil/all_types PASSED C 0:29.110 - R 0:07.892 ctrl-flow/ifwhileCtl PASSED C 0:05.452 - R 0:00.009 enum_tests/funcEnum PASSED C 0:02.107 - R 0:00.008 enum_tests/inc-dec PASSED C 0:01.017 - R 0:00.006 enum_tests/lvalue PASSED C 0:00.653 - R n/a ctrl-flow/loop_else PASSED C 0:05.940 - R 0:00.010 enum_tests/anonymous PASSED C 0:06.001 - R 0:00.009 ctrl-flow/loop_else-WRN1 PASSED C 0:07.112 - R 0:00.003 ctrl-flow/loopctrl PASSED C 0:07.060 - R 0:00.006 enum_tests/enumInlineValue PASSED C 0:06.477 - R 0:00.017 errors/declaration PASSED C 0:00.137 - R n/a concurrency/mutexstmt/locks PASSED C 0:10.161 - R 1:12.531 div PASSED C 0:08.308 - R 0:00.009 errors/scope-type PASSED C 0:00.282 - R n/a errors/scope PASSED C 0:00.527 - R n/a errors/signature PASSED C 0:00.097 - R n/a enum_tests/structEnum PASSED C 0:02.366 - R 0:00.006 device/cpu PASSED C 0:09.283 - R 0:00.009 eval PASSED C 0:01.070 - R 0:00.018 enum_tests/input PASSED C 0:06.358 - R 0:00.008 enum_tests/stringEnum PASSED C 0:06.649 - R 0:00.005 enum_tests/planet PASSED C 0:07.708 - R 0:00.006 enum_tests/typedIntEnum PASSED C 0:05.856 - R 0:00.020 enum_tests/voidEnum PASSED C 0:05.973 - R 0:00.007 enum_tests/position PASSED C 0:08.955 - R 0:00.012 ...urrency/unified_locking/mcs_spin PASSED C 0:12.089 - R 0:49.273 .../unified_locking/spin_queue_lock PASSED C 0:11.949 - R 0:47.305 exceptions/conditional PASSED C 0:06.027 - R 0:00.008 exceptions/data-except PASSED C 0:05.900 - R 0:00.009 concurrency/waituntil/repeat_close PASSED C 0:11.165 - R 0:30.049 exceptions/cancel/coroutine PASSED C 0:07.830 - R 0:00.017 exceptions/conditional-threads PASSED C 0:07.676 - R 0:00.011 exceptions/message PASSED C 0:02.542 - R 0:00.006 exceptions/defaults PASSED C 0:06.097 - R 0:00.007 exceptions/finally PASSED C 0:05.899 - R 0:00.007 exceptions/try-ctrl-flow PASSED C 0:00.329 - R n/a exceptions/defaults-threads PASSED C 0:07.501 - R 0:00.034 exceptions/cor_resumer PASSED C 0:10.254 - R 0:00.011 exceptions/try-leave-catch PASSED C 0:01.122 - R 0:00.005 exceptions/type-check PASSED C 0:00.443 - R n/a exceptions/cancel/thread PASSED C 0:11.584 - R 0:00.008 exceptions/interact PASSED C 0:06.092 - R 0:00.007 expression PASSED C 0:01.193 - R 0:00.005 exceptions/finally-threads PASSED C 0:07.701 - R 0:00.037 exceptions/polymorphic PASSED C 0:06.080 - R 0:00.007 exceptions/fibonacci_nonlocal PASSED C 0:09.683 - R 0:00.011 exceptions/resume PASSED C 0:06.219 - R 0:00.007 exceptions/terminate PASSED C 0:06.131 - R 0:00.007 exceptions/trash PASSED C 0:05.907 - R 0:00.020 exceptions/resume-threads PASSED C 0:07.476 - R 0:00.007 global-monomorph PASSED C 0:00.992 - R 0:00.007 identFuncDeclarator PASSED C 0:01.066 - R 0:00.007 exceptions/terminate-threads PASSED C 0:07.997 - R 0:00.011 exceptions/pingpong_nonlocal PASSED C 0:11.268 - R 0:00.011 identParamDeclarator PASSED C 0:01.118 - R 0:00.006 exceptions/virtual-poly PASSED C 0:06.351 - R 0:00.012 fstream_test PASSED C 0:05.843 - R 0:00.020 forall PASSED C 0:06.787 - R 0:00.020 generator/fibonacci PASSED C 0:05.735 - R 0:00.007 generator/fmtLines PASSED C 0:05.790 - R 0:00.007 exceptions/virtual-cast PASSED C 0:07.849 - R 0:00.007 generator/suspend_then PASSED C 0:05.807 - R 0:00.011 init1-ERROR PASSED C 0:00.626 - R n/a init1 PASSED C 0:01.105 - R 0:00.005 include/vector-sequence PASSED C 0:01.677 - R 0:00.011 genericUnion PASSED C 0:06.325 - R 0:00.007 include/vector-collections PASSED C 0:02.609 - R 0:00.008 function-operator PASSED C 0:08.038 - R 0:00.006 hello PASSED C 0:05.766 - R 0:00.006 identity PASSED C 0:05.948 - R 0:00.005 include/vector-fstream PASSED C 0:06.042 - R 0:00.009 include/stdincludes PASSED C 0:06.210 - R 0:00.007 io/eofType PASSED C 0:05.805 - R 0:00.006 io/io PASSED C 0:09.676 - R 0:00.007 limits PASSED C 0:01.139 - R 0:00.022 io/io-acquire-in PASSED C 0:11.441 - R 0:00.070 io/io-acquire PASSED C 0:11.598 - R 0:00.218 io/io-acquire-out PASSED C 0:11.280 - R 0:00.167 io/manipulatorsOutput4 PASSED C 0:08.535 - R 0:00.036 io/away_fair PASSED C 0:13.302 - R 0:00.168 io/manipulatorsInput-uchunk PASSED C 0:08.935 - R 0:00.070 linking/nostdlib PASSED C 0:01.550 - R 0:00.038 io/comp_basic PASSED C 0:14.816 - R 0:00.118 io/io-acquire-no-io PASSED C 0:10.739 - R 0:02.879 io/io-acquire2 PASSED C 0:11.652 - R 0:00.121 linking/exception-nothreads PASSED C 0:04.400 - R 0:00.006 linkonce PASSED C 0:01.427 - R 0:00.006 io/comp_fair PASSED C 0:15.485 - R 0:00.572 maybe PASSED C 0:01.388 - R 0:00.007 concurrency/waituntil/locks PASSED C 0:12.523 - R 1:03.251 linking/exception-withthreads PASSED C 0:06.492 - R 0:00.025 io/many_read PASSED C 0:13.414 - R 0:00.067 linking/mangling/anon PASSED C 0:06.809 - R 0:00.020 nested-types-ERR1 PASSED C 0:00.234 - R n/a nested-types-ERR2 PASSED C 0:00.197 - R n/a include/includes PASSED C 0:22.925 - R 0:00.005 list/dlist-insert-remove PASSED C 0:06.140 - R 0:00.023 nested-types PASSED C 0:01.313 - R 0:00.011 linking/io-acquire PASSED C 0:08.580 - R 0:00.005 linking/weakso_nothd PASSED C 0:07.719 - R 0:00.006 linking/nothreads PASSED C 0:08.293 - R 0:00.006 list/dlist2-insert-remove PASSED C 0:07.002 - R 0:00.012 nowarn/array PASSED C 0:01.698 - R 0:00.021 nowarn/zero-thunk PASSED C 0:00.968 - R 0:00.007 nowarn/no-autogen PASSED C 0:01.158 - R 0:00.017 opt-params PASSED C 0:00.109 - R n/a nowarn/unused PASSED C 0:01.186 - R 0:00.006 nowarn/exception PASSED C 0:01.309 - R 0:00.011 numericConstants PASSED C 0:01.160 - R 0:00.006 literals PASSED C 0:06.833 - R 0:00.019 nowarn/printf-sizeof PASSED C 0:01.628 - R 0:00.009 polybits PASSED C 0:00.260 - R n/a meta/fork+exec PASSED C 0:04.661 - R 0:00.018 operators PASSED C 0:01.242 - R 0:00.014 poly-member PASSED C 0:01.046 - R 0:00.011 poly-bare-assn PASSED C 0:01.151 - R 0:00.011 poly-d-cycle PASSED C 0:01.261 - R 0:00.022 poly-o-cycle PASSED C 0:01.181 - R 0:00.006 poly-many-arsz PASSED C 0:01.273 - R 0:00.019 poly-selection PASSED C 0:01.235 - R 0:00.020 raii/ctor-autogen-ERR1 PASSED C 0:00.690 - R n/a poly-self-cycle PASSED C 0:01.525 - R 0:00.007 quasiKeyword PASSED C 0:01.274 - R 0:00.007 raii/ctor-autogen PASSED C 0:01.938 - R 0:00.007 meta/dumpable PASSED C 0:07.909 - R 0:00.019 raii/init_once PASSED C 0:01.285 - R 0:00.007 heap PASSED C 0:08.057 - R 0:21.939 malloc PASSED C 0:09.595 - R 0:00.021 raii/partial-ERR1 PASSED C 0:00.628 - R n/a linking/withthreads PASSED C 0:11.683 - R 0:00.011 raii/partial PASSED C 0:01.110 - R 0:00.006 raii/typeof-member PASSED C 0:01.009 - R 0:00.005 result PASSED C 0:01.458 - R 0:00.007 raii/dtor-early-exit-ERR1 PASSED C 0:04.596 - R n/a raii/dtor-early-exit-ERR2 PASSED C 0:04.567 - R n/a minmax PASSED C 0:09.971 - R 0:00.007 simpleGenericTriple PASSED C 0:01.247 - R 0:00.007 polymorphism PASSED C 0:06.084 - R 0:00.007 quotedKeyword PASSED C 0:05.921 - R 0:00.010 raii/memberCtors-ERR1 PASSED C 0:03.824 - R n/a raii/boxed-types PASSED C 0:05.927 - R 0:00.012 smart-pointers PASSED C 0:01.334 - R 0:00.006 switch PASSED C 0:01.169 - R 0:00.011 raii/globals PASSED C 0:06.118 - R 0:00.007 raii/memberCtors PASSED C 0:06.079 - R 0:00.006 tuple/tupleCast PASSED C 0:01.133 - R 0:00.005 raii/dtor-early-exit PASSED C 0:07.785 - R 0:00.006 tuple/tupleMember PASSED C 0:01.182 - R 0:00.013 tuple/tupleFunction PASSED C 0:01.246 - R 0:00.009 typedefRedef-ERR1 PASSED C 0:00.117 - R n/a tuple/tuplePolymorphism PASSED C 0:01.305 - R 0:00.007 references PASSED C 0:05.935 - R 0:00.005 var-assert PASSED C 0:00.142 - R n/a typedefRedef PASSED C 0:00.971 - R 0:00.006 shortCircuit PASSED C 0:05.761 - R 0:00.007 typeof PASSED C 0:01.098 - R 0:00.007 variableDeclarator PASSED C 0:01.101 - R 0:00.007 sizeof PASSED C 0:05.753 - R 0:00.007 searchsort PASSED C 0:08.003 - R 0:00.010 tuple/tupleVariadic PASSED C 0:04.046 - R 0:00.006 strstream PASSED C 0:06.353 - R 0:00.007 tuple/tupleAssign PASSED C 0:06.360 - R 0:00.006 time PASSED C 0:07.401 - R 0:00.006 tuplearray PASSED C 0:06.096 - R 0:00.024 swap PASSED C 0:08.507 - R 0:00.005 voidPtr PASSED C 0:01.071 - R 0:00.011 sum PASSED C 0:08.992 - R 0:00.007 userLiterals PASSED C 0:06.236 - R 0:00.005 withconflict PASSED C 0:00.561 - R n/a warnings/self-assignment PASSED C 0:00.905 - R 0:00.001 KRfunctions PASSED C 0:01.003 - R 0:00.001 vector PASSED C 0:07.531 - R 0:00.006 zero_one-ERR1 PASSED C 0:03.188 - R n/a vector_math/vec2_double PASSED C 0:08.761 - R 0:00.007 arithmeticConversions PASSED C 0:02.390 - R 0:00.007 ...collections/dimexpr-match-c-ERRS PASSED C 0:00.746 - R n/a vector_math/vec2_uint PASSED C 0:08.471 - R 0:00.021 ...llections/dimexpr-match-cfa-ERRS PASSED C 0:01.320 - R n/a attributes PASSED C 0:01.194 - R 0:00.001 zero_one PASSED C 0:05.908 - R 0:00.007 vector_math/vec2_float PASSED C 0:11.836 - R 0:00.009 vector_math/vec2_int PASSED C 0:12.010 - R 0:00.019 vector_math/vec3_int PASSED C 0:11.338 - R 0:00.006 declarationSpecifier PASSED C 0:01.095 - R 0:00.001 abs PASSED C 0:08.185 - R 0:00.013 ...collections/array-md-sbscr-cases PASSED C 0:06.702 - R 0:00.006 vector_math/vec3_float PASSED C 0:12.247 - R 0:00.010 errors/completeType PASSED C 0:00.565 - R n/a vector_math/vec4_float PASSED C 0:11.828 - R 0:00.008 vector_math/vec4_int PASSED C 0:11.635 - R 0:00.008 extension PASSED C 0:01.082 - R 0:00.001 functions PASSED C 0:01.077 - R 0:00.001 gccExtensions PASSED C 0:01.057 - R 0:00.001 ato PASSED C 0:08.546 - R 0:00.011 rational PASSED C 0:24.505 - R 0:00.010 bitmanip1 PASSED C 0:09.594 - R 0:00.012 bitmanip2 PASSED C 0:09.761 - R 0:00.029 meta/arch PASSED C 0:00.577 - R n/a configs/parsenums PASSED C 0:08.218 - R 0:00.170 bitmanip3 PASSED C 0:11.373 - R 0:00.039 concurrency/pthread/bounded_buffer PASSED C 0:11.018 - R 0:00.118 gmp PASSED C 0:07.745 - R 0:00.020 io/manipulatorsInput PASSED C 0:07.655 - R 0:00.035 PRNG PASSED C 0:15.789 - R 0:02.081 exceptions/cardgame PASSED C 0:09.570 - R 0:00.019 exceptions/hotpotato_checked PASSED C 0:09.755 - R 0:00.017 exceptions/hotpotato PASSED C 0:09.589 - R 0:00.009 io/manipulatorsOutput2 PASSED C 0:08.812 - R 0:00.009 concurrency/unified_locking/locks PASSED C 0:12.838 - R 2:03.786 io/manipulatorsOutput1 PASSED C 0:12.066 - R 0:00.009 random PASSED C 0:07.440 - R 0:00.005 mathX PASSED C 0:11.155 - R 0:00.017 io/manipulatorsOutput3 PASSED C 0:12.228 - R 0:00.009 vector_math/vec2_ldouble PASSED C 0:07.817 - R 0:00.010 nested_function PASSED C 0:09.888 - R 0:00.012 math PASSED C 0:10.896 - R 0:00.010 378 passes, 0 failures, 0 timeouts, 0 cancelled, 0 other Tests took 3:36.029 [Pipeline] } [Pipeline] // dir [Pipeline] } [Pipeline] // stage [Pipeline] echo -------- Test: Release -------- [Pipeline] stage [Pipeline] { (Test: Release) [Pipeline] dir Running in /var/lib/jenkins/workspace/Cforall_master@tmp [Pipeline] { [Pipeline] sh + nproc + make -j 16 --no-print-directory -C tests timeout=600 global-timeout=14400 tests debug=no archive-errors=/var/lib/jenkins/workspace/Cforall_master@tmp/tests/crashes/full-nodebug Running 378 tests on 16 cores (x64 - no debug) array-ERR2 PASSED C 0:00.070 - R n/a array-ERR3 PASSED C 0:00.074 - R n/a ...ollections/language-dim-mismatch PASSED C 0:00.272 - R n/a array-ERR1 PASSED C 0:01.084 - R n/a array-collections/safety-summary PASSED C 0:00.720 - R n/a array PASSED C 0:01.211 - R 0:00.023 array-collections/c-dependent PASSED C 0:01.338 - R 0:00.021 array-collections/symtab-collision PASSED C 0:00.619 - R n/a array-collections/array-raii-c PASSED C 0:01.778 - R 0:00.008 array-collections/dimexpr-match-c PASSED C 0:02.080 - R 0:00.026 array-collections/array-sbscr-types PASSED C 0:02.276 - R 0:00.006 castError PASSED C 0:00.877 - R n/a attr-priority PASSED C 0:01.912 - R 0:00.004 builtins/sync PASSED C 0:01.639 - R 0:00.012 array-collections/boxed PASSED C 0:03.031 - R 0:00.021 array-collections/array-basic PASSED C 0:03.176 - R 0:00.023 cast PASSED C 0:01.564 - R 0:00.019 castReturn PASSED C 0:01.599 - R 0:00.016 array-collections/dimexpr-match-cfa PASSED C 0:04.928 - R 0:00.021 alloc-ERROR PASSED C 0:06.056 - R n/a algorithms/range_test PASSED C 0:06.623 - R 0:00.006 avl_test PASSED C 0:06.232 - R 0:00.006 array-collections/accordion PASSED C 0:07.541 - R 0:00.006 array-collections/array-raii-cfa PASSED C 0:08.028 - R 0:00.005 collections/multi_list PASSED C 0:08.942 - R 0:00.007 collections/queue PASSED C 0:09.543 - R 0:00.006 collections/string-gc PASSED C 0:06.761 - R 0:00.007 collections/stack PASSED C 0:09.853 - R 0:00.005 collections/string-operator-ERR09 PASSED C 0:04.962 - R n/a collections/string-istream PASSED C 0:07.241 - R 0:00.020 collections/sequence PASSED C 0:10.876 - R 0:00.011 collections/atomic_mpsc PASSED C 0:11.369 - R 0:00.870 collections/string-ctx-manage PASSED C 0:09.818 - R 0:00.007 alloc PASSED C 0:15.446 - R 0:00.022 collections/string-compare PASSED C 0:12.227 - R 0:00.007 collections/string-operator-ERR11 PASSED C 0:04.931 - R n/a collections/string-istream-manip PASSED C 0:10.061 - R 0:00.007 collections/string-operator-ERR13 PASSED C 0:05.117 - R n/a collections/string-operator-ERR15 PASSED C 0:04.942 - R n/a collections/string-operator-ERR16 PASSED C 0:04.971 - R n/a ...ns/vector-err-pass-perm-it-byval PASSED C 0:03.022 - R n/a ...ns/vector-err-retn-perm-it-byval PASSED C 0:02.600 - R n/a collections/string-api-coverage PASSED C 0:16.487 - R 0:00.026 ...ions/string-api-coverage-noshare PASSED C 0:16.551 - R 0:00.043 collections/vector-demo PASSED C 0:06.727 - R 0:00.007 complex PASSED C 0:06.027 - R 0:00.007 collections/string-operator PASSED C 0:14.951 - R 0:00.007 collections/string-ostream PASSED C 0:09.689 - R 0:00.006 collections/string-overwrite PASSED C 0:11.115 - R 0:00.009 ...ections/string-overwrite-noshare PASSED C 0:11.316 - R 0:00.011 alloc2 PASSED C 0:25.684 - R 0:00.007 concurrency/actors/dynamic PASSED C 0:15.789 - R 0:00.268 concurrency/actors/executor PASSED C 0:16.060 - R 0:00.036 concurrency/actors/inline PASSED C 0:16.001 - R 0:00.036 concurrency/actors/poison PASSED C 0:15.700 - R 0:00.067 concurrency/barrier/generation PASSED C 0:12.592 - R 0:00.117 concurrency/actors/pingpong PASSED C 0:16.047 - R 0:00.066 concurrency/actors/matrixMultiply PASSED C 0:15.925 - R 0:00.218 concurrency/actors/inherit PASSED C 0:16.879 - R 0:00.036 concurrency/barrier/last PASSED C 0:12.598 - R 0:00.019 concurrency/barrier/order PASSED C 0:12.599 - R 0:00.020 concurrency/actors/static PASSED C 0:15.715 - R 0:00.117 concurrency/ctor-check PASSED C 0:00.860 - R n/a concurrency/clib_tls PASSED C 0:02.899 - R 0:00.020 concurrency/clib PASSED C 0:02.925 - R 0:00.038 concurrency/actors/types PASSED C 0:17.148 - R 0:00.119 concurrency/cluster PASSED C 0:07.280 - R 0:00.009 concurrency/cofor PASSED C 0:09.554 - R 0:00.010 concurrency/coroutineYield PASSED C 0:10.877 - R 0:00.020 concurrency/examples/gortn PASSED C 0:10.242 - R 0:00.014 concurrency/examples/matrixSum PASSED C 0:10.159 - R 0:00.009 ...rrency/examples/boundedBufferEXT PASSED C 0:11.041 - R 0:01.170 concurrency/examples/datingService PASSED C 0:10.877 - R 0:00.006 ...rrency/examples/boundedBufferINT PASSED C 0:11.077 - R 0:01.420 concurrency/channels/big_elems PASSED C 0:15.487 - R 0:10.489 concurrency/keywordErrors PASSED C 0:00.420 - R n/a concurrency/mainError PASSED C 0:00.315 - R n/a concurrency/channels/churn PASSED C 0:15.480 - R 0:10.064 concurrency/channels/daisy_chain PASSED C 0:15.049 - R 0:10.055 concurrency/futures/abandon PASSED C 0:07.560 - R 0:00.017 concurrency/channels/contend PASSED C 0:16.413 - R 0:10.153 concurrency/futures/basic PASSED C 0:07.442 - R 0:00.419 concurrency/examples/quickSort PASSED C 0:12.331 - R 0:00.007 concurrency/channels/hot_potato PASSED C 0:14.794 - R 0:10.049 concurrency/join PASSED C 0:10.435 - R 0:00.021 concurrency/channels/ping_pong PASSED C 0:15.146 - R 0:10.013 concurrency/channels/zero_size PASSED C 0:15.235 - R 0:10.044 concurrency/channels/pub_sub PASSED C 0:15.445 - R 0:10.048 concurrency/migrate PASSED C 0:10.645 - R 0:00.042 concurrency/mutexstmt/monitors PASSED C 0:08.712 - R 0:00.417 concurrency/futures/wait_any PASSED C 0:13.329 - R 0:00.019 concurrency/lockfree_stack PASSED C 0:10.309 - R 0:02.627 concurrency/monitor PASSED C 0:11.243 - R 0:01.273 concurrency/multi-monitor PASSED C 0:10.769 - R 0:01.678 concurrency/park/contention PASSED C 0:07.546 - R 0:00.036 concurrency/futures/typed PASSED C 0:18.156 - R 0:00.035 concurrency/once PASSED C 0:12.664 - R 0:00.036 concurrency/park/start_parked PASSED C 0:07.833 - R 0:00.036 concurrency/mutexstmt/tuple PASSED C 0:13.327 - R 0:00.018 ...urrency/pthread/pthread_key_test PASSED C 0:03.715 - R 0:00.009 concurrency/park/force_preempt PASSED C 0:10.496 - R 0:00.268 ...rrency/pthread/pthread_attr_test PASSED C 0:10.410 - R 0:00.021 ...rrency/pthread/pthread_cond_test PASSED C 0:10.775 - R 0:00.011 ...pthread/pthread_demo_create_join PASSED C 0:10.686 - R 0:00.018 concurrency/futures/future_except PASSED C 0:24.680 - R 0:00.026 concurrency/mutexstmt/locks PASSED C 0:11.577 - R 0:09.498 ...rrency/pthread/pthread_once_test PASSED C 0:10.118 - R 0:00.014 concurrency/readyQ/leader_spin PASSED C 0:10.869 - R 0:01.223 concurrency/readyQ/barrier_sleeper PASSED C 0:12.634 - R 0:00.218 concurrency/signal/disjoint PASSED C 0:11.451 - R 0:00.318 ...rrency/pthread/pthread_demo_lock PASSED C 0:10.432 - R 0:06.443 concurrency/signal/wait PASSED C 0:11.832 - R 0:00.036 concurrency/sleep PASSED C 0:10.755 - R 0:01.169 concurrency/signal/block PASSED C 0:12.811 - R 0:00.219 concurrency/suspend_then PASSED C 0:11.350 - R 0:00.019 concurrency/preempt PASSED C 0:12.288 - R 0:09.192 concurrency/thread PASSED C 0:12.181 - R 0:00.007 ...ency/unified_locking/exp_backoff PASSED C 0:12.538 - R 0:00.011 .../unified_locking/fast_block_lock PASSED C 0:12.600 - R 0:00.018 .../unified_locking/block_spin_lock PASSED C 0:13.486 - R 0:00.011 ...cy/unified_locking/pthread_locks PASSED C 0:10.047 - R 0:00.469 ...ncy/unified_locking/timeout_lock PASSED C 0:09.594 - R 0:01.139 ...fied_locking/mcs_block_spin_lock PASSED C 0:12.489 - R 0:00.011 concurrency/waitfor/barge PASSED C 0:10.362 - R 0:00.067 concurrency/waitfor/parse PASSED C 0:06.390 - R 0:00.010 ...nified_locking/simple_owner_lock PASSED C 0:12.319 - R 0:00.010 concurrency/waitfor/dtor PASSED C 0:10.249 - R 0:00.166 concurrency/waitfor/else PASSED C 0:08.551 - R 0:00.009 concurrency/unified_locking/mcs PASSED C 0:12.682 - R 0:01.270 concurrency/preempt2 PASSED C 0:12.489 - R 0:20.352 ...urrency/waitfor/lexical_priority PASSED C 0:10.779 - R 0:00.021 concurrency/waitfor/recurse PASSED C 0:10.616 - R 0:00.368 concurrency/waitfor/statment PASSED C 0:10.552 - R 0:00.012 concurrency/waitfor/when PASSED C 0:10.454 - R 0:00.036 concurrency/unified_locking/locks PASSED C 0:13.655 - R 0:15.031 ...ency/waituntil/channel_zero_size PASSED C 0:12.373 - R 0:00.321 concurrency/waituntil/channels PASSED C 0:13.172 - R 0:00.570 concurrency/waituntil/one_chan PASSED C 0:12.510 - R 0:00.118 const-init PASSED C 0:01.177 - R 0:00.005 concurrency/waituntil/timeout PASSED C 0:06.227 - R 0:03.076 const-ref PASSED C 0:01.147 - R 0:00.019 concurrency/waituntil/basic_else PASSED C 0:16.888 - R 0:00.018 configs/parsebools PASSED C 0:09.027 - R 0:00.036 concurrency/waituntil/locks PASSED C 0:14.305 - R 0:02.988 configs/parseconfig PASSED C 0:08.958 - R 0:00.007 copyfile PASSED C 0:06.043 - R 0:00.006 configs/usage PASSED C 0:09.257 - R 0:00.008 coroutine/devicedriver PASSED C 0:07.191 - R 0:00.007 coroutine/fmtLines PASSED C 0:07.218 - R 0:00.035 coroutine/fibonacci PASSED C 0:07.813 - R 0:00.037 coroutine/pingpong PASSED C 0:07.154 - R 0:00.007 ctrl-flow/labelledExit PASSED C 0:01.217 - R 0:00.005 coroutine/raii PASSED C 0:07.310 - R 0:00.011 counter PASSED C 0:06.041 - R 0:00.006 concurrency/waituntil/channel_close PASSED C 0:16.094 - R 0:10.044 ctrl-flow/break-misc PASSED C 0:05.796 - R 0:00.010 ctrl-flow/loop-inc PASSED C 0:01.109 - R 0:00.011 coroutine/runningTotal PASSED C 0:07.743 - R 0:00.011 concurrency/waituntil/futures FAILED with code -6 C 0:25.020 - R 0:00.166 start Cforall Runtime error (UNIX pid:622574): Attempting to fulfil a future that has already been fulfilled Stack back trace for: /var/lib/jenkins/workspace/Cforall_master@tmp/libcfa/x64-nodebug/src/.libs/libcfa.so.1 warning: Can't open file anon_inode:[io_uring] which was expanded to anon_inode:[io_uring] during file-backed mapping note processing [New LWP 622576] [New LWP 622575] [New LWP 622574] [Thread debugging using libthread_db enabled] Using host libthread_db library "/lib/x86_64-linux-gnu/libthread_db.so.1". Core was generated by `/var/lib/jenkins/workspace/Cforall_master@tmp/tests/concurrency/waituntil/futur'. Program terminated with signal SIGABRT, Aborted. #0 __pthread_kill_implementation (no_tid=0, signo=6, threadid=) at ./nptl/pthread_kill.c:44 warning: 44 ./nptl/pthread_kill.c: No such file or directory [Current thread is 1 (Thread 0x55555562e780 (LWP 622576))] ----- #0 __pthread_kill_implementation (no_tid=0, signo=6, threadid=) at ./nptl/pthread_kill.c:44 #1 __pthread_kill_internal (signo=6, threadid=) at ./nptl/pthread_kill.c:78 #2 __GI___pthread_kill (threadid=, signo=signo@entry=6) at ./nptl/pthread_kill.c:89 #3 0x00007ffff7a4527e in __GI_raise (sig=sig@entry=6) at ../sysdeps/posix/raise.c:26 #4 0x00007ffff7a288ff in __GI_abort () at ./stdlib/abort.c:79 #5 0x00007ffff7f1878d in _X7__abortFv_bPKcY17__builtin_va_list__1 (_X11signalAbortb_1=_X11signalAbortb_1@entry=true, _X3fmtPKc_1=0x7ffff7f2ba38 "Application interrupted by signal: %s.\n", _X4argsY17__builtin_va_list_1=_X4argsY17__builtin_va_list_1@entry=0x7ffff7f6e190 ) at /var/lib/jenkins/workspace/Cforall_master/libcfa/src/interpose.cfa:263 #6 0x00007ffff7f18cbe in _X5abortFv_bPKc__1 (_X11signalAbortb_1=_X11signalAbortb_1@entry=true, _X3fmtPKc_1=_X3fmtPKc_1@entry=0x7ffff7f2ba38 "Application interrupted by signal: %s.\n") at /var/lib/jenkins/workspace/Cforall_master/libcfa/src/interpose.cfa:301 #7 0x00007ffff7f18ce5 in _X15sigHandler_termFv_iPS21__anonymous_siginfo_tPS10ucontext_t__1 (_X3sigi_1=, _X3sfpPS21__anonymous_siginfo_t_1=, _X3cxtPS10ucontext_t_1=) at /var/lib/jenkins/workspace/Cforall_master/libcfa/src/interpose.cfa:337 #8 #9 __pthread_kill_implementation (no_tid=0, signo=6, threadid=) at ./nptl/pthread_kill.c:44 #10 __pthread_kill_internal (signo=6, threadid=) at ./nptl/pthread_kill.c:78 #11 __GI___pthread_kill (threadid=, signo=signo@entry=6) at ./nptl/pthread_kill.c:89 #12 0x00007ffff7a4527e in __GI_raise (sig=sig@entry=6) at ../sysdeps/posix/raise.c:26 #13 0x00007ffff7a288ff in __GI_abort () at ./stdlib/abort.c:79 #14 0x00007ffff7f18846 in _X7__abortFv_bPKcY17__builtin_va_list__1 (_X11signalAbortb_1=_X11signalAbortb_1@entry=false, _X3fmtPKc_1=, _X3fmtPKc_1@entry=0x55555555c0c0 "Attempting to fulfil a future that has already been fulfilled", _X4argsY17__builtin_va_list_1=_X4argsY17__builtin_va_list_1@entry=0x55555579ff40) at /var/lib/jenkins/workspace/Cforall_master/libcfa/src/interpose.cfa:286 #15 0x00007ffff7f189d7 in _X5abortFv_PKc__1 (_X3fmtPKc_1=_X3fmtPKc_1@entry=0x55555555c0c0 "Attempting to fulfil a future that has already been fulfilled") at /var/lib/jenkins/workspace/Cforall_master/libcfa/src/interpose.cfa:293 #16 0x0000555555558b2b in _X6fulfilQ1_0_0_4__X16_operator_assignFBD0_BD0BD0__X12_constructorFv_BD0__X12_constructorFv_BD0BD0__X11_destructorFv_BD0__Fb_S6future_BD0_BD0__1 (_sizeof_Y1T=, _alignof_Y1T=, _adapterFv_PY1TY1T__MP=, _adapterFY1T_PY1TY1T_P_MP=, _X16_operator_assignFY1T_Y1TY1T__1=, _X12_constructorFv_Y1T__1=, _X12_constructorFv_Y1TY1T__1=, _X11_destructorFv_Y1T__1=, _X3valY1T_1=, _X3futS6future_Y1T__1=) at /var/lib/jenkins/workspace/Cforall_master/libcfa/src/concurrency/future.hfa:196 #17 _X14_operator_callQ1_0_0_4__X16_operator_assignFBD0_BD0BD0__X12_constructorFv_BD0__X12_constructorFv_BD0BD0__X11_destructorFv_BD0__Fb_S6future_BD0_BD0__1 (_adapterFv_PY1TY1T__MP=_adapterFv_PY1TY1T__MP@entry=0x5555555582d0 <_adapterFv_Pii__MP.41263>, _X3futS6future_Y1T__1=_X3futS6future_Y1T__1@entry=0x55555555f380 <_X1CS6future_i__1>, _X3valY1T_1=_X3valY1T_1@entry=0x5555557a00b4, _X12_constructorFv_Y1T__1=, _X16_operator_assignFY1T_Y1TY1T__1=, _adapterFY1T_PY1TY1T_P_MP=, _X11_destructorFv_Y1T__1=, _X12_constructorFv_Y1TY1T__1=, _alignof_Y1T=4, _sizeof_Y1T=4) at /var/lib/jenkins/workspace/Cforall_master/libcfa/src/concurrency/future.hfa:200 #18 0x0000555555558c39 in _X4mainFv_S6Server__1 (__anonymous_object2711=__anonymous_object2711@entry=0x7fffffffdad0) at concurrency/waituntil/futures.cfa:11 #19 0x00007ffff7f90a9f in __cfactx_invoke_thread (main=0x555555558bc0 <_X4mainFv_S6Server__1>, this=0x7fffffffdad0) at /var/lib/jenkins/workspace/Cforall_master/libcfa/src/concurrency/invoke.c:87 #20 0x0000000000000000 in ?? () ----- Id Target Id Frame * 1 Thread 0x55555562e780 (LWP 622576) __pthread_kill_implementation (no_tid=0, signo=6, threadid=) at ./nptl/pthread_kill.c:44 2 Thread 0x5555555ae5c0 (LWP 622575) 0x00007ffff7a45fc8 in __GI___sigtimedwait (set=set@entry=0x5555555adb80, info=info@entry=0x5555555adc00, timeout=timeout@entry=0x0) at ../sysdeps/unix/sysv/linux/sigtimedwait.c:31 3 Thread 0x7ffff7d60840 (LWP 622574) 0x00007ffff7b1bbca in __GI___libc_read (nbytes=8, buf=0x5555555ef7e8, fd=3) at ../sysdeps/unix/sysv/linux/read.c:26 Archiving concurrency/waituntil/futures (executable and core) to crashes/full-nodebug/concurrency/waituntil/futures coroutine/prodcons PASSED C 0:09.695 - R 0:00.035 ctrl-flow/fallthrough PASSED C 0:06.279 - R 0:00.011 enum PASSED C 0:01.106 - R 0:00.008 ctrl-flow/goto PASSED C 0:06.536 - R 0:00.019 ctrl-flow/ifwhileCtl PASSED C 0:06.372 - R 0:00.009 designations PASSED C 0:02.792 - R 0:00.005 enum_tests/lvalue PASSED C 0:00.509 - R n/a enum_tests/inc-dec PASSED C 0:01.264 - R 0:00.020 enum_tests/funcEnum PASSED C 0:02.254 - R 0:00.006 ctrl-flow/loop_else PASSED C 0:05.874 - R 0:00.009 concurrency/waituntil/all_types PASSED C 0:31.497 - R 0:01.119 ...ency/unified_locking/futex_mutex PASSED C 0:12.358 - R 0:38.299 enum_tests/structEnum PASSED C 0:02.427 - R 0:00.007 enum_tests/anonymous PASSED C 0:06.328 - R 0:00.006 errors/declaration PASSED C 0:00.149 - R n/a ctrl-flow/loop_else-WRN1 PASSED C 0:07.862 - R 0:00.001 errors/signature PASSED C 0:00.205 - R n/a errors/scope-type PASSED C 0:00.293 - R n/a ctrl-flow/loopctrl PASSED C 0:08.212 - R 0:00.020 errors/scope PASSED C 0:00.706 - R n/a enum_tests/enumInlineValue PASSED C 0:07.111 - R 0:00.012 div PASSED C 0:08.260 - R 0:00.012 enum_tests/input PASSED C 0:06.098 - R 0:00.019 eval PASSED C 0:01.315 - R 0:00.023 enum_tests/stringEnum PASSED C 0:05.711 - R 0:00.009 device/cpu PASSED C 0:10.455 - R 0:00.007 enum_tests/planet PASSED C 0:07.982 - R 0:00.011 enum_tests/typedIntEnum PASSED C 0:06.512 - R 0:00.012 enum_tests/position PASSED C 0:08.524 - R 0:00.019 enum_tests/voidEnum PASSED C 0:06.478 - R 0:00.011 exceptions/conditional PASSED C 0:06.053 - R 0:00.004 exceptions/data-except PASSED C 0:06.061 - R 0:00.005 exceptions/cancel/coroutine PASSED C 0:07.301 - R 0:00.006 exceptions/message PASSED C 0:02.647 - R 0:00.019 exceptions/conditional-threads PASSED C 0:07.433 - R 0:00.006 exceptions/defaults PASSED C 0:06.634 - R 0:00.014 exceptions/finally PASSED C 0:05.985 - R 0:00.005 exceptions/defaults-threads PASSED C 0:07.543 - R 0:00.006 exceptions/try-ctrl-flow PASSED C 0:00.403 - R n/a exceptions/interact PASSED C 0:06.420 - R 0:00.019 exceptions/try-leave-catch PASSED C 0:01.219 - R 0:00.029 exceptions/cor_resumer PASSED C 0:10.713 - R 0:00.008 exceptions/type-check PASSED C 0:00.466 - R n/a exceptions/fibonacci_nonlocal PASSED C 0:08.838 - R 0:00.014 exceptions/cancel/thread PASSED C 0:11.607 - R 0:00.007 exceptions/finally-threads PASSED C 0:08.058 - R 0:00.008 expression PASSED C 0:01.289 - R 0:00.022 exceptions/polymorphic PASSED C 0:06.052 - R 0:00.005 exceptions/resume PASSED C 0:06.366 - R 0:00.007 concurrency/waituntil/repeat_close PASSED C 0:13.504 - R 0:30.064 exceptions/terminate PASSED C 0:06.926 - R 0:00.017 exceptions/trash PASSED C 0:06.018 - R 0:00.007 exceptions/terminate-threads PASSED C 0:07.915 - R 0:00.036 ...urrency/unified_locking/mcs_spin PASSED C 0:12.550 - R 0:50.017 exceptions/resume-threads PASSED C 0:08.395 - R 0:00.007 global-monomorph PASSED C 0:01.184 - R 0:00.005 identFuncDeclarator PASSED C 0:01.226 - R 0:00.005 identParamDeclarator PASSED C 0:01.137 - R 0:00.015 .../unified_locking/spin_queue_lock PASSED C 0:12.646 - R 0:51.194 exceptions/pingpong_nonlocal PASSED C 0:11.114 - R 0:00.010 exceptions/virtual-poly PASSED C 0:06.399 - R 0:00.005 fstream_test PASSED C 0:06.114 - R 0:00.007 forall PASSED C 0:07.157 - R 0:00.007 generator/fibonacci PASSED C 0:05.986 - R 0:00.007 generator/fmtLines PASSED C 0:05.840 - R 0:00.007 init1 PASSED C 0:01.083 - R 0:00.006 init1-ERROR PASSED C 0:00.587 - R n/a include/vector-sequence PASSED C 0:01.654 - R 0:00.007 exceptions/virtual-cast PASSED C 0:08.395 - R 0:00.007 generator/suspend_then PASSED C 0:06.167 - R 0:00.006 include/vector-collections PASSED C 0:02.716 - R 0:00.006 genericUnion PASSED C 0:06.601 - R 0:00.005 function-operator PASSED C 0:09.220 - R 0:00.006 hello PASSED C 0:06.016 - R 0:00.005 identity PASSED C 0:06.117 - R 0:00.005 include/vector-fstream PASSED C 0:05.887 - R 0:00.005 include/stdincludes PASSED C 0:07.802 - R 0:00.024 io/eofType PASSED C 0:06.101 - R 0:00.005 limits PASSED C 0:01.655 - R 0:00.019 io/io PASSED C 0:09.545 - R 0:00.019 linking/exception-nothreads PASSED C 0:04.560 - R 0:00.019 io/io-acquire-in PASSED C 0:10.981 - R 0:00.218 io/io-acquire PASSED C 0:11.959 - R 0:00.319 io/manipulatorsInput-uchunk PASSED C 0:09.889 - R 0:00.035 heap PASSED C 0:08.201 - R 0:08.242 linking/nostdlib PASSED C 0:01.137 - R 0:00.010 io/away_fair PASSED C 0:13.415 - R 0:00.019 io/io-acquire-out PASSED C 0:11.917 - R 0:00.519 linking/exception-withthreads PASSED C 0:06.298 - R 0:00.041 io/io-acquire2 PASSED C 0:11.326 - R 0:00.020 io/io-acquire-no-io PASSED C 0:10.794 - R 0:02.121 linkonce PASSED C 0:01.222 - R 0:00.006 io/comp_fair PASSED C 0:15.289 - R 0:00.118 maybe PASSED C 0:01.384 - R 0:00.007 linking/mangling/anon PASSED C 0:06.079 - R 0:00.006 io/comp_basic PASSED C 0:17.059 - R 0:00.299 nested-types-ERR1 PASSED C 0:00.119 - R n/a nested-types-ERR2 PASSED C 0:00.190 - R n/a io/many_read PASSED C 0:13.516 - R 0:00.014 linking/io-acquire PASSED C 0:08.096 - R 0:00.014 nested-types PASSED C 0:01.127 - R 0:00.007 nowarn/array PASSED C 0:01.256 - R 0:00.008 io/manipulatorsOutput4 PASSED C 0:15.874 - R 0:00.012 nowarn/exception PASSED C 0:01.233 - R 0:00.007 nowarn/no-autogen PASSED C 0:01.106 - R 0:00.005 list/dlist-insert-remove PASSED C 0:06.153 - R 0:00.006 opt-params PASSED C 0:00.081 - R n/a nowarn/printf-sizeof PASSED C 0:01.329 - R 0:00.005 list/dlist2-insert-remove PASSED C 0:06.140 - R 0:00.007 nowarn/unused PASSED C 0:01.158 - R 0:00.007 nowarn/zero-thunk PASSED C 0:01.100 - R 0:00.007 literals PASSED C 0:06.141 - R 0:00.006 numericConstants PASSED C 0:01.128 - R 0:00.006 operators PASSED C 0:01.132 - R 0:00.005 meta/fork+exec PASSED C 0:04.946 - R 0:00.036 linking/nothreads PASSED C 0:07.726 - R 0:00.005 linking/weakso_nothd PASSED C 0:07.724 - R 0:00.008 polybits PASSED C 0:00.235 - R n/a poly-bare-assn PASSED C 0:01.108 - R 0:00.005 poly-d-cycle PASSED C 0:01.168 - R 0:00.007 poly-many-arsz PASSED C 0:01.149 - R 0:00.005 poly-member PASSED C 0:01.152 - R 0:00.005 poly-selection PASSED C 0:01.139 - R 0:00.007 poly-o-cycle PASSED C 0:01.189 - R 0:00.005 raii/ctor-autogen-ERR1 PASSED C 0:00.681 - R n/a include/includes PASSED C 0:23.428 - R 0:00.005 poly-self-cycle PASSED C 0:01.245 - R 0:00.005 quasiKeyword PASSED C 0:01.255 - R 0:00.006 raii/ctor-autogen PASSED C 0:01.623 - R 0:00.006 meta/dumpable PASSED C 0:08.285 - R 0:00.007 raii/init_once PASSED C 0:01.382 - R 0:00.006 raii/partial-ERR1 PASSED C 0:00.634 - R n/a raii/partial PASSED C 0:01.148 - R 0:00.006 linking/withthreads PASSED C 0:10.797 - R 0:00.006 raii/typeof-member PASSED C 0:01.016 - R 0:00.005 malloc PASSED C 0:09.754 - R 0:00.005 result PASSED C 0:01.572 - R 0:00.008 simpleGenericTriple PASSED C 0:01.483 - R 0:00.006 raii/memberCtors-ERR1 PASSED C 0:03.756 - R n/a raii/dtor-early-exit-ERR1 PASSED C 0:04.432 - R n/a raii/dtor-early-exit-ERR2 PASSED C 0:04.452 - R n/a quotedKeyword PASSED C 0:05.763 - R 0:00.006 raii/boxed-types PASSED C 0:05.868 - R 0:00.007 minmax PASSED C 0:11.108 - R 0:00.006 polymorphism PASSED C 0:06.165 - R 0:00.007 smart-pointers PASSED C 0:01.413 - R 0:00.006 raii/globals PASSED C 0:05.908 - R 0:00.006 switch PASSED C 0:01.117 - R 0:00.005 raii/memberCtors PASSED C 0:06.135 - R 0:00.007 tuple/tupleCast PASSED C 0:01.110 - R 0:00.005 tuple/tupleFunction PASSED C 0:01.197 - R 0:00.006 tuple/tupleMember PASSED C 0:01.148 - R 0:00.006 typedefRedef-ERR1 PASSED C 0:00.112 - R n/a tuple/tuplePolymorphism PASSED C 0:01.501 - R 0:00.006 typedefRedef PASSED C 0:01.080 - R 0:00.005 references PASSED C 0:06.210 - R 0:00.005 var-assert PASSED C 0:00.143 - R n/a raii/dtor-early-exit PASSED C 0:08.531 - R 0:00.006 typeof PASSED C 0:01.046 - R 0:00.007 shortCircuit PASSED C 0:05.951 - R 0:00.005 variableDeclarator PASSED C 0:01.080 - R 0:00.005 sizeof PASSED C 0:05.731 - R 0:00.005 strstream PASSED C 0:06.264 - R 0:00.005 searchsort PASSED C 0:08.398 - R 0:00.006 tuple/tupleVariadic PASSED C 0:04.724 - R 0:00.005 tuple/tupleAssign PASSED C 0:06.571 - R 0:00.006 tuplearray PASSED C 0:05.820 - R 0:00.009 sum PASSED C 0:08.356 - R 0:00.005 time PASSED C 0:07.733 - R 0:00.007 voidPtr PASSED C 0:01.095 - R 0:00.007 withconflict PASSED C 0:00.529 - R n/a warnings/self-assignment PASSED C 0:01.029 - R 0:00.001 swap PASSED C 0:08.941 - R 0:00.006 KRfunctions PASSED C 0:00.982 - R 0:00.001 userLiterals PASSED C 0:06.706 - R 0:00.006 vector PASSED C 0:07.108 - R 0:00.006 ...collections/dimexpr-match-c-ERRS PASSED C 0:00.722 - R n/a zero_one-ERR1 PASSED C 0:03.225 - R n/a arithmeticConversions PASSED C 0:02.560 - R 0:00.006 ...llections/dimexpr-match-cfa-ERRS PASSED C 0:01.309 - R n/a vector_math/vec2_double PASSED C 0:08.918 - R 0:00.007 vector_math/vec2_uint PASSED C 0:09.000 - R 0:00.006 attributes PASSED C 0:01.230 - R 0:00.001 zero_one PASSED C 0:05.860 - R 0:00.006 abs PASSED C 0:08.011 - R 0:00.007 declarationSpecifier PASSED C 0:01.030 - R 0:00.001 errors/completeType PASSED C 0:00.604 - R n/a ...collections/array-md-sbscr-cases PASSED C 0:09.987 - R 0:00.008 ato PASSED C 0:08.843 - R 0:00.007 vector_math/vec3_int PASSED C 0:16.373 - R 0:00.007 vector_math/vec2_float PASSED C 0:18.672 - R 0:00.006 extension PASSED C 0:00.981 - R 0:00.001 configs/parsenums PASSED C 0:09.007 - R 0:00.127 functions PASSED C 0:00.923 - R 0:00.006 vector_math/vec4_int PASSED C 0:17.207 - R 0:00.007 PRNG PASSED C 0:14.879 - R 0:00.384 gccExtensions PASSED C 0:00.955 - R 0:00.008 rational PASSED C 0:27.117 - R 0:00.006 concurrency/pthread/bounded_buffer PASSED C 0:10.726 - R 0:00.050 bitmanip2 PASSED C 0:11.823 - R 0:00.011 meta/arch PASSED C 0:00.590 - R n/a bitmanip1 PASSED C 0:12.838 - R 0:00.288 bitmanip3 PASSED C 0:12.153 - R 0:00.172 vector_math/vec3_float PASSED C 0:22.308 - R 0:00.010 vector_math/vec2_int PASSED C 0:22.977 - R 0:00.005 vector_math/vec4_float PASSED C 0:21.444 - R 0:00.009 exceptions/cardgame PASSED C 0:10.274 - R 0:00.009 exceptions/hotpotato_checked PASSED C 0:09.867 - R 0:00.010 exceptions/hotpotato PASSED C 0:09.739 - R 0:00.009 io/manipulatorsInput PASSED C 0:07.862 - R 0:00.010 random PASSED C 0:07.963 - R 0:00.005 vector_math/vec2_ldouble PASSED C 0:08.659 - R 0:00.005 gmp PASSED C 0:11.690 - R 0:00.012 nested_function PASSED C 0:10.087 - R 0:00.010 math PASSED C 0:10.945 - R 0:00.005 mathX PASSED C 0:11.686 - R 0:00.010 io/manipulatorsOutput2 PASSED C 0:12.128 - R 0:00.005 io/manipulatorsOutput1 PASSED C 0:22.209 - R 0:00.011 io/manipulatorsOutput3 PASSED C 0:24.324 - R 0:00.011 377 passes, 1 failures, 0 timeouts, 0 cancelled, 0 other Tests took 3:39.299 make: *** [Makefile:986: all-local] Error 1 [Pipeline] } [Pipeline] // dir [Pipeline] } [Pipeline] // stage [Pipeline] echo Archiving core dumps [Pipeline] dir Running in /var/lib/jenkins/workspace/Cforall_master@tmp [Pipeline] { [Pipeline] fileExists [Pipeline] sh + /var/lib/jenkins/workspace/Cforall_master/tools/jenkins/archive-gen.sh [Pipeline] archiveArtifacts Archiving artifacts Recording fingerprints [Pipeline] } [Pipeline] // dir [Pipeline] } [Pipeline] // wrap [Pipeline] } [Pipeline] // node [Pipeline] echo hudson.AbortException: script returned exit code 2 [Pipeline] node Running on Brokk 5 in /var/lib/jenkins/workspace/Cforall_master_2 [Pipeline] { [Pipeline] echo Notifying users of result [Pipeline] echo Reusing previously constructed message [Pipeline] echo Would send email to: cforall@lists.uwaterloo.ca [Pipeline] echo With title: [cforall git][BUILD# 3615 - FAILURE] - branch master [Pipeline] echo Content:

This is an automated email from the Jenkins build machine. It was generated because of a git hooks/post-receive script following a ref change which was pushed to the C∀ repository.

- Status --------------------------------------------------------------

BUILD# 3615 - FAILURE

Check console output at https://cforall.uwaterloo.ca/jenkins/job/Cforall/job/master/3615/ to view the results.

- Changes -------------------------------------------------------------

The branch master has been updated.
      from  4ff8cb209307cd30c3626d4fbe3cc2d2ce4219ea (commit)

- Log -----------------------------------------------------------------


-----------------------------------------------------------------------

Summary of changes:

[Pipeline] } [Pipeline] // node [Pipeline] echo Build Completed [Pipeline] End of Pipeline ERROR: script returned exit code 2 Finished: FAILURE [Pipeline] error [Pipeline] } Failed in branch gcc_9_x64_new Build Cforall » master #3610 completed: SUCCESS [Pipeline] echo SUCCESS [Pipeline] } Build Cforall » master #3614 completed: SUCCESS [Pipeline] echo SUCCESS [Pipeline] } Build Cforall » master #3613 completed: SUCCESS [Pipeline] echo SUCCESS [Pipeline] } Build Cforall » master #3608 completed: SUCCESS [Pipeline] echo SUCCESS [Pipeline] } Build Cforall » master #3611 completed: SUCCESS [Pipeline] echo SUCCESS [Pipeline] } Build Cforall » master #3607 completed: SUCCESS [Pipeline] echo SUCCESS [Pipeline] } Build Cforall » master #3612 completed: SUCCESS [Pipeline] echo SUCCESS [Pipeline] } [Pipeline] // parallel [Pipeline] } [Pipeline] // stage [Pipeline] } [Pipeline] // wrap [Pipeline] echo error caught [Pipeline] node Running on Brokk 4 in /var/lib/jenkins/workspace/Cforall_Full_Build [Pipeline] { [Pipeline] echo notifying users [Pipeline] emailext Sending email to: cforall@lists.uwaterloo.ca [Pipeline] } [Pipeline] // node [Pipeline] } [Pipeline] // node [Pipeline] End of Pipeline ERROR: FAILURE Finished: FAILURE