Started by timer Running as Jenkins Build User Obtained Jenkins/FullBuild from git cforall@plg.uwaterloo.ca:software/cfa/cfa-cc [Pipeline] Start of Pipeline [Pipeline] node Running on Brokk 3 in /var/lib/jenkins/workspace/Cforall_Full_Build [Pipeline] { [Pipeline] checkout The recommended git tool is: NONE using credential git_key_aug2025 Fetching changes from the remote Git repository > git rev-parse --resolve-git-dir /var/lib/jenkins/workspace/Cforall_Full_Build/.git # timeout=10 > git config remote.origin.url cforall@plg.uwaterloo.ca:software/cfa/cfa-cc # timeout=10 Fetching upstream changes from cforall@plg.uwaterloo.ca:software/cfa/cfa-cc > git --version # timeout=10 > git --version # 'git version 2.43.0' using GIT_SSH to set credentials Git key use to connect to the cforall git repo (August 2025) Verifying host key using known hosts file > git fetch --tags --force --progress -- cforall@plg.uwaterloo.ca:software/cfa/cfa-cc +refs/heads/*:refs/remotes/origin/* # timeout=10 Checking out Revision 262e12b24a19d992dad599c1cc6143374ac571f4 (refs/remotes/origin/master) Commit message: "allow making print version without editing source" > git rev-parse refs/remotes/origin/master^{commit} # timeout=10 > git config core.sparsecheckout # timeout=10 > git checkout -f 262e12b24a19d992dad599c1cc6143374ac571f4 # timeout=10 > git rev-list --no-walk 262e12b24a19d992dad599c1cc6143374ac571f4 # timeout=10 [Pipeline] wrap [Pipeline] { [Pipeline] stage [Pipeline] { (Build) [Pipeline] parallel [Pipeline] { (Branch: gcc_10_x86_new) [Pipeline] { (Branch: gcc_11_x86_new) [Pipeline] { (Branch: gcc_12_x86_new) [Pipeline] { (Branch: gcc_9_x64_new) [Pipeline] { (Branch: gcc_10_x64_new) [Pipeline] { (Branch: gcc_11_x64_new) [Pipeline] { (Branch: gcc_12_x64_new) [Pipeline] { (Branch: gcc_10_arm64_new) [Pipeline] { (Branch: gcc_11_arm64_new) [Pipeline] { (Branch: gcc_12_arm64_new) [Pipeline] { (Branch: clang_x64_new) [Pipeline] sleep Sleeping for 4 min 0 sec [Pipeline] sleep No need to sleep any longer [Pipeline] sleep Sleeping for 2 min 0 sec [Pipeline] sleep Sleeping for 4 min 0 sec [Pipeline] sleep Sleeping for 2 min 0 sec [Pipeline] sleep Sleeping for 4 min 0 sec [Pipeline] sleep Sleeping for 2 min 0 sec [Pipeline] sleep Sleeping for 2 min 0 sec [Pipeline] sleep Sleeping for 3 min 0 sec [Pipeline] sleep Sleeping for 4 min 0 sec [Pipeline] sleep Sleeping for 4 min 0 sec [Pipeline] build Scheduling project: Cforall » master Starting building: Cforall » master #3851 [Pipeline] build Scheduling project: Cforall » master [Pipeline] build Scheduling project: Cforall » master [Pipeline] build Scheduling project: Cforall » master [Pipeline] build Scheduling project: Cforall » master Starting building: Cforall » master #3855 Starting building: Cforall » master #3852 Starting building: Cforall » master #3854 Starting building: Cforall » master #3853 [Pipeline] build Scheduling project: Cforall » master Starting building: Cforall » master #3856 [Pipeline] build Scheduling project: Cforall » master [Pipeline] build Scheduling project: Cforall » master [Pipeline] build Scheduling project: Cforall » master [Pipeline] build Scheduling project: Cforall » master [Pipeline] build Scheduling project: Cforall » master Starting building: Cforall » master #3861 Starting building: Cforall » master #3859 Starting building: Cforall » master #3857 Starting building: Cforall » master #3858 Starting building: Cforall » master #3860 Build Cforall » master #3855 completed: SUCCESS [Pipeline] echo SUCCESS [Pipeline] } Build Cforall » master #3861 completed: FAILURE [Pipeline] echo FAILURE [Pipeline] sh + wget -q -O - https://cforall.uwaterloo.ca/jenkins/job/Cforall/job/master/3861/consoleText Started by upstream project "Cforall_Full_Build" build number 430 originally caused by: Started by timer Running as Jenkins Build User > git rev-parse --resolve-git-dir /var/lib/jenkins/caches/git-914b6fdde163b7e17ee75d99ca23f18a/.git # timeout=10 Setting origin to cforall@plg.uwaterloo.ca:software/cfa/cfa-cc > git config remote.origin.url cforall@plg.uwaterloo.ca:software/cfa/cfa-cc # timeout=10 Fetching origin... Fetching upstream changes from origin > git --version # timeout=10 > git --version # 'git version 2.43.0' > git config --get remote.origin.url # timeout=10 using GIT_SSH to set credentials Git key use to connect to the cforall git repo (August 2025) Verifying host key using known hosts file > git fetch --no-tags --force --progress -- origin +refs/heads/*:refs/remotes/origin/* # timeout=10 Seen branch in repository origin/ADT Seen branch in repository origin/aaron-thesis Seen branch in repository origin/arm-eh Seen branch in repository origin/ast-experimental Seen branch in repository origin/cleanup-dtors Seen branch in repository origin/ctor Seen branch in repository origin/deferred_resn Seen branch in repository origin/demangler Seen branch in repository origin/enum Seen branch in repository origin/forall-pointer-decay Seen branch in repository origin/gc_noraii Seen branch in repository origin/jacob/cs343-translation Seen branch in repository origin/jenkins-sandbox Seen branch in repository origin/master Seen branch in repository origin/memory Seen branch in repository origin/new-ast Seen branch in repository origin/new-ast-unique-expr Seen branch in repository origin/new-env Seen branch in repository origin/no_list Seen branch in repository origin/persistent-indexer Seen branch in repository origin/pthread-emulation Seen branch in repository origin/qualifiedEnum Seen branch in repository origin/resolv-new Seen branch in repository origin/string Seen branch in repository origin/stuck-waitfor-destruct Seen branch in repository origin/with_gc Seen 26 remote branches Obtained Jenkinsfile from 262e12b24a19d992dad599c1cc6143374ac571f4 [Pipeline] Start of Pipeline [Pipeline] node Running on Brokk 2 in /var/lib/jenkins/workspace/Cforall_master_2 [Pipeline] { [Pipeline] wrap [Pipeline] { [Pipeline] properties WARNING: Unknown parameter(s) found for class type 'hudson.model.ChoiceParameterDefinition': defaultValue WARNING: Unknown parameter(s) found for class type 'hudson.model.ChoiceParameterDefinition': defaultValue [Pipeline] checkout The recommended git tool is: NONE using credential git_key_aug2025 Fetching changes from the remote Git repository Cleaning workspace Fetching without tags Checking out Revision 262e12b24a19d992dad599c1cc6143374ac571f4 (master) Commit message: "allow making print version without editing source" [Pipeline] load [Pipeline] { (Jenkins/tools.groovy) [Pipeline] } [Pipeline] // load [Pipeline] echo Compiler : clang (clang++/gcc-11) Architecture : x64 Arc Flags : --host=x86_64 Run All Tests : true Run Benchmark : true Build Documentation : true Publish : true Silent : true [Pipeline] } [Pipeline] // wrap [Pipeline] } > git rev-parse --resolve-git-dir /var/lib/jenkins/workspace/Cforall_master_2/.git # timeout=10 > git config remote.origin.url cforall@plg.uwaterloo.ca:software/cfa/cfa-cc # timeout=10 > git rev-parse --verify HEAD # timeout=10 Resetting working tree > git reset --hard # timeout=10 > git clean -fdx # timeout=10 Fetching upstream changes from cforall@plg.uwaterloo.ca:software/cfa/cfa-cc > git --version # timeout=10 > git --version # 'git version 2.43.0' using GIT_SSH to set credentials Git key use to connect to the cforall git repo (August 2025) Verifying host key using known hosts file > git fetch --no-tags --force --progress -- cforall@plg.uwaterloo.ca:software/cfa/cfa-cc +refs/heads/*:refs/remotes/origin/* # timeout=10 > git config core.sparsecheckout # timeout=10 > git checkout -f 262e12b24a19d992dad599c1cc6143374ac571f4 # timeout=10 > git rev-list --no-walk 262e12b24a19d992dad599c1cc6143374ac571f4 # timeout=10 [Pipeline] // node [Pipeline] node Running on Brokk 2 in /var/lib/jenkins/workspace/Cforall_master_2 [Pipeline] { [Pipeline] wrap [Pipeline] { [Pipeline] pwd [Pipeline] pwd [Pipeline] echo -------- Cleanup -------- [Pipeline] stage [Pipeline] { (Cleanup) [Pipeline] dir Running in /var/lib/jenkins/workspace/Cforall_master_2@tmp [Pipeline] { [Pipeline] deleteDir [Pipeline] } [Pipeline] // dir [Pipeline] } [Pipeline] // stage [Pipeline] echo -------- Checkout -------- [Pipeline] stage [Pipeline] { (Checkout) [Pipeline] checkout The recommended git tool is: NONE using credential git_key_aug2025 Fetching changes from the remote Git repository Cleaning workspace Fetching without tags Checking out Revision 262e12b24a19d992dad599c1cc6143374ac571f4 (master) Commit message: "allow making print version without editing source" [Pipeline] echo Constructing new git message [Pipeline] sh > git rev-parse --resolve-git-dir /var/lib/jenkins/workspace/Cforall_master_2/.git # timeout=10 > git config remote.origin.url cforall@plg.uwaterloo.ca:software/cfa/cfa-cc # timeout=10 > git rev-parse --verify HEAD # timeout=10 Resetting working tree > git reset --hard # timeout=10 > git clean -fdx # timeout=10 Fetching upstream changes from cforall@plg.uwaterloo.ca:software/cfa/cfa-cc > git --version # timeout=10 > git --version # 'git version 2.43.0' using GIT_SSH to set credentials Git key use to connect to the cforall git repo (August 2025) Verifying host key using known hosts file > git fetch --no-tags --force --progress -- cforall@plg.uwaterloo.ca:software/cfa/cfa-cc +refs/heads/*:refs/remotes/origin/* # timeout=10 > git config core.sparsecheckout # timeout=10 > git checkout -f 262e12b24a19d992dad599c1cc6143374ac571f4 # timeout=10 + git rev-list 262e12b24a19d992dad599c1cc6143374ac571f4..262e12b24a19d992dad599c1cc6143374ac571f4 [Pipeline] sh + git cat-file -t 262e12b24a19d992dad599c1cc6143374ac571f4 [Pipeline] sh + git rev-list --format=short 262e12b24a19d992dad599c1cc6143374ac571f4...262e12b24a19d992dad599c1cc6143374ac571f4 [Pipeline] sh + git diff --stat --color 262e12b24a19d992dad599c1cc6143374ac571f4 262e12b24a19d992dad599c1cc6143374ac571f4 [Pipeline] echo

- Changes -------------------------------------------------------------

The branch master has been updated.
      from  262e12b24a19d992dad599c1cc6143374ac571f4 (commit)

- Log -----------------------------------------------------------------


-----------------------------------------------------------------------

Summary of changes:

[Pipeline] } [Pipeline] // stage [Pipeline] echo -------- Build : configure -------- [Pipeline] stage [Pipeline] { (Build : configure) [Pipeline] dir Running in /var/lib/jenkins/workspace/Cforall_master_2 [Pipeline] { [Pipeline] sh + ./autogen.sh Running aclocal in root Running libtoolize in root libtoolize: putting auxiliary files in AC_CONFIG_AUX_DIR, 'automake'. libtoolize: linking file 'automake/ltmain.sh' libtoolize: putting macros in AC_CONFIG_MACRO_DIRS, 'automake'. libtoolize: linking file 'automake/libtool.m4' libtoolize: linking file 'automake/ltoptions.m4' libtoolize: linking file 'automake/ltsugar.m4' libtoolize: linking file 'automake/ltversion.m4' libtoolize: linking file 'automake/lt~obsolete.m4' Running autoconf in root Running automake in root configure.ac:223: installing 'automake/compile' configure.ac:138: installing 'automake/config.guess' configure.ac:138: installing 'automake/config.sub' configure.ac:17: installing 'automake/install-sh' benchmark/Makefile.am: installing 'automake/depcomp' parallel-tests: installing 'automake/test-driver' configure.ac: installing 'automake/ylwrap' Running aclocal in libcfa Running libtoolize in libcfa libtoolize: putting auxiliary files in AC_CONFIG_AUX_DIR, 'automake'. libtoolize: linking file 'automake/ltmain.sh' libtoolize: putting macros in AC_CONFIG_MACRO_DIRS, 'automake'. libtoolize: linking file 'automake/libtool.m4' libtoolize: linking file 'automake/ltoptions.m4' libtoolize: linking file 'automake/ltsugar.m4' libtoolize: linking file 'automake/ltversion.m4' libtoolize: linking file 'automake/lt~obsolete.m4' Running autoconf in libcfa Running automake in libcfa configure.ac:119: installing 'automake/compile' configure.ac:119: installing 'automake/config.guess' configure.ac:119: installing 'automake/config.sub' configure.ac:12: installing 'automake/install-sh' src/Makefile.am: installing 'automake/depcomp' [Pipeline] } [Pipeline] // dir [Pipeline] dir Running in /var/lib/jenkins/workspace/Cforall_master_2@tmp [Pipeline] { [Pipeline] sh + /var/lib/jenkins/workspace/Cforall_master_2/configure CXX=clang++ CC=gcc-11 --host=x86_64 AR=gcc-ar RANLIB=gcc-ranlib --with-target-hosts=host:debug,host:nodebug --quiet --prefix=/var/lib/jenkins/workspace/Cforall_master_2@tmp [Pipeline] sh + nproc + make -j 16 --no-print-directory configure-libcfa libcfa/x64-debug/config.data Configuring libcfa (/var/lib/jenkins/workspace/Cforall_master_2/libcfa/configure) with ''CXX=clang++' 'CC=gcc-11' 'AR=gcc-ar' 'RANLIB=gcc-ranlib' '--prefix=/var/lib/jenkins/workspace/Cforall_master_2@tmp' DRIVER_DIR=/var/lib/jenkins/workspace/Cforall_master_2@tmp/driver/ ARCHITECTURE=x64 CONFIGURATION=debug CFA_VERSION=1:0:0' from /var/lib/jenkins/workspace/Cforall_master_2@tmp / libcfa/x64-debug/ libcfa/x64-nodebug/config.data Configuring libcfa (/var/lib/jenkins/workspace/Cforall_master_2/libcfa/configure) with ''CXX=clang++' 'CC=gcc-11' 'AR=gcc-ar' 'RANLIB=gcc-ranlib' '--prefix=/var/lib/jenkins/workspace/Cforall_master_2@tmp' DRIVER_DIR=/var/lib/jenkins/workspace/Cforall_master_2@tmp/driver/ ARCHITECTURE=x64 CONFIGURATION=nodebug CFA_VERSION=1:0:0' from /var/lib/jenkins/workspace/Cforall_master_2@tmp / libcfa/x64-nodebug/ checking whether make supports nested variables... yes checking for a BSD-compatible install... checking whether make supports nested variables... yes checking for a BSD-compatible install... /usr/bin/install -c checking whether build environment is sane... /usr/bin/install -c checking whether build environment is sane... yes yes checking for a race-free mkdir -p... /usr/bin/mkdir -p checking for gawk... gawk checking whether make sets $(MAKE)... checking for a race-free mkdir -p... /usr/bin/mkdir -p checking for gawk... gawk checking whether make sets $(MAKE)... yes yes checking for distributated build... no checking for distributated build... no checking build system type... checking build system type... x86_64-pc-linux-gnu checking host system type... x86_64-pc-linux-gnu checking how to print strings... printf checking whether make supports the include directive... x86_64-pc-linux-gnu checking host system type... x86_64-pc-linux-gnu checking how to print strings... printf checking whether make supports the include directive... yes (GNU style) checking for gcc... gcc-11 yes (GNU style) checking for gcc... gcc-11 checking whether the C compiler works... checking whether the C compiler works... yes checking for C compiler default output file name... a.out checking for suffix of executables... yes checking for C compiler default output file name... a.out checking for suffix of executables... checking whether we are cross compiling... checking whether we are cross compiling... no checking for suffix of object files... no checking for suffix of object files... o checking whether the compiler supports GNU C... o checking whether the compiler supports GNU C... yes checking whether gcc-11 accepts -g... yes checking whether gcc-11 accepts -g... yes checking for gcc-11 option to enable C11 features... yes checking for gcc-11 option to enable C11 features... none needed checking whether gcc-11 understands -c and -o together... none needed checking whether gcc-11 understands -c and -o together... yes checking dependency style of gcc-11... yes checking dependency style of gcc-11... gcc3 checking for a sed that does not truncate output... /usr/bin/sed checking for grep that handles long lines and -e... /usr/bin/grep checking for egrep... /usr/bin/grep -E checking for fgrep... /usr/bin/grep -F checking for ld used by gcc-11... gcc3 checking for a sed that does not truncate output... /usr/bin/ld checking if the linker (/usr/bin/ld) is GNU ld... /usr/bin/sed yes checking for BSD- or MS-compatible name lister (nm)... checking for grep that handles long lines and -e... /usr/bin/grep /usr/bin/nm -B checking for egrep... checking the name lister (/usr/bin/nm -B) interface... /usr/bin/grep -E checking for fgrep... /usr/bin/grep -F checking for ld used by gcc-11... /usr/bin/ld checking if the linker (/usr/bin/ld) is GNU ld... yes checking for BSD- or MS-compatible name lister (nm)... /usr/bin/nm -B checking the name lister (/usr/bin/nm -B) interface... BSD nm checking whether ln -s works... yes checking the maximum length of command line arguments... 1572864 checking how to convert x86_64-pc-linux-gnu file names to x86_64-pc-linux-gnu format... func_convert_file_noop checking how to convert x86_64-pc-linux-gnu file names to toolchain format... func_convert_file_noop checking for /usr/bin/ld option to reload object files... -r checking for file... file checking for objdump... objdump checking how to recognize dependent libraries... pass_all checking for dlltool... no checking how to associate runtime and link libraries... printf %s\n checking for archiver @FILE support... BSD nm checking whether ln -s works... yes checking the maximum length of command line arguments... 1572864 checking how to convert x86_64-pc-linux-gnu file names to x86_64-pc-linux-gnu format... func_convert_file_noop checking how to convert x86_64-pc-linux-gnu file names to toolchain format... func_convert_file_noop checking for /usr/bin/ld option to reload object files... -r checking for file... file checking for objdump... objdump checking how to recognize dependent libraries... pass_all checking for dlltool... no checking how to associate runtime and link libraries... printf %s\n checking for archiver @FILE support... @ checking for strip... strip checking for ranlib... gcc-ranlib checking command to parse /usr/bin/nm -B output from gcc-11 object... @ checking for strip... strip checking for ranlib... gcc-ranlib checking command to parse /usr/bin/nm -B output from gcc-11 object... ok checking for sysroot... no checking for a working dd... /usr/bin/dd checking how to truncate binary pipes... ok /usr/bin/dd bs=4096 count=1 checking for sysroot... no checking for a working dd... /usr/bin/dd checking how to truncate binary pipes... /usr/bin/dd bs=4096 count=1 checking for mt... mt checking if mt is a manifest tool... no checking for stdio.h... checking for mt... mt checking if mt is a manifest tool... no checking for stdio.h... yes checking for stdlib.h... yes checking for stdlib.h... yes checking for string.h... yes checking for string.h... yes checking for inttypes.h... yes checking for inttypes.h... yes checking for stdint.h... yes checking for stdint.h... yes checking for strings.h... yes checking for strings.h... yes checking for sys/stat.h... yes checking for sys/stat.h... yes checking for sys/types.h... yes checking for sys/types.h... yes checking for unistd.h... yes checking for unistd.h... yes checking for dlfcn.h... yes checking for dlfcn.h... yes checking for objdir... yes checking for objdir... .libs .libs checking if gcc-11 supports -fno-rtti -fno-exceptions... checking if gcc-11 supports -fno-rtti -fno-exceptions... no checking for gcc-11 option to produce PIC... -fPIC -DPIC checking if gcc-11 PIC flag -fPIC -DPIC works... no checking for gcc-11 option to produce PIC... -fPIC -DPIC checking if gcc-11 PIC flag -fPIC -DPIC works... yes checking if gcc-11 static flag -static works... yes checking if gcc-11 static flag -static works... yes checking if gcc-11 supports -c -o file.o... yes checking if gcc-11 supports -c -o file.o... yes checking if gcc-11 supports -c -o file.o... (cached) yes checking whether the gcc-11 linker (/usr/bin/ld -m elf_x86_64) supports shared libraries... yes checking if gcc-11 supports -c -o file.o... (cached) yes checking whether the gcc-11 linker (/usr/bin/ld -m elf_x86_64) supports shared libraries... yes checking whether -lc should be explicitly linked in... yes checking whether -lc should be explicitly linked in... no checking dynamic linker characteristics... no checking dynamic linker characteristics... GNU/Linux ld.so checking how to hardcode library paths into programs... immediate checking whether stripping libraries is possible... yes checking if libtool supports shared libraries... yes checking whether to build shared libraries... yes checking whether to build static libraries... no GNU/Linux ld.so checking how to hardcode library paths into programs... immediate checking whether stripping libraries is possible... yes checking if libtool supports shared libraries... yes checking whether to build shared libraries... yes checking whether to build static libraries... no checking whether the compiler supports GNU C++... checking whether the compiler supports GNU C++... yes checking whether clang++ accepts -g... yes checking whether clang++ accepts -g... yes checking for clang++ option to enable C++11 features... yes checking for clang++ option to enable C++11 features... none needed checking dependency style of clang++... none needed checking dependency style of clang++... gcc3 checking how to run the C++ preprocessor... gcc3 checking how to run the C++ preprocessor... clang++ -E clang++ -E checking for ld used by clang++... checking for ld used by clang++... /usr/bin/ld -m elf_x86_64 checking if the linker (/usr/bin/ld -m elf_x86_64) is GNU ld... /usr/bin/ld -m elf_x86_64 checking if the linker (/usr/bin/ld -m elf_x86_64) is GNU ld... yes yes checking whether the clang++ linker (/usr/bin/ld -m elf_x86_64) supports shared libraries... checking whether the clang++ linker (/usr/bin/ld -m elf_x86_64) supports shared libraries... yes yes checking for clang++ option to produce PIC... -fPIC -DPIC checking if clang++ PIC flag -fPIC -DPIC works... checking for clang++ option to produce PIC... -fPIC -DPIC checking if clang++ PIC flag -fPIC -DPIC works... yes checking if clang++ static flag -static works... yes checking if clang++ static flag -static works... yes checking if clang++ supports -c -o file.o... yes checking if clang++ supports -c -o file.o... yes checking if clang++ supports -c -o file.o... (cached) yes checking whether the clang++ linker (/usr/bin/ld -m elf_x86_64) supports shared libraries... yes checking dynamic linker characteristics... (cached) yes checking if clang++ supports -c -o file.o... (cached) yes checking whether the clang++ linker (/usr/bin/ld -m elf_x86_64) supports shared libraries... yes checking dynamic linker characteristics... (cached) GNU/Linux ld.so checking how to hardcode library paths into programs... immediate GNU/Linux ld.so checking how to hardcode library paths into programs... immediate checking for gcc... checking for gcc... (cached) (cached) gcc-11 gcc-11 checking whether the compiler supports GNU C... (cached) yes checking whether gcc-11 accepts -g... (cached) yes checking for gcc-11 option to enable C11 features... (cached) none needed checking whether the compiler supports GNU C... (cached) yes checking whether gcc-11 accepts -g... checking whether gcc-11 understands -c and -o together... (cached) (cached) yes yes checking dependency style of gcc-11... checking for gcc-11 option to enable C11 features... (cached) none needed (cached) gcc3 checking dependency style of gcc-11... checking whether gcc-11 understands -c and -o together... (cached) yes checking dependency style of gcc-11... (cached) gcc3 checking dependency style of gcc-11... gcc3 checking whether make sets $(MAKE)... (cached) yes checking for linux/rseq.h... gcc3 checking whether make sets $(MAKE)... (cached) yes checking for linux/rseq.h... yes checking for rseq_available in -lrseq... yes checking for rseq_available in -lrseq... no no checking for gcc-11 options needed to detect all undeclared functions... checking for gcc-11 options needed to detect all undeclared functions... none needed none needed checking for linux/io_uring.h... checking for linux/io_uring.h... yes checking for liburing.h... yes checking for liburing.h... no checking whether IORING_OP_NOP is declared... no checking whether IORING_OP_NOP is declared... yes checking whether IORING_OP_READV is declared... yes checking whether IORING_OP_READV is declared... yes checking whether IORING_OP_WRITEV is declared... yes checking whether IORING_OP_WRITEV is declared... yes checking whether IORING_OP_FSYNC is declared... yes checking whether IORING_OP_FSYNC is declared... yes checking whether IORING_OP_READ_FIXED is declared... yes checking whether IORING_OP_READ_FIXED is declared... yes checking whether IORING_OP_WRITE_FIXED is declared... yes checking whether IORING_OP_WRITE_FIXED is declared... yes checking whether IORING_OP_POLL_ADD is declared... yes checking whether IORING_OP_POLL_ADD is declared... yes checking whether IORING_OP_POLL_REMOVE is declared... yes checking whether IORING_OP_POLL_REMOVE is declared... yes checking whether IORING_OP_SYNC_FILE_RANGE is declared... yes checking whether IORING_OP_SYNC_FILE_RANGE is declared... yes checking whether IORING_OP_SENDMSG is declared... yes checking whether IORING_OP_SENDMSG is declared... yes checking whether IORING_OP_RECVMSG is declared... yes checking whether IORING_OP_RECVMSG is declared... yes checking whether IORING_OP_TIMEOUT is declared... yes checking whether IORING_OP_TIMEOUT is declared... yes checking whether IORING_OP_TIMEOUT_REMOVE is declared... yes checking whether IORING_OP_TIMEOUT_REMOVE is declared... yes checking whether IORING_OP_ACCEPT is declared... yes checking whether IORING_OP_ACCEPT is declared... yes checking whether IORING_OP_ASYNC_CANCEL is declared... yes checking whether IORING_OP_ASYNC_CANCEL is declared... yes checking whether IORING_OP_LINK_TIMEOUT is declared... yes checking whether IORING_OP_LINK_TIMEOUT is declared... yes checking whether IORING_OP_CONNECT is declared... yes checking whether IORING_OP_CONNECT is declared... yes checking whether IORING_OP_FALLOCATE is declared... yes checking whether IORING_OP_FALLOCATE is declared... yes checking whether IORING_OP_OPENAT is declared... yes checking whether IORING_OP_OPENAT is declared... yes checking whether IORING_OP_CLOSE is declared... yes checking whether IORING_OP_CLOSE is declared... yes checking whether IORING_OP_FILES_UPDATE is declared... yes checking whether IORING_OP_FILES_UPDATE is declared... yes checking whether IORING_OP_STATX is declared... yes checking whether IORING_OP_STATX is declared... yes checking whether IORING_OP_READ is declared... yes checking whether IORING_OP_READ is declared... yes checking whether IORING_OP_WRITE is declared... yes checking whether IORING_OP_WRITE is declared... yes checking whether IORING_OP_FADVISE is declared... yes checking whether IORING_OP_FADVISE is declared... yes checking whether IORING_OP_MADVISE is declared... yes checking whether IORING_OP_MADVISE is declared... yes checking whether IORING_OP_SEND is declared... yes checking whether IORING_OP_SEND is declared... yes checking whether IORING_OP_RECV is declared... yes checking whether IORING_OP_RECV is declared... yes checking whether IORING_OP_OPENAT2 is declared... yes checking whether IORING_OP_OPENAT2 is declared... yes checking whether IORING_OP_EPOLL_CTL is declared... yes checking whether IORING_OP_EPOLL_CTL is declared... yes checking whether IORING_OP_SPLICE is declared... yes checking whether IORING_OP_SPLICE is declared... yes checking whether IORING_OP_PROVIDE_BUFFERS is declared... yes checking whether IORING_OP_PROVIDE_BUFFERS is declared... yes checking whether IORING_OP_REMOVE_BUFFER is declared... yes checking whether IORING_OP_REMOVE_BUFFER is declared... no checking whether IORING_OP_TEE is declared... no checking whether IORING_OP_TEE is declared... yes checking whether IOSQE_FIXED_FILE is declared... yes checking whether IOSQE_FIXED_FILE is declared... yes checking whether IOSQE_IO_DRAIN is declared... yes yes checking whether IOSQE_IO_DRAIN is declared... checking whether IOSQE_IO_LINK is declared... yes checking whether IOSQE_IO_HARDLINK is declared... yes checking whether IOSQE_IO_LINK is declared... yes checking whether IOSQE_ASYNC is declared... yes checking whether IOSQE_IO_HARDLINK is declared... yes checking whether IOSQE_BUFFER_SELECT is declared... yes checking whether IOSQE_ASYNC is declared... yes checking whether SPLICE_F_FD_IN_FIXED is declared... yes checking whether IOSQE_BUFFER_SELECT is declared... yes checking whether IORING_SETUP_ATTACH_WQ is declared... yes checking whether SPLICE_F_FD_IN_FIXED is declared... yes checking whether IORING_REGISTER_IOWQ_MAX_WORKERS is declared... yes checking whether IORING_SETUP_ATTACH_WQ is declared... yes checking for preadv2... yes checking whether IORING_REGISTER_IOWQ_MAX_WORKERS is declared... yes checking for pwritev2... yes checking for preadv2... yes yes checking for pwritev2... checking that generated files are newer than configure... done configure: creating ./config.status yes checking that generated files are newer than configure... done configure: creating ./config.status config.status: creating Makefile config.status: creating src/Makefile config.status: creating prelude/Makefile config.status: creating Makefile config.status: creating src/Makefile config.status: creating src/concurrency/io/call.cfa config.status: creating prelude/Makefile /var/lib/jenkins/workspace/Cforall_master_2/libcfa/src/concurrency/io/call.cfa.in:144: SyntaxWarning: invalid escape sequence '\(' sig = re.search("(.*) (.*)\((.*)\)", signature) config.status: creating src/concurrency/io/call.cfa config.status: creating prelude/defines.hfa config.status: executing depfiles commands /var/lib/jenkins/workspace/Cforall_master_2/libcfa/src/concurrency/io/call.cfa.in:144: SyntaxWarning: invalid escape sequence '\(' sig = re.search("(.*) (.*)\((.*)\)", signature) config.status: creating prelude/defines.hfa config.status: executing depfiles commands config.status: executing libtool commands Cforall library configuraton completed. Type "make -j 8 install". config.status: executing libtool commands Cforall library configuraton completed. Type "make -j 8 install". [Pipeline] } [Pipeline] // dir [Pipeline] } [Pipeline] // stage [Pipeline] echo -------- Build : cfa-cpp -------- [Pipeline] stage [Pipeline] { (Build : cfa-cpp) [Pipeline] dir Running in /var/lib/jenkins/workspace/Cforall_master_2@tmp [Pipeline] { [Pipeline] sh + nproc + make -j 16 --no-print-directory -C driver CXX as.o CXX cc1.o CXX cfa.o CXXLD as /var/lib/jenkins/workspace/Cforall_master_2/driver/cc1.cc:149:20: warning: variable length arrays in C++ are a Clang extension [-Wvla-cxx-extension] 149 | const char * args[argc + 100]; // leave space for 100 additional cpp command line values | ^~~~~~~~~~ /var/lib/jenkins/workspace/Cforall_master_2/driver/cc1.cc:149:20: note: function parameter 'argc' with unknown value cannot be used in a constant expression /var/lib/jenkins/workspace/Cforall_master_2/driver/cc1.cc:139:31: note: declared here 139 | static void Stage1( const int argc, const char * const argv[] ) { | ^ /var/lib/jenkins/workspace/Cforall_master_2/driver/cc1.cc:343:20: warning: variable length arrays in C++ are a Clang extension [-Wvla-cxx-extension] 343 | const char * args[argc + 100]; // leave space for 100 additional cfa command line values | ^~~~~~~~~~ /var/lib/jenkins/workspace/Cforall_master_2/driver/cc1.cc:343:20: note: function parameter 'argc' with unknown value cannot be used in a constant expression /var/lib/jenkins/workspace/Cforall_master_2/driver/cc1.cc:336:31: note: declared here 336 | static void Stage2( const int argc, const char * const * argv ) { | ^ /var/lib/jenkins/workspace/Cforall_master_2/driver/cfa.cc:151:20: warning: variable length arrays in C++ are a Clang extension [-Wvla-cxx-extension] 151 | const char * args[argc + 100]; // cfa command line values, plus some space for additional flags | ^~~~~~~~~~ /var/lib/jenkins/workspace/Cforall_master_2/driver/cfa.cc:151:20: note: function parameter 'argc' with unknown value cannot be used in a constant expression /var/lib/jenkins/workspace/Cforall_master_2/driver/cfa.cc:115:15: note: declared here 115 | int main( int argc, char * argv[] ) { | ^ /var/lib/jenkins/workspace/Cforall_master_2/driver/cfa.cc:155:20: warning: variable length arrays in C++ are a Clang extension [-Wvla-cxx-extension] 155 | const char * libs[argc + 20]; // non-user libraries must come separately, plus some added libraries and flags | ^~~~~~~~~ /var/lib/jenkins/workspace/Cforall_master_2/driver/cfa.cc:155:20: note: function parameter 'argc' with unknown value cannot be used in a constant expression /var/lib/jenkins/workspace/Cforall_master_2/driver/cfa.cc:115:15: note: declared here 115 | int main( int argc, char * argv[] ) { | ^ 2 warnings generated. CXXLD cc1 2 warnings generated. CXXLD cfa [Pipeline] sh + nproc + make -j 16 --no-print-directory -C src YACC Parser/parser.cc updating Parser/parser.output updating Parser/parser.hh make all-am CXX main.o CXX CompilationState.o CXX MakeLibCfa.o LEX Parser/lex.cc CXX AST/Attribute.o CXX AST/Copy.o CXX AST/Create.o CXX AST/Decl.o CXX AST/DeclReplacer.o CXX AST/Expr.o CXX AST/GenericSubstitution.o CXX AST/Init.o CXX AST/Inspect.o CXX AST/LinkageSpec.o CXX AST/Node.o CXX AST/Pass.o CXX AST/Print.o CXX AST/Stmt.o CXX AST/SymbolTable.o CXX AST/Type.o CXX AST/TypeEnvironment.o CXX AST/TypeSubstitution.o CXX AST/Util.o CXX CodeGen/CodeGenerator.o CXX CodeGen/GenType.o CXX CodeGen/OperatorTable.o CXX CodeGen/FixMain.o CXX CodeGen/FixNames.o CXX CodeGen/Generate.o CXX CodeGen/LinkOnce.o CXX Concurrency/Actors.o CXX Concurrency/Corun.o CXX Concurrency/Keywords.o CXX Concurrency/Waitfor.o CXX Concurrency/Waituntil.o CXX Common/Assert.o CXX Common/CodeLocationTools.o CXX Common/DeclStats.o CXX Common/Eval.o CXX Common/Examine.o CXX Common/Indenter.o CXX Common/ResolvProtoDump.o CXX Common/SemanticError.o CXX Common/Stats/Counter.o CXX Common/Stats/Heap.o CXX Common/Stats/ResolveTime.o CXX Common/Stats/Stats.o CXX Common/Stats/Time.o CXX Common/Symbol.o CXX Common/UniqueName.o CXX Common/DebugMalloc.o CXX ControlStruct/ExceptDecl.o CXX ControlStruct/ExceptTranslate.o CXX ControlStruct/FixLabels.o CXX ControlStruct/HoistControlDecls.o CXX ControlStruct/LabelGenerator.o CXX ControlStruct/MultiLevelExit.o CXX ControlStruct/TranslateEnumRange.o CXX GenPoly/GenPoly.o CXX GenPoly/Lvalue2.o CXX GenPoly/Box.o CXX GenPoly/FindFunction.o CXX GenPoly/InstantiateGeneric.o CXX GenPoly/Lvalue.o CXX GenPoly/ScrubTypeVars.o CXX GenPoly/Specialize.o CXX InitTweak/GenInit.o CXX InitTweak/InitTweak.o CXX InitTweak/FixGlobalInit.o CXX InitTweak/FixInit.o CXX Parser/DeclarationNode.o CXX Parser/ExpressionNode.o CXX Parser/InitializerNode.o CXX Parser/lex.o CXX Parser/ParseNode.o CXX Parser/parser.o CXX Parser/RunParser.o CXX Parser/StatementNode.o CXX Parser/TypeData.o CXX Parser/TypedefTable.o CXX ResolvExpr/AdjustExprType.o CXX ResolvExpr/Candidate.o CXX ResolvExpr/CandidateFinder.o CXX ResolvExpr/CastCost.o CXX ResolvExpr/CommonType.o CXX ResolvExpr/ConversionCost.o CXX ResolvExpr/CurrentObject.o CXX ResolvExpr/ExplodedArg.o CXX ResolvExpr/FindOpenVars.o CXX ResolvExpr/PolyCost.o CXX ResolvExpr/PtrsAssignable.o CXX ResolvExpr/PtrsCastable.o CXX ResolvExpr/RenameVars.o CXX ResolvExpr/Resolver.o CXX ResolvExpr/ResolveTypeof.o CXX ResolvExpr/SatisfyAssertions.o CXX ResolvExpr/SpecCost.o CXX ResolvExpr/Unify.o CXX ResolvExpr/CandidatePrinter.o CXX ResolvExpr/EraseWith.o CXX SymTab/FixFunction.o CXX SymTab/GenImplicitCall.o CXX SymTab/Mangler.o CXX SymTab/ManglerCommon.o CXX Tuples/Explode.o CXX Tuples/TupleAssignment.o CXX Tuples/TupleExpansion.o CXX Tuples/Tuples.o CXX Validate/Autogen.o CXX Validate/CheckAssertions.o CXX Validate/CompoundLiteral.o CXX Validate/EliminateTypedef.o CXX Validate/EnumAndPointerDecay.o CXX Validate/FindSpecialDecls.o CXX Validate/FixQualifiedTypes.o CXX Validate/FixReturnTypes.o CXX Validate/ForallPointerDecay.o CXX Validate/GenericParameter.o CXX Validate/HoistStruct.o CXX Validate/HoistTypeDecls.o CXX Validate/ImplementEnumFunc.o CXX Validate/InitializerLength.o CXX Validate/LabelAddressFixer.o CXX Validate/LinkInstanceTypes.o CXX Validate/ReplaceTypedef.o CXX Validate/ReturnCheck.o CXX Validate/VerifyCtorDtorAssign.o CXX Virtual/ExpandCasts.o CXX Virtual/Tables.o CXX Virtual/VirtualDtor.o CXXLD ../driver/cfa-cpp [Pipeline] } [Pipeline] // dir [Pipeline] } [Pipeline] // stage [Pipeline] echo -------- Build : libcfa(debug) -------- [Pipeline] stage [Pipeline] { (Build : libcfa(debug)) [Pipeline] dir Running in /var/lib/jenkins/workspace/Cforall_master_2@tmp [Pipeline] { [Pipeline] sh + nproc + make -j 16 --no-print-directory -C libcfa/x64-debug Making all in prelude mkdir .deps touch .deps/builtins.Po (CDPATH="${ZSH_VERSION+.}:" && cd /var/lib/jenkins/workspace/Cforall_master_2/libcfa && /bin/bash '/var/lib/jenkins/workspace/Cforall_master_2/libcfa/automake/missing' autoheader) rm -f stamp-h1 touch /var/lib/jenkins/workspace/Cforall_master_2/libcfa/prelude/defines.hfa.in cd .. && /bin/bash ./config.status prelude/defines.hfa config.status: creating prelude/defines.hfa config.status: prelude/defines.hfa is unchanged make all-am GEN builtins.cfa GEN gcc-builtins.c GEN prelude.cfa GEN extras.cfa GEN extras.cfa GEN gcc-builtins.cfa GEN bootloader.c Making all in src CFA common.lo CFA fstream.lo CFA heap.lo CFA iostream.lo CFA iterator.lo CFA limits.lo CFA math.lo CFA memory.lo CFA parseargs.lo CFA parseconfig.lo CFA rational.lo CFA stdlib.lo CFA strstream.lo CFA time.lo CFA assert.lo CFA bits/debug.lo CC exception.lo CFA interpose.lo CFA prelude-inline.lo CFA startup.lo CC virtual.lo GEN prelude.lo CFA concurrency/locks.lo CFA concurrency/monitor.lo CFA concurrency/mutex.lo CFA concurrency/select.lo CFA concurrency/thread.lo CFA concurrency/cofor.lo CFA interpose_thread.lo CPPAS concurrency/CtxSwitch-x64.lo CC concurrency/invoke.lo CFA concurrency/io.lo CFA concurrency/kernel/startup.lo CFA concurrency/preemption.lo CFA concurrency/ready_queue.lo CFA concurrency/stats.lo CFA concurrency/pthread.lo CFA bits/weakso_locks.lo CFA algorithms/range_iterator.lo CFA collections/maybe.lo CFA collections/pair.lo CFA collections/result.lo CFA collections/string.lo CFA collections/string_res.lo CFA collections/vector.lo CFA device/cpu.lo CFA concurrency/alarm.lo CFA concurrency/coroutine.lo CFA concurrency/exception.lo CFA concurrency/kernel.lo CFA concurrency/kernel/cluster.lo CFA concurrency/clib/cfathread.lo CFA concurrency/io/setup.lo CFA concurrency/io/call.lo /usr/include/linux/io_uring.h:83:43: warning: 'packed' attribute ignored for field of type 'union __io_uring_sqe____anonymous55' [-Wattributes] 83 | } __attribute__((packed)); | ^ /usr/include/linux/io_uring.h:83:43: warning: 'packed' attribute ignored for field of type 'union __io_uring_sqe____anonymous131' [-Wattributes] 83 | } __attribute__((packed)); | ^ CCLD libcfa.la /usr/bin/ld: warning: .libs/common.o: requires executable stack (because the .note.GNU-stack section is executable) /usr/bin/ld: .libs/exception.o: warning: relocation against `__gcfa_personality_v0' in read-only section `.rodata' /usr/bin/ld: warning: creating DT_TEXTREL in a shared object /usr/include/linux/io_uring.h:83:43: warning: 'packed' attribute ignored for field of type 'union __io_uring_sqe____anonymous65' [-Wattributes] 83 | } __attribute__((packed)); | ^ /usr/include/linux/io_uring.h:83:43: warning: 'packed' attribute ignored for field of type 'union __io_uring_sqe____anonymous121' [-Wattributes] 83 | } __attribute__((packed)); | ^ /usr/include/linux/io_uring.h:83:43: warning: 'packed' attribute ignored for field of type 'union __io_uring_sqe____anonymous121' [-Wattributes] 83 | } __attribute__((packed)); | ^ /usr/include/linux/io_uring.h:83:43: warning: 'packed' attribute ignored for field of type 'union __io_uring_sqe____anonymous32' [-Wattributes] 83 | } __attribute__((packed)); | ^ /usr/include/linux/io_uring.h:83:43: warning: 'packed' attribute ignored for field of type 'union __io_uring_sqe____anonymous97' [-Wattributes] 83 | } __attribute__((packed)); | ^ CCLD libcfathread.la /usr/bin/ld: warning: concurrency/.libs/alarm.o: requires executable stack (because the .note.GNU-stack section is executable) make[1]: Nothing to be done for 'all-am'. [Pipeline] } [Pipeline] // dir [Pipeline] } [Pipeline] // stage [Pipeline] echo -------- Build : libcfa(nodebug) -------- [Pipeline] stage [Pipeline] { (Build : libcfa(nodebug)) [Pipeline] dir Running in /var/lib/jenkins/workspace/Cforall_master_2@tmp [Pipeline] { [Pipeline] sh + nproc + make -j 16 --no-print-directory -C libcfa/x64-nodebug Making all in prelude mkdir .deps touch .deps/builtins.Po cd .. && /bin/bash ./config.status prelude/defines.hfa config.status: creating prelude/defines.hfa config.status: prelude/defines.hfa is unchanged make all-am GEN gcc-builtins.c GEN builtins.cfa GEN prelude.cfa GEN extras.cfa GEN extras.cfa GEN gcc-builtins.cfa GEN bootloader.c Making all in src CFA common.lo CFA fstream.lo CFA heap.lo CFA iostream.lo CFA iterator.lo CFA limits.lo CFA math.lo CFA memory.lo CFA parseargs.lo CFA parseconfig.lo CFA rational.lo CFA stdlib.lo CFA strstream.lo CFA time.lo CFA assert.lo CFA bits/debug.lo CC exception.lo /var/lib/jenkins/workspace/Cforall_master_2/libcfa/src/exception.c: In function '__cfaehm_allocate_exception': /var/lib/jenkins/workspace/Cforall_master_2/libcfa/src/exception.c:142:17: warning: ignoring return value of 'write' declared with attribute 'warn_unused_result' [-Wunused-result] 142 | write( 2, "abort2\n", 7 ); | ^~~~~~~~~~~~~~~~~~~~~~~~~ /var/lib/jenkins/workspace/Cforall_master_2/libcfa/src/exception.c: In function '__cfaehm_exception_cleanup': /var/lib/jenkins/workspace/Cforall_master_2/libcfa/src/exception.c:127:17: warning: ignoring return value of 'write' declared with attribute 'warn_unused_result' [-Wunused-result] 127 | write( 2, "abort1\n", 7 ); | ^~~~~~~~~~~~~~~~~~~~~~~~~ /var/lib/jenkins/workspace/Cforall_master_2/libcfa/src/exception.c: In function '__cfaehm_cancel_stack': /var/lib/jenkins/workspace/Cforall_master_2/libcfa/src/exception.c:230:9: warning: ignoring return value of 'write' declared with attribute 'warn_unused_result' [-Wunused-result] 230 | write( 2, "abort3\n", 7 ); | ^~~~~~~~~~~~~~~~~~~~~~~~~ /var/lib/jenkins/workspace/Cforall_master_2/libcfa/src/exception.c: In function '__cfaehm_begin_unwind': /var/lib/jenkins/workspace/Cforall_master_2/libcfa/src/exception.c:252:17: warning: ignoring return value of 'write' declared with attribute 'warn_unused_result' [-Wunused-result] 252 | write( 2, "abort4\n", 7 ); | ^~~~~~~~~~~~~~~~~~~~~~~~~ /var/lib/jenkins/workspace/Cforall_master_2/libcfa/src/exception.c:278:17: warning: ignoring return value of 'write' declared with attribute 'warn_unused_result' [-Wunused-result] 278 | write( 2, "abort5\n", 7 ); | ^~~~~~~~~~~~~~~~~~~~~~~~~ /var/lib/jenkins/workspace/Cforall_master_2/libcfa/src/exception.c: In function '__cfaehm_rethrow_terminate': /var/lib/jenkins/workspace/Cforall_master_2/libcfa/src/exception.c:308:9: warning: ignoring return value of 'write' declared with attribute 'warn_unused_result' [-Wunused-result] 308 | write( 2, "abort7\n", 7 ); | ^~~~~~~~~~~~~~~~~~~~~~~~~ /var/lib/jenkins/workspace/Cforall_master_2/libcfa/src/exception.c: In function '__cfaehm_rethrow_adapter': /var/lib/jenkins/workspace/Cforall_master_2/libcfa/src/exception.c:300:9: warning: ignoring return value of 'write' declared with attribute 'warn_unused_result' [-Wunused-result] 300 | write( 2, "abort6\n", 7 ); | ^~~~~~~~~~~~~~~~~~~~~~~~~ CFA interpose.lo CFA prelude-inline.lo CFA startup.lo CC virtual.lo GEN prelude.lo CFA concurrency/locks.lo CFA concurrency/monitor.lo CFA concurrency/mutex.lo CFA concurrency/select.lo CFA concurrency/thread.lo CFA concurrency/cofor.lo CFA interpose_thread.lo CPPAS concurrency/CtxSwitch-x64.lo CC concurrency/invoke.lo CFA concurrency/io.lo CFA concurrency/kernel/startup.lo CFA concurrency/preemption.lo CFA concurrency/ready_queue.lo CFA concurrency/stats.lo CFA concurrency/pthread.lo CFA bits/weakso_locks.lo CFA algorithms/range_iterator.lo CFA collections/maybe.lo CFA collections/pair.lo CFA collections/result.lo CFA collections/string.lo CFA collections/string_res.lo CFA collections/vector.lo CFA device/cpu.lo CFA concurrency/alarm.lo CFA concurrency/coroutine.lo CFA concurrency/exception.lo CFA concurrency/kernel.lo CFA concurrency/kernel/cluster.lo CFA concurrency/clib/cfathread.lo CFA concurrency/io/setup.lo CFA concurrency/io/call.lo /usr/include/linux/io_uring.h:83:43: warning: 'packed' attribute ignored for field of type 'union __io_uring_sqe____anonymous55' [-Wattributes] 83 | } __attribute__((packed)); | ^ /usr/include/linux/io_uring.h:83:43: warning: 'packed' attribute ignored for field of type 'union __io_uring_sqe____anonymous131' [-Wattributes] 83 | } __attribute__((packed)); | ^ /usr/include/x86_64-linux-gnu/bits/socket2.h:70:95: warning: '_X12_constructorFv_U26__anonymous___SOCKADDR_ARGU26__anonymous___SOCKADDR_ARG_autogen___1' is static but used in inline function 'recvfrom' which is not static 70 | return __recvfrom_chk (__fd, __buf, __n, sz, __flags, __addr, __addr_len); | ^ /usr/include/x86_64-linux-gnu/bits/socket2.h:70:125: warning: '_X11_destructorFv_U26__anonymous___SOCKADDR_ARG_autogen___1' is static but used in inline function 'recvfrom' which is not static 70 | return __recvfrom_chk (__fd, __buf, __n, sz, __flags, __addr, __addr_len); | ^ /usr/include/x86_64-linux-gnu/bits/socket2.h:68:104: warning: '_X12_constructorFv_U26__anonymous___SOCKADDR_ARGU26__anonymous___SOCKADDR_ARG_autogen___1' is static but used in inline function 'recvfrom' which is not static 68 | return __recvfrom_chk_warn (__fd, __buf, __n, sz, __flags, __addr, | ^ /usr/include/x86_64-linux-gnu/bits/socket2.h:68:129: warning: '_X11_destructorFv_U26__anonymous___SOCKADDR_ARG_autogen___1' is static but used in inline function 'recvfrom' which is not static 68 | return __recvfrom_chk_warn (__fd, __buf, __n, sz, __flags, __addr, | ^ /usr/include/x86_64-linux-gnu/bits/socket2.h:66:97: warning: '_X12_constructorFv_U26__anonymous___SOCKADDR_ARGU26__anonymous___SOCKADDR_ARG_autogen___1' is static but used in inline function 'recvfrom' which is not static 66 | return __recvfrom_alias (__fd, __buf, __n, __flags, __addr, __addr_len); | ^ /usr/include/x86_64-linux-gnu/bits/socket2.h:66:129: warning: '_X11_destructorFv_U26__anonymous___SOCKADDR_ARG_autogen___1' is static but used in inline function 'recvfrom' which is not static 66 | return __recvfrom_alias (__fd, __buf, __n, __flags, __addr, __addr_len); | ^ /usr/include/x86_64-linux-gnu/bits/socket2.h:70:95: warning: '_X12_constructorFv_U26__anonymous___SOCKADDR_ARGU26__anonymous___SOCKADDR_ARG_autogen___1' is static but used in inline function 'recvfrom' which is not static 70 | return __recvfrom_chk (__fd, __buf, __n, sz, __flags, __addr, __addr_len); | ^ /usr/include/x86_64-linux-gnu/bits/socket2.h:70:125: warning: '_X11_destructorFv_U26__anonymous___SOCKADDR_ARG_autogen___1' is static but used in inline function 'recvfrom' which is not static 70 | return __recvfrom_chk (__fd, __buf, __n, sz, __flags, __addr, __addr_len); | ^ /usr/include/x86_64-linux-gnu/bits/socket2.h:68:104: warning: '_X12_constructorFv_U26__anonymous___SOCKADDR_ARGU26__anonymous___SOCKADDR_ARG_autogen___1' is static but used in inline function 'recvfrom' which is not static 68 | return __recvfrom_chk_warn (__fd, __buf, __n, sz, __flags, __addr, | ^ /usr/include/x86_64-linux-gnu/bits/socket2.h:68:129: warning: '_X11_destructorFv_U26__anonymous___SOCKADDR_ARG_autogen___1' is static but used in inline function 'recvfrom' which is not static 68 | return __recvfrom_chk_warn (__fd, __buf, __n, sz, __flags, __addr, | ^ /usr/include/x86_64-linux-gnu/bits/socket2.h:66:97: warning: '_X12_constructorFv_U26__anonymous___SOCKADDR_ARGU26__anonymous___SOCKADDR_ARG_autogen___1' is static but used in inline function 'recvfrom' which is not static 66 | return __recvfrom_alias (__fd, __buf, __n, __flags, __addr, __addr_len); | ^ /usr/include/x86_64-linux-gnu/bits/socket2.h:66:129: warning: '_X11_destructorFv_U26__anonymous___SOCKADDR_ARG_autogen___1' is static but used in inline function 'recvfrom' which is not static 66 | return __recvfrom_alias (__fd, __buf, __n, __flags, __addr, __addr_len); | ^ CCLD libcfa.la /usr/bin/ld: warning: .libs/common.o: requires executable stack (because the .note.GNU-stack section is executable) /usr/bin/ld: .libs/exception.o: warning: relocation against `__gcfa_personality_v0' in read-only section `.text' /usr/bin/ld: warning: creating DT_TEXTREL in a shared object /usr/include/linux/io_uring.h:83:43: warning: 'packed' attribute ignored for field of type 'union __io_uring_sqe____anonymous65' [-Wattributes] 83 | } __attribute__((packed)); | ^ /usr/include/x86_64-linux-gnu/bits/socket2.h:70:94: warning: '_X12_constructorFv_U26__anonymous___SOCKADDR_ARGU26__anonymous___SOCKADDR_ARG_autogen___1' is static but used in inline function 'recvfrom' which is not static 70 | return __recvfrom_chk (__fd, __buf, __n, sz, __flags, __addr, __addr_len); | ^ /usr/include/x86_64-linux-gnu/bits/socket2.h:70:124: warning: '_X11_destructorFv_U26__anonymous___SOCKADDR_ARG_autogen___1' is static but used in inline function 'recvfrom' which is not static 70 | return __recvfrom_chk (__fd, __buf, __n, sz, __flags, __addr, __addr_len); | ^ /usr/include/x86_64-linux-gnu/bits/socket2.h:68:103: warning: '_X12_constructorFv_U26__anonymous___SOCKADDR_ARGU26__anonymous___SOCKADDR_ARG_autogen___1' is static but used in inline function 'recvfrom' which is not static 68 | return __recvfrom_chk_warn (__fd, __buf, __n, sz, __flags, __addr, | ^ /usr/include/x86_64-linux-gnu/bits/socket2.h:68:128: warning: '_X11_destructorFv_U26__anonymous___SOCKADDR_ARG_autogen___1' is static but used in inline function 'recvfrom' which is not static 68 | return __recvfrom_chk_warn (__fd, __buf, __n, sz, __flags, __addr, | ^ /usr/include/x86_64-linux-gnu/bits/socket2.h:66:96: warning: '_X12_constructorFv_U26__anonymous___SOCKADDR_ARGU26__anonymous___SOCKADDR_ARG_autogen___1' is static but used in inline function 'recvfrom' which is not static 66 | return __recvfrom_alias (__fd, __buf, __n, __flags, __addr, __addr_len); | ^ /usr/include/x86_64-linux-gnu/bits/socket2.h:66:128: warning: '_X11_destructorFv_U26__anonymous___SOCKADDR_ARG_autogen___1' is static but used in inline function 'recvfrom' which is not static 66 | return __recvfrom_alias (__fd, __buf, __n, __flags, __addr, __addr_len); | ^ /usr/include/linux/io_uring.h:83:43: warning: 'packed' attribute ignored for field of type 'union __io_uring_sqe____anonymous121' [-Wattributes] 83 | } __attribute__((packed)); | ^ /usr/include/x86_64-linux-gnu/bits/socket2.h:70:95: warning: '_X12_constructorFv_U26__anonymous___SOCKADDR_ARGU26__anonymous___SOCKADDR_ARG_autogen___1' is static but used in inline function 'recvfrom' which is not static 70 | return __recvfrom_chk (__fd, __buf, __n, sz, __flags, __addr, __addr_len); | ^ /usr/include/x86_64-linux-gnu/bits/socket2.h:70:125: warning: '_X11_destructorFv_U26__anonymous___SOCKADDR_ARG_autogen___1' is static but used in inline function 'recvfrom' which is not static 70 | return __recvfrom_chk (__fd, __buf, __n, sz, __flags, __addr, __addr_len); | ^ /usr/include/x86_64-linux-gnu/bits/socket2.h:68:104: warning: '_X12_constructorFv_U26__anonymous___SOCKADDR_ARGU26__anonymous___SOCKADDR_ARG_autogen___1' is static but used in inline function 'recvfrom' which is not static 68 | return __recvfrom_chk_warn (__fd, __buf, __n, sz, __flags, __addr, | ^ /usr/include/x86_64-linux-gnu/bits/socket2.h:68:129: warning: '_X11_destructorFv_U26__anonymous___SOCKADDR_ARG_autogen___1' is static but used in inline function 'recvfrom' which is not static 68 | return __recvfrom_chk_warn (__fd, __buf, __n, sz, __flags, __addr, | ^ /usr/include/x86_64-linux-gnu/bits/socket2.h:66:97: warning: '_X12_constructorFv_U26__anonymous___SOCKADDR_ARGU26__anonymous___SOCKADDR_ARG_autogen___1' is static but used in inline function 'recvfrom' which is not static 66 | return __recvfrom_alias (__fd, __buf, __n, __flags, __addr, __addr_len); | ^ /usr/include/x86_64-linux-gnu/bits/socket2.h:66:129: warning: '_X11_destructorFv_U26__anonymous___SOCKADDR_ARG_autogen___1' is static but used in inline function 'recvfrom' which is not static 66 | return __recvfrom_alias (__fd, __buf, __n, __flags, __addr, __addr_len); | ^ /usr/include/linux/io_uring.h:83:43: warning: 'packed' attribute ignored for field of type 'union __io_uring_sqe____anonymous121' [-Wattributes] 83 | } __attribute__((packed)); | ^ /usr/include/x86_64-linux-gnu/bits/socket2.h:70:95: warning: '_X12_constructorFv_U26__anonymous___SOCKADDR_ARGU26__anonymous___SOCKADDR_ARG_autogen___1' is static but used in inline function 'recvfrom' which is not static 70 | return __recvfrom_chk (__fd, __buf, __n, sz, __flags, __addr, __addr_len); | ^ /usr/include/x86_64-linux-gnu/bits/socket2.h:70:125: warning: '_X11_destructorFv_U26__anonymous___SOCKADDR_ARG_autogen___1' is static but used in inline function 'recvfrom' which is not static 70 | return __recvfrom_chk (__fd, __buf, __n, sz, __flags, __addr, __addr_len); | ^ /usr/include/x86_64-linux-gnu/bits/socket2.h:68:104: warning: '_X12_constructorFv_U26__anonymous___SOCKADDR_ARGU26__anonymous___SOCKADDR_ARG_autogen___1' is static but used in inline function 'recvfrom' which is not static 68 | return __recvfrom_chk_warn (__fd, __buf, __n, sz, __flags, __addr, | ^ /usr/include/x86_64-linux-gnu/bits/socket2.h:68:129: warning: '_X11_destructorFv_U26__anonymous___SOCKADDR_ARG_autogen___1' is static but used in inline function 'recvfrom' which is not static 68 | return __recvfrom_chk_warn (__fd, __buf, __n, sz, __flags, __addr, | ^ /usr/include/x86_64-linux-gnu/bits/socket2.h:66:97: warning: '_X12_constructorFv_U26__anonymous___SOCKADDR_ARGU26__anonymous___SOCKADDR_ARG_autogen___1' is static but used in inline function 'recvfrom' which is not static 66 | return __recvfrom_alias (__fd, __buf, __n, __flags, __addr, __addr_len); | ^ /usr/include/x86_64-linux-gnu/bits/socket2.h:66:129: warning: '_X11_destructorFv_U26__anonymous___SOCKADDR_ARG_autogen___1' is static but used in inline function 'recvfrom' which is not static 66 | return __recvfrom_alias (__fd, __buf, __n, __flags, __addr, __addr_len); | ^ /usr/include/linux/io_uring.h:83:43: warning: 'packed' attribute ignored for field of type 'union __io_uring_sqe____anonymous32' [-Wattributes] 83 | } __attribute__((packed)); | ^ /usr/include/x86_64-linux-gnu/bits/socket2.h:70:94: warning: '_X12_constructorFv_U26__anonymous___SOCKADDR_ARGU26__anonymous___SOCKADDR_ARG_autogen___1' is static but used in inline function 'recvfrom' which is not static 70 | return __recvfrom_chk (__fd, __buf, __n, sz, __flags, __addr, __addr_len); | ^ /usr/include/x86_64-linux-gnu/bits/socket2.h:70:124: warning: '_X11_destructorFv_U26__anonymous___SOCKADDR_ARG_autogen___1' is static but used in inline function 'recvfrom' which is not static 70 | return __recvfrom_chk (__fd, __buf, __n, sz, __flags, __addr, __addr_len); | ^ /usr/include/x86_64-linux-gnu/bits/socket2.h:68:103: warning: '_X12_constructorFv_U26__anonymous___SOCKADDR_ARGU26__anonymous___SOCKADDR_ARG_autogen___1' is static but used in inline function 'recvfrom' which is not static 68 | return __recvfrom_chk_warn (__fd, __buf, __n, sz, __flags, __addr, | ^ /usr/include/x86_64-linux-gnu/bits/socket2.h:68:128: warning: '_X11_destructorFv_U26__anonymous___SOCKADDR_ARG_autogen___1' is static but used in inline function 'recvfrom' which is not static 68 | return __recvfrom_chk_warn (__fd, __buf, __n, sz, __flags, __addr, | ^ /usr/include/x86_64-linux-gnu/bits/socket2.h:66:96: warning: '_X12_constructorFv_U26__anonymous___SOCKADDR_ARGU26__anonymous___SOCKADDR_ARG_autogen___1' is static but used in inline function 'recvfrom' which is not static 66 | return __recvfrom_alias (__fd, __buf, __n, __flags, __addr, __addr_len); | ^ /usr/include/x86_64-linux-gnu/bits/socket2.h:66:128: warning: '_X11_destructorFv_U26__anonymous___SOCKADDR_ARG_autogen___1' is static but used in inline function 'recvfrom' which is not static 66 | return __recvfrom_alias (__fd, __buf, __n, __flags, __addr, __addr_len); | ^ /usr/include/linux/io_uring.h:83:43: warning: 'packed' attribute ignored for field of type 'union __io_uring_sqe____anonymous97' [-Wattributes] 83 | } __attribute__((packed)); | ^ /usr/include/x86_64-linux-gnu/bits/socket2.h:70:95: warning: '_X12_constructorFv_U26__anonymous___SOCKADDR_ARGU26__anonymous___SOCKADDR_ARG_autogen___1' is static but used in inline function 'recvfrom' which is not static 70 | return __recvfrom_chk (__fd, __buf, __n, sz, __flags, __addr, __addr_len); | ^ /usr/include/x86_64-linux-gnu/bits/socket2.h:70:125: warning: '_X11_destructorFv_U26__anonymous___SOCKADDR_ARG_autogen___1' is static but used in inline function 'recvfrom' which is not static 70 | return __recvfrom_chk (__fd, __buf, __n, sz, __flags, __addr, __addr_len); | ^ /usr/include/x86_64-linux-gnu/bits/socket2.h:68:104: warning: '_X12_constructorFv_U26__anonymous___SOCKADDR_ARGU26__anonymous___SOCKADDR_ARG_autogen___1' is static but used in inline function 'recvfrom' which is not static 68 | return __recvfrom_chk_warn (__fd, __buf, __n, sz, __flags, __addr, | ^ /usr/include/x86_64-linux-gnu/bits/socket2.h:68:129: warning: '_X11_destructorFv_U26__anonymous___SOCKADDR_ARG_autogen___1' is static but used in inline function 'recvfrom' which is not static 68 | return __recvfrom_chk_warn (__fd, __buf, __n, sz, __flags, __addr, | ^ /usr/include/x86_64-linux-gnu/bits/socket2.h:66:97: warning: '_X12_constructorFv_U26__anonymous___SOCKADDR_ARGU26__anonymous___SOCKADDR_ARG_autogen___1' is static but used in inline function 'recvfrom' which is not static 66 | return __recvfrom_alias (__fd, __buf, __n, __flags, __addr, __addr_len); | ^ /usr/include/x86_64-linux-gnu/bits/socket2.h:66:129: warning: '_X11_destructorFv_U26__anonymous___SOCKADDR_ARG_autogen___1' is static but used in inline function 'recvfrom' which is not static 66 | return __recvfrom_alias (__fd, __buf, __n, __flags, __addr, __addr_len); | ^ CCLD libcfathread.la /usr/bin/ld: warning: concurrency/.libs/coroutine.o: requires executable stack (because the .note.GNU-stack section is executable) make[1]: Nothing to be done for 'all-am'. [Pipeline] } [Pipeline] // dir [Pipeline] } [Pipeline] // stage [Pipeline] echo -------- Build : install -------- [Pipeline] stage [Pipeline] { (Build : install) [Pipeline] dir Running in /var/lib/jenkins/workspace/Cforall_master_2@tmp [Pipeline] { [Pipeline] sh + nproc + make -j 16 --no-print-directory install Making install in driver make install-exec-hook /usr/bin/mkdir -p '/var/lib/jenkins/workspace/Cforall_master_2@tmp/lib/cfa/' /usr/bin/install -c cfa '/var/lib/jenkins/workspace/Cforall_master_2@tmp/bin//cfa' /bin/bash ../libtool --mode=install /usr/bin/install -c as cc1 '/var/lib/jenkins/workspace/Cforall_master_2@tmp/lib/cfa/' libtool: install: /usr/bin/install -c as /var/lib/jenkins/workspace/Cforall_master_2@tmp/lib/cfa/as libtool: install: /usr/bin/install -c cc1 /var/lib/jenkins/workspace/Cforall_master_2@tmp/lib/cfa/cc1 Making install in src make install-am make[3]: Nothing to be done for 'install-exec-am'. /usr/bin/mkdir -p '/var/lib/jenkins/workspace/Cforall_master_2@tmp/lib/cfa/' /bin/bash ../libtool --mode=install /usr/bin/install -c ../driver/cfa-cpp '/var/lib/jenkins/workspace/Cforall_master_2@tmp/lib/cfa/' libtool: install: /usr/bin/install -c ../driver/cfa-cpp /var/lib/jenkins/workspace/Cforall_master_2@tmp/lib/cfa/cfa-cpp Making install in . (CDPATH="${ZSH_VERSION+.}:" && cd /var/lib/jenkins/workspace/Cforall_master_2 && /bin/bash '/var/lib/jenkins/workspace/Cforall_master_2/automake/missing' autoheader) rm -f stamp-h1 touch /var/lib/jenkins/workspace/Cforall_master_2/src/config.h.in cd . && /bin/bash ./config.status config.h config.status: creating config.h config.status: config.h is unchanged make[2]: Nothing to be done for 'install-exec-am'. /usr/bin/mkdir -p '/var/lib/jenkins/workspace/Cforall_master_2@tmp/share/man/man1' /usr/bin/install -c -m 644 /var/lib/jenkins/workspace/Cforall_master_2/doc/man/cfa.1 '/var/lib/jenkins/workspace/Cforall_master_2@tmp/share/man/man1' Making install in libcfa/x64-debug Making install in prelude make[3]: Nothing to be done for 'install-exec-am'. /usr/bin/mkdir -p '/var/lib/jenkins/workspace/Cforall_master_2@tmp/lib/cfa/x64-debug/' /usr/bin/install -c -m 644 gcc-builtins.cfa builtins.cfa extras.cfa prelude.cfa bootloader.c defines.hfa '/var/lib/jenkins/workspace/Cforall_master_2@tmp/lib/cfa/x64-debug/' Making install in src /usr/bin/mkdir -p '/var/lib/jenkins/workspace/Cforall_master_2@tmp/lib/cfa/x64-debug/' /bin/bash ../libtool --mode=install /usr/bin/install -c libcfa.la libcfathread.la '/var/lib/jenkins/workspace/Cforall_master_2@tmp/lib/cfa/x64-debug/' /usr/bin/mkdir -p '/var/lib/jenkins/workspace/Cforall_master_2@tmp/include/cfa/' /usr/bin/mkdir -p '/var/lib/jenkins/workspace/Cforall_master_2@tmp/include/cfa//stdhdr/sys' /usr/bin/install -c -m 644 /var/lib/jenkins/workspace/Cforall_master_2/libcfa/src/stdhdr/sys/socket.h /var/lib/jenkins/workspace/Cforall_master_2/libcfa/src/stdhdr/sys/time.h /var/lib/jenkins/workspace/Cforall_master_2/libcfa/src/stdhdr/sys/mman.h '/var/lib/jenkins/workspace/Cforall_master_2@tmp/include/cfa//stdhdr/sys' /usr/bin/mkdir -p '/var/lib/jenkins/workspace/Cforall_master_2@tmp/include/cfa//algorithms' /usr/bin/install -c -m 644 /var/lib/jenkins/workspace/Cforall_master_2/libcfa/src/algorithms/range_iterator.hfa '/var/lib/jenkins/workspace/Cforall_master_2@tmp/include/cfa//algorithms' /usr/bin/mkdir -p '/var/lib/jenkins/workspace/Cforall_master_2@tmp/include/cfa//concurrency/kernel' /usr/bin/install -c -m 644 /var/lib/jenkins/workspace/Cforall_master_2/libcfa/src/concurrency/kernel/cluster.hfa /var/lib/jenkins/workspace/Cforall_master_2/libcfa/src/concurrency/kernel/fwd.hfa '/var/lib/jenkins/workspace/Cforall_master_2@tmp/include/cfa//concurrency/kernel' /usr/bin/install -c -m 644 /var/lib/jenkins/workspace/Cforall_master_2/libcfa/src/common.hfa /var/lib/jenkins/workspace/Cforall_master_2/libcfa/src/fstream.hfa /var/lib/jenkins/workspace/Cforall_master_2/libcfa/src/heap.hfa /var/lib/jenkins/workspace/Cforall_master_2/libcfa/src/iostream.hfa /var/lib/jenkins/workspace/Cforall_master_2/libcfa/src/iterator.hfa /var/lib/jenkins/workspace/Cforall_master_2/libcfa/src/limits.hfa /var/lib/jenkins/workspace/Cforall_master_2/libcfa/src/math.hfa /var/lib/jenkins/workspace/Cforall_master_2/libcfa/src/memory.hfa /var/lib/jenkins/workspace/Cforall_master_2/libcfa/src/parseargs.hfa /var/lib/jenkins/workspace/Cforall_master_2/libcfa/src/parseconfig.hfa /var/lib/jenkins/workspace/Cforall_master_2/libcfa/src/rational.hfa /var/lib/jenkins/workspace/Cforall_master_2/libcfa/src/stdlib.hfa /var/lib/jenkins/workspace/Cforall_master_2/libcfa/src/strstream.hfa /var/lib/jenkins/workspace/Cforall_master_2/libcfa/src/time.hfa /var/lib/jenkins/workspace/Cforall_master_2/libcfa/src/Exception.hfa /var/lib/jenkins/workspace/Cforall_master_2/libcfa/src/bitmanip.hfa /var/lib/jenkins/workspace/Cforall_master_2/libcfa/src/clock.hfa /var/lib/jenkins/workspace/Cforall_master_2/libcfa/src/exception.hfa /var/lib/jenkins/workspace/Cforall_master_2/libcfa/src/exception.h /var/lib/jenkins/workspace/Cforall_master_2/libcfa/src/gmp.hfa /var/lib/jenkins/workspace/Cforall_master_2/libcfa/src/math.trait.hfa /var/lib/jenkins/workspace/Cforall_master_2/libcfa/src/raii.hfa /var/lib/jenkins/workspace/Cforall_master_2/libcfa/src/time_t.hfa /var/lib/jenkins/workspace/Cforall_master_2/libcfa/src/virtual_dtor.hfa '/var/lib/jenkins/workspace/Cforall_master_2@tmp/include/cfa//.' /usr/bin/mkdir -p '/var/lib/jenkins/workspace/Cforall_master_2@tmp/include/cfa//concurrency' /usr/bin/install -c -m 644 /var/lib/jenkins/workspace/Cforall_master_2/libcfa/src/concurrency/iofwd.hfa /var/lib/jenkins/workspace/Cforall_master_2/libcfa/src/concurrency/barrier.hfa /var/lib/jenkins/workspace/Cforall_master_2/libcfa/src/concurrency/alarm.hfa /var/lib/jenkins/workspace/Cforall_master_2/libcfa/src/concurrency/coroutine.hfa /var/lib/jenkins/workspace/Cforall_master_2/libcfa/src/concurrency/exception.hfa /var/lib/jenkins/workspace/Cforall_master_2/libcfa/src/concurrency/kernel.hfa /var/lib/jenkins/workspace/Cforall_master_2/libcfa/src/concurrency/locks.hfa /var/lib/jenkins/workspace/Cforall_master_2/libcfa/src/concurrency/monitor.hfa /var/lib/jenkins/workspace/Cforall_master_2/libcfa/src/concurrency/mutex.hfa /var/lib/jenkins/workspace/Cforall_master_2/libcfa/src/concurrency/select.hfa /var/lib/jenkins/workspace/Cforall_master_2/libcfa/src/concurrency/thread.hfa /var/lib/jenkins/workspace/Cforall_master_2/libcfa/src/concurrency/cofor.hfa /var/lib/jenkins/workspace/Cforall_master_2/libcfa/src/concurrency/invoke.h /var/lib/jenkins/workspace/Cforall_master_2/libcfa/src/concurrency/future.hfa /var/lib/jenkins/workspace/Cforall_master_2/libcfa/src/concurrency/once.hfa /var/lib/jenkins/workspace/Cforall_master_2/libcfa/src/concurrency/mutex_stmt.hfa /var/lib/jenkins/workspace/Cforall_master_2/libcfa/src/concurrency/channel.hfa /var/lib/jenkins/workspace/Cforall_master_2/libcfa/src/concurrency/actor.hfa '/var/lib/jenkins/workspace/Cforall_master_2@tmp/include/cfa//concurrency' /usr/bin/mkdir -p '/var/lib/jenkins/workspace/Cforall_master_2@tmp/include/cfa//concurrency/clib' /usr/bin/install -c -m 644 /var/lib/jenkins/workspace/Cforall_master_2/libcfa/src/concurrency/clib/cfathread.h '/var/lib/jenkins/workspace/Cforall_master_2@tmp/include/cfa//concurrency/clib' /usr/bin/mkdir -p '/var/lib/jenkins/workspace/Cforall_master_2@tmp/include/cfa//device' /usr/bin/install -c -m 644 /var/lib/jenkins/workspace/Cforall_master_2/libcfa/src/device/cpu.hfa '/var/lib/jenkins/workspace/Cforall_master_2@tmp/include/cfa//device' /usr/bin/mkdir -p '/var/lib/jenkins/workspace/Cforall_master_2@tmp/include/cfa//stdhdr/libltdl' /usr/bin/install -c -m 644 /var/lib/jenkins/workspace/Cforall_master_2/libcfa/src/stdhdr/libltdl/lt_dlloader.h '/var/lib/jenkins/workspace/Cforall_master_2@tmp/include/cfa//stdhdr/libltdl' /usr/bin/mkdir -p '/var/lib/jenkins/workspace/Cforall_master_2@tmp/include/cfa//vec' libtool: install: /usr/bin/install -c .libs/libcfa.so.1.0.0 /var/lib/jenkins/workspace/Cforall_master_2@tmp/lib/cfa/x64-debug/libcfa.so.1.0.0 /usr/bin/install -c -m 644 /var/lib/jenkins/workspace/Cforall_master_2/libcfa/src/vec/vec.hfa /var/lib/jenkins/workspace/Cforall_master_2/libcfa/src/vec/vec2.hfa /var/lib/jenkins/workspace/Cforall_master_2/libcfa/src/vec/vec3.hfa /var/lib/jenkins/workspace/Cforall_master_2/libcfa/src/vec/vec4.hfa '/var/lib/jenkins/workspace/Cforall_master_2@tmp/include/cfa//vec' /usr/bin/mkdir -p '/var/lib/jenkins/workspace/Cforall_master_2@tmp/include/cfa//bits' /usr/bin/install -c -m 644 /var/lib/jenkins/workspace/Cforall_master_2/libcfa/src/bits/weakso_locks.hfa /var/lib/jenkins/workspace/Cforall_master_2/libcfa/src/bits/algorithm.hfa /var/lib/jenkins/workspace/Cforall_master_2/libcfa/src/bits/align.hfa /var/lib/jenkins/workspace/Cforall_master_2/libcfa/src/bits/collections.hfa /var/lib/jenkins/workspace/Cforall_master_2/libcfa/src/bits/debug.hfa /var/lib/jenkins/workspace/Cforall_master_2/libcfa/src/bits/defs.hfa /var/lib/jenkins/workspace/Cforall_master_2/libcfa/src/bits/locks.hfa /var/lib/jenkins/workspace/Cforall_master_2/libcfa/src/bits/collection.hfa /var/lib/jenkins/workspace/Cforall_master_2/libcfa/src/bits/stack.hfa /var/lib/jenkins/workspace/Cforall_master_2/libcfa/src/bits/queue.hfa /var/lib/jenkins/workspace/Cforall_master_2/libcfa/src/bits/sequence.hfa /var/lib/jenkins/workspace/Cforall_master_2/libcfa/src/bits/atomic.hfa /var/lib/jenkins/workspace/Cforall_master_2/libcfa/src/bits/random.hfa '/var/lib/jenkins/workspace/Cforall_master_2@tmp/include/cfa//bits' libtool: install: (cd /var/lib/jenkins/workspace/Cforall_master_2@tmp/lib/cfa/x64-debug && { ln -s -f libcfa.so.1.0.0 libcfa.so.1 || { rm -f libcfa.so.1 && ln -s libcfa.so.1.0.0 libcfa.so.1; }; }) /usr/bin/mkdir -p '/var/lib/jenkins/workspace/Cforall_master_2@tmp/include/cfa//stdhdr' /usr/bin/install -c -m 644 /var/lib/jenkins/workspace/Cforall_master_2/libcfa/src/stdhdr/string.h /var/lib/jenkins/workspace/Cforall_master_2/libcfa/src/stdhdr/uchar.h /var/lib/jenkins/workspace/Cforall_master_2/libcfa/src/stdhdr/stdbool.h /var/lib/jenkins/workspace/Cforall_master_2/libcfa/src/stdhdr/iso646.h /var/lib/jenkins/workspace/Cforall_master_2/libcfa/src/stdhdr/stddef.h /var/lib/jenkins/workspace/Cforall_master_2/libcfa/src/stdhdr/inttypes.h /var/lib/jenkins/workspace/Cforall_master_2/libcfa/src/stdhdr/wctype.h /var/lib/jenkins/workspace/Cforall_master_2/libcfa/src/stdhdr/limits.h /var/lib/jenkins/workspace/Cforall_master_2/libcfa/src/stdhdr/malloc.h /var/lib/jenkins/workspace/Cforall_master_2/libcfa/src/stdhdr/assert.h /var/lib/jenkins/workspace/Cforall_master_2/libcfa/src/stdhdr/setjmp.h /var/lib/jenkins/workspace/Cforall_master_2/libcfa/src/stdhdr/complex.h /var/lib/jenkins/workspace/Cforall_master_2/libcfa/src/stdhdr/threads.h /var/lib/jenkins/workspace/Cforall_master_2/libcfa/src/stdhdr/locale.h /var/lib/jenkins/workspace/Cforall_master_2/libcfa/src/stdhdr/ctype.h /var/lib/jenkins/workspace/Cforall_master_2/libcfa/src/stdhdr/stdlib.h /var/lib/jenkins/workspace/Cforall_master_2/libcfa/src/stdhdr/stdalign.h /var/lib/jenkins/workspace/Cforall_master_2/libcfa/src/stdhdr/fenv.h /var/lib/jenkins/workspace/Cforall_master_2/libcfa/src/stdhdr/stdarg.h /var/lib/jenkins/workspace/Cforall_master_2/libcfa/src/stdhdr/wchar.h /var/lib/jenkins/workspace/Cforall_master_2/libcfa/src/stdhdr/gmp.h /var/lib/jenkins/workspace/Cforall_master_2/libcfa/src/stdhdr/pthread.h /var/lib/jenkins/workspace/Cforall_master_2/libcfa/src/stdhdr/stdnoreturn.h /var/lib/jenkins/workspace/Cforall_master_2/libcfa/src/stdhdr/stdint.h /var/lib/jenkins/workspace/Cforall_master_2/libcfa/src/stdhdr/float.h /var/lib/jenkins/workspace/Cforall_master_2/libcfa/src/stdhdr/time.h /var/lib/jenkins/workspace/Cforall_master_2/libcfa/src/stdhdr/unistd.h /var/lib/jenkins/workspace/Cforall_master_2/libcfa/src/stdhdr/signal.h /var/lib/jenkins/workspace/Cforall_master_2/libcfa/src/stdhdr/stdio.h /var/lib/jenkins/workspace/Cforall_master_2/libcfa/src/stdhdr/tgmath.h /var/lib/jenkins/workspace/Cforall_master_2/libcfa/src/stdhdr/errno.h /var/lib/jenkins/workspace/Cforall_master_2/libcfa/src/stdhdr/stdatomic.h /var/lib/jenkins/workspace/Cforall_master_2/libcfa/src/stdhdr/unwind.h /var/lib/jenkins/workspace/Cforall_master_2/libcfa/src/stdhdr/math.h '/var/lib/jenkins/workspace/Cforall_master_2@tmp/include/cfa//stdhdr' libtool: install: (cd /var/lib/jenkins/workspace/Cforall_master_2@tmp/lib/cfa/x64-debug && { ln -s -f libcfa.so.1.0.0 libcfa.so || { rm -f libcfa.so && ln -s libcfa.so.1.0.0 libcfa.so; }; }) /usr/bin/mkdir -p '/var/lib/jenkins/workspace/Cforall_master_2@tmp/include/cfa//collections' /usr/bin/install -c -m 644 /var/lib/jenkins/workspace/Cforall_master_2/libcfa/src/collections/maybe.hfa /var/lib/jenkins/workspace/Cforall_master_2/libcfa/src/collections/pair.hfa /var/lib/jenkins/workspace/Cforall_master_2/libcfa/src/collections/result.hfa /var/lib/jenkins/workspace/Cforall_master_2/libcfa/src/collections/string.hfa /var/lib/jenkins/workspace/Cforall_master_2/libcfa/src/collections/string_res.hfa /var/lib/jenkins/workspace/Cforall_master_2/libcfa/src/collections/vector.hfa /var/lib/jenkins/workspace/Cforall_master_2/libcfa/src/collections/array.hfa /var/lib/jenkins/workspace/Cforall_master_2/libcfa/src/collections/list.hfa /var/lib/jenkins/workspace/Cforall_master_2/libcfa/src/collections/list2.hfa /var/lib/jenkins/workspace/Cforall_master_2/libcfa/src/collections/lockfree.hfa /var/lib/jenkins/workspace/Cforall_master_2/libcfa/src/collections/string_sharectx.hfa /var/lib/jenkins/workspace/Cforall_master_2/libcfa/src/collections/vector2.hfa '/var/lib/jenkins/workspace/Cforall_master_2@tmp/include/cfa//collections' libtool: install: /usr/bin/install -c .libs/libcfa.lai /var/lib/jenkins/workspace/Cforall_master_2@tmp/lib/cfa/x64-debug/libcfa.la libtool: install: /usr/bin/install -c .libs/libcfathread.so.1.0.0 /var/lib/jenkins/workspace/Cforall_master_2@tmp/lib/cfa/x64-debug/libcfathread.so.1.0.0 libtool: install: (cd /var/lib/jenkins/workspace/Cforall_master_2@tmp/lib/cfa/x64-debug && { ln -s -f libcfathread.so.1.0.0 libcfathread.so.1 || { rm -f libcfathread.so.1 && ln -s libcfathread.so.1.0.0 libcfathread.so.1; }; }) libtool: install: (cd /var/lib/jenkins/workspace/Cforall_master_2@tmp/lib/cfa/x64-debug && { ln -s -f libcfathread.so.1.0.0 libcfathread.so || { rm -f libcfathread.so && ln -s libcfathread.so.1.0.0 libcfathread.so; }; }) libtool: install: /usr/bin/install -c .libs/libcfathread.lai /var/lib/jenkins/workspace/Cforall_master_2@tmp/lib/cfa/x64-debug/libcfathread.la libtool: warning: remember to run 'libtool --finish /var/lib/jenkins/workspace/Cforall_master_2@tmp/lib/cfa/x64-debug/' make[3]: Nothing to be done for 'install-exec-am'. make[3]: Nothing to be done for 'install-data-am'. Making install in libcfa/x64-nodebug Making install in prelude make[3]: Nothing to be done for 'install-exec-am'. /usr/bin/mkdir -p '/var/lib/jenkins/workspace/Cforall_master_2@tmp/lib/cfa/x64-nodebug/' /usr/bin/install -c -m 644 gcc-builtins.cfa builtins.cfa extras.cfa prelude.cfa bootloader.c defines.hfa '/var/lib/jenkins/workspace/Cforall_master_2@tmp/lib/cfa/x64-nodebug/' Making install in src /usr/bin/mkdir -p '/var/lib/jenkins/workspace/Cforall_master_2@tmp/lib/cfa/x64-nodebug/' /bin/bash ../libtool --mode=install /usr/bin/install -c libcfa.la libcfathread.la '/var/lib/jenkins/workspace/Cforall_master_2@tmp/lib/cfa/x64-nodebug/' /usr/bin/mkdir -p '/var/lib/jenkins/workspace/Cforall_master_2@tmp/include/cfa/' /usr/bin/mkdir -p '/var/lib/jenkins/workspace/Cforall_master_2@tmp/include/cfa//stdhdr/sys' /usr/bin/install -c -m 644 /var/lib/jenkins/workspace/Cforall_master_2/libcfa/src/stdhdr/sys/socket.h /var/lib/jenkins/workspace/Cforall_master_2/libcfa/src/stdhdr/sys/time.h /var/lib/jenkins/workspace/Cforall_master_2/libcfa/src/stdhdr/sys/mman.h '/var/lib/jenkins/workspace/Cforall_master_2@tmp/include/cfa//stdhdr/sys' /usr/bin/mkdir -p '/var/lib/jenkins/workspace/Cforall_master_2@tmp/include/cfa//algorithms' /usr/bin/install -c -m 644 /var/lib/jenkins/workspace/Cforall_master_2/libcfa/src/algorithms/range_iterator.hfa '/var/lib/jenkins/workspace/Cforall_master_2@tmp/include/cfa//algorithms' /usr/bin/mkdir -p '/var/lib/jenkins/workspace/Cforall_master_2@tmp/include/cfa//concurrency/kernel' /usr/bin/install -c -m 644 /var/lib/jenkins/workspace/Cforall_master_2/libcfa/src/concurrency/kernel/cluster.hfa /var/lib/jenkins/workspace/Cforall_master_2/libcfa/src/concurrency/kernel/fwd.hfa '/var/lib/jenkins/workspace/Cforall_master_2@tmp/include/cfa//concurrency/kernel' /usr/bin/install -c -m 644 /var/lib/jenkins/workspace/Cforall_master_2/libcfa/src/common.hfa /var/lib/jenkins/workspace/Cforall_master_2/libcfa/src/fstream.hfa /var/lib/jenkins/workspace/Cforall_master_2/libcfa/src/heap.hfa /var/lib/jenkins/workspace/Cforall_master_2/libcfa/src/iostream.hfa /var/lib/jenkins/workspace/Cforall_master_2/libcfa/src/iterator.hfa /var/lib/jenkins/workspace/Cforall_master_2/libcfa/src/limits.hfa /var/lib/jenkins/workspace/Cforall_master_2/libcfa/src/math.hfa /var/lib/jenkins/workspace/Cforall_master_2/libcfa/src/memory.hfa /var/lib/jenkins/workspace/Cforall_master_2/libcfa/src/parseargs.hfa /var/lib/jenkins/workspace/Cforall_master_2/libcfa/src/parseconfig.hfa /var/lib/jenkins/workspace/Cforall_master_2/libcfa/src/rational.hfa /var/lib/jenkins/workspace/Cforall_master_2/libcfa/src/stdlib.hfa /var/lib/jenkins/workspace/Cforall_master_2/libcfa/src/strstream.hfa /var/lib/jenkins/workspace/Cforall_master_2/libcfa/src/time.hfa /var/lib/jenkins/workspace/Cforall_master_2/libcfa/src/Exception.hfa /var/lib/jenkins/workspace/Cforall_master_2/libcfa/src/bitmanip.hfa /var/lib/jenkins/workspace/Cforall_master_2/libcfa/src/clock.hfa /var/lib/jenkins/workspace/Cforall_master_2/libcfa/src/exception.hfa /var/lib/jenkins/workspace/Cforall_master_2/libcfa/src/exception.h /var/lib/jenkins/workspace/Cforall_master_2/libcfa/src/gmp.hfa /var/lib/jenkins/workspace/Cforall_master_2/libcfa/src/math.trait.hfa /var/lib/jenkins/workspace/Cforall_master_2/libcfa/src/raii.hfa /var/lib/jenkins/workspace/Cforall_master_2/libcfa/src/time_t.hfa /var/lib/jenkins/workspace/Cforall_master_2/libcfa/src/virtual_dtor.hfa '/var/lib/jenkins/workspace/Cforall_master_2@tmp/include/cfa//.' /usr/bin/mkdir -p '/var/lib/jenkins/workspace/Cforall_master_2@tmp/include/cfa//concurrency' /usr/bin/install -c -m 644 /var/lib/jenkins/workspace/Cforall_master_2/libcfa/src/concurrency/iofwd.hfa /var/lib/jenkins/workspace/Cforall_master_2/libcfa/src/concurrency/barrier.hfa /var/lib/jenkins/workspace/Cforall_master_2/libcfa/src/concurrency/alarm.hfa /var/lib/jenkins/workspace/Cforall_master_2/libcfa/src/concurrency/coroutine.hfa /var/lib/jenkins/workspace/Cforall_master_2/libcfa/src/concurrency/exception.hfa /var/lib/jenkins/workspace/Cforall_master_2/libcfa/src/concurrency/kernel.hfa /var/lib/jenkins/workspace/Cforall_master_2/libcfa/src/concurrency/locks.hfa /var/lib/jenkins/workspace/Cforall_master_2/libcfa/src/concurrency/monitor.hfa /var/lib/jenkins/workspace/Cforall_master_2/libcfa/src/concurrency/mutex.hfa /var/lib/jenkins/workspace/Cforall_master_2/libcfa/src/concurrency/select.hfa /var/lib/jenkins/workspace/Cforall_master_2/libcfa/src/concurrency/thread.hfa /var/lib/jenkins/workspace/Cforall_master_2/libcfa/src/concurrency/cofor.hfa /var/lib/jenkins/workspace/Cforall_master_2/libcfa/src/concurrency/invoke.h /var/lib/jenkins/workspace/Cforall_master_2/libcfa/src/concurrency/future.hfa /var/lib/jenkins/workspace/Cforall_master_2/libcfa/src/concurrency/once.hfa /var/lib/jenkins/workspace/Cforall_master_2/libcfa/src/concurrency/mutex_stmt.hfa /var/lib/jenkins/workspace/Cforall_master_2/libcfa/src/concurrency/channel.hfa /var/lib/jenkins/workspace/Cforall_master_2/libcfa/src/concurrency/actor.hfa '/var/lib/jenkins/workspace/Cforall_master_2@tmp/include/cfa//concurrency' /usr/bin/mkdir -p '/var/lib/jenkins/workspace/Cforall_master_2@tmp/include/cfa//concurrency/clib' /usr/bin/install -c -m 644 /var/lib/jenkins/workspace/Cforall_master_2/libcfa/src/concurrency/clib/cfathread.h '/var/lib/jenkins/workspace/Cforall_master_2@tmp/include/cfa//concurrency/clib' /usr/bin/mkdir -p '/var/lib/jenkins/workspace/Cforall_master_2@tmp/include/cfa//device' libtool: install: /usr/bin/install -c .libs/libcfa.so.1.0.0 /var/lib/jenkins/workspace/Cforall_master_2@tmp/lib/cfa/x64-nodebug/libcfa.so.1.0.0 /usr/bin/install -c -m 644 /var/lib/jenkins/workspace/Cforall_master_2/libcfa/src/device/cpu.hfa '/var/lib/jenkins/workspace/Cforall_master_2@tmp/include/cfa//device' /usr/bin/mkdir -p '/var/lib/jenkins/workspace/Cforall_master_2@tmp/include/cfa//stdhdr/libltdl' /usr/bin/install -c -m 644 /var/lib/jenkins/workspace/Cforall_master_2/libcfa/src/stdhdr/libltdl/lt_dlloader.h '/var/lib/jenkins/workspace/Cforall_master_2@tmp/include/cfa//stdhdr/libltdl' /usr/bin/mkdir -p '/var/lib/jenkins/workspace/Cforall_master_2@tmp/include/cfa//vec' libtool: install: (cd /var/lib/jenkins/workspace/Cforall_master_2@tmp/lib/cfa/x64-nodebug && { ln -s -f libcfa.so.1.0.0 libcfa.so.1 || { rm -f libcfa.so.1 && ln -s libcfa.so.1.0.0 libcfa.so.1; }; }) /usr/bin/install -c -m 644 /var/lib/jenkins/workspace/Cforall_master_2/libcfa/src/vec/vec.hfa /var/lib/jenkins/workspace/Cforall_master_2/libcfa/src/vec/vec2.hfa /var/lib/jenkins/workspace/Cforall_master_2/libcfa/src/vec/vec3.hfa /var/lib/jenkins/workspace/Cforall_master_2/libcfa/src/vec/vec4.hfa '/var/lib/jenkins/workspace/Cforall_master_2@tmp/include/cfa//vec' /usr/bin/mkdir -p '/var/lib/jenkins/workspace/Cforall_master_2@tmp/include/cfa//bits' libtool: install: (cd /var/lib/jenkins/workspace/Cforall_master_2@tmp/lib/cfa/x64-nodebug && { ln -s -f libcfa.so.1.0.0 libcfa.so || { rm -f libcfa.so && ln -s libcfa.so.1.0.0 libcfa.so; }; }) /usr/bin/install -c -m 644 /var/lib/jenkins/workspace/Cforall_master_2/libcfa/src/bits/weakso_locks.hfa /var/lib/jenkins/workspace/Cforall_master_2/libcfa/src/bits/algorithm.hfa /var/lib/jenkins/workspace/Cforall_master_2/libcfa/src/bits/align.hfa /var/lib/jenkins/workspace/Cforall_master_2/libcfa/src/bits/collections.hfa /var/lib/jenkins/workspace/Cforall_master_2/libcfa/src/bits/debug.hfa /var/lib/jenkins/workspace/Cforall_master_2/libcfa/src/bits/defs.hfa /var/lib/jenkins/workspace/Cforall_master_2/libcfa/src/bits/locks.hfa /var/lib/jenkins/workspace/Cforall_master_2/libcfa/src/bits/collection.hfa /var/lib/jenkins/workspace/Cforall_master_2/libcfa/src/bits/stack.hfa /var/lib/jenkins/workspace/Cforall_master_2/libcfa/src/bits/queue.hfa /var/lib/jenkins/workspace/Cforall_master_2/libcfa/src/bits/sequence.hfa /var/lib/jenkins/workspace/Cforall_master_2/libcfa/src/bits/atomic.hfa /var/lib/jenkins/workspace/Cforall_master_2/libcfa/src/bits/random.hfa '/var/lib/jenkins/workspace/Cforall_master_2@tmp/include/cfa//bits' libtool: install: /usr/bin/install -c .libs/libcfa.lai /var/lib/jenkins/workspace/Cforall_master_2@tmp/lib/cfa/x64-nodebug/libcfa.la /usr/bin/mkdir -p '/var/lib/jenkins/workspace/Cforall_master_2@tmp/include/cfa//stdhdr' /usr/bin/install -c -m 644 /var/lib/jenkins/workspace/Cforall_master_2/libcfa/src/stdhdr/string.h /var/lib/jenkins/workspace/Cforall_master_2/libcfa/src/stdhdr/uchar.h /var/lib/jenkins/workspace/Cforall_master_2/libcfa/src/stdhdr/stdbool.h /var/lib/jenkins/workspace/Cforall_master_2/libcfa/src/stdhdr/iso646.h /var/lib/jenkins/workspace/Cforall_master_2/libcfa/src/stdhdr/stddef.h /var/lib/jenkins/workspace/Cforall_master_2/libcfa/src/stdhdr/inttypes.h /var/lib/jenkins/workspace/Cforall_master_2/libcfa/src/stdhdr/wctype.h /var/lib/jenkins/workspace/Cforall_master_2/libcfa/src/stdhdr/limits.h /var/lib/jenkins/workspace/Cforall_master_2/libcfa/src/stdhdr/malloc.h /var/lib/jenkins/workspace/Cforall_master_2/libcfa/src/stdhdr/assert.h /var/lib/jenkins/workspace/Cforall_master_2/libcfa/src/stdhdr/setjmp.h /var/lib/jenkins/workspace/Cforall_master_2/libcfa/src/stdhdr/complex.h /var/lib/jenkins/workspace/Cforall_master_2/libcfa/src/stdhdr/threads.h /var/lib/jenkins/workspace/Cforall_master_2/libcfa/src/stdhdr/locale.h /var/lib/jenkins/workspace/Cforall_master_2/libcfa/src/stdhdr/ctype.h /var/lib/jenkins/workspace/Cforall_master_2/libcfa/src/stdhdr/stdlib.h /var/lib/jenkins/workspace/Cforall_master_2/libcfa/src/stdhdr/stdalign.h /var/lib/jenkins/workspace/Cforall_master_2/libcfa/src/stdhdr/fenv.h /var/lib/jenkins/workspace/Cforall_master_2/libcfa/src/stdhdr/stdarg.h /var/lib/jenkins/workspace/Cforall_master_2/libcfa/src/stdhdr/wchar.h /var/lib/jenkins/workspace/Cforall_master_2/libcfa/src/stdhdr/gmp.h /var/lib/jenkins/workspace/Cforall_master_2/libcfa/src/stdhdr/pthread.h /var/lib/jenkins/workspace/Cforall_master_2/libcfa/src/stdhdr/stdnoreturn.h /var/lib/jenkins/workspace/Cforall_master_2/libcfa/src/stdhdr/stdint.h /var/lib/jenkins/workspace/Cforall_master_2/libcfa/src/stdhdr/float.h /var/lib/jenkins/workspace/Cforall_master_2/libcfa/src/stdhdr/time.h /var/lib/jenkins/workspace/Cforall_master_2/libcfa/src/stdhdr/unistd.h /var/lib/jenkins/workspace/Cforall_master_2/libcfa/src/stdhdr/signal.h /var/lib/jenkins/workspace/Cforall_master_2/libcfa/src/stdhdr/stdio.h /var/lib/jenkins/workspace/Cforall_master_2/libcfa/src/stdhdr/tgmath.h /var/lib/jenkins/workspace/Cforall_master_2/libcfa/src/stdhdr/errno.h /var/lib/jenkins/workspace/Cforall_master_2/libcfa/src/stdhdr/stdatomic.h /var/lib/jenkins/workspace/Cforall_master_2/libcfa/src/stdhdr/unwind.h /var/lib/jenkins/workspace/Cforall_master_2/libcfa/src/stdhdr/math.h '/var/lib/jenkins/workspace/Cforall_master_2@tmp/include/cfa//stdhdr' /usr/bin/mkdir -p '/var/lib/jenkins/workspace/Cforall_master_2@tmp/include/cfa//collections' /usr/bin/install -c -m 644 /var/lib/jenkins/workspace/Cforall_master_2/libcfa/src/collections/maybe.hfa /var/lib/jenkins/workspace/Cforall_master_2/libcfa/src/collections/pair.hfa /var/lib/jenkins/workspace/Cforall_master_2/libcfa/src/collections/result.hfa /var/lib/jenkins/workspace/Cforall_master_2/libcfa/src/collections/string.hfa /var/lib/jenkins/workspace/Cforall_master_2/libcfa/src/collections/string_res.hfa /var/lib/jenkins/workspace/Cforall_master_2/libcfa/src/collections/vector.hfa /var/lib/jenkins/workspace/Cforall_master_2/libcfa/src/collections/array.hfa /var/lib/jenkins/workspace/Cforall_master_2/libcfa/src/collections/list.hfa /var/lib/jenkins/workspace/Cforall_master_2/libcfa/src/collections/list2.hfa /var/lib/jenkins/workspace/Cforall_master_2/libcfa/src/collections/lockfree.hfa /var/lib/jenkins/workspace/Cforall_master_2/libcfa/src/collections/string_sharectx.hfa /var/lib/jenkins/workspace/Cforall_master_2/libcfa/src/collections/vector2.hfa '/var/lib/jenkins/workspace/Cforall_master_2@tmp/include/cfa//collections' libtool: install: /usr/bin/install -c .libs/libcfathread.so.1.0.0 /var/lib/jenkins/workspace/Cforall_master_2@tmp/lib/cfa/x64-nodebug/libcfathread.so.1.0.0 libtool: install: (cd /var/lib/jenkins/workspace/Cforall_master_2@tmp/lib/cfa/x64-nodebug && { ln -s -f libcfathread.so.1.0.0 libcfathread.so.1 || { rm -f libcfathread.so.1 && ln -s libcfathread.so.1.0.0 libcfathread.so.1; }; }) libtool: install: (cd /var/lib/jenkins/workspace/Cforall_master_2@tmp/lib/cfa/x64-nodebug && { ln -s -f libcfathread.so.1.0.0 libcfathread.so || { rm -f libcfathread.so && ln -s libcfathread.so.1.0.0 libcfathread.so; }; }) libtool: install: /usr/bin/install -c .libs/libcfathread.lai /var/lib/jenkins/workspace/Cforall_master_2@tmp/lib/cfa/x64-nodebug/libcfathread.la libtool: warning: remember to run 'libtool --finish /var/lib/jenkins/workspace/Cforall_master_2@tmp/lib/cfa/x64-nodebug/' make[3]: Nothing to be done for 'install-exec-am'. make[3]: Nothing to be done for 'install-data-am'. [Pipeline] } [Pipeline] // dir [Pipeline] } [Pipeline] // stage [Pipeline] sh + free -h total used free shared buff/cache available Mem: 62Gi 2.2Gi 58Gi 4.9Mi 2.2Gi 60Gi Swap: 8.0Gi 0B 8.0Gi [Pipeline] sh + ulimit -a time(seconds) unlimited file(blocks) unlimited data(kbytes) unlimited stack(kbytes) 8192 coredump(blocks) 0 memory(kbytes) unlimited locked memory(kbytes) 8238436 process 257124 nofiles 1048576 vmemory(kbytes) unlimited locks unlimited rtprio 0 [Pipeline] echo -------- Test: Debug -------- [Pipeline] stage [Pipeline] { (Test: Debug) [Pipeline] dir Running in /var/lib/jenkins/workspace/Cforall_master_2@tmp [Pipeline] { [Pipeline] sh + nproc + make -j 16 --no-print-directory -C tests timeout=600 global-timeout=14400 tests debug=yes archive-errors=/var/lib/jenkins/workspace/Cforall_master_2@tmp/tests/crashes/full-debug Running 378 tests on 16 cores (x64 - debug) array-ERR2 PASSED C 0:00.073 - R n/a array-ERR3 PASSED C 0:00.075 - R n/a ...ollections/language-dim-mismatch PASSED C 0:00.461 - R n/a array-ERR1 PASSED C 0:01.024 - R n/a array-collections/c-dependent PASSED C 0:01.100 - R 0:00.007 array PASSED C 0:01.191 - R 0:00.022 array-collections/array-raii-c PASSED C 0:01.359 - R 0:00.012 array-collections/dimexpr-match-c PASSED C 0:01.440 - R 0:00.019 array-collections/symtab-collision PASSED C 0:00.590 - R n/a array-collections/safety-summary PASSED C 0:01.314 - R n/a array-collections/array-sbscr-types PASSED C 0:02.014 - R 0:00.010 attr-priority PASSED C 0:01.118 - R 0:00.001 castError PASSED C 0:00.691 - R n/a array-collections/array-basic PASSED C 0:02.509 - R 0:00.020 array-collections/boxed PASSED C 0:02.517 - R 0:00.025 array-collections/dimexpr-match-cfa PASSED C 0:02.620 - R 0:00.023 cast PASSED C 0:01.458 - R 0:00.023 builtins/sync PASSED C 0:01.737 - R 0:00.019 castReturn PASSED C 0:01.921 - R 0:00.019 alloc-ERROR PASSED C 0:05.284 - R n/a algorithms/range_test PASSED C 0:05.785 - R 0:00.027 avl_test PASSED C 0:04.951 - R 0:00.012 array-collections/accordion PASSED C 0:06.493 - R 0:00.006 array-collections/array-raii-cfa PASSED C 0:07.407 - R 0:00.009 collections/multi_list PASSED C 0:07.746 - R 0:00.007 collections/stack PASSED C 0:07.802 - R 0:00.009 alloc PASSED C 0:10.675 - R 0:00.012 collections/sequence PASSED C 0:08.653 - R 0:00.006 collections/queue PASSED C 0:08.863 - R 0:00.009 collections/string-compare PASSED C 0:08.046 - R 0:00.007 collections/string-operator-ERR09 PASSED C 0:04.268 - R n/a collections/string-gc PASSED C 0:06.399 - R 0:00.007 collections/string-istream PASSED C 0:06.633 - R 0:00.007 collections/string-ctx-manage PASSED C 0:08.637 - R 0:00.005 alloc2 PASSED C 0:12.898 - R 0:00.011 collections/string-api-coverage PASSED C 0:11.467 - R 0:00.008 collections/string-operator-ERR11 PASSED C 0:04.317 - R n/a ...ions/string-api-coverage-noshare PASSED C 0:11.530 - R 0:00.019 collections/string-operator-ERR13 PASSED C 0:04.296 - R n/a ...ns/vector-err-retn-perm-it-byval PASSED C 0:02.219 - R n/a collections/string-operator PASSED C 0:08.350 - R 0:00.036 collections/string-operator-ERR15 PASSED C 0:04.287 - R n/a ...ns/vector-err-pass-perm-it-byval PASSED C 0:02.524 - R n/a collections/string-istream-manip PASSED C 0:08.949 - R 0:00.068 collections/string-operator-ERR16 PASSED C 0:04.348 - R n/a collections/vector-demo PASSED C 0:05.052 - R 0:00.006 complex PASSED C 0:05.365 - R 0:00.007 collections/atomic_mpsc PASSED C 0:10.630 - R 0:05.737 collections/string-ostream PASSED C 0:07.829 - R 0:00.007 collections/string-overwrite PASSED C 0:09.402 - R 0:00.011 ...ections/string-overwrite-noshare PASSED C 0:10.248 - R 0:00.012 concurrency/barrier/generation PASSED C 0:11.446 - R 0:00.270 concurrency/barrier/last PASSED C 0:11.257 - R 0:00.069 concurrency/actors/executor PASSED C 0:13.840 - R 0:00.034 concurrency/actors/inline PASSED C 0:13.990 - R 0:00.068 concurrency/actors/poison PASSED C 0:13.795 - R 0:00.066 concurrency/actors/inherit PASSED C 0:14.520 - R 0:00.036 concurrency/actors/pingpong PASSED C 0:14.300 - R 0:00.067 concurrency/barrier/order PASSED C 0:11.277 - R 0:00.068 concurrency/actors/matrixMultiply PASSED C 0:14.179 - R 0:00.768 concurrency/actors/types PASSED C 0:14.541 - R 0:00.068 concurrency/actors/static PASSED C 0:14.753 - R 0:00.237 concurrency/ctor-check PASSED C 0:00.821 - R n/a concurrency/clib_tls PASSED C 0:02.062 - R 0:00.018 concurrency/clib PASSED C 0:02.202 - R 0:00.120 concurrency/actors/dynamic PASSED C 0:14.055 - R 0:03.177 concurrency/cluster PASSED C 0:06.608 - R 0:00.009 concurrency/cofor PASSED C 0:08.622 - R 0:00.009 concurrency/coroutineYield PASSED C 0:09.562 - R 0:00.034 concurrency/examples/gortn PASSED C 0:09.291 - R 0:00.008 concurrency/examples/matrixSum PASSED C 0:09.343 - R 0:00.009 concurrency/examples/datingService PASSED C 0:09.678 - R 0:00.018 concurrency/channels/big_elems PASSED C 0:12.540 - R 0:10.521 concurrency/channels/churn PASSED C 0:12.894 - R 0:10.027 concurrency/keywordErrors PASSED C 0:00.391 - R n/a concurrency/channels/contend PASSED C 0:12.754 - R 0:10.115 concurrency/mainError PASSED C 0:00.230 - R n/a concurrency/channels/daisy_chain PASSED C 0:12.540 - R 0:10.017 concurrency/futures/abandon PASSED C 0:06.760 - R 0:00.068 ...rrency/examples/boundedBufferEXT PASSED C 0:09.702 - R 0:05.488 ...rrency/examples/boundedBufferINT PASSED C 0:09.678 - R 0:05.343 concurrency/futures/basic PASSED C 0:06.722 - R 0:00.118 concurrency/examples/quickSort PASSED C 0:11.313 - R 0:00.011 concurrency/channels/hot_potato PASSED C 0:12.376 - R 0:10.054 concurrency/channels/ping_pong PASSED C 0:12.315 - R 0:10.051 concurrency/join PASSED C 0:09.192 - R 0:00.037 concurrency/channels/pub_sub PASSED C 0:12.755 - R 0:10.051 concurrency/channels/zero_size PASSED C 0:12.492 - R 0:10.052 concurrency/futures/wait_any PASSED C 0:11.923 - R 0:00.035 concurrency/migrate PASSED C 0:10.098 - R 0:00.121 concurrency/lockfree_stack PASSED C 0:09.316 - R 0:02.381 concurrency/futures/typed PASSED C 0:14.572 - R 0:00.320 concurrency/mutexstmt/monitors PASSED C 0:07.856 - R 0:02.276 concurrency/park/contention PASSED C 0:07.366 - R 0:00.217 concurrency/park/start_parked PASSED C 0:07.029 - R 0:00.035 concurrency/once PASSED C 0:11.173 - R 0:00.122 concurrency/mutexstmt/tuple PASSED C 0:12.386 - R 0:00.011 ...urrency/pthread/pthread_key_test PASSED C 0:02.942 - R 0:00.012 concurrency/park/force_preempt PASSED C 0:10.242 - R 0:00.268 ...rrency/pthread/pthread_attr_test PASSED C 0:09.516 - R 0:00.007 ...rrency/pthread/pthread_cond_test PASSED C 0:09.532 - R 0:00.013 concurrency/futures/future_except PASSED C 0:23.035 - R 0:00.022 ...pthread/pthread_demo_create_join PASSED C 0:09.982 - R 0:00.011 concurrency/monitor PASSED C 0:09.623 - R 0:10.807 ...rrency/pthread/pthread_once_test PASSED C 0:09.567 - R 0:00.019 concurrency/multi-monitor PASSED C 0:10.014 - R 0:12.658 concurrency/readyQ/leader_spin PASSED C 0:09.962 - R 0:00.823 concurrency/readyQ/barrier_sleeper PASSED C 0:11.259 - R 0:00.422 concurrency/signal/disjoint PASSED C 0:09.940 - R 0:01.774 concurrency/signal/block PASSED C 0:11.099 - R 0:01.222 ...rrency/pthread/pthread_demo_lock PASSED C 0:09.639 - R 0:05.835 concurrency/signal/wait PASSED C 0:10.153 - R 0:00.223 concurrency/suspend_then PASSED C 0:09.545 - R 0:00.068 concurrency/sleep PASSED C 0:09.827 - R 0:01.124 concurrency/preempt PASSED C 0:11.151 - R 0:11.758 concurrency/thread PASSED C 0:10.948 - R 0:00.010 .../unified_locking/block_spin_lock PASSED C 0:11.736 - R 0:00.036 ...ency/unified_locking/exp_backoff PASSED C 0:11.089 - R 0:00.020 .../unified_locking/fast_block_lock PASSED C 0:10.906 - R 0:00.035 ...cy/unified_locking/pthread_locks PASSED C 0:08.386 - R 0:00.773 concurrency/preempt2 PASSED C 0:09.720 - R 0:20.285 ...fied_locking/mcs_block_spin_lock PASSED C 0:10.892 - R 0:00.569 ...nified_locking/simple_owner_lock PASSED C 0:11.143 - R 0:00.034 ...ncy/unified_locking/timeout_lock PASSED C 0:08.572 - R 0:01.121 concurrency/waitfor/parse PASSED C 0:05.744 - R 0:00.008 concurrency/waitfor/barge PASSED C 0:09.459 - R 0:00.218 concurrency/waitfor/else PASSED C 0:07.917 - R 0:00.078 concurrency/waitfor/dtor PASSED C 0:09.571 - R 0:01.120 ...urrency/waitfor/lexical_priority PASSED C 0:10.250 - R 0:00.038 concurrency/unified_locking/mcs PASSED C 0:10.809 - R 0:08.138 concurrency/waitfor/recurse PASSED C 0:09.258 - R 0:00.767 concurrency/waitfor/statment PASSED C 0:09.723 - R 0:00.069 concurrency/waitfor/when PASSED C 0:09.476 - R 0:00.118 concurrency/waituntil/basic_else PASSED C 0:14.257 - R 0:00.011 ...ency/waituntil/channel_zero_size PASSED C 0:09.753 - R 0:05.029 configs/parsebools PASSED C 0:07.531 - R 0:00.036 concurrency/waituntil/one_chan PASSED C 0:09.729 - R 0:01.124 const-init PASSED C 0:00.980 - R 0:00.011 const-ref PASSED C 0:00.970 - R 0:00.005 concurrency/waituntil/timeout PASSED C 0:06.351 - R 0:03.125 concurrency/waituntil/channels PASSED C 0:10.749 - R 0:08.096 configs/parseconfig PASSED C 0:07.271 - R 0:00.007 copyfile PASSED C 0:05.216 - R 0:00.007 configs/usage PASSED C 0:07.381 - R 0:00.009 coroutine/devicedriver PASSED C 0:06.418 - R 0:00.035 concurrency/waituntil/channel_close PASSED C 0:13.088 - R 0:10.044 coroutine/fibonacci PASSED C 0:06.447 - R 0:00.011 concurrency/waituntil/futures PASSED C 0:21.948 - R 0:00.037 coroutine/fmtLines PASSED C 0:06.536 - R 0:00.035 coroutine/pingpong PASSED C 0:06.749 - R 0:00.008 counter PASSED C 0:05.199 - R 0:00.006 ctrl-flow/break-misc PASSED C 0:05.097 - R 0:00.007 ctrl-flow/fallthrough PASSED C 0:05.198 - R 0:00.006 ctrl-flow/labelledExit PASSED C 0:00.940 - R 0:00.006 ctrl-flow/loop-inc PASSED C 0:00.978 - R 0:00.013 coroutine/runningTotal PASSED C 0:06.527 - R 0:00.007 coroutine/raii PASSED C 0:07.630 - R 0:00.011 coroutine/prodcons PASSED C 0:08.124 - R 0:00.011 ctrl-flow/goto PASSED C 0:05.437 - R 0:00.009 designations PASSED C 0:01.862 - R 0:00.006 enum PASSED C 0:00.842 - R 0:00.007 ctrl-flow/loop_else PASSED C 0:05.046 - R 0:00.017 ctrl-flow/ifwhileCtl PASSED C 0:06.093 - R 0:00.020 ...ency/unified_locking/futex_mutex PASSED C 0:11.017 - R 0:38.939 concurrency/waituntil/all_types PASSED C 0:28.705 - R 0:07.189 enum_tests/inc-dec PASSED C 0:01.192 - R 0:00.007 enum_tests/lvalue PASSED C 0:00.568 - R n/a ctrl-flow/loop_else-WRN1 PASSED C 0:06.108 - R 0:00.002 enum_tests/funcEnum PASSED C 0:01.903 - R 0:00.019 ctrl-flow/loopctrl PASSED C 0:06.660 - R 0:00.007 enum_tests/anonymous PASSED C 0:05.137 - R 0:00.021 div PASSED C 0:07.076 - R 0:00.021 errors/declaration PASSED C 0:00.123 - R n/a errors/scope PASSED C 0:00.602 - R n/a errors/scope-type PASSED C 0:00.208 - R n/a enum_tests/structEnum PASSED C 0:02.234 - R 0:00.010 errors/signature PASSED C 0:00.197 - R n/a enum_tests/enumInlineValue PASSED C 0:06.381 - R 0:00.007 device/cpu PASSED C 0:08.673 - R 0:00.020 concurrency/unified_locking/locks FAILED with code -6 C 0:11.553 - R 0:39.978 Start Test 1: multi acquisition lock and condition variable single wait/notify Done Test 1 Start Test 2: multi acquisition lock and condition variable 3 wait/notify all Done Test 2 Start Test 3: single acquisition lock and condition variable single wait/notify Done Test 3 Start Test 4: single acquisition lock and condition variable 3 wait/notify all Cforall Assertion error "thrd->state == Halted" from program "locks" in "_X15__thread_finishFv_PS7thread$__1" at line 321 in file "/var/lib/jenkins/workspace/Cforall_master_2/libcfa/src/concurrency/monitor.cfa". Cforall Runtime error (UNIX pid:80506): Cforall Assertion error "t" from program "locks" in "_X13active_threadFPS7thread$___1" at line 109 in file "/var/lib/jenkins/workspace/Cforall_master_2/libcfa/src/concurrency/kernel/fwd.hfa". warning: Can't open file anon_inode:[io_uring] which was expanded to anon_inode:[io_uring] during file-backed mapping note processing [New LWP 80509] [New LWP 80508] [New LWP 80507] [New LWP 80506] [Thread debugging using libthread_db enabled] Using host libthread_db library "/lib/x86_64-linux-gnu/libthread_db.so.1". Core was generated by `/var/lib/jenkins/workspace/Cforall_master_2@tmp/tests/concurrency/unified_locki'. Program terminated with signal SIGABRT, Aborted. #0 __pthread_kill_implementation (no_tid=0, signo=6, threadid=) at ./nptl/pthread_kill.c:44 warning: 44 ./nptl/pthread_kill.c: No such file or directory [Current thread is 1 (Thread 0x5555556a7ec0 (LWP 80509))] ----- #0 __pthread_kill_implementation (no_tid=0, signo=6, threadid=) at ./nptl/pthread_kill.c:44 #1 __pthread_kill_internal (signo=6, threadid=) at ./nptl/pthread_kill.c:78 #2 __GI___pthread_kill (threadid=, signo=signo@entry=6) at ./nptl/pthread_kill.c:89 #3 0x00007ffff7a4527e in __GI_raise (sig=sig@entry=6) at ../sysdeps/posix/raise.c:26 #4 0x00007ffff7a288ff in __GI_abort () at ./stdlib/abort.c:79 #5 0x00007ffff7e97e87 in _X7__abortFv_bPKcY17__builtin_va_list__1 (_X11signalAbortb_1=false, _X3fmtPKc_1=0x7ffff7eb87e0 "%s", _X4argsY17__builtin_va_list_1=0x5555556a6570) at /var/lib/jenkins/workspace/Cforall_master_2/libcfa/src/interpose.cfa:263 #6 0x00007ffff7e9812f in _X5abortFv_bPKc__1 (_X11signalAbortb_1=false, _X3fmtPKc_1=0x7ffff7eb87e0 "%s") at /var/lib/jenkins/workspace/Cforall_master_2/libcfa/src/interpose.cfa:301 #7 0x00007ffff7e978d2 in abort () at /var/lib/jenkins/workspace/Cforall_master_2/libcfa/src/interpose.cfa:176 #8 0x00007ffff7e95ce7 in __assert_fail (assertion=0x7ffff7f93a12 "t", file=0x7ffff7f939c0 "/var/lib/jenkins/workspace/Cforall_master_2/libcfa/src/concurrency/kernel/fwd.hfa", line=109, function=0x7ffff7f942a0 <__PRETTY_FUNCTION__.89> "_X13active_threadFPS7thread$___1") at /var/lib/jenkins/workspace/Cforall_master_2/libcfa/src/assert.cfa:33 #9 0x00007ffff7f7fd68 in _X13active_threadFPS7thread$___1 () at /var/lib/jenkins/workspace/Cforall_master_2/libcfa/src/concurrency/kernel/fwd.hfa:109 #10 0x00007ffff7f81a16 in _X4lockFv_S17simple_owner_lock__1 (_X4thisS17simple_owner_lock_1=0x7ffff7fb4bc0 <_X9once_lockS17simple_owner_lock_1>) at /var/lib/jenkins/workspace/Cforall_master_2/libcfa/src/concurrency/locks.hfa:534 #11 0x00007ffff7f84a63 in pthread_once (once_control=0x7ffff7cc9230, init_routine=0x7ffff7cbb4a0) at /var/lib/jenkins/workspace/Cforall_master_2/libcfa/src/concurrency/pthread.cfa:504 #12 0x00007ffff7cbe3f0 in ?? () from /lib/x86_64-linux-gnu/libgcc_s.so.1 #13 0x00007ffff7cbf3a1 in _Unwind_Backtrace () from /lib/x86_64-linux-gnu/libgcc_s.so.1 #14 0x00007ffff7b36113 in __GI___backtrace (array=, size=50) at ./debug/backtrace.c:78 #15 0x00007ffff7e97a31 in _X18__cfaabi_backtraceFv_i__1 (_X5starti_1=2) at /var/lib/jenkins/workspace/Cforall_master_2/libcfa/src/interpose.cfa:204 #16 0x00007ffff7e97fb3 in _X7__abortFv_bPKcY17__builtin_va_list__1 (_X11signalAbortb_1=false, _X3fmtPKc_1=0x7ffff7eb87e0 "%s", _X4argsY17__builtin_va_list_1=0x5555556a6e00) at /var/lib/jenkins/workspace/Cforall_master_2/libcfa/src/interpose.cfa:283 #17 0x00007ffff7e9812f in _X5abortFv_bPKc__1 (_X11signalAbortb_1=false, _X3fmtPKc_1=0x7ffff7eb87e0 "%s") at /var/lib/jenkins/workspace/Cforall_master_2/libcfa/src/interpose.cfa:301 #18 0x00007ffff7e978d2 in abort () at /var/lib/jenkins/workspace/Cforall_master_2/libcfa/src/interpose.cfa:176 #19 0x00007ffff7e95ce7 in __assert_fail (assertion=0x7ffff7f8d949 "thrd->state == Halted", file=0x7ffff7f8d4b8 "/var/lib/jenkins/workspace/Cforall_master_2/libcfa/src/concurrency/monitor.cfa", line=321, function=0x7ffff7f8e080 <__PRETTY_FUNCTION__.31> "_X15__thread_finishFv_PS7thread$__1") at /var/lib/jenkins/workspace/Cforall_master_2/libcfa/src/assert.cfa:33 #20 0x00007ffff7f351f1 in _X15__thread_finishFv_PS7thread$__1 (_X4thrdPS7thread$_1=0x7fffffffda70) at /var/lib/jenkins/workspace/Cforall_master_2/libcfa/src/concurrency/monitor.cfa:321 #21 0x00007ffff7f1f8e5 in _X12__run_threadFv_PS9processorPS7thread$__1 (_X4thisPS9processor_1=0x7fffffffd900, _X8thrd_dstPS7thread$_1=0x7fffffffda70) at /var/lib/jenkins/workspace/Cforall_master_2/libcfa/src/concurrency/kernel.cfa:359 #22 0x00007ffff7f1eef7 in _X4mainFv_S14processorCtx_t__1 (_X6runnerS14processorCtx_t_1=0x7fffffffd920) at /var/lib/jenkins/workspace/Cforall_master_2/libcfa/src/concurrency/kernel.cfa:246 #23 0x00007ffff7f5aa32 in _X18__invoke_processorFPv_Pv__1 (_X3argPv_1=0x7fffffffd900) at /var/lib/jenkins/workspace/Cforall_master_2/libcfa/src/concurrency/kernel/startup.cfa:387 #24 0x00007ffff7a9cb84 in start_thread (arg=) at ./nptl/pthread_create.c:447 #25 0x00007ffff7b29ecc in clone3 () at ../sysdeps/unix/sysv/linux/x86_64/clone3.S:78 ----- Id Target Id Frame * 1 Thread 0x5555556a7ec0 (LWP 80509) __pthread_kill_implementation (no_tid=0, signo=6, threadid=) at ./nptl/pthread_kill.c:44 2 Thread 0x555555647ec0 (LWP 80508) 0x00005555557f2f2e in ?? () 3 Thread 0x5555555b7ec0 (LWP 80507) 0x00007ffff7a45fc8 in __GI___sigtimedwait (set=0x5555555b73f0, info=0x5555555b7470, timeout=0x0) at ../sysdeps/unix/sysv/linux/sigtimedwait.c:31 4 Thread 0x7ffff7c97900 (LWP 80506) 0x00007ffff7f27231 in _X4lockFv_S12__spinlock_tPKc__1 (_X4thisS12__spinlock_t_1=0x5555555688c0 <_X1sS23single_acquisition_lock_1>, _X6callerPKc_1=0x7ffff7f8c740 <__PRETTY_FUNCTION__.180> "_X6unlockFv_S13blocking_lock__1") at /var/lib/jenkins/workspace/Cforall_master_2/libcfa/src/bits/locks.hfa:67 Archiving concurrency/unified_locking/locks (executable and core) to crashes/full-debug/concurrency/unified_locking/locks eval PASSED C 0:01.120 - R 0:00.020 enum_tests/input PASSED C 0:05.826 - R 0:00.019 enum_tests/stringEnum PASSED C 0:05.688 - R 0:00.019 enum_tests/typedIntEnum PASSED C 0:05.513 - R 0:00.007 enum_tests/planet PASSED C 0:07.056 - R 0:00.007 enum_tests/voidEnum PASSED C 0:05.560 - R 0:00.018 enum_tests/position PASSED C 0:07.851 - R 0:00.005 ...urrency/unified_locking/mcs_spin PASSED C 0:11.160 - R 0:45.957 exceptions/conditional PASSED C 0:05.842 - R 0:00.010 exceptions/conditional-threads PASSED C 0:06.977 - R 0:00.008 exceptions/cancel/coroutine PASSED C 0:07.775 - R 0:00.011 exceptions/data-except PASSED C 0:06.409 - R 0:00.019 exceptions/message PASSED C 0:02.335 - R 0:00.021 concurrency/waituntil/repeat_close PASSED C 0:10.186 - R 0:30.063 exceptions/defaults PASSED C 0:05.851 - R 0:00.006 exceptions/cancel/thread PASSED C 0:09.613 - R 0:00.011 .../unified_locking/spin_queue_lock PASSED C 0:10.812 - R 0:47.718 exceptions/finally PASSED C 0:05.944 - R 0:00.020 exceptions/try-ctrl-flow PASSED C 0:00.361 - R n/a exceptions/type-check PASSED C 0:00.402 - R n/a exceptions/defaults-threads PASSED C 0:07.144 - R 0:00.009 exceptions/cor_resumer PASSED C 0:09.697 - R 0:00.008 exceptions/try-leave-catch PASSED C 0:00.970 - R 0:00.005 exceptions/finally-threads PASSED C 0:06.657 - R 0:00.011 expression PASSED C 0:01.067 - R 0:00.007 exceptions/interact PASSED C 0:05.809 - R 0:00.005 exceptions/fibonacci_nonlocal PASSED C 0:08.735 - R 0:00.008 exceptions/polymorphic PASSED C 0:05.564 - R 0:00.009 exceptions/resume PASSED C 0:05.719 - R 0:00.007 exceptions/terminate PASSED C 0:05.796 - R 0:00.006 exceptions/trash PASSED C 0:05.418 - R 0:00.007 exceptions/resume-threads PASSED C 0:06.843 - R 0:00.036 global-monomorph PASSED C 0:00.959 - R 0:00.009 exceptions/terminate-threads PASSED C 0:06.767 - R 0:00.019 exceptions/virtual-poly PASSED C 0:05.347 - R 0:00.018 identFuncDeclarator PASSED C 0:01.044 - R 0:00.005 identParamDeclarator PASSED C 0:01.135 - R 0:00.006 forall PASSED C 0:06.138 - R 0:00.019 exceptions/virtual-cast PASSED C 0:06.857 - R 0:00.007 generator/fibonacci PASSED C 0:05.522 - R 0:00.033 fstream_test PASSED C 0:05.834 - R 0:00.006 exceptions/pingpong_nonlocal PASSED C 0:09.915 - R 0:00.011 init1-ERROR PASSED C 0:00.567 - R n/a generator/fmtLines PASSED C 0:05.449 - R 0:00.007 init1 PASSED C 0:00.945 - R 0:00.005 include/vector-sequence PASSED C 0:01.498 - R 0:00.006 genericUnion PASSED C 0:05.297 - R 0:00.007 generator/suspend_then PASSED C 0:05.828 - R 0:00.020 function-operator PASSED C 0:07.503 - R 0:00.006 include/vector-collections PASSED C 0:02.355 - R 0:00.007 hello PASSED C 0:05.324 - R 0:00.015 identity PASSED C 0:05.363 - R 0:00.006 include/stdincludes PASSED C 0:05.458 - R 0:00.005 include/vector-fstream PASSED C 0:05.366 - R 0:00.012 io/eofType PASSED C 0:05.312 - R 0:00.007 io/io PASSED C 0:08.228 - R 0:00.007 limits PASSED C 0:01.051 - R 0:00.008 io/io-acquire-in PASSED C 0:10.015 - R 0:00.037 io/io-acquire PASSED C 0:10.316 - R 0:00.067 io/away_fair PASSED C 0:11.591 - R 0:00.117 io/manipulatorsInput-uchunk PASSED C 0:07.938 - R 0:00.071 io/io-acquire-out PASSED C 0:09.806 - R 0:00.069 io/manipulatorsOutput4 PASSED C 0:07.941 - R 0:00.068 linking/nostdlib PASSED C 0:01.052 - R 0:00.009 io/comp_basic PASSED C 0:13.121 - R 0:00.269 io/comp_fair PASSED C 0:13.078 - R 0:00.223 io/io-acquire-no-io PASSED C 0:09.813 - R 0:02.877 io/io-acquire2 PASSED C 0:11.016 - R 0:00.119 linking/exception-nothreads PASSED C 0:04.095 - R 0:00.021 linkonce PASSED C 0:01.596 - R 0:00.022 maybe PASSED C 0:01.305 - R 0:00.005 concurrency/waituntil/locks PASSED C 0:11.781 - R 0:58.617 include/includes PASSED C 0:18.582 - R 0:00.019 linking/exception-withthreads PASSED C 0:06.101 - R 0:00.038 linking/mangling/anon PASSED C 0:06.089 - R 0:00.006 nested-types-ERR1 PASSED C 0:00.115 - R n/a nested-types-ERR2 PASSED C 0:00.178 - R n/a nested-types PASSED C 0:01.166 - R 0:00.005 io/many_read PASSED C 0:12.802 - R 0:00.036 nowarn/array PASSED C 0:01.218 - R 0:00.006 list/dlist-insert-remove PASSED C 0:05.804 - R 0:00.046 linking/weakso_nothd PASSED C 0:06.980 - R 0:00.006 nowarn/exception PASSED C 0:01.151 - R 0:00.007 linking/io-acquire PASSED C 0:08.567 - R 0:00.021 nowarn/no-autogen PASSED C 0:01.111 - R 0:00.023 linking/nothreads PASSED C 0:07.842 - R 0:00.024 opt-params PASSED C 0:00.154 - R n/a literals PASSED C 0:06.106 - R 0:00.023 nowarn/unused PASSED C 0:01.187 - R 0:00.033 nowarn/printf-sizeof PASSED C 0:01.412 - R 0:00.014 nowarn/zero-thunk PASSED C 0:01.206 - R 0:00.006 numericConstants PASSED C 0:01.163 - R 0:00.019 operators PASSED C 0:00.920 - R 0:00.005 list/dlist2-insert-remove PASSED C 0:06.987 - R 0:00.011 meta/fork+exec PASSED C 0:04.474 - R 0:00.069 polybits PASSED C 0:00.304 - R n/a poly-d-cycle PASSED C 0:01.227 - R 0:00.011 poly-member PASSED C 0:01.080 - R 0:00.017 poly-many-arsz PASSED C 0:01.280 - R 0:00.012 poly-bare-assn PASSED C 0:01.463 - R 0:00.022 poly-self-cycle PASSED C 0:01.016 - R 0:00.006 poly-o-cycle PASSED C 0:01.271 - R 0:00.024 poly-selection PASSED C 0:01.320 - R 0:00.019 raii/ctor-autogen-ERR1 PASSED C 0:00.729 - R n/a quasiKeyword PASSED C 0:01.444 - R 0:00.022 malloc PASSED C 0:08.600 - R 0:00.019 raii/ctor-autogen PASSED C 0:01.671 - R 0:00.007 meta/dumpable PASSED C 0:07.388 - R 0:00.019 raii/init_once PASSED C 0:01.351 - R 0:00.010 heap PASSED C 0:07.259 - R 0:19.825 linking/withthreads PASSED C 0:10.962 - R 0:00.012 raii/partial-ERR1 PASSED C 0:00.572 - R n/a raii/partial PASSED C 0:01.085 - R 0:00.007 raii/typeof-member PASSED C 0:01.038 - R 0:00.006 result PASSED C 0:01.417 - R 0:00.006 raii/dtor-early-exit-ERR1 PASSED C 0:03.952 - R n/a concurrency/mutexstmt/locks PASSED C 0:09.723 - R 1:51.404 minmax PASSED C 0:09.228 - R 0:00.007 raii/dtor-early-exit-ERR2 PASSED C 0:04.255 - R n/a quotedKeyword PASSED C 0:05.157 - R 0:00.006 raii/memberCtors-ERR1 PASSED C 0:03.825 - R n/a simpleGenericTriple PASSED C 0:01.183 - R 0:00.007 raii/boxed-types PASSED C 0:05.614 - R 0:00.007 polymorphism PASSED C 0:06.372 - R 0:00.008 smart-pointers PASSED C 0:01.262 - R 0:00.009 raii/globals PASSED C 0:05.554 - R 0:00.007 switch PASSED C 0:01.018 - R 0:00.005 raii/memberCtors PASSED C 0:05.649 - R 0:00.007 tuple/tupleCast PASSED C 0:01.066 - R 0:00.007 tuple/tupleFunction PASSED C 0:01.184 - R 0:00.007 tuple/tupleMember PASSED C 0:01.084 - R 0:00.007 typedefRedef-ERR1 PASSED C 0:00.118 - R n/a tuple/tuplePolymorphism PASSED C 0:01.210 - R 0:00.007 raii/dtor-early-exit PASSED C 0:07.735 - R 0:00.006 references PASSED C 0:05.582 - R 0:00.009 typedefRedef PASSED C 0:00.986 - R 0:00.006 var-assert PASSED C 0:00.147 - R n/a typeof PASSED C 0:00.961 - R 0:00.007 shortCircuit PASSED C 0:05.629 - R 0:00.009 variableDeclarator PASSED C 0:00.983 - R 0:00.005 sizeof PASSED C 0:05.205 - R 0:00.007 tuple/tupleVariadic PASSED C 0:03.638 - R 0:00.007 searchsort PASSED C 0:07.419 - R 0:00.007 strstream PASSED C 0:05.864 - R 0:00.006 tuple/tupleAssign PASSED C 0:05.825 - R 0:00.007 sum PASSED C 0:07.394 - R 0:00.005 time PASSED C 0:06.840 - R 0:00.007 tuplearray PASSED C 0:05.260 - R 0:00.006 swap PASSED C 0:07.563 - R 0:00.006 voidPtr PASSED C 0:00.988 - R 0:00.006 withconflict PASSED C 0:00.540 - R n/a warnings/self-assignment PASSED C 0:00.897 - R 0:00.001 userLiterals PASSED C 0:05.606 - R 0:00.007 KRfunctions PASSED C 0:00.891 - R 0:00.001 vector PASSED C 0:06.662 - R 0:00.006 arithmeticConversions PASSED C 0:02.056 - R 0:00.005 zero_one-ERR1 PASSED C 0:02.852 - R n/a ...collections/dimexpr-match-c-ERRS PASSED C 0:00.683 - R n/a vector_math/vec2_double PASSED C 0:07.598 - R 0:00.007 ...llections/dimexpr-match-cfa-ERRS PASSED C 0:01.226 - R n/a attributes PASSED C 0:01.111 - R 0:00.001 vector_math/vec2_uint PASSED C 0:07.583 - R 0:00.005 zero_one PASSED C 0:05.353 - R 0:00.006 vector_math/vec2_float PASSED C 0:11.218 - R 0:00.007 ...collections/array-md-sbscr-cases PASSED C 0:06.451 - R 0:00.006 vector_math/vec2_int PASSED C 0:10.790 - R 0:00.006 abs PASSED C 0:07.135 - R 0:00.007 errors/completeType PASSED C 0:00.522 - R n/a vector_math/vec3_int PASSED C 0:10.112 - R 0:00.007 declarationSpecifier PASSED C 0:00.892 - R 0:00.012 vector_math/vec4_int PASSED C 0:10.219 - R 0:00.007 vector_math/vec3_float PASSED C 0:11.456 - R 0:00.007 extension PASSED C 0:00.941 - R 0:00.001 functions PASSED C 0:00.937 - R 0:00.001 vector_math/vec4_float PASSED C 0:11.215 - R 0:00.008 gccExtensions PASSED C 0:00.960 - R 0:00.001 ato PASSED C 0:07.843 - R 0:00.007 rational PASSED C 0:21.296 - R 0:00.006 bitmanip1 PASSED C 0:08.523 - R 0:00.019 meta/arch PASSED C 0:00.539 - R n/a bitmanip2 PASSED C 0:08.410 - R 0:00.012 configs/parsenums PASSED C 0:07.616 - R 0:00.067 concurrency/pthread/bounded_buffer PASSED C 0:09.474 - R 0:00.167 bitmanip3 PASSED C 0:09.721 - R 0:00.012 gmp PASSED C 0:07.035 - R 0:00.009 PRNG PASSED C 0:12.961 - R 0:02.377 io/manipulatorsInput PASSED C 0:06.691 - R 0:00.006 exceptions/cardgame PASSED C 0:08.413 - R 0:00.027 exceptions/hotpotato_checked PASSED C 0:08.695 - R 0:00.009 exceptions/hotpotato PASSED C 0:08.611 - R 0:00.009 io/manipulatorsOutput2 PASSED C 0:08.171 - R 0:00.009 random PASSED C 0:07.022 - R 0:00.005 io/manipulatorsOutput1 PASSED C 0:11.088 - R 0:00.009 vector_math/vec2_ldouble PASSED C 0:07.394 - R 0:00.005 io/manipulatorsOutput3 PASSED C 0:11.049 - R 0:00.009 mathX PASSED C 0:10.469 - R 0:00.023 math PASSED C 0:10.234 - R 0:00.010 nested_function PASSED C 0:09.378 - R 0:00.010 377 passes, 1 failures, 0 timeouts, 0 cancelled, 0 other Tests took 3:16.675 make: *** [Makefile:986: all-local] Error 1 [Pipeline] } [Pipeline] // dir [Pipeline] } [Pipeline] // stage [Pipeline] echo Archiving core dumps [Pipeline] dir Running in /var/lib/jenkins/workspace/Cforall_master_2@tmp [Pipeline] { [Pipeline] fileExists [Pipeline] sh + /var/lib/jenkins/workspace/Cforall_master_2/tools/jenkins/archive-gen.sh [Pipeline] archiveArtifacts Archiving artifacts Recording fingerprints [Pipeline] } [Pipeline] // dir [Pipeline] } [Pipeline] // wrap [Pipeline] } [Pipeline] // node [Pipeline] echo hudson.AbortException: script returned exit code 2 [Pipeline] node Running on Brokk 2 in /var/lib/jenkins/workspace/Cforall_master_2 [Pipeline] { [Pipeline] echo Notifying users of result [Pipeline] echo Reusing previously constructed message [Pipeline] echo Would send email to: cforall@lists.uwaterloo.ca [Pipeline] echo With title: [cforall git][BUILD# 3861 - FAILURE] - branch master [Pipeline] echo Content:

This is an automated email from the Jenkins build machine. It was generated because of a git hooks/post-receive script following a ref change which was pushed to the C∀ repository.

- Status --------------------------------------------------------------

BUILD# 3861 - FAILURE

Check console output at https://cforall.uwaterloo.ca/jenkins/job/Cforall/job/master/3861/ to view the results.

- Changes -------------------------------------------------------------

The branch master has been updated.
      from  262e12b24a19d992dad599c1cc6143374ac571f4 (commit)

- Log -----------------------------------------------------------------


-----------------------------------------------------------------------

Summary of changes:

[Pipeline] } [Pipeline] // node [Pipeline] echo Build Completed [Pipeline] End of Pipeline ERROR: script returned exit code 2 Finished: FAILURE [Pipeline] error [Pipeline] } Failed in branch clang_x64_new Build Cforall » master #3851 completed: SUCCESS [Pipeline] echo SUCCESS [Pipeline] } Build Cforall » master #3853 completed: SUCCESS [Pipeline] echo SUCCESS [Pipeline] } Build Cforall » master #3854 completed: SUCCESS [Pipeline] echo SUCCESS [Pipeline] } Build Cforall » master #3859 completed: SUCCESS [Pipeline] echo SUCCESS [Pipeline] } Build Cforall » master #3858 completed: SUCCESS [Pipeline] echo SUCCESS [Pipeline] } Build Cforall » master #3856 completed: FAILURE [Pipeline] echo FAILURE [Pipeline] sh + wget -q -O - https://cforall.uwaterloo.ca/jenkins/job/Cforall/job/master/3856/consoleText Started by upstream project "Cforall_Full_Build" build number 430 originally caused by: Started by timer Running as Jenkins Build User > git rev-parse --resolve-git-dir /var/lib/jenkins/caches/git-914b6fdde163b7e17ee75d99ca23f18a/.git # timeout=10 Setting origin to cforall@plg.uwaterloo.ca:software/cfa/cfa-cc > git config remote.origin.url cforall@plg.uwaterloo.ca:software/cfa/cfa-cc # timeout=10 Fetching origin... Fetching upstream changes from origin > git --version # timeout=10 > git --version # 'git version 2.43.0' > git config --get remote.origin.url # timeout=10 using GIT_SSH to set credentials Git key use to connect to the cforall git repo (August 2025) Verifying host key using known hosts file > git fetch --no-tags --force --progress -- origin +refs/heads/*:refs/remotes/origin/* # timeout=10 Seen branch in repository origin/ADT Seen branch in repository origin/aaron-thesis Seen branch in repository origin/arm-eh Seen branch in repository origin/ast-experimental Seen branch in repository origin/cleanup-dtors Seen branch in repository origin/ctor Seen branch in repository origin/deferred_resn Seen branch in repository origin/demangler Seen branch in repository origin/enum Seen branch in repository origin/forall-pointer-decay Seen branch in repository origin/gc_noraii Seen branch in repository origin/jacob/cs343-translation Seen branch in repository origin/jenkins-sandbox Seen branch in repository origin/master Seen branch in repository origin/memory Seen branch in repository origin/new-ast Seen branch in repository origin/new-ast-unique-expr Seen branch in repository origin/new-env Seen branch in repository origin/no_list Seen branch in repository origin/persistent-indexer Seen branch in repository origin/pthread-emulation Seen branch in repository origin/qualifiedEnum Seen branch in repository origin/resolv-new Seen branch in repository origin/string Seen branch in repository origin/stuck-waitfor-destruct Seen branch in repository origin/with_gc Seen 26 remote branches Obtained Jenkinsfile from 262e12b24a19d992dad599c1cc6143374ac571f4 [Pipeline] Start of Pipeline [Pipeline] node Running on Brokk 2 in /var/lib/jenkins/workspace/Cforall_master_2 [Pipeline] { [Pipeline] wrap [Pipeline] { [Pipeline] properties WARNING: Unknown parameter(s) found for class type 'hudson.model.ChoiceParameterDefinition': defaultValue WARNING: Unknown parameter(s) found for class type 'hudson.model.ChoiceParameterDefinition': defaultValue [Pipeline] checkout The recommended git tool is: NONE using credential git_key_aug2025 Fetching changes from the remote Git repository Cleaning workspace Fetching without tags Checking out Revision 262e12b24a19d992dad599c1cc6143374ac571f4 (master) Commit message: "allow making print version without editing source" [Pipeline] load [Pipeline] { (Jenkins/tools.groovy) [Pipeline] } [Pipeline] // load [Pipeline] echo Compiler : gcc-11 (g++-11/gcc-11) Architecture : arm64 Arc Flags : --host=aarch64 Run All Tests : true Run Benchmark : true Build Documentation : false Publish : true Silent : true [Pipeline] } [Pipeline] // wrap [Pipeline] } [Pipeline] // node [Pipeline] node > git rev-parse --resolve-git-dir /var/lib/jenkins/workspace/Cforall_master_2/.git # timeout=10 > git config remote.origin.url cforall@plg.uwaterloo.ca:software/cfa/cfa-cc # timeout=10 > git rev-parse --verify HEAD # timeout=10 Resetting working tree > git reset --hard # timeout=10 > git clean -fdx # timeout=10 Fetching upstream changes from cforall@plg.uwaterloo.ca:software/cfa/cfa-cc > git --version # timeout=10 > git --version # 'git version 2.43.0' using GIT_SSH to set credentials Git key use to connect to the cforall git repo (August 2025) Verifying host key using known hosts file > git fetch --no-tags --force --progress -- cforall@plg.uwaterloo.ca:software/cfa/cfa-cc +refs/heads/*:refs/remotes/origin/* # timeout=10 > git config core.sparsecheckout # timeout=10 > git checkout -f 262e12b24a19d992dad599c1cc6143374ac571f4 # timeout=10 > git rev-list --no-walk 262e12b24a19d992dad599c1cc6143374ac571f4 # timeout=10 Still waiting to schedule task Waiting for next available executor on ‘Algol’ Running on Algol in /var/lib/jenkins/workspace/Cforall_master [Pipeline] { [Pipeline] wrap [Pipeline] { [Pipeline] pwd [Pipeline] pwd [Pipeline] echo -------- Cleanup -------- [Pipeline] stage [Pipeline] { (Cleanup) [Pipeline] dir Running in /var/lib/jenkins/workspace/Cforall_master@tmp [Pipeline] { [Pipeline] deleteDir [Pipeline] } [Pipeline] // dir [Pipeline] } [Pipeline] // stage [Pipeline] echo -------- Checkout -------- [Pipeline] stage [Pipeline] { (Checkout) [Pipeline] checkout The recommended git tool is: NONE using credential git_key_aug2025 Fetching changes from the remote Git repository Cleaning workspace Fetching without tags > git rev-parse --resolve-git-dir /var/lib/jenkins/workspace/Cforall_master/.git # timeout=10 > git config remote.origin.url cforall@plg.uwaterloo.ca:software/cfa/cfa-cc # timeout=10 > git rev-parse --verify HEAD # timeout=10 Resetting working tree > git reset --hard # timeout=10 > git clean -fdx # timeout=10 Fetching upstream changes from cforall@plg.uwaterloo.ca:software/cfa/cfa-cc > git --version # timeout=10 > git --version # 'git version 2.43.0' using GIT_SSH to set credentials Git key use to connect to the cforall git repo (August 2025) Verifying host key using known hosts file > git fetch --no-tags --force --progress -- cforall@plg.uwaterloo.ca:software/cfa/cfa-cc +refs/heads/*:refs/remotes/origin/* # timeout=10 Checking out Revision 262e12b24a19d992dad599c1cc6143374ac571f4 (master) Commit message: "allow making print version without editing source" [Pipeline] echo Constructing new git message [Pipeline] sh + git rev-list 262e12b24a19d992dad599c1cc6143374ac571f4..262e12b24a19d992dad599c1cc6143374ac571f4 [Pipeline] sh > git config core.sparsecheckout # timeout=10 > git checkout -f 262e12b24a19d992dad599c1cc6143374ac571f4 # timeout=10 + git cat-file -t 262e12b24a19d992dad599c1cc6143374ac571f4 [Pipeline] sh + git rev-list --format=short 262e12b24a19d992dad599c1cc6143374ac571f4...262e12b24a19d992dad599c1cc6143374ac571f4 [Pipeline] sh + git diff --stat --color 262e12b24a19d992dad599c1cc6143374ac571f4 262e12b24a19d992dad599c1cc6143374ac571f4 [Pipeline] echo

- Changes -------------------------------------------------------------

The branch master has been updated.
      from  262e12b24a19d992dad599c1cc6143374ac571f4 (commit)

- Log -----------------------------------------------------------------


-----------------------------------------------------------------------

Summary of changes:

[Pipeline] } [Pipeline] // stage [Pipeline] echo -------- Build : configure -------- [Pipeline] stage [Pipeline] { (Build : configure) [Pipeline] dir Running in /var/lib/jenkins/workspace/Cforall_master [Pipeline] { [Pipeline] sh + ./autogen.sh Running aclocal in root Running libtoolize in root libtoolize: putting auxiliary files in AC_CONFIG_AUX_DIR, 'automake'. libtoolize: linking file 'automake/ltmain.sh' libtoolize: putting macros in AC_CONFIG_MACRO_DIRS, 'automake'. libtoolize: linking file 'automake/libtool.m4' libtoolize: linking file 'automake/ltoptions.m4' libtoolize: linking file 'automake/ltsugar.m4' libtoolize: linking file 'automake/ltversion.m4' libtoolize: linking file 'automake/lt~obsolete.m4' Running autoconf in root Running automake in root configure.ac:223: installing 'automake/compile' configure.ac:138: installing 'automake/config.guess' configure.ac:138: installing 'automake/config.sub' configure.ac:17: installing 'automake/install-sh' benchmark/Makefile.am: installing 'automake/depcomp' parallel-tests: installing 'automake/test-driver' configure.ac: installing 'automake/ylwrap' Running aclocal in libcfa Running libtoolize in libcfa libtoolize: putting auxiliary files in AC_CONFIG_AUX_DIR, 'automake'. libtoolize: linking file 'automake/ltmain.sh' libtoolize: putting macros in AC_CONFIG_MACRO_DIRS, 'automake'. libtoolize: linking file 'automake/libtool.m4' libtoolize: linking file 'automake/ltoptions.m4' libtoolize: linking file 'automake/ltsugar.m4' libtoolize: linking file 'automake/ltversion.m4' libtoolize: linking file 'automake/lt~obsolete.m4' Running autoconf in libcfa Running automake in libcfa configure.ac:119: installing 'automake/compile' configure.ac:119: installing 'automake/config.guess' configure.ac:119: installing 'automake/config.sub' configure.ac:12: installing 'automake/install-sh' src/Makefile.am: installing 'automake/depcomp' [Pipeline] } [Pipeline] // dir [Pipeline] dir Running in /var/lib/jenkins/workspace/Cforall_master@tmp [Pipeline] { [Pipeline] sh + /var/lib/jenkins/workspace/Cforall_master/configure CXX=g++-11 CC=gcc-11 --host=aarch64 AR=gcc-ar RANLIB=gcc-ranlib --with-target-hosts=host:debug,host:nodebug --quiet --prefix=/var/lib/jenkins/workspace/Cforall_master@tmp [Pipeline] sh + nproc + make -j 96 --no-print-directory configure-libcfa libcfa/arm64-debug/config.data Configuring libcfa (/var/lib/jenkins/workspace/Cforall_master/libcfa/configure) with ''CXX=g++-11' 'CC=gcc-11' 'AR=gcc-ar' 'RANLIB=gcc-ranlib' '--prefix=/var/lib/jenkins/workspace/Cforall_master@tmp' DRIVER_DIR=/var/lib/jenkins/workspace/Cforall_master@tmp/driver/ ARCHITECTURE=arm64 CONFIGURATION=debug CFA_VERSION=1:0:0' from /var/lib/jenkins/workspace/Cforall_master@tmp / libcfa/arm64-debug/ libcfa/arm64-nodebug/config.data Configuring libcfa (/var/lib/jenkins/workspace/Cforall_master/libcfa/configure) with ''CXX=g++-11' 'CC=gcc-11' 'AR=gcc-ar' 'RANLIB=gcc-ranlib' '--prefix=/var/lib/jenkins/workspace/Cforall_master@tmp' DRIVER_DIR=/var/lib/jenkins/workspace/Cforall_master@tmp/driver/ ARCHITECTURE=arm64 CONFIGURATION=nodebug CFA_VERSION=1:0:0' from /var/lib/jenkins/workspace/Cforall_master@tmp / libcfa/arm64-nodebug/ checking whether make supports nested variables... yes checking for a BSD-compatible install... /usr/bin/install -c checking whether build environment is sane... checking whether make supports nested variables... yes checking for a BSD-compatible install... yes /usr/bin/install -c checking whether build environment is sane... checking for a race-free mkdir -p... /usr/bin/mkdir -p checking for gawk... gawk checking whether make sets $(MAKE)... yes yes checking for a race-free mkdir -p... /usr/bin/mkdir -p checking for gawk... gawk checking whether make sets $(MAKE)... checking for distributated build... no yes checking build system type... checking for distributated build... no checking build system type... aarch64-unknown-linux-gnu checking host system type... aarch64-unknown-linux-gnu checking how to print strings... printf checking whether make supports the include directive... aarch64-unknown-linux-gnu yes (GNU style) checking host system type... aarch64-unknown-linux-gnu checking how to print strings... checking for gcc... gcc-11 printf checking whether make supports the include directive... yes (GNU style) checking for gcc... gcc-11 checking whether the C compiler works... checking whether the C compiler works... yes checking for C compiler default output file name... a.out checking for suffix of executables... yes checking for C compiler default output file name... a.out checking for suffix of executables... checking whether we are cross compiling... checking whether we are cross compiling... no checking for suffix of object files... no checking for suffix of object files... o checking whether the compiler supports GNU C... o checking whether the compiler supports GNU C... yes checking whether gcc-11 accepts -g... yes checking whether gcc-11 accepts -g... yes checking for gcc-11 option to enable C11 features... yes checking for gcc-11 option to enable C11 features... none needed checking whether gcc-11 understands -c and -o together... none needed checking whether gcc-11 understands -c and -o together... yes checking dependency style of gcc-11... yes checking dependency style of gcc-11... gcc3 checking for a sed that does not truncate output... /usr/bin/sed gcc3 checking for a sed that does not truncate output... checking for grep that handles long lines and -e... /usr/bin/grep checking for egrep... /usr/bin/grep -E checking for fgrep... /usr/bin/sed checking for grep that handles long lines and -e... /usr/bin/grep -F checking for ld used by gcc-11... /usr/bin/grep checking for egrep... /usr/bin/grep -E checking for fgrep... /usr/bin/grep -F /usr/bin/ld checking for ld used by gcc-11... checking if the linker (/usr/bin/ld) is GNU ld... yes checking for BSD- or MS-compatible name lister (nm)... /usr/bin/ld checking if the linker (/usr/bin/ld) is GNU ld... /usr/bin/nm -B checking the name lister (/usr/bin/nm -B) interface... yes checking for BSD- or MS-compatible name lister (nm)... /usr/bin/nm -B checking the name lister (/usr/bin/nm -B) interface... BSD nm checking whether ln -s works... yes checking the maximum length of command line arguments... 1572864 BSD nm checking whether ln -s works... yes checking the maximum length of command line arguments... checking how to convert aarch64-unknown-linux-gnu file names to aarch64-unknown-linux-gnu format... func_convert_file_noop checking how to convert aarch64-unknown-linux-gnu file names to toolchain format... func_convert_file_noop checking for /usr/bin/ld option to reload object files... -r checking for file... file checking for objdump... objdump checking how to recognize dependent libraries... pass_all checking for dlltool... no checking how to associate runtime and link libraries... printf %s\n checking for archiver @FILE support... 1572864 checking how to convert aarch64-unknown-linux-gnu file names to aarch64-unknown-linux-gnu format... func_convert_file_noop checking how to convert aarch64-unknown-linux-gnu file names to toolchain format... func_convert_file_noop checking for /usr/bin/ld option to reload object files... -r checking for file... file checking for objdump... objdump checking how to recognize dependent libraries... pass_all checking for dlltool... no checking how to associate runtime and link libraries... printf %s\n checking for archiver @FILE support... @ checking for strip... strip checking for ranlib... gcc-ranlib checking command to parse /usr/bin/nm -B output from gcc-11 object... @ checking for strip... strip checking for ranlib... gcc-ranlib checking command to parse /usr/bin/nm -B output from gcc-11 object... ok checking for sysroot... no checking for a working dd... ok checking for sysroot... no checking for a working dd... /usr/bin/dd checking how to truncate binary pipes... /usr/bin/dd checking how to truncate binary pipes... /usr/bin/dd bs=4096 count=1 checking for mt... mt checking if mt is a manifest tool... /usr/bin/dd bs=4096 count=1 checking for mt... mt checking if mt is a manifest tool... no checking for stdio.h... no checking for stdio.h... yes checking for stdlib.h... yes checking for stdlib.h... yes checking for string.h... yes checking for string.h... yes checking for inttypes.h... yes checking for inttypes.h... yes checking for stdint.h... yes checking for stdint.h... yes checking for strings.h... yes checking for strings.h... yes checking for sys/stat.h... yes checking for sys/stat.h... yes checking for sys/types.h... yes checking for sys/types.h... yes checking for unistd.h... yes checking for unistd.h... yes yes checking for dlfcn.h... checking for dlfcn.h... yes checking for objdir... yes checking for objdir... .libs .libs checking if gcc-11 supports -fno-rtti -fno-exceptions... checking if gcc-11 supports -fno-rtti -fno-exceptions... no checking for gcc-11 option to produce PIC... -fPIC -DPIC checking if gcc-11 PIC flag -fPIC -DPIC works... no checking for gcc-11 option to produce PIC... -fPIC -DPIC checking if gcc-11 PIC flag -fPIC -DPIC works... yes checking if gcc-11 static flag -static works... yes checking if gcc-11 static flag -static works... yes checking if gcc-11 supports -c -o file.o... yes checking if gcc-11 supports -c -o file.o... yes checking if gcc-11 supports -c -o file.o... (cached) yes checking whether the gcc-11 linker (/usr/bin/ld) supports shared libraries... yes checking if gcc-11 supports -c -o file.o... (cached) yes checking whether the gcc-11 linker (/usr/bin/ld) supports shared libraries... yes checking whether -lc should be explicitly linked in... yes checking whether -lc should be explicitly linked in... no checking dynamic linker characteristics... no checking dynamic linker characteristics... GNU/Linux ld.so checking how to hardcode library paths into programs... immediate checking whether stripping libraries is possible... yes checking if libtool supports shared libraries... yes checking whether to build shared libraries... yes checking whether to build static libraries... no GNU/Linux ld.so checking how to hardcode library paths into programs... immediate checking whether stripping libraries is possible... yes checking if libtool supports shared libraries... yes checking whether to build shared libraries... yes checking whether to build static libraries... no checking whether the compiler supports GNU C++... checking whether the compiler supports GNU C++... yes checking whether g++-11 accepts -g... yes checking whether g++-11 accepts -g... yes checking for g++-11 option to enable C++11 features... yes checking for g++-11 option to enable C++11 features... none needed checking dependency style of g++-11... none needed checking dependency style of g++-11... gcc3 checking how to run the C++ preprocessor... gcc3 checking how to run the C++ preprocessor... g++-11 -E g++-11 -E checking for ld used by g++-11... /usr/bin/ld checking if the linker (/usr/bin/ld) is GNU ld... yes checking whether the g++-11 linker (/usr/bin/ld) supports shared libraries... yes checking for ld used by g++-11... /usr/bin/ld checking if the linker (/usr/bin/ld) is GNU ld... yes checking whether the g++-11 linker (/usr/bin/ld) supports shared libraries... yes checking for g++-11 option to produce PIC... -fPIC -DPIC checking if g++-11 PIC flag -fPIC -DPIC works... yes checking if g++-11 static flag -static works... checking for g++-11 option to produce PIC... -fPIC -DPIC checking if g++-11 PIC flag -fPIC -DPIC works... yes checking if g++-11 static flag -static works... yes checking if g++-11 supports -c -o file.o... yes checking if g++-11 supports -c -o file.o... (cached) yes checking whether the g++-11 linker (/usr/bin/ld) supports shared libraries... yes checking dynamic linker characteristics... (cached) GNU/Linux ld.so checking how to hardcode library paths into programs... immediate checking for gcc... (cached) gcc-11 yes checking if g++-11 supports -c -o file.o... checking whether the compiler supports GNU C... (cached) yes checking whether gcc-11 accepts -g... (cached) yes checking for gcc-11 option to enable C11 features... (cached) none needed checking whether gcc-11 understands -c and -o together... (cached) yes checking dependency style of gcc-11... (cached) gcc3 checking dependency style of gcc-11... yes checking if g++-11 supports -c -o file.o... (cached) yes checking whether the g++-11 linker (/usr/bin/ld) supports shared libraries... yes checking dynamic linker characteristics... (cached) GNU/Linux ld.so checking how to hardcode library paths into programs... immediate checking for gcc... (cached) gcc-11 gcc3 checking whether make sets $(MAKE)... (cached) yes checking for linux/rseq.h... checking whether the compiler supports GNU C... (cached) yes checking whether gcc-11 accepts -g... (cached) yes checking for gcc-11 option to enable C11 features... (cached) none needed checking whether gcc-11 understands -c and -o together... (cached) yes checking dependency style of gcc-11... (cached) gcc3 checking dependency style of gcc-11... yes checking for rseq_available in -lrseq... gcc3 checking whether make sets $(MAKE)... (cached) yes checking for linux/rseq.h... no checking for gcc-11 options needed to detect all undeclared functions... yes checking for rseq_available in -lrseq... none needed checking for linux/io_uring.h... no checking for gcc-11 options needed to detect all undeclared functions... yes checking for liburing.h... no checking whether IORING_OP_NOP is declared... none needed checking for linux/io_uring.h... yes checking whether IORING_OP_READV is declared... yes checking for liburing.h... yes checking whether IORING_OP_WRITEV is declared... no checking whether IORING_OP_NOP is declared... yes checking whether IORING_OP_FSYNC is declared... yes checking whether IORING_OP_READV is declared... yes checking whether IORING_OP_READ_FIXED is declared... yes checking whether IORING_OP_WRITEV is declared... yes checking whether IORING_OP_WRITE_FIXED is declared... yes checking whether IORING_OP_FSYNC is declared... yes checking whether IORING_OP_POLL_ADD is declared... yes checking whether IORING_OP_READ_FIXED is declared... yes checking whether IORING_OP_POLL_REMOVE is declared... yes checking whether IORING_OP_WRITE_FIXED is declared... yes checking whether IORING_OP_SYNC_FILE_RANGE is declared... yes checking whether IORING_OP_POLL_ADD is declared... yes checking whether IORING_OP_SENDMSG is declared... yes checking whether IORING_OP_POLL_REMOVE is declared... yes checking whether IORING_OP_RECVMSG is declared... yes checking whether IORING_OP_SYNC_FILE_RANGE is declared... yes checking whether IORING_OP_TIMEOUT is declared... yes yes checking whether IORING_OP_SENDMSG is declared... checking whether IORING_OP_TIMEOUT_REMOVE is declared... yes yes checking whether IORING_OP_RECVMSG is declared... checking whether IORING_OP_ACCEPT is declared... yes yes checking whether IORING_OP_ASYNC_CANCEL is declared... checking whether IORING_OP_TIMEOUT is declared... yes checking whether IORING_OP_LINK_TIMEOUT is declared... yes checking whether IORING_OP_TIMEOUT_REMOVE is declared... yes checking whether IORING_OP_CONNECT is declared... yes checking whether IORING_OP_ACCEPT is declared... yes checking whether IORING_OP_FALLOCATE is declared... yes checking whether IORING_OP_ASYNC_CANCEL is declared... yes checking whether IORING_OP_OPENAT is declared... yes checking whether IORING_OP_LINK_TIMEOUT is declared... yes checking whether IORING_OP_CLOSE is declared... yes checking whether IORING_OP_CONNECT is declared... yes checking whether IORING_OP_FILES_UPDATE is declared... yes checking whether IORING_OP_FALLOCATE is declared... yes checking whether IORING_OP_STATX is declared... yes checking whether IORING_OP_OPENAT is declared... yes checking whether IORING_OP_READ is declared... yes checking whether IORING_OP_CLOSE is declared... yes checking whether IORING_OP_WRITE is declared... yes checking whether IORING_OP_FILES_UPDATE is declared... yes checking whether IORING_OP_FADVISE is declared... yes checking whether IORING_OP_STATX is declared... yes checking whether IORING_OP_MADVISE is declared... yes checking whether IORING_OP_READ is declared... yes checking whether IORING_OP_SEND is declared... yes checking whether IORING_OP_WRITE is declared... yes checking whether IORING_OP_RECV is declared... yes checking whether IORING_OP_FADVISE is declared... yes checking whether IORING_OP_OPENAT2 is declared... yes checking whether IORING_OP_MADVISE is declared... yes checking whether IORING_OP_EPOLL_CTL is declared... yes checking whether IORING_OP_SEND is declared... yes checking whether IORING_OP_SPLICE is declared... yes checking whether IORING_OP_RECV is declared... yes checking whether IORING_OP_PROVIDE_BUFFERS is declared... yes checking whether IORING_OP_OPENAT2 is declared... yes checking whether IORING_OP_REMOVE_BUFFER is declared... yes checking whether IORING_OP_EPOLL_CTL is declared... no checking whether IORING_OP_TEE is declared... yes checking whether IORING_OP_SPLICE is declared... yes checking whether IOSQE_FIXED_FILE is declared... yes checking whether IORING_OP_PROVIDE_BUFFERS is declared... yes checking whether IOSQE_IO_DRAIN is declared... yes checking whether IORING_OP_REMOVE_BUFFER is declared... yes checking whether IOSQE_IO_LINK is declared... no checking whether IORING_OP_TEE is declared... yes checking whether IOSQE_IO_HARDLINK is declared... yes checking whether IOSQE_FIXED_FILE is declared... yes checking whether IOSQE_ASYNC is declared... yes checking whether IOSQE_IO_DRAIN is declared... yes checking whether IOSQE_BUFFER_SELECT is declared... yes checking whether IOSQE_IO_LINK is declared... yes checking whether SPLICE_F_FD_IN_FIXED is declared... yes checking whether IOSQE_IO_HARDLINK is declared... yes checking whether IORING_SETUP_ATTACH_WQ is declared... yes checking whether IOSQE_ASYNC is declared... yes checking whether IORING_REGISTER_IOWQ_MAX_WORKERS is declared... yes checking whether IOSQE_BUFFER_SELECT is declared... yes checking for preadv2... yes checking whether SPLICE_F_FD_IN_FIXED is declared... yes checking for pwritev2... yes checking whether IORING_SETUP_ATTACH_WQ is declared... yes yes checking whether IORING_REGISTER_IOWQ_MAX_WORKERS is declared... checking that generated files are newer than configure... done configure: creating ./config.status yes checking for preadv2... yes checking for pwritev2... yes checking that generated files are newer than configure... done configure: creating ./config.status config.status: creating Makefile config.status: creating src/Makefile config.status: creating prelude/Makefile config.status: creating src/concurrency/io/call.cfa /var/lib/jenkins/workspace/Cforall_master/libcfa/src/concurrency/io/call.cfa.in:144: SyntaxWarning: invalid escape sequence '\(' sig = re.search("(.*) (.*)\((.*)\)", signature) config.status: creating prelude/defines.hfa config.status: executing depfiles commands config.status: executing libtool commands Cforall library configuraton completed. Type "make -j 8 install". config.status: creating Makefile config.status: creating src/Makefile config.status: creating prelude/Makefile config.status: creating src/concurrency/io/call.cfa /var/lib/jenkins/workspace/Cforall_master/libcfa/src/concurrency/io/call.cfa.in:144: SyntaxWarning: invalid escape sequence '\(' sig = re.search("(.*) (.*)\((.*)\)", signature) config.status: creating prelude/defines.hfa config.status: executing depfiles commands config.status: executing libtool commands Cforall library configuraton completed. Type "make -j 8 install". [Pipeline] } [Pipeline] // dir [Pipeline] } [Pipeline] // stage [Pipeline] echo -------- Build : cfa-cpp -------- [Pipeline] stage [Pipeline] { (Build : cfa-cpp) [Pipeline] dir Running in /var/lib/jenkins/workspace/Cforall_master@tmp [Pipeline] { [Pipeline] sh + nproc + make -j 96 --no-print-directory -C driver CXX as.o CXX cc1.o CXX cfa.o CXXLD as CXXLD cc1 CXXLD cfa [Pipeline] sh + nproc + make -j 96 --no-print-directory -C src YACC Parser/parser.cc updating Parser/parser.output updating Parser/parser.hh make all-am CXX main.o CXX CompilationState.o CXX MakeLibCfa.o LEX Parser/lex.cc CXX AST/Attribute.o CXX AST/Copy.o CXX AST/Create.o CXX AST/Decl.o CXX AST/DeclReplacer.o CXX AST/Expr.o CXX AST/GenericSubstitution.o CXX AST/Init.o CXX AST/Inspect.o CXX AST/LinkageSpec.o CXX AST/Node.o CXX AST/Pass.o CXX AST/Print.o CXX AST/Stmt.o CXX AST/SymbolTable.o CXX AST/Type.o CXX AST/TypeEnvironment.o CXX AST/TypeSubstitution.o CXX AST/Util.o CXX CodeGen/CodeGenerator.o CXX CodeGen/GenType.o CXX CodeGen/OperatorTable.o CXX CodeGen/FixMain.o CXX CodeGen/FixNames.o CXX CodeGen/Generate.o CXX CodeGen/LinkOnce.o CXX Concurrency/Actors.o CXX Concurrency/Corun.o CXX Concurrency/Keywords.o CXX Concurrency/Waitfor.o CXX Concurrency/Waituntil.o CXX Common/Assert.o CXX Common/CodeLocationTools.o CXX Common/DeclStats.o CXX Common/Eval.o CXX Common/Examine.o CXX Common/Indenter.o CXX Common/ResolvProtoDump.o CXX Common/SemanticError.o CXX Common/Stats/Counter.o CXX Common/Stats/Heap.o CXX Common/Stats/ResolveTime.o CXX Common/Stats/Stats.o CXX Common/Stats/Time.o CXX Common/Symbol.o CXX Common/UniqueName.o CXX Common/DebugMalloc.o CXX ControlStruct/ExceptDecl.o CXX ControlStruct/ExceptTranslate.o CXX ControlStruct/FixLabels.o CXX ControlStruct/HoistControlDecls.o CXX ControlStruct/LabelGenerator.o CXX ControlStruct/MultiLevelExit.o CXX ControlStruct/TranslateEnumRange.o CXX GenPoly/GenPoly.o CXX GenPoly/Lvalue2.o CXX GenPoly/Box.o CXX GenPoly/FindFunction.o CXX GenPoly/InstantiateGeneric.o CXX GenPoly/Lvalue.o CXX GenPoly/ScrubTypeVars.o CXX GenPoly/Specialize.o CXX InitTweak/GenInit.o CXX InitTweak/InitTweak.o CXX InitTweak/FixGlobalInit.o CXX InitTweak/FixInit.o CXX Parser/DeclarationNode.o CXX Parser/ExpressionNode.o CXX Parser/InitializerNode.o CXX Parser/ParseNode.o CXX Parser/parser.o CXX Parser/RunParser.o CXX Parser/StatementNode.o CXX Parser/TypeData.o CXX Parser/TypedefTable.o CXX ResolvExpr/AdjustExprType.o CXX ResolvExpr/Candidate.o CXX ResolvExpr/CandidateFinder.o CXX ResolvExpr/CastCost.o CXX ResolvExpr/CommonType.o CXX ResolvExpr/ConversionCost.o CXX ResolvExpr/CurrentObject.o CXX ResolvExpr/FindOpenVars.o CXX ResolvExpr/ExplodedArg.o CXX ResolvExpr/PolyCost.o CXX ResolvExpr/PtrsAssignable.o CXX ResolvExpr/PtrsCastable.o CXX ResolvExpr/RenameVars.o CXX ResolvExpr/Resolver.o CXX ResolvExpr/SatisfyAssertions.o CXX ResolvExpr/Unify.o CXX ResolvExpr/ResolveTypeof.o CXX ResolvExpr/SpecCost.o In file included from /usr/include/aarch64-linux-gnu/c++/11/bits/os_defines.h:39, from /usr/include/aarch64-linux-gnu/c++/11/bits/c++config.h:586, from /usr/include/c++/11/cstdio:41, from /var/lib/jenkins/workspace/Cforall_master/src/Parser/parser.yy:41: /usr/include/features.h:415:4: warning: #warning _FORTIFY_SOURCE requires GCC 4.1 or later [-Wcpp] 415 | # warning _FORTIFY_SOURCE requires GCC 4.1 or later | ^~~~~~~ CXX ResolvExpr/CandidatePrinter.o CXX ResolvExpr/EraseWith.o CXX SymTab/FixFunction.o CXX SymTab/GenImplicitCall.o CXX SymTab/Mangler.o CXX SymTab/ManglerCommon.o CXX Tuples/Explode.o CXX Tuples/TupleAssignment.o CXX Tuples/TupleExpansion.o CXX Tuples/Tuples.o CXX Validate/Autogen.o CXX Validate/CheckAssertions.o CXX Validate/CompoundLiteral.o CXX Validate/EliminateTypedef.o CXX Validate/EnumAndPointerDecay.o CXX Validate/FindSpecialDecls.o CXX Validate/FixQualifiedTypes.o CXX Validate/FixReturnTypes.o CXX Validate/ForallPointerDecay.o CXX Validate/GenericParameter.o CXX Validate/HoistStruct.o CXX Validate/HoistTypeDecls.o CXX Validate/ImplementEnumFunc.o CXX Validate/InitializerLength.o CXX Validate/LabelAddressFixer.o CXX Validate/LinkInstanceTypes.o CXX Validate/ReplaceTypedef.o CXX Validate/ReturnCheck.o CXX Validate/VerifyCtorDtorAssign.o CXX Virtual/ExpandCasts.o CXX Virtual/Tables.o CXX Virtual/VirtualDtor.o CXX Parser/lex.o CXXLD ../driver/cfa-cpp [Pipeline] } [Pipeline] // dir [Pipeline] } [Pipeline] // stage [Pipeline] echo -------- Build : libcfa(debug) -------- [Pipeline] stage [Pipeline] { (Build : libcfa(debug)) [Pipeline] dir Running in /var/lib/jenkins/workspace/Cforall_master@tmp [Pipeline] { [Pipeline] sh + nproc + make -j 96 --no-print-directory -C libcfa/arm64-debug Making all in prelude mkdir .deps touch .deps/builtins.Po (CDPATH="${ZSH_VERSION+.}:" && cd /var/lib/jenkins/workspace/Cforall_master/libcfa && /bin/bash '/var/lib/jenkins/workspace/Cforall_master/libcfa/automake/missing' autoheader) rm -f stamp-h1 touch /var/lib/jenkins/workspace/Cforall_master/libcfa/prelude/defines.hfa.in cd .. && /bin/bash ./config.status prelude/defines.hfa config.status: creating prelude/defines.hfa config.status: prelude/defines.hfa is unchanged make all-am GEN gcc-builtins.c GEN builtins.cfa GEN prelude.cfa GEN extras.cfa GEN extras.cfa GEN gcc-builtins.cfa GEN bootloader.c Making all in src CFA common.lo CFA fstream.lo CFA iterator.lo CFA heap.lo CFA limits.lo CFA iostream.lo CFA math.lo CFA memory.lo CFA parseargs.lo CFA parseconfig.lo CFA rational.lo CFA stdlib.lo CFA strstream.lo CFA time.lo CFA assert.lo CFA bits/debug.lo CC exception.lo CFA interpose.lo CFA prelude-inline.lo CFA startup.lo CC virtual.lo GEN prelude.lo CFA interpose_thread.lo CFA bits/weakso_locks.lo CFA algorithms/range_iterator.lo CFA collections/maybe.lo CFA collections/pair.lo CFA collections/result.lo CFA collections/string.lo CFA collections/string_res.lo CFA collections/vector.lo CFA device/cpu.lo CFA concurrency/alarm.lo CFA concurrency/coroutine.lo CFA concurrency/exception.lo CFA concurrency/kernel.lo CFA concurrency/kernel/cluster.lo CFA concurrency/locks.lo CFA concurrency/monitor.lo CFA concurrency/mutex.lo CFA concurrency/select.lo CFA concurrency/thread.lo CFA concurrency/cofor.lo CFA concurrency/clib/cfathread.lo CPPAS concurrency/CtxSwitch-arm64.lo CC concurrency/invoke.lo CFA concurrency/io.lo CFA concurrency/io/setup.lo CFA concurrency/io/call.lo CFA concurrency/kernel/startup.lo CFA concurrency/preemption.lo CFA concurrency/ready_queue.lo CFA concurrency/stats.lo CFA concurrency/pthread.lo /usr/include/linux/io_uring.h:83:43: warning: 'packed' attribute ignored for field of type 'union __io_uring_sqe____anonymous65' [-Wattributes] 83 | } __attribute__((packed)); | ^ /usr/include/linux/io_uring.h:83:43: warning: 'packed' attribute ignored for field of type 'union __io_uring_sqe____anonymous129' [-Wattributes] 83 | } __attribute__((packed)); | ^ /usr/include/linux/io_uring.h:83:43: warning: 'packed' attribute ignored for field of type 'union __io_uring_sqe____anonymous53' [-Wattributes] 83 | } __attribute__((packed)); | ^ CCLD libcfa.la /usr/include/linux/io_uring.h:83:43: warning: 'packed' attribute ignored for field of type 'union __io_uring_sqe____anonymous119' [-Wattributes] 83 | } __attribute__((packed)); | ^ /usr/bin/ld: warning: .libs/common.o: requires executable stack (because the .note.GNU-stack section is executable) /usr/include/linux/io_uring.h:83:43: warning: 'packed' attribute ignored for field of type 'union __io_uring_sqe____anonymous119' [-Wattributes] 83 | } __attribute__((packed)); | ^ /usr/include/linux/io_uring.h:83:43: warning: 'packed' attribute ignored for field of type 'union __io_uring_sqe____anonymous32' [-Wattributes] 83 | } __attribute__((packed)); | ^ /usr/include/linux/io_uring.h:83:43: warning: 'packed' attribute ignored for field of type 'union __io_uring_sqe____anonymous97' [-Wattributes] 83 | } __attribute__((packed)); | ^ CCLD libcfathread.la /usr/bin/ld: warning: concurrency/.libs/alarm.o: requires executable stack (because the .note.GNU-stack section is executable) make[1]: Nothing to be done for 'all-am'. [Pipeline] } [Pipeline] // dir [Pipeline] } [Pipeline] // stage [Pipeline] echo -------- Build : libcfa(nodebug) -------- [Pipeline] stage [Pipeline] { (Build : libcfa(nodebug)) [Pipeline] dir Running in /var/lib/jenkins/workspace/Cforall_master@tmp [Pipeline] { [Pipeline] sh + nproc + make -j 96 --no-print-directory -C libcfa/arm64-nodebug Making all in prelude mkdir .deps touch .deps/builtins.Po cd .. && /bin/bash ./config.status prelude/defines.hfa config.status: creating prelude/defines.hfa config.status: prelude/defines.hfa is unchanged make all-am GEN gcc-builtins.c GEN builtins.cfa GEN prelude.cfa GEN extras.cfa GEN gcc-builtins.cfa GEN extras.cfa GEN bootloader.c Making all in src CFA common.lo CFA fstream.lo CFA heap.lo CFA iostream.lo CFA iterator.lo CFA limits.lo CFA math.lo CFA memory.lo CFA parseargs.lo CFA parseconfig.lo CFA rational.lo CFA stdlib.lo CFA strstream.lo CFA time.lo CFA assert.lo CFA bits/debug.lo CC exception.lo CFA interpose.lo CFA prelude-inline.lo CFA startup.lo CC virtual.lo GEN prelude.lo CFA interpose_thread.lo CFA concurrency/preemption.lo CFA concurrency/ready_queue.lo CFA concurrency/stats.lo CFA concurrency/pthread.lo CFA bits/weakso_locks.lo CFA algorithms/range_iterator.lo CFA collections/maybe.lo CFA collections/pair.lo CFA collections/result.lo CFA collections/string.lo CFA collections/string_res.lo CFA collections/vector.lo CFA device/cpu.lo CFA concurrency/alarm.lo CFA concurrency/coroutine.lo CFA concurrency/exception.lo CFA concurrency/kernel.lo CFA concurrency/kernel/cluster.lo CFA concurrency/locks.lo CFA concurrency/monitor.lo CFA concurrency/mutex.lo CFA concurrency/select.lo CFA concurrency/thread.lo CFA concurrency/cofor.lo CFA concurrency/clib/cfathread.lo CPPAS concurrency/CtxSwitch-arm64.lo CC concurrency/invoke.lo CFA concurrency/io.lo CFA concurrency/io/setup.lo CFA concurrency/io/call.lo CFA concurrency/kernel/startup.lo /var/lib/jenkins/workspace/Cforall_master/libcfa/src/exception.c: In function '__cfaehm_allocate_exception': /var/lib/jenkins/workspace/Cforall_master/libcfa/src/exception.c:142:17: warning: ignoring return value of 'write' declared with attribute 'warn_unused_result' [-Wunused-result] 142 | write( 2, "abort2\n", 7 ); | ^~~~~~~~~~~~~~~~~~~~~~~~~ /var/lib/jenkins/workspace/Cforall_master/libcfa/src/exception.c: In function '__cfaehm_exception_cleanup': /var/lib/jenkins/workspace/Cforall_master/libcfa/src/exception.c:127:17: warning: ignoring return value of 'write' declared with attribute 'warn_unused_result' [-Wunused-result] 127 | write( 2, "abort1\n", 7 ); | ^~~~~~~~~~~~~~~~~~~~~~~~~ /var/lib/jenkins/workspace/Cforall_master/libcfa/src/exception.c: In function '__cfaehm_cancel_stack': /var/lib/jenkins/workspace/Cforall_master/libcfa/src/exception.c:230:9: warning: ignoring return value of 'write' declared with attribute 'warn_unused_result' [-Wunused-result] 230 | write( 2, "abort3\n", 7 ); | ^~~~~~~~~~~~~~~~~~~~~~~~~ /var/lib/jenkins/workspace/Cforall_master/libcfa/src/exception.c: In function '__cfaehm_begin_unwind': /var/lib/jenkins/workspace/Cforall_master/libcfa/src/exception.c:252:17: warning: ignoring return value of 'write' declared with attribute 'warn_unused_result' [-Wunused-result] 252 | write( 2, "abort4\n", 7 ); | ^~~~~~~~~~~~~~~~~~~~~~~~~ /var/lib/jenkins/workspace/Cforall_master/libcfa/src/exception.c:278:17: warning: ignoring return value of 'write' declared with attribute 'warn_unused_result' [-Wunused-result] 278 | write( 2, "abort5\n", 7 ); | ^~~~~~~~~~~~~~~~~~~~~~~~~ /var/lib/jenkins/workspace/Cforall_master/libcfa/src/exception.c: In function '__cfaehm_rethrow_terminate': /var/lib/jenkins/workspace/Cforall_master/libcfa/src/exception.c:308:9: warning: ignoring return value of 'write' declared with attribute 'warn_unused_result' [-Wunused-result] 308 | write( 2, "abort7\n", 7 ); | ^~~~~~~~~~~~~~~~~~~~~~~~~ /var/lib/jenkins/workspace/Cforall_master/libcfa/src/exception.c: In function '__cfaehm_rethrow_adapter': /var/lib/jenkins/workspace/Cforall_master/libcfa/src/exception.c:300:9: warning: ignoring return value of 'write' declared with attribute 'warn_unused_result' [-Wunused-result] 300 | write( 2, "abort6\n", 7 ); | ^~~~~~~~~~~~~~~~~~~~~~~~~ /usr/include/linux/io_uring.h:83:43: warning: 'packed' attribute ignored for field of type 'union __io_uring_sqe____anonymous65' [-Wattributes] 83 | } __attribute__((packed)); | ^ /usr/include/aarch64-linux-gnu/bits/socket2.h:70:94: warning: '_X12_constructorFv_U26__anonymous___SOCKADDR_ARGU26__anonymous___SOCKADDR_ARG_autogen___1' is static but used in inline function 'recvfrom' which is not static 70 | return __recvfrom_chk (__fd, __buf, __n, sz, __flags, __addr, __addr_len); | ^ /usr/include/aarch64-linux-gnu/bits/socket2.h:70:124: warning: '_X11_destructorFv_U26__anonymous___SOCKADDR_ARG_autogen___1' is static but used in inline function 'recvfrom' which is not static 70 | return __recvfrom_chk (__fd, __buf, __n, sz, __flags, __addr, __addr_len); | ^ /usr/include/aarch64-linux-gnu/bits/socket2.h:68:103: warning: '_X12_constructorFv_U26__anonymous___SOCKADDR_ARGU26__anonymous___SOCKADDR_ARG_autogen___1' is static but used in inline function 'recvfrom' which is not static 68 | return __recvfrom_chk_warn (__fd, __buf, __n, sz, __flags, __addr, | ^ /usr/include/aarch64-linux-gnu/bits/socket2.h:68:128: warning: '_X11_destructorFv_U26__anonymous___SOCKADDR_ARG_autogen___1' is static but used in inline function 'recvfrom' which is not static 68 | return __recvfrom_chk_warn (__fd, __buf, __n, sz, __flags, __addr, | ^ /usr/include/aarch64-linux-gnu/bits/socket2.h:66:96: warning: '_X12_constructorFv_U26__anonymous___SOCKADDR_ARGU26__anonymous___SOCKADDR_ARG_autogen___1' is static but used in inline function 'recvfrom' which is not static 66 | return __recvfrom_alias (__fd, __buf, __n, __flags, __addr, __addr_len); | ^ /usr/include/aarch64-linux-gnu/bits/socket2.h:66:128: warning: '_X11_destructorFv_U26__anonymous___SOCKADDR_ARG_autogen___1' is static but used in inline function 'recvfrom' which is not static 66 | return __recvfrom_alias (__fd, __buf, __n, __flags, __addr, __addr_len); | ^ /usr/include/linux/io_uring.h:83:43: warning: 'packed' attribute ignored for field of type 'union __io_uring_sqe____anonymous129' [-Wattributes] 83 | } __attribute__((packed)); | ^ /usr/include/aarch64-linux-gnu/bits/socket2.h:70:95: warning: '_X12_constructorFv_U26__anonymous___SOCKADDR_ARGU26__anonymous___SOCKADDR_ARG_autogen___1' is static but used in inline function 'recvfrom' which is not static 70 | return __recvfrom_chk (__fd, __buf, __n, sz, __flags, __addr, __addr_len); | ^ /usr/include/aarch64-linux-gnu/bits/socket2.h:70:125: warning: '_X11_destructorFv_U26__anonymous___SOCKADDR_ARG_autogen___1' is static but used in inline function 'recvfrom' which is not static 70 | return __recvfrom_chk (__fd, __buf, __n, sz, __flags, __addr, __addr_len); | ^ /usr/include/aarch64-linux-gnu/bits/socket2.h:68:104: warning: '_X12_constructorFv_U26__anonymous___SOCKADDR_ARGU26__anonymous___SOCKADDR_ARG_autogen___1' is static but used in inline function 'recvfrom' which is not static 68 | return __recvfrom_chk_warn (__fd, __buf, __n, sz, __flags, __addr, | ^ /usr/include/aarch64-linux-gnu/bits/socket2.h:68:129: warning: '_X11_destructorFv_U26__anonymous___SOCKADDR_ARG_autogen___1' is static but used in inline function 'recvfrom' which is not static 68 | return __recvfrom_chk_warn (__fd, __buf, __n, sz, __flags, __addr, | ^ /usr/include/aarch64-linux-gnu/bits/socket2.h:66:97: warning: '_X12_constructorFv_U26__anonymous___SOCKADDR_ARGU26__anonymous___SOCKADDR_ARG_autogen___1' is static but used in inline function 'recvfrom' which is not static 66 | return __recvfrom_alias (__fd, __buf, __n, __flags, __addr, __addr_len); | ^ /usr/include/aarch64-linux-gnu/bits/socket2.h:66:129: warning: '_X11_destructorFv_U26__anonymous___SOCKADDR_ARG_autogen___1' is static but used in inline function 'recvfrom' which is not static 66 | return __recvfrom_alias (__fd, __buf, __n, __flags, __addr, __addr_len); | ^ /usr/include/linux/io_uring.h:83:43: warning: 'packed' attribute ignored for field of type 'union __io_uring_sqe____anonymous53' [-Wattributes] 83 | } __attribute__((packed)); | ^ /usr/include/aarch64-linux-gnu/bits/socket2.h:70:95: warning: '_X12_constructorFv_U26__anonymous___SOCKADDR_ARGU26__anonymous___SOCKADDR_ARG_autogen___1' is static but used in inline function 'recvfrom' which is not static 70 | return __recvfrom_chk (__fd, __buf, __n, sz, __flags, __addr, __addr_len); | ^ /usr/include/aarch64-linux-gnu/bits/socket2.h:70:125: warning: '_X11_destructorFv_U26__anonymous___SOCKADDR_ARG_autogen___1' is static but used in inline function 'recvfrom' which is not static 70 | return __recvfrom_chk (__fd, __buf, __n, sz, __flags, __addr, __addr_len); | ^ /usr/include/aarch64-linux-gnu/bits/socket2.h:68:104: warning: '_X12_constructorFv_U26__anonymous___SOCKADDR_ARGU26__anonymous___SOCKADDR_ARG_autogen___1' is static but used in inline function 'recvfrom' which is not static 68 | return __recvfrom_chk_warn (__fd, __buf, __n, sz, __flags, __addr, | ^ /usr/include/aarch64-linux-gnu/bits/socket2.h:68:129: warning: '_X11_destructorFv_U26__anonymous___SOCKADDR_ARG_autogen___1' is static but used in inline function 'recvfrom' which is not static 68 | return __recvfrom_chk_warn (__fd, __buf, __n, sz, __flags, __addr, | ^ /usr/include/aarch64-linux-gnu/bits/socket2.h:66:97: warning: '_X12_constructorFv_U26__anonymous___SOCKADDR_ARGU26__anonymous___SOCKADDR_ARG_autogen___1' is static but used in inline function 'recvfrom' which is not static 66 | return __recvfrom_alias (__fd, __buf, __n, __flags, __addr, __addr_len); | ^ /usr/include/aarch64-linux-gnu/bits/socket2.h:66:129: warning: '_X11_destructorFv_U26__anonymous___SOCKADDR_ARG_autogen___1' is static but used in inline function 'recvfrom' which is not static 66 | return __recvfrom_alias (__fd, __buf, __n, __flags, __addr, __addr_len); | ^ /usr/include/linux/io_uring.h:83:43: warning: 'packed' attribute ignored for field of type 'union __io_uring_sqe____anonymous119' [-Wattributes] 83 | } __attribute__((packed)); | ^ /usr/include/aarch64-linux-gnu/bits/socket2.h:70:95: warning: '_X12_constructorFv_U26__anonymous___SOCKADDR_ARGU26__anonymous___SOCKADDR_ARG_autogen___1' is static but used in inline function 'recvfrom' which is not static 70 | return __recvfrom_chk (__fd, __buf, __n, sz, __flags, __addr, __addr_len); | ^ /usr/include/aarch64-linux-gnu/bits/socket2.h:70:125: warning: '_X11_destructorFv_U26__anonymous___SOCKADDR_ARG_autogen___1' is static but used in inline function 'recvfrom' which is not static 70 | return __recvfrom_chk (__fd, __buf, __n, sz, __flags, __addr, __addr_len); | ^ /usr/include/aarch64-linux-gnu/bits/socket2.h:68:104: warning: '_X12_constructorFv_U26__anonymous___SOCKADDR_ARGU26__anonymous___SOCKADDR_ARG_autogen___1' is static but used in inline function 'recvfrom' which is not static 68 | return __recvfrom_chk_warn (__fd, __buf, __n, sz, __flags, __addr, | ^ /usr/include/aarch64-linux-gnu/bits/socket2.h:68:129: warning: '_X11_destructorFv_U26__anonymous___SOCKADDR_ARG_autogen___1' is static but used in inline function 'recvfrom' which is not static 68 | return __recvfrom_chk_warn (__fd, __buf, __n, sz, __flags, __addr, | ^ /usr/include/aarch64-linux-gnu/bits/socket2.h:66:97: warning: '_X12_constructorFv_U26__anonymous___SOCKADDR_ARGU26__anonymous___SOCKADDR_ARG_autogen___1' is static but used in inline function 'recvfrom' which is not static 66 | return __recvfrom_alias (__fd, __buf, __n, __flags, __addr, __addr_len); | ^ /usr/include/aarch64-linux-gnu/bits/socket2.h:66:129: warning: '_X11_destructorFv_U26__anonymous___SOCKADDR_ARG_autogen___1' is static but used in inline function 'recvfrom' which is not static 66 | return __recvfrom_alias (__fd, __buf, __n, __flags, __addr, __addr_len); | ^ /usr/include/linux/io_uring.h:83:43: warning: 'packed' attribute ignored for field of type 'union __io_uring_sqe____anonymous119' [-Wattributes] 83 | } __attribute__((packed)); | ^ /usr/include/aarch64-linux-gnu/bits/socket2.h:70:95: warning: '_X12_constructorFv_U26__anonymous___SOCKADDR_ARGU26__anonymous___SOCKADDR_ARG_autogen___1' is static but used in inline function 'recvfrom' which is not static 70 | return __recvfrom_chk (__fd, __buf, __n, sz, __flags, __addr, __addr_len); | ^ /usr/include/aarch64-linux-gnu/bits/socket2.h:70:125: warning: '_X11_destructorFv_U26__anonymous___SOCKADDR_ARG_autogen___1' is static but used in inline function 'recvfrom' which is not static 70 | return __recvfrom_chk (__fd, __buf, __n, sz, __flags, __addr, __addr_len); | ^ /usr/include/aarch64-linux-gnu/bits/socket2.h:68:104: warning: '_X12_constructorFv_U26__anonymous___SOCKADDR_ARGU26__anonymous___SOCKADDR_ARG_autogen___1' is static but used in inline function 'recvfrom' which is not static 68 | return __recvfrom_chk_warn (__fd, __buf, __n, sz, __flags, __addr, | ^ /usr/include/aarch64-linux-gnu/bits/socket2.h:68:129: warning: '_X11_destructorFv_U26__anonymous___SOCKADDR_ARG_autogen___1' is static but used in inline function 'recvfrom' which is not static 68 | return __recvfrom_chk_warn (__fd, __buf, __n, sz, __flags, __addr, | ^ /usr/include/aarch64-linux-gnu/bits/socket2.h:66:97: warning: '_X12_constructorFv_U26__anonymous___SOCKADDR_ARGU26__anonymous___SOCKADDR_ARG_autogen___1' is static but used in inline function 'recvfrom' which is not static 66 | return __recvfrom_alias (__fd, __buf, __n, __flags, __addr, __addr_len); | ^ /usr/include/aarch64-linux-gnu/bits/socket2.h:66:129: warning: '_X11_destructorFv_U26__anonymous___SOCKADDR_ARG_autogen___1' is static but used in inline function 'recvfrom' which is not static 66 | return __recvfrom_alias (__fd, __buf, __n, __flags, __addr, __addr_len); | ^ CCLD libcfa.la /usr/bin/ld: warning: .libs/common.o: requires executable stack (because the .note.GNU-stack section is executable) /usr/include/linux/io_uring.h:83:43: warning: 'packed' attribute ignored for field of type 'union __io_uring_sqe____anonymous32' [-Wattributes] 83 | } __attribute__((packed)); | ^ /usr/include/aarch64-linux-gnu/bits/socket2.h:70:94: warning: '_X12_constructorFv_U26__anonymous___SOCKADDR_ARGU26__anonymous___SOCKADDR_ARG_autogen___1' is static but used in inline function 'recvfrom' which is not static 70 | return __recvfrom_chk (__fd, __buf, __n, sz, __flags, __addr, __addr_len); | ^ /usr/include/aarch64-linux-gnu/bits/socket2.h:70:124: warning: '_X11_destructorFv_U26__anonymous___SOCKADDR_ARG_autogen___1' is static but used in inline function 'recvfrom' which is not static 70 | return __recvfrom_chk (__fd, __buf, __n, sz, __flags, __addr, __addr_len); | ^ /usr/include/aarch64-linux-gnu/bits/socket2.h:68:103: warning: '_X12_constructorFv_U26__anonymous___SOCKADDR_ARGU26__anonymous___SOCKADDR_ARG_autogen___1' is static but used in inline function 'recvfrom' which is not static 68 | return __recvfrom_chk_warn (__fd, __buf, __n, sz, __flags, __addr, | ^ /usr/include/aarch64-linux-gnu/bits/socket2.h:68:128: warning: '_X11_destructorFv_U26__anonymous___SOCKADDR_ARG_autogen___1' is static but used in inline function 'recvfrom' which is not static 68 | return __recvfrom_chk_warn (__fd, __buf, __n, sz, __flags, __addr, | ^ /usr/include/aarch64-linux-gnu/bits/socket2.h:66:96: warning: '_X12_constructorFv_U26__anonymous___SOCKADDR_ARGU26__anonymous___SOCKADDR_ARG_autogen___1' is static but used in inline function 'recvfrom' which is not static 66 | return __recvfrom_alias (__fd, __buf, __n, __flags, __addr, __addr_len); | ^ /usr/include/aarch64-linux-gnu/bits/socket2.h:66:128: warning: '_X11_destructorFv_U26__anonymous___SOCKADDR_ARG_autogen___1' is static but used in inline function 'recvfrom' which is not static 66 | return __recvfrom_alias (__fd, __buf, __n, __flags, __addr, __addr_len); | ^ /usr/include/linux/io_uring.h:83:43: warning: 'packed' attribute ignored for field of type 'union __io_uring_sqe____anonymous97' [-Wattributes] 83 | } __attribute__((packed)); | ^ /usr/include/aarch64-linux-gnu/bits/socket2.h:70:95: warning: '_X12_constructorFv_U26__anonymous___SOCKADDR_ARGU26__anonymous___SOCKADDR_ARG_autogen___1' is static but used in inline function 'recvfrom' which is not static 70 | return __recvfrom_chk (__fd, __buf, __n, sz, __flags, __addr, __addr_len); | ^ /usr/include/aarch64-linux-gnu/bits/socket2.h:70:125: warning: '_X11_destructorFv_U26__anonymous___SOCKADDR_ARG_autogen___1' is static but used in inline function 'recvfrom' which is not static 70 | return __recvfrom_chk (__fd, __buf, __n, sz, __flags, __addr, __addr_len); | ^ /usr/include/aarch64-linux-gnu/bits/socket2.h:68:104: warning: '_X12_constructorFv_U26__anonymous___SOCKADDR_ARGU26__anonymous___SOCKADDR_ARG_autogen___1' is static but used in inline function 'recvfrom' which is not static 68 | return __recvfrom_chk_warn (__fd, __buf, __n, sz, __flags, __addr, | ^ /usr/include/aarch64-linux-gnu/bits/socket2.h:68:129: warning: '_X11_destructorFv_U26__anonymous___SOCKADDR_ARG_autogen___1' is static but used in inline function 'recvfrom' which is not static 68 | return __recvfrom_chk_warn (__fd, __buf, __n, sz, __flags, __addr, | ^ /usr/include/aarch64-linux-gnu/bits/socket2.h:66:97: warning: '_X12_constructorFv_U26__anonymous___SOCKADDR_ARGU26__anonymous___SOCKADDR_ARG_autogen___1' is static but used in inline function 'recvfrom' which is not static 66 | return __recvfrom_alias (__fd, __buf, __n, __flags, __addr, __addr_len); | ^ /usr/include/aarch64-linux-gnu/bits/socket2.h:66:129: warning: '_X11_destructorFv_U26__anonymous___SOCKADDR_ARG_autogen___1' is static but used in inline function 'recvfrom' which is not static 66 | return __recvfrom_alias (__fd, __buf, __n, __flags, __addr, __addr_len); | ^ CCLD libcfathread.la /usr/bin/ld: warning: concurrency/.libs/coroutine.o: requires executable stack (because the .note.GNU-stack section is executable) make[1]: Nothing to be done for 'all-am'. [Pipeline] } [Pipeline] // dir [Pipeline] } [Pipeline] // stage [Pipeline] echo -------- Build : install -------- [Pipeline] stage [Pipeline] { (Build : install) [Pipeline] dir Running in /var/lib/jenkins/workspace/Cforall_master@tmp [Pipeline] { [Pipeline] sh + nproc + make -j 96 --no-print-directory install Making install in driver make install-exec-hook /usr/bin/install -c cfa '/var/lib/jenkins/workspace/Cforall_master@tmp/bin//cfa' /usr/bin/mkdir -p '/var/lib/jenkins/workspace/Cforall_master@tmp/lib/cfa/' /bin/bash ../libtool --mode=install /usr/bin/install -c as cc1 '/var/lib/jenkins/workspace/Cforall_master@tmp/lib/cfa/' libtool: install: /usr/bin/install -c as /var/lib/jenkins/workspace/Cforall_master@tmp/lib/cfa/as libtool: install: /usr/bin/install -c cc1 /var/lib/jenkins/workspace/Cforall_master@tmp/lib/cfa/cc1 Making install in src make install-am make[3]: Nothing to be done for 'install-exec-am'. /usr/bin/mkdir -p '/var/lib/jenkins/workspace/Cforall_master@tmp/lib/cfa/' /bin/bash ../libtool --mode=install /usr/bin/install -c ../driver/cfa-cpp '/var/lib/jenkins/workspace/Cforall_master@tmp/lib/cfa/' libtool: install: /usr/bin/install -c ../driver/cfa-cpp /var/lib/jenkins/workspace/Cforall_master@tmp/lib/cfa/cfa-cpp Making install in . (CDPATH="${ZSH_VERSION+.}:" && cd /var/lib/jenkins/workspace/Cforall_master && /bin/bash '/var/lib/jenkins/workspace/Cforall_master/automake/missing' autoheader) rm -f stamp-h1 touch /var/lib/jenkins/workspace/Cforall_master/src/config.h.in cd . && /bin/bash ./config.status config.h config.status: creating config.h config.status: config.h is unchanged make[2]: Nothing to be done for 'install-exec-am'. /usr/bin/mkdir -p '/var/lib/jenkins/workspace/Cforall_master@tmp/share/man/man1' /usr/bin/install -c -m 644 /var/lib/jenkins/workspace/Cforall_master/doc/man/cfa.1 '/var/lib/jenkins/workspace/Cforall_master@tmp/share/man/man1' Making install in libcfa/arm64-debug Making install in prelude touch .deps/builtins.Po make[3]: Nothing to be done for 'install-exec-am'. /usr/bin/mkdir -p '/var/lib/jenkins/workspace/Cforall_master@tmp/lib/cfa/arm64-debug/' /usr/bin/install -c -m 644 gcc-builtins.cfa builtins.cfa extras.cfa prelude.cfa bootloader.c defines.hfa '/var/lib/jenkins/workspace/Cforall_master@tmp/lib/cfa/arm64-debug/' Making install in src /usr/bin/mkdir -p '/var/lib/jenkins/workspace/Cforall_master@tmp/lib/cfa/arm64-debug/' /bin/bash ../libtool --mode=install /usr/bin/install -c libcfa.la libcfathread.la '/var/lib/jenkins/workspace/Cforall_master@tmp/lib/cfa/arm64-debug/' /usr/bin/mkdir -p '/var/lib/jenkins/workspace/Cforall_master@tmp/include/cfa/' /usr/bin/mkdir -p '/var/lib/jenkins/workspace/Cforall_master@tmp/include/cfa//stdhdr/sys' /usr/bin/install -c -m 644 /var/lib/jenkins/workspace/Cforall_master/libcfa/src/stdhdr/sys/mman.h /var/lib/jenkins/workspace/Cforall_master/libcfa/src/stdhdr/sys/time.h /var/lib/jenkins/workspace/Cforall_master/libcfa/src/stdhdr/sys/socket.h '/var/lib/jenkins/workspace/Cforall_master@tmp/include/cfa//stdhdr/sys' /usr/bin/mkdir -p '/var/lib/jenkins/workspace/Cforall_master@tmp/include/cfa//algorithms' /usr/bin/install -c -m 644 /var/lib/jenkins/workspace/Cforall_master/libcfa/src/algorithms/range_iterator.hfa '/var/lib/jenkins/workspace/Cforall_master@tmp/include/cfa//algorithms' /usr/bin/mkdir -p '/var/lib/jenkins/workspace/Cforall_master@tmp/include/cfa//concurrency/kernel' /usr/bin/install -c -m 644 /var/lib/jenkins/workspace/Cforall_master/libcfa/src/concurrency/kernel/cluster.hfa /var/lib/jenkins/workspace/Cforall_master/libcfa/src/concurrency/kernel/fwd.hfa '/var/lib/jenkins/workspace/Cforall_master@tmp/include/cfa//concurrency/kernel' /usr/bin/install -c -m 644 /var/lib/jenkins/workspace/Cforall_master/libcfa/src/common.hfa /var/lib/jenkins/workspace/Cforall_master/libcfa/src/fstream.hfa /var/lib/jenkins/workspace/Cforall_master/libcfa/src/heap.hfa /var/lib/jenkins/workspace/Cforall_master/libcfa/src/iostream.hfa /var/lib/jenkins/workspace/Cforall_master/libcfa/src/iterator.hfa /var/lib/jenkins/workspace/Cforall_master/libcfa/src/limits.hfa /var/lib/jenkins/workspace/Cforall_master/libcfa/src/math.hfa /var/lib/jenkins/workspace/Cforall_master/libcfa/src/memory.hfa /var/lib/jenkins/workspace/Cforall_master/libcfa/src/parseargs.hfa /var/lib/jenkins/workspace/Cforall_master/libcfa/src/parseconfig.hfa /var/lib/jenkins/workspace/Cforall_master/libcfa/src/rational.hfa /var/lib/jenkins/workspace/Cforall_master/libcfa/src/stdlib.hfa /var/lib/jenkins/workspace/Cforall_master/libcfa/src/strstream.hfa /var/lib/jenkins/workspace/Cforall_master/libcfa/src/time.hfa /var/lib/jenkins/workspace/Cforall_master/libcfa/src/Exception.hfa /var/lib/jenkins/workspace/Cforall_master/libcfa/src/bitmanip.hfa /var/lib/jenkins/workspace/Cforall_master/libcfa/src/clock.hfa /var/lib/jenkins/workspace/Cforall_master/libcfa/src/exception.hfa /var/lib/jenkins/workspace/Cforall_master/libcfa/src/exception.h /var/lib/jenkins/workspace/Cforall_master/libcfa/src/gmp.hfa /var/lib/jenkins/workspace/Cforall_master/libcfa/src/math.trait.hfa /var/lib/jenkins/workspace/Cforall_master/libcfa/src/raii.hfa /var/lib/jenkins/workspace/Cforall_master/libcfa/src/time_t.hfa /var/lib/jenkins/workspace/Cforall_master/libcfa/src/virtual_dtor.hfa '/var/lib/jenkins/workspace/Cforall_master@tmp/include/cfa//.' /usr/bin/mkdir -p '/var/lib/jenkins/workspace/Cforall_master@tmp/include/cfa//concurrency' /usr/bin/install -c -m 644 /var/lib/jenkins/workspace/Cforall_master/libcfa/src/concurrency/iofwd.hfa /var/lib/jenkins/workspace/Cforall_master/libcfa/src/concurrency/barrier.hfa /var/lib/jenkins/workspace/Cforall_master/libcfa/src/concurrency/alarm.hfa /var/lib/jenkins/workspace/Cforall_master/libcfa/src/concurrency/coroutine.hfa /var/lib/jenkins/workspace/Cforall_master/libcfa/src/concurrency/exception.hfa /var/lib/jenkins/workspace/Cforall_master/libcfa/src/concurrency/kernel.hfa /var/lib/jenkins/workspace/Cforall_master/libcfa/src/concurrency/locks.hfa /var/lib/jenkins/workspace/Cforall_master/libcfa/src/concurrency/monitor.hfa /var/lib/jenkins/workspace/Cforall_master/libcfa/src/concurrency/mutex.hfa /var/lib/jenkins/workspace/Cforall_master/libcfa/src/concurrency/select.hfa /var/lib/jenkins/workspace/Cforall_master/libcfa/src/concurrency/thread.hfa /var/lib/jenkins/workspace/Cforall_master/libcfa/src/concurrency/cofor.hfa /var/lib/jenkins/workspace/Cforall_master/libcfa/src/concurrency/invoke.h /var/lib/jenkins/workspace/Cforall_master/libcfa/src/concurrency/future.hfa /var/lib/jenkins/workspace/Cforall_master/libcfa/src/concurrency/once.hfa /var/lib/jenkins/workspace/Cforall_master/libcfa/src/concurrency/mutex_stmt.hfa /var/lib/jenkins/workspace/Cforall_master/libcfa/src/concurrency/channel.hfa /var/lib/jenkins/workspace/Cforall_master/libcfa/src/concurrency/actor.hfa '/var/lib/jenkins/workspace/Cforall_master@tmp/include/cfa//concurrency' /usr/bin/mkdir -p '/var/lib/jenkins/workspace/Cforall_master@tmp/include/cfa//concurrency/clib' /usr/bin/install -c -m 644 /var/lib/jenkins/workspace/Cforall_master/libcfa/src/concurrency/clib/cfathread.h '/var/lib/jenkins/workspace/Cforall_master@tmp/include/cfa//concurrency/clib' /usr/bin/mkdir -p '/var/lib/jenkins/workspace/Cforall_master@tmp/include/cfa//device' /usr/bin/install -c -m 644 /var/lib/jenkins/workspace/Cforall_master/libcfa/src/device/cpu.hfa '/var/lib/jenkins/workspace/Cforall_master@tmp/include/cfa//device' /usr/bin/mkdir -p '/var/lib/jenkins/workspace/Cforall_master@tmp/include/cfa//stdhdr/libltdl' /usr/bin/install -c -m 644 /var/lib/jenkins/workspace/Cforall_master/libcfa/src/stdhdr/libltdl/lt_dlloader.h '/var/lib/jenkins/workspace/Cforall_master@tmp/include/cfa//stdhdr/libltdl' /usr/bin/mkdir -p '/var/lib/jenkins/workspace/Cforall_master@tmp/include/cfa//vec' /usr/bin/install -c -m 644 /var/lib/jenkins/workspace/Cforall_master/libcfa/src/vec/vec.hfa /var/lib/jenkins/workspace/Cforall_master/libcfa/src/vec/vec2.hfa /var/lib/jenkins/workspace/Cforall_master/libcfa/src/vec/vec3.hfa /var/lib/jenkins/workspace/Cforall_master/libcfa/src/vec/vec4.hfa '/var/lib/jenkins/workspace/Cforall_master@tmp/include/cfa//vec' /usr/bin/mkdir -p '/var/lib/jenkins/workspace/Cforall_master@tmp/include/cfa//bits' libtool: install: /usr/bin/install -c .libs/libcfa.so.1.0.0 /var/lib/jenkins/workspace/Cforall_master@tmp/lib/cfa/arm64-debug/libcfa.so.1.0.0 /usr/bin/install -c -m 644 /var/lib/jenkins/workspace/Cforall_master/libcfa/src/bits/weakso_locks.hfa /var/lib/jenkins/workspace/Cforall_master/libcfa/src/bits/algorithm.hfa /var/lib/jenkins/workspace/Cforall_master/libcfa/src/bits/align.hfa /var/lib/jenkins/workspace/Cforall_master/libcfa/src/bits/collections.hfa /var/lib/jenkins/workspace/Cforall_master/libcfa/src/bits/debug.hfa /var/lib/jenkins/workspace/Cforall_master/libcfa/src/bits/defs.hfa /var/lib/jenkins/workspace/Cforall_master/libcfa/src/bits/locks.hfa /var/lib/jenkins/workspace/Cforall_master/libcfa/src/bits/collection.hfa /var/lib/jenkins/workspace/Cforall_master/libcfa/src/bits/stack.hfa /var/lib/jenkins/workspace/Cforall_master/libcfa/src/bits/queue.hfa /var/lib/jenkins/workspace/Cforall_master/libcfa/src/bits/sequence.hfa /var/lib/jenkins/workspace/Cforall_master/libcfa/src/bits/atomic.hfa /var/lib/jenkins/workspace/Cforall_master/libcfa/src/bits/random.hfa '/var/lib/jenkins/workspace/Cforall_master@tmp/include/cfa//bits' /usr/bin/mkdir -p '/var/lib/jenkins/workspace/Cforall_master@tmp/include/cfa//stdhdr' /usr/bin/install -c -m 644 /var/lib/jenkins/workspace/Cforall_master/libcfa/src/stdhdr/stdalign.h /var/lib/jenkins/workspace/Cforall_master/libcfa/src/stdhdr/stdio.h /var/lib/jenkins/workspace/Cforall_master/libcfa/src/stdhdr/malloc.h /var/lib/jenkins/workspace/Cforall_master/libcfa/src/stdhdr/time.h /var/lib/jenkins/workspace/Cforall_master/libcfa/src/stdhdr/signal.h /var/lib/jenkins/workspace/Cforall_master/libcfa/src/stdhdr/stdbool.h /var/lib/jenkins/workspace/Cforall_master/libcfa/src/stdhdr/unistd.h /var/lib/jenkins/workspace/Cforall_master/libcfa/src/stdhdr/stdatomic.h /var/lib/jenkins/workspace/Cforall_master/libcfa/src/stdhdr/stdint.h /var/lib/jenkins/workspace/Cforall_master/libcfa/src/stdhdr/gmp.h /var/lib/jenkins/workspace/Cforall_master/libcfa/src/stdhdr/locale.h /var/lib/jenkins/workspace/Cforall_master/libcfa/src/stdhdr/string.h /var/lib/jenkins/workspace/Cforall_master/libcfa/src/stdhdr/fenv.h /var/lib/jenkins/workspace/Cforall_master/libcfa/src/stdhdr/wchar.h /var/lib/jenkins/workspace/Cforall_master/libcfa/src/stdhdr/tgmath.h /var/lib/jenkins/workspace/Cforall_master/libcfa/src/stdhdr/math.h /var/lib/jenkins/workspace/Cforall_master/libcfa/src/stdhdr/pthread.h /var/lib/jenkins/workspace/Cforall_master/libcfa/src/stdhdr/complex.h /var/lib/jenkins/workspace/Cforall_master/libcfa/src/stdhdr/wctype.h /var/lib/jenkins/workspace/Cforall_master/libcfa/src/stdhdr/unwind.h /var/lib/jenkins/workspace/Cforall_master/libcfa/src/stdhdr/float.h /var/lib/jenkins/workspace/Cforall_master/libcfa/src/stdhdr/stdarg.h /var/lib/jenkins/workspace/Cforall_master/libcfa/src/stdhdr/stdlib.h /var/lib/jenkins/workspace/Cforall_master/libcfa/src/stdhdr/iso646.h /var/lib/jenkins/workspace/Cforall_master/libcfa/src/stdhdr/stddef.h /var/lib/jenkins/workspace/Cforall_master/libcfa/src/stdhdr/stdnoreturn.h /var/lib/jenkins/workspace/Cforall_master/libcfa/src/stdhdr/assert.h /var/lib/jenkins/workspace/Cforall_master/libcfa/src/stdhdr/ctype.h /var/lib/jenkins/workspace/Cforall_master/libcfa/src/stdhdr/errno.h /var/lib/jenkins/workspace/Cforall_master/libcfa/src/stdhdr/threads.h /var/lib/jenkins/workspace/Cforall_master/libcfa/src/stdhdr/uchar.h /var/lib/jenkins/workspace/Cforall_master/libcfa/src/stdhdr/inttypes.h /var/lib/jenkins/workspace/Cforall_master/libcfa/src/stdhdr/limits.h /var/lib/jenkins/workspace/Cforall_master/libcfa/src/stdhdr/setjmp.h '/var/lib/jenkins/workspace/Cforall_master@tmp/include/cfa//stdhdr' libtool: install: (cd /var/lib/jenkins/workspace/Cforall_master@tmp/lib/cfa/arm64-debug && { ln -s -f libcfa.so.1.0.0 libcfa.so.1 || { rm -f libcfa.so.1 && ln -s libcfa.so.1.0.0 libcfa.so.1; }; }) /usr/bin/mkdir -p '/var/lib/jenkins/workspace/Cforall_master@tmp/include/cfa//collections' /usr/bin/install -c -m 644 /var/lib/jenkins/workspace/Cforall_master/libcfa/src/collections/maybe.hfa /var/lib/jenkins/workspace/Cforall_master/libcfa/src/collections/pair.hfa /var/lib/jenkins/workspace/Cforall_master/libcfa/src/collections/result.hfa /var/lib/jenkins/workspace/Cforall_master/libcfa/src/collections/string.hfa /var/lib/jenkins/workspace/Cforall_master/libcfa/src/collections/string_res.hfa /var/lib/jenkins/workspace/Cforall_master/libcfa/src/collections/vector.hfa /var/lib/jenkins/workspace/Cforall_master/libcfa/src/collections/array.hfa /var/lib/jenkins/workspace/Cforall_master/libcfa/src/collections/list.hfa /var/lib/jenkins/workspace/Cforall_master/libcfa/src/collections/list2.hfa /var/lib/jenkins/workspace/Cforall_master/libcfa/src/collections/lockfree.hfa /var/lib/jenkins/workspace/Cforall_master/libcfa/src/collections/string_sharectx.hfa /var/lib/jenkins/workspace/Cforall_master/libcfa/src/collections/vector2.hfa '/var/lib/jenkins/workspace/Cforall_master@tmp/include/cfa//collections' libtool: install: (cd /var/lib/jenkins/workspace/Cforall_master@tmp/lib/cfa/arm64-debug && { ln -s -f libcfa.so.1.0.0 libcfa.so || { rm -f libcfa.so && ln -s libcfa.so.1.0.0 libcfa.so; }; }) libtool: install: /usr/bin/install -c .libs/libcfa.lai /var/lib/jenkins/workspace/Cforall_master@tmp/lib/cfa/arm64-debug/libcfa.la libtool: install: /usr/bin/install -c .libs/libcfathread.so.1.0.0 /var/lib/jenkins/workspace/Cforall_master@tmp/lib/cfa/arm64-debug/libcfathread.so.1.0.0 libtool: install: (cd /var/lib/jenkins/workspace/Cforall_master@tmp/lib/cfa/arm64-debug && { ln -s -f libcfathread.so.1.0.0 libcfathread.so.1 || { rm -f libcfathread.so.1 && ln -s libcfathread.so.1.0.0 libcfathread.so.1; }; }) libtool: install: (cd /var/lib/jenkins/workspace/Cforall_master@tmp/lib/cfa/arm64-debug && { ln -s -f libcfathread.so.1.0.0 libcfathread.so || { rm -f libcfathread.so && ln -s libcfathread.so.1.0.0 libcfathread.so; }; }) libtool: install: /usr/bin/install -c .libs/libcfathread.lai /var/lib/jenkins/workspace/Cforall_master@tmp/lib/cfa/arm64-debug/libcfathread.la libtool: warning: remember to run 'libtool --finish /var/lib/jenkins/workspace/Cforall_master@tmp/lib/cfa/arm64-debug/' make[3]: Nothing to be done for 'install-exec-am'. make[3]: Nothing to be done for 'install-data-am'. Making install in libcfa/arm64-nodebug Making install in prelude make[3]: Nothing to be done for 'install-exec-am'. /usr/bin/mkdir -p '/var/lib/jenkins/workspace/Cforall_master@tmp/lib/cfa/arm64-nodebug/' /usr/bin/install -c -m 644 gcc-builtins.cfa builtins.cfa extras.cfa prelude.cfa bootloader.c defines.hfa '/var/lib/jenkins/workspace/Cforall_master@tmp/lib/cfa/arm64-nodebug/' Making install in src /usr/bin/mkdir -p '/var/lib/jenkins/workspace/Cforall_master@tmp/lib/cfa/arm64-nodebug/' /bin/bash ../libtool --mode=install /usr/bin/install -c libcfa.la libcfathread.la '/var/lib/jenkins/workspace/Cforall_master@tmp/lib/cfa/arm64-nodebug/' /usr/bin/mkdir -p '/var/lib/jenkins/workspace/Cforall_master@tmp/include/cfa/' /usr/bin/mkdir -p '/var/lib/jenkins/workspace/Cforall_master@tmp/include/cfa//stdhdr/sys' /usr/bin/install -c -m 644 /var/lib/jenkins/workspace/Cforall_master/libcfa/src/stdhdr/sys/mman.h /var/lib/jenkins/workspace/Cforall_master/libcfa/src/stdhdr/sys/time.h /var/lib/jenkins/workspace/Cforall_master/libcfa/src/stdhdr/sys/socket.h '/var/lib/jenkins/workspace/Cforall_master@tmp/include/cfa//stdhdr/sys' /usr/bin/mkdir -p '/var/lib/jenkins/workspace/Cforall_master@tmp/include/cfa//algorithms' /usr/bin/install -c -m 644 /var/lib/jenkins/workspace/Cforall_master/libcfa/src/algorithms/range_iterator.hfa '/var/lib/jenkins/workspace/Cforall_master@tmp/include/cfa//algorithms' /usr/bin/mkdir -p '/var/lib/jenkins/workspace/Cforall_master@tmp/include/cfa//concurrency/kernel' /usr/bin/install -c -m 644 /var/lib/jenkins/workspace/Cforall_master/libcfa/src/concurrency/kernel/cluster.hfa /var/lib/jenkins/workspace/Cforall_master/libcfa/src/concurrency/kernel/fwd.hfa '/var/lib/jenkins/workspace/Cforall_master@tmp/include/cfa//concurrency/kernel' /usr/bin/install -c -m 644 /var/lib/jenkins/workspace/Cforall_master/libcfa/src/common.hfa /var/lib/jenkins/workspace/Cforall_master/libcfa/src/fstream.hfa /var/lib/jenkins/workspace/Cforall_master/libcfa/src/heap.hfa /var/lib/jenkins/workspace/Cforall_master/libcfa/src/iostream.hfa /var/lib/jenkins/workspace/Cforall_master/libcfa/src/iterator.hfa /var/lib/jenkins/workspace/Cforall_master/libcfa/src/limits.hfa /var/lib/jenkins/workspace/Cforall_master/libcfa/src/math.hfa /var/lib/jenkins/workspace/Cforall_master/libcfa/src/memory.hfa /var/lib/jenkins/workspace/Cforall_master/libcfa/src/parseargs.hfa /var/lib/jenkins/workspace/Cforall_master/libcfa/src/parseconfig.hfa /var/lib/jenkins/workspace/Cforall_master/libcfa/src/rational.hfa /var/lib/jenkins/workspace/Cforall_master/libcfa/src/stdlib.hfa /var/lib/jenkins/workspace/Cforall_master/libcfa/src/strstream.hfa /var/lib/jenkins/workspace/Cforall_master/libcfa/src/time.hfa /var/lib/jenkins/workspace/Cforall_master/libcfa/src/Exception.hfa /var/lib/jenkins/workspace/Cforall_master/libcfa/src/bitmanip.hfa /var/lib/jenkins/workspace/Cforall_master/libcfa/src/clock.hfa /var/lib/jenkins/workspace/Cforall_master/libcfa/src/exception.hfa /var/lib/jenkins/workspace/Cforall_master/libcfa/src/exception.h /var/lib/jenkins/workspace/Cforall_master/libcfa/src/gmp.hfa /var/lib/jenkins/workspace/Cforall_master/libcfa/src/math.trait.hfa /var/lib/jenkins/workspace/Cforall_master/libcfa/src/raii.hfa /var/lib/jenkins/workspace/Cforall_master/libcfa/src/time_t.hfa /var/lib/jenkins/workspace/Cforall_master/libcfa/src/virtual_dtor.hfa '/var/lib/jenkins/workspace/Cforall_master@tmp/include/cfa//.' /usr/bin/mkdir -p '/var/lib/jenkins/workspace/Cforall_master@tmp/include/cfa//concurrency' /usr/bin/install -c -m 644 /var/lib/jenkins/workspace/Cforall_master/libcfa/src/concurrency/iofwd.hfa /var/lib/jenkins/workspace/Cforall_master/libcfa/src/concurrency/barrier.hfa /var/lib/jenkins/workspace/Cforall_master/libcfa/src/concurrency/alarm.hfa /var/lib/jenkins/workspace/Cforall_master/libcfa/src/concurrency/coroutine.hfa /var/lib/jenkins/workspace/Cforall_master/libcfa/src/concurrency/exception.hfa /var/lib/jenkins/workspace/Cforall_master/libcfa/src/concurrency/kernel.hfa /var/lib/jenkins/workspace/Cforall_master/libcfa/src/concurrency/locks.hfa /var/lib/jenkins/workspace/Cforall_master/libcfa/src/concurrency/monitor.hfa /var/lib/jenkins/workspace/Cforall_master/libcfa/src/concurrency/mutex.hfa /var/lib/jenkins/workspace/Cforall_master/libcfa/src/concurrency/select.hfa /var/lib/jenkins/workspace/Cforall_master/libcfa/src/concurrency/thread.hfa /var/lib/jenkins/workspace/Cforall_master/libcfa/src/concurrency/cofor.hfa /var/lib/jenkins/workspace/Cforall_master/libcfa/src/concurrency/invoke.h /var/lib/jenkins/workspace/Cforall_master/libcfa/src/concurrency/future.hfa /var/lib/jenkins/workspace/Cforall_master/libcfa/src/concurrency/once.hfa /var/lib/jenkins/workspace/Cforall_master/libcfa/src/concurrency/mutex_stmt.hfa /var/lib/jenkins/workspace/Cforall_master/libcfa/src/concurrency/channel.hfa /var/lib/jenkins/workspace/Cforall_master/libcfa/src/concurrency/actor.hfa '/var/lib/jenkins/workspace/Cforall_master@tmp/include/cfa//concurrency' /usr/bin/mkdir -p '/var/lib/jenkins/workspace/Cforall_master@tmp/include/cfa//concurrency/clib' /usr/bin/install -c -m 644 /var/lib/jenkins/workspace/Cforall_master/libcfa/src/concurrency/clib/cfathread.h '/var/lib/jenkins/workspace/Cforall_master@tmp/include/cfa//concurrency/clib' /usr/bin/mkdir -p '/var/lib/jenkins/workspace/Cforall_master@tmp/include/cfa//device' /usr/bin/install -c -m 644 /var/lib/jenkins/workspace/Cforall_master/libcfa/src/device/cpu.hfa '/var/lib/jenkins/workspace/Cforall_master@tmp/include/cfa//device' /usr/bin/mkdir -p '/var/lib/jenkins/workspace/Cforall_master@tmp/include/cfa//stdhdr/libltdl' /usr/bin/install -c -m 644 /var/lib/jenkins/workspace/Cforall_master/libcfa/src/stdhdr/libltdl/lt_dlloader.h '/var/lib/jenkins/workspace/Cforall_master@tmp/include/cfa//stdhdr/libltdl' /usr/bin/mkdir -p '/var/lib/jenkins/workspace/Cforall_master@tmp/include/cfa//vec' /usr/bin/install -c -m 644 /var/lib/jenkins/workspace/Cforall_master/libcfa/src/vec/vec.hfa /var/lib/jenkins/workspace/Cforall_master/libcfa/src/vec/vec2.hfa /var/lib/jenkins/workspace/Cforall_master/libcfa/src/vec/vec3.hfa /var/lib/jenkins/workspace/Cforall_master/libcfa/src/vec/vec4.hfa '/var/lib/jenkins/workspace/Cforall_master@tmp/include/cfa//vec' libtool: install: /usr/bin/install -c .libs/libcfa.so.1.0.0 /var/lib/jenkins/workspace/Cforall_master@tmp/lib/cfa/arm64-nodebug/libcfa.so.1.0.0 /usr/bin/mkdir -p '/var/lib/jenkins/workspace/Cforall_master@tmp/include/cfa//bits' /usr/bin/install -c -m 644 /var/lib/jenkins/workspace/Cforall_master/libcfa/src/bits/weakso_locks.hfa /var/lib/jenkins/workspace/Cforall_master/libcfa/src/bits/algorithm.hfa /var/lib/jenkins/workspace/Cforall_master/libcfa/src/bits/align.hfa /var/lib/jenkins/workspace/Cforall_master/libcfa/src/bits/collections.hfa /var/lib/jenkins/workspace/Cforall_master/libcfa/src/bits/debug.hfa /var/lib/jenkins/workspace/Cforall_master/libcfa/src/bits/defs.hfa /var/lib/jenkins/workspace/Cforall_master/libcfa/src/bits/locks.hfa /var/lib/jenkins/workspace/Cforall_master/libcfa/src/bits/collection.hfa /var/lib/jenkins/workspace/Cforall_master/libcfa/src/bits/stack.hfa /var/lib/jenkins/workspace/Cforall_master/libcfa/src/bits/queue.hfa /var/lib/jenkins/workspace/Cforall_master/libcfa/src/bits/sequence.hfa /var/lib/jenkins/workspace/Cforall_master/libcfa/src/bits/atomic.hfa /var/lib/jenkins/workspace/Cforall_master/libcfa/src/bits/random.hfa '/var/lib/jenkins/workspace/Cforall_master@tmp/include/cfa//bits' libtool: install: (cd /var/lib/jenkins/workspace/Cforall_master@tmp/lib/cfa/arm64-nodebug && { ln -s -f libcfa.so.1.0.0 libcfa.so.1 || { rm -f libcfa.so.1 && ln -s libcfa.so.1.0.0 libcfa.so.1; }; }) /usr/bin/mkdir -p '/var/lib/jenkins/workspace/Cforall_master@tmp/include/cfa//stdhdr' /usr/bin/install -c -m 644 /var/lib/jenkins/workspace/Cforall_master/libcfa/src/stdhdr/stdalign.h /var/lib/jenkins/workspace/Cforall_master/libcfa/src/stdhdr/stdio.h /var/lib/jenkins/workspace/Cforall_master/libcfa/src/stdhdr/malloc.h /var/lib/jenkins/workspace/Cforall_master/libcfa/src/stdhdr/time.h /var/lib/jenkins/workspace/Cforall_master/libcfa/src/stdhdr/signal.h /var/lib/jenkins/workspace/Cforall_master/libcfa/src/stdhdr/stdbool.h /var/lib/jenkins/workspace/Cforall_master/libcfa/src/stdhdr/unistd.h /var/lib/jenkins/workspace/Cforall_master/libcfa/src/stdhdr/stdatomic.h /var/lib/jenkins/workspace/Cforall_master/libcfa/src/stdhdr/stdint.h /var/lib/jenkins/workspace/Cforall_master/libcfa/src/stdhdr/gmp.h /var/lib/jenkins/workspace/Cforall_master/libcfa/src/stdhdr/locale.h /var/lib/jenkins/workspace/Cforall_master/libcfa/src/stdhdr/string.h /var/lib/jenkins/workspace/Cforall_master/libcfa/src/stdhdr/fenv.h /var/lib/jenkins/workspace/Cforall_master/libcfa/src/stdhdr/wchar.h /var/lib/jenkins/workspace/Cforall_master/libcfa/src/stdhdr/tgmath.h /var/lib/jenkins/workspace/Cforall_master/libcfa/src/stdhdr/math.h /var/lib/jenkins/workspace/Cforall_master/libcfa/src/stdhdr/pthread.h /var/lib/jenkins/workspace/Cforall_master/libcfa/src/stdhdr/complex.h /var/lib/jenkins/workspace/Cforall_master/libcfa/src/stdhdr/wctype.h /var/lib/jenkins/workspace/Cforall_master/libcfa/src/stdhdr/unwind.h /var/lib/jenkins/workspace/Cforall_master/libcfa/src/stdhdr/float.h /var/lib/jenkins/workspace/Cforall_master/libcfa/src/stdhdr/stdarg.h /var/lib/jenkins/workspace/Cforall_master/libcfa/src/stdhdr/stdlib.h /var/lib/jenkins/workspace/Cforall_master/libcfa/src/stdhdr/iso646.h /var/lib/jenkins/workspace/Cforall_master/libcfa/src/stdhdr/stddef.h /var/lib/jenkins/workspace/Cforall_master/libcfa/src/stdhdr/stdnoreturn.h /var/lib/jenkins/workspace/Cforall_master/libcfa/src/stdhdr/assert.h /var/lib/jenkins/workspace/Cforall_master/libcfa/src/stdhdr/ctype.h /var/lib/jenkins/workspace/Cforall_master/libcfa/src/stdhdr/errno.h /var/lib/jenkins/workspace/Cforall_master/libcfa/src/stdhdr/threads.h /var/lib/jenkins/workspace/Cforall_master/libcfa/src/stdhdr/uchar.h /var/lib/jenkins/workspace/Cforall_master/libcfa/src/stdhdr/inttypes.h /var/lib/jenkins/workspace/Cforall_master/libcfa/src/stdhdr/limits.h /var/lib/jenkins/workspace/Cforall_master/libcfa/src/stdhdr/setjmp.h '/var/lib/jenkins/workspace/Cforall_master@tmp/include/cfa//stdhdr' libtool: install: (cd /var/lib/jenkins/workspace/Cforall_master@tmp/lib/cfa/arm64-nodebug && { ln -s -f libcfa.so.1.0.0 libcfa.so || { rm -f libcfa.so && ln -s libcfa.so.1.0.0 libcfa.so; }; }) /usr/bin/mkdir -p '/var/lib/jenkins/workspace/Cforall_master@tmp/include/cfa//collections' /usr/bin/install -c -m 644 /var/lib/jenkins/workspace/Cforall_master/libcfa/src/collections/maybe.hfa /var/lib/jenkins/workspace/Cforall_master/libcfa/src/collections/pair.hfa /var/lib/jenkins/workspace/Cforall_master/libcfa/src/collections/result.hfa /var/lib/jenkins/workspace/Cforall_master/libcfa/src/collections/string.hfa /var/lib/jenkins/workspace/Cforall_master/libcfa/src/collections/string_res.hfa /var/lib/jenkins/workspace/Cforall_master/libcfa/src/collections/vector.hfa /var/lib/jenkins/workspace/Cforall_master/libcfa/src/collections/array.hfa /var/lib/jenkins/workspace/Cforall_master/libcfa/src/collections/list.hfa /var/lib/jenkins/workspace/Cforall_master/libcfa/src/collections/list2.hfa /var/lib/jenkins/workspace/Cforall_master/libcfa/src/collections/lockfree.hfa /var/lib/jenkins/workspace/Cforall_master/libcfa/src/collections/string_sharectx.hfa /var/lib/jenkins/workspace/Cforall_master/libcfa/src/collections/vector2.hfa '/var/lib/jenkins/workspace/Cforall_master@tmp/include/cfa//collections' libtool: install: /usr/bin/install -c .libs/libcfa.lai /var/lib/jenkins/workspace/Cforall_master@tmp/lib/cfa/arm64-nodebug/libcfa.la libtool: install: /usr/bin/install -c .libs/libcfathread.so.1.0.0 /var/lib/jenkins/workspace/Cforall_master@tmp/lib/cfa/arm64-nodebug/libcfathread.so.1.0.0 libtool: install: (cd /var/lib/jenkins/workspace/Cforall_master@tmp/lib/cfa/arm64-nodebug && { ln -s -f libcfathread.so.1.0.0 libcfathread.so.1 || { rm -f libcfathread.so.1 && ln -s libcfathread.so.1.0.0 libcfathread.so.1; }; }) libtool: install: (cd /var/lib/jenkins/workspace/Cforall_master@tmp/lib/cfa/arm64-nodebug && { ln -s -f libcfathread.so.1.0.0 libcfathread.so || { rm -f libcfathread.so && ln -s libcfathread.so.1.0.0 libcfathread.so; }; }) libtool: install: /usr/bin/install -c .libs/libcfathread.lai /var/lib/jenkins/workspace/Cforall_master@tmp/lib/cfa/arm64-nodebug/libcfathread.la libtool: warning: remember to run 'libtool --finish /var/lib/jenkins/workspace/Cforall_master@tmp/lib/cfa/arm64-nodebug/' make[3]: Nothing to be done for 'install-exec-am'. make[3]: Nothing to be done for 'install-data-am'. [Pipeline] } [Pipeline] // dir [Pipeline] } [Pipeline] // stage [Pipeline] sh + free -h total used free shared buff/cache available Mem: 502Gi 7.3Gi 491Gi 3.5Mi 6.0Gi 495Gi Swap: 127Gi 0B 127Gi [Pipeline] sh + ulimit -a time(seconds) unlimited file(blocks) unlimited data(kbytes) unlimited stack(kbytes) 8192 coredump(blocks) 0 memory(kbytes) unlimited locked memory(kbytes) 65876424 process 2058180 nofiles 1048576 vmemory(kbytes) unlimited locks unlimited rtprio 0 [Pipeline] echo -------- Test: Debug -------- [Pipeline] stage [Pipeline] { (Test: Debug) [Pipeline] dir Running in /var/lib/jenkins/workspace/Cforall_master@tmp [Pipeline] { [Pipeline] sh + nproc + make -j 96 --no-print-directory -C tests timeout=600 global-timeout=14400 tests debug=yes archive-errors=/var/lib/jenkins/workspace/Cforall_master@tmp/tests/crashes/full-debug Running 375 tests on 96 cores (arm64 - debug) array-ERR2 PASSED C 0:00.133 - R n/a array-ERR3 PASSED C 0:00.142 - R n/a ...ollections/language-dim-mismatch PASSED C 0:00.361 - R n/a concurrency/mainError PASSED C 0:00.458 - R n/a concurrency/keywordErrors PASSED C 0:00.626 - R n/a array-collections/symtab-collision PASSED C 0:00.885 - R n/a castError PASSED C 0:00.891 - R n/a array-collections/safety-summary PASSED C 0:01.084 - R n/a concurrency/ctor-check PASSED C 0:01.225 - R n/a array-ERR1 PASSED C 0:01.471 - R n/a attr-priority PASSED C 0:01.674 - R 0:00.007 castReturn PASSED C 0:01.684 - R 0:00.048 cast PASSED C 0:01.658 - R 0:00.131 array PASSED C 0:01.701 - R 0:00.131 array-collections/c-dependent PASSED C 0:01.871 - R 0:00.075 builtins/sync PASSED C 0:01.971 - R 0:00.072 array-collections/array-raii-c PASSED C 0:01.991 - R 0:00.074 array-collections/dimexpr-match-c PASSED C 0:02.210 - R 0:00.044 concurrency/clib_tls PASSED C 0:02.700 - R 0:00.130 concurrency/clib PASSED C 0:02.657 - R 0:00.220 array-collections/array-sbscr-types PASSED C 0:02.806 - R 0:00.122 ...ns/vector-err-retn-perm-it-byval PASSED C 0:02.925 - R n/a array-collections/boxed PASSED C 0:02.955 - R 0:00.041 array-collections/dimexpr-match-cfa PASSED C 0:03.081 - R 0:00.024 array-collections/array-basic PASSED C 0:03.135 - R 0:00.039 ...ns/vector-err-pass-perm-it-byval PASSED C 0:03.373 - R n/a collections/string-operator-ERR13 PASSED C 0:05.394 - R n/a collections/string-operator-ERR15 PASSED C 0:05.422 - R n/a avl_test PASSED C 0:05.528 - R 0:00.043 collections/string-operator-ERR09 PASSED C 0:05.616 - R n/a ...urrency/pthread/pthread_key_test PASSED C 0:03.818 - R 0:00.038 collections/string-operator-ERR11 PASSED C 0:05.700 - R n/a alloc-ERROR PASSED C 0:05.978 - R n/a collections/string-operator-ERR16 PASSED C 0:06.116 - R n/a algorithms/range_test PASSED C 0:06.717 - R 0:00.023 collections/vector-demo PASSED C 0:06.950 - R 0:00.038 array-collections/accordion PASSED C 0:07.046 - R 0:00.027 complex PASSED C 0:07.086 - R 0:00.023 collections/string-gc PASSED C 0:07.607 - R 0:00.037 array-collections/array-raii-cfa PASSED C 0:07.896 - R 0:00.023 concurrency/cluster PASSED C 0:08.456 - R 0:00.043 concurrency/futures/basic PASSED C 0:08.765 - R 0:00.270 concurrency/futures/abandon PASSED C 0:08.825 - R 0:00.271 collections/stack PASSED C 0:09.150 - R 0:00.038 collections/string-istream PASSED C 0:09.179 - R 0:00.039 concurrency/park/contention PASSED C 0:08.698 - R 0:00.369 concurrency/park/start_parked PASSED C 0:08.646 - R 0:00.125 collections/string-compare PASSED C 0:09.786 - R 0:00.040 collections/multi_list PASSED C 0:09.855 - R 0:00.023 collections/string-ostream PASSED C 0:10.252 - R 0:00.045 collections/queue PASSED C 0:10.468 - R 0:00.026 collections/string-ctx-manage PASSED C 0:10.511 - R 0:00.022 collections/string-operator PASSED C 0:10.935 - R 0:00.079 collections/string-istream-manip PASSED C 0:11.043 - R 0:00.076 concurrency/cofor PASSED C 0:11.172 - R 0:00.074 concurrency/examples/matrixSum PASSED C 0:11.815 - R 0:00.178 ...ections/string-overwrite-noshare PASSED C 0:12.235 - R 0:00.072 concurrency/coroutineYield PASSED C 0:12.257 - R 0:00.070 collections/string-overwrite PASSED C 0:12.244 - R 0:00.121 concurrency/examples/gortn PASSED C 0:12.268 - R 0:00.080 concurrency/join PASSED C 0:12.310 - R 0:00.172 concurrency/examples/datingService PASSED C 0:12.466 - R 0:00.120 collections/sequence PASSED C 0:12.984 - R 0:00.072 alloc PASSED C 0:13.338 - R 0:00.125 concurrency/park/force_preempt PASSED C 0:12.460 - R 0:00.481 ...rrency/pthread/pthread_attr_test PASSED C 0:12.268 - R 0:00.130 const-init PASSED C 0:01.695 - R 0:00.040 ...rrency/pthread/pthread_once_test PASSED C 0:11.899 - R 0:00.072 ...pthread/pthread_demo_create_join PASSED C 0:12.063 - R 0:00.072 ...rrency/pthread/pthread_cond_test PASSED C 0:12.196 - R 0:00.181 const-ref PASSED C 0:01.717 - R 0:00.129 ...ions/string-api-coverage-noshare PASSED C 0:14.171 - R 0:00.134 collections/string-api-coverage PASSED C 0:14.471 - R 0:00.131 concurrency/futures/wait_any PASSED C 0:14.591 - R 0:00.071 concurrency/examples/quickSort PASSED C 0:14.491 - R 0:00.176 concurrency/barrier/last PASSED C 0:14.513 - R 0:00.272 concurrency/once PASSED C 0:14.474 - R 0:00.176 concurrency/mutexstmt/tuple PASSED C 0:14.860 - R 0:00.022 concurrency/migrate PASSED C 0:14.798 - R 0:00.228 concurrency/readyQ/leader_spin PASSED C 0:12.157 - R 0:00.976 concurrency/barrier/order PASSED C 0:14.846 - R 0:00.379 concurrency/waitfor/parse PASSED C 0:07.786 - R 0:00.041 concurrency/suspend_then PASSED C 0:12.701 - R 0:00.124 concurrency/signal/wait PASSED C 0:12.496 - R 0:00.681 ctrl-flow/labelledExit PASSED C 0:01.767 - R 0:00.088 ctrl-flow/loop-inc PASSED C 0:01.837 - R 0:00.129 concurrency/barrier/generation PASSED C 0:14.502 - R 0:02.031 alloc2 PASSED C 0:16.910 - R 0:00.077 enum_tests/lvalue PASSED C 0:00.893 - R n/a enum PASSED C 0:01.829 - R 0:00.124 concurrency/sleep PASSED C 0:13.000 - R 0:01.228 concurrency/thread PASSED C 0:14.181 - R 0:00.072 concurrency/lockfree_stack PASSED C 0:11.826 - R 0:05.484 errors/declaration PASSED C 0:00.158 - R n/a concurrency/waitfor/else PASSED C 0:10.330 - R 0:00.077 .../unified_locking/block_spin_lock PASSED C 0:14.323 - R 0:00.174 enum_tests/inc-dec PASSED C 0:01.736 - R 0:00.040 designations PASSED C 0:02.835 - R 0:00.070 errors/scope-type PASSED C 0:00.282 - R n/a errors/signature PASSED C 0:00.257 - R n/a concurrency/actors/inline PASSED C 0:17.903 - R 0:00.071 ...cy/unified_locking/pthread_locks PASSED C 0:11.424 - R 0:00.874 .../unified_locking/fast_block_lock PASSED C 0:14.427 - R 0:00.377 concurrency/readyQ/barrier_sleeper PASSED C 0:14.764 - R 0:01.428 errors/scope PASSED C 0:00.830 - R n/a ...ncy/unified_locking/timeout_lock PASSED C 0:10.844 - R 0:01.280 concurrency/actors/poison PASSED C 0:18.186 - R 0:00.126 enum_tests/funcEnum PASSED C 0:02.796 - R 0:00.130 concurrency/actors/types PASSED C 0:18.410 - R 0:00.120 concurrency/actors/inherit PASSED C 0:18.395 - R 0:00.180 concurrency/signal/block PASSED C 0:12.744 - R 0:03.933 concurrency/actors/executor PASSED C 0:18.546 - R 0:00.278 concurrency/actors/static PASSED C 0:18.602 - R 0:00.327 concurrency/futures/typed PASSED C 0:18.419 - R 0:00.522 concurrency/mutexstmt/monitors PASSED C 0:09.490 - R 0:09.510 eval PASSED C 0:01.596 - R 0:00.039 copyfile PASSED C 0:06.832 - R 0:00.073 ...urrency/waitfor/lexical_priority PASSED C 0:12.222 - R 0:00.070 concurrency/preempt PASSED C 0:13.637 - R 0:04.943 enum_tests/structEnum PASSED C 0:02.541 - R 0:00.043 exceptions/try-ctrl-flow PASSED C 0:00.553 - R n/a concurrency/actors/matrixMultiply PASSED C 0:18.722 - R 0:01.176 ...nified_locking/simple_owner_lock PASSED C 0:14.033 - R 0:00.226 exceptions/type-check PASSED C 0:00.697 - R n/a concurrency/signal/disjoint PASSED C 0:12.816 - R 0:05.255 concurrency/waitfor/barge PASSED C 0:12.650 - R 0:01.222 ...ency/unified_locking/exp_backoff PASSED C 0:17.314 - R 0:00.227 ctrl-flow/goto PASSED C 0:06.787 - R 0:00.071 configs/usage PASSED C 0:09.424 - R 0:00.072 ctrl-flow/break-misc PASSED C 0:07.055 - R 0:00.040 ctrl-flow/ifwhileCtl PASSED C 0:06.961 - R 0:00.073 coroutine/fibonacci PASSED C 0:08.501 - R 0:00.072 ctrl-flow/fallthrough PASSED C 0:07.156 - R 0:00.038 coroutine/pingpong PASSED C 0:08.397 - R 0:00.068 exceptions/try-leave-catch PASSED C 0:01.661 - R 0:00.022 ctrl-flow/loop_else PASSED C 0:06.625 - R 0:00.037 exceptions/message PASSED C 0:02.744 - R 0:00.038 counter PASSED C 0:07.593 - R 0:00.043 coroutine/devicedriver PASSED C 0:08.986 - R 0:00.075 ...fied_locking/mcs_block_spin_lock PASSED C 0:15.464 - R 0:00.476 concurrency/actors/pingpong PASSED C 0:21.416 - R 0:00.171 expression PASSED C 0:01.697 - R 0:00.037 concurrency/waituntil/timeout PASSED C 0:07.791 - R 0:03.336 configs/parseconfig PASSED C 0:10.482 - R 0:00.081 coroutine/raii PASSED C 0:08.392 - R 0:00.037 concurrency/waitfor/when PASSED C 0:12.513 - R 0:00.577 concurrency/waitfor/statment PASSED C 0:13.724 - R 0:00.122 global-monomorph PASSED C 0:01.477 - R 0:00.038 enum_tests/anonymous PASSED C 0:07.182 - R 0:00.124 configs/parsebools PASSED C 0:11.253 - R 0:00.275 init1-ERROR PASSED C 0:00.893 - R n/a identFuncDeclarator PASSED C 0:01.513 - R 0:00.075 ctrl-flow/loop_else-WRN1 PASSED C 0:07.973 - R 0:00.002 identParamDeclarator PASSED C 0:01.554 - R 0:00.021 coroutine/runningTotal PASSED C 0:09.031 - R 0:00.071 coroutine/fmtLines PASSED C 0:10.511 - R 0:00.123 init1 PASSED C 0:01.549 - R 0:00.073 enum_tests/input PASSED C 0:07.545 - R 0:00.039 ctrl-flow/loopctrl PASSED C 0:08.982 - R 0:00.041 coroutine/prodcons PASSED C 0:10.907 - R 0:00.071 enum_tests/enumInlineValue PASSED C 0:08.738 - R 0:00.040 enum_tests/stringEnum PASSED C 0:07.003 - R 0:00.073 ...rrency/pthread/pthread_demo_lock PASSED C 0:12.021 - R 0:10.329 enum_tests/voidEnum PASSED C 0:06.899 - R 0:00.039 include/vector-sequence PASSED C 0:02.551 - R 0:00.038 enum_tests/typedIntEnum PASSED C 0:07.362 - R 0:00.042 exceptions/conditional PASSED C 0:06.772 - R 0:00.038 include/vector-collections PASSED C 0:03.270 - R 0:00.076 div PASSED C 0:09.652 - R 0:00.075 limits PASSED C 0:01.687 - R 0:00.024 enum_tests/planet PASSED C 0:08.911 - R 0:00.129 exceptions/finally PASSED C 0:07.040 - R 0:00.041 exceptions/defaults PASSED C 0:07.343 - R 0:00.073 exceptions/data-except PASSED C 0:07.372 - R 0:00.072 enum_tests/position PASSED C 0:09.023 - R 0:00.038 linking/nostdlib PASSED C 0:01.535 - R 0:00.043 concurrency/waitfor/recurse PASSED C 0:12.963 - R 0:04.945 nested-types-ERR1 PASSED C 0:00.195 - R n/a exceptions/polymorphic PASSED C 0:07.172 - R 0:00.041 nested-types-ERR2 PASSED C 0:00.360 - R n/a exceptions/interact PASSED C 0:07.506 - R 0:00.077 linkonce PASSED C 0:01.898 - R 0:00.080 exceptions/conditional-threads PASSED C 0:08.268 - R 0:00.074 concurrency/channels/ping_pong PASSED C 0:16.202 - R 0:10.121 concurrency/channels/daisy_chain PASSED C 0:16.180 - R 0:10.187 exceptions/terminate PASSED C 0:07.351 - R 0:00.038 concurrency/channels/hot_potato PASSED C 0:16.277 - R 0:10.112 device/cpu PASSED C 0:11.138 - R 0:00.179 exceptions/trash PASSED C 0:07.046 - R 0:00.175 concurrency/channels/contend PASSED C 0:16.362 - R 0:10.111 concurrency/channels/churn PASSED C 0:16.397 - R 0:10.162 opt-params PASSED C 0:00.170 - R n/a concurrency/waitfor/dtor PASSED C 0:12.521 - R 0:07.052 exceptions/resume PASSED C 0:07.873 - R 0:00.070 exceptions/finally-threads PASSED C 0:08.383 - R 0:00.069 maybe PASSED C 0:01.878 - R 0:00.038 exceptions/virtual-poly PASSED C 0:06.952 - R 0:00.038 concurrency/channels/pub_sub PASSED C 0:16.860 - R 0:10.105 polybits PASSED C 0:00.390 - R n/a exceptions/defaults-threads PASSED C 0:08.903 - R 0:00.074 exceptions/cancel/coroutine PASSED C 0:09.501 - R 0:00.069 nested-types PASSED C 0:01.630 - R 0:00.039 fstream_test PASSED C 0:06.903 - R 0:00.036 generator/fibonacci PASSED C 0:06.759 - R 0:00.021 concurrency/channels/zero_size PASSED C 0:17.247 - R 0:10.180 generator/suspend_then PASSED C 0:06.729 - R 0:00.040 generator/fmtLines PASSED C 0:06.772 - R 0:00.072 nowarn/exception PASSED C 0:01.667 - R 0:00.036 nowarn/array PASSED C 0:01.733 - R 0:00.035 nowarn/no-autogen PASSED C 0:01.597 - R 0:00.021 nowarn/zero-thunk PASSED C 0:01.456 - R 0:00.038 genericUnion PASSED C 0:06.816 - R 0:00.072 numericConstants PASSED C 0:01.512 - R 0:00.044 hello PASSED C 0:06.829 - R 0:00.038 poly-bare-assn PASSED C 0:01.442 - R 0:00.039 exceptions/resume-threads PASSED C 0:08.908 - R 0:00.070 poly-many-arsz PASSED C 0:01.534 - R 0:00.042 poly-d-cycle PASSED C 0:01.525 - R 0:00.124 raii/ctor-autogen-ERR1 PASSED C 0:01.036 - R n/a poly-member PASSED C 0:01.627 - R 0:00.076 operators PASSED C 0:01.836 - R 0:00.039 exceptions/terminate-threads PASSED C 0:09.036 - R 0:00.040 nowarn/printf-sizeof PASSED C 0:02.124 - R 0:00.031 include/stdincludes PASSED C 0:06.924 - R 0:00.037 poly-self-cycle PASSED C 0:01.671 - R 0:00.047 identity PASSED C 0:07.127 - R 0:00.040 poly-selection PASSED C 0:01.668 - R 0:00.071 quasiKeyword PASSED C 0:01.603 - R 0:00.042 concurrency/channels/big_elems PASSED C 0:16.665 - R 0:11.830 poly-o-cycle PASSED C 0:01.879 - R 0:00.126 raii/partial-ERR1 PASSED C 0:00.925 - R n/a linking/exception-nothreads PASSED C 0:05.142 - R 0:00.127 nowarn/unused PASSED C 0:02.378 - R 0:00.122 typedefRedef-ERR1 PASSED C 0:00.202 - R n/a exceptions/fibonacci_nonlocal PASSED C 0:10.514 - R 0:00.038 concurrency/waituntil/basic_else PASSED C 0:19.554 - R 0:00.040 exceptions/virtual-cast PASSED C 0:09.093 - R 0:00.070 include/vector-fstream PASSED C 0:07.315 - R 0:00.129 var-assert PASSED C 0:00.206 - R n/a raii/typeof-member PASSED C 0:01.529 - R 0:00.021 raii/init_once PASSED C 0:01.775 - R 0:00.038 concurrency/futures/future_except PASSED C 0:29.300 - R 0:00.095 raii/ctor-autogen PASSED C 0:02.403 - R 0:00.072 raii/partial PASSED C 0:01.869 - R 0:00.101 io/eofType PASSED C 0:07.482 - R 0:00.093 exceptions/cor_resumer PASSED C 0:11.913 - R 0:00.075 result PASSED C 0:02.146 - R 0:00.059 exceptions/cancel/thread PASSED C 0:12.151 - R 0:00.070 switch PASSED C 0:01.699 - R 0:00.076 simpleGenericTriple PASSED C 0:02.061 - R 0:00.125 tuple/tupleCast PASSED C 0:01.717 - R 0:00.083 forall PASSED C 0:10.116 - R 0:00.041 tuple/tupleMember PASSED C 0:01.790 - R 0:00.035 typedefRedef PASSED C 0:01.596 - R 0:00.073 smart-pointers PASSED C 0:02.142 - R 0:00.039 typeof PASSED C 0:01.578 - R 0:00.123 tuple/tuplePolymorphism PASSED C 0:01.987 - R 0:00.036 variableDeclarator PASSED C 0:01.615 - R 0:00.038 function-operator PASSED C 0:10.001 - R 0:00.127 tuple/tupleFunction PASSED C 0:02.202 - R 0:00.077 linking/exception-withthreads PASSED C 0:07.047 - R 0:00.070 meta/fork+exec PASSED C 0:05.115 - R 0:00.378 withconflict PASSED C 0:00.970 - R n/a linking/mangling/anon PASSED C 0:07.034 - R 0:00.038 voidPtr PASSED C 0:01.510 - R 0:00.021 ...collections/dimexpr-match-c-ERRS PASSED C 0:01.103 - R n/a warnings/self-assignment PASSED C 0:01.434 - R 0:00.002 KRfunctions PASSED C 0:01.451 - R 0:00.004 collections/atomic_mpsc PASSED C 0:13.541 - R 0:18.358 errors/completeType PASSED C 0:00.885 - R n/a exceptions/pingpong_nonlocal PASSED C 0:13.265 - R 0:00.071 raii/memberCtors-ERR1 PASSED C 0:04.506 - R n/a raii/dtor-early-exit-ERR1 PASSED C 0:04.853 - R n/a attributes PASSED C 0:01.572 - R 0:00.002 list/dlist-insert-remove PASSED C 0:07.489 - R 0:00.129 ...llections/dimexpr-match-cfa-ERRS PASSED C 0:01.906 - R n/a list/dlist2-insert-remove PASSED C 0:07.726 - R 0:00.070 raii/dtor-early-exit-ERR2 PASSED C 0:05.353 - R n/a declarationSpecifier PASSED C 0:01.668 - R 0:00.009 literals PASSED C 0:07.883 - R 0:00.044 io/manipulatorsInput-uchunk PASSED C 0:09.921 - R 0:00.169 extension PASSED C 0:01.432 - R 0:00.001 io/manipulatorsOutput4 PASSED C 0:10.140 - R 0:00.128 functions PASSED C 0:01.371 - R 0:00.003 linking/nothreads PASSED C 0:08.970 - R 0:00.040 linking/weakso_nothd PASSED C 0:08.862 - R 0:00.127 arithmeticConversions PASSED C 0:02.929 - R 0:00.021 meta/arch PASSED C 0:00.856 - R n/a gccExtensions PASSED C 0:01.394 - R 0:00.003 tuple/tupleVariadic PASSED C 0:04.910 - R 0:00.023 io/io PASSED C 0:11.118 - R 0:00.070 linking/io-acquire PASSED C 0:09.893 - R 0:00.040 zero_one-ERR1 PASSED C 0:03.694 - R n/a quotedKeyword PASSED C 0:06.923 - R 0:00.037 raii/globals PASSED C 0:06.628 - R 0:00.073 raii/boxed-types PASSED C 0:07.106 - R 0:00.038 polymorphism PASSED C 0:07.277 - R 0:00.019 meta/dumpable PASSED C 0:08.867 - R 0:00.037 shortCircuit PASSED C 0:06.505 - R 0:00.038 sizeof PASSED C 0:06.869 - R 0:00.021 io/io-acquire-in PASSED C 0:12.172 - R 0:00.170 malloc PASSED C 0:10.239 - R 0:00.037 ...rrency/examples/boundedBufferINT PASSED C 0:12.503 - R 0:22.619 references PASSED C 0:07.420 - R 0:00.019 raii/memberCtors PASSED C 0:07.647 - R 0:00.043 concurrency/preempt2 PASSED C 0:12.851 - R 0:21.437 io/io-acquire-out PASSED C 0:12.595 - R 0:00.218 strstream PASSED C 0:07.335 - R 0:00.018 tuplearray PASSED C 0:07.035 - R 0:00.037 io/io-acquire PASSED C 0:13.113 - R 0:00.173 linking/withthreads PASSED C 0:11.624 - R 0:00.038 userLiterals PASSED C 0:07.175 - R 0:00.036 tuple/tupleAssign PASSED C 0:07.786 - R 0:00.021 concurrency/waituntil/one_chan PASSED C 0:12.956 - R 0:12.877 raii/dtor-early-exit PASSED C 0:08.920 - R 0:00.036 io/io-acquire2 PASSED C 0:13.617 - R 0:00.377 zero_one PASSED C 0:06.655 - R 0:00.042 io/away_fair PASSED C 0:15.102 - R 0:00.117 minmax PASSED C 0:11.637 - R 0:00.037 searchsort PASSED C 0:09.326 - R 0:00.070 sum PASSED C 0:09.353 - R 0:00.038 time PASSED C 0:09.298 - R 0:00.019 io/many_read PASSED C 0:15.310 - R 0:00.069 swap PASSED C 0:10.044 - R 0:00.038 ...collections/array-md-sbscr-cases PASSED C 0:08.055 - R 0:00.070 vector PASSED C 0:09.634 - R 0:00.020 io/comp_fair PASSED C 0:16.550 - R 0:00.368 vector_math/vec2_uint PASSED C 0:09.713 - R 0:00.020 concurrency/waituntil/channel_close PASSED C 0:19.678 - R 0:10.123 concurrency/waituntil/futures PASSED C 0:29.908 - R 0:00.069 ato PASSED C 0:09.477 - R 0:00.035 vector_math/vec2_double PASSED C 0:11.505 - R 0:00.036 io/manipulatorsInput PASSED C 0:08.622 - R 0:00.037 ...rrency/examples/boundedBufferEXT PASSED C 0:12.769 - R 0:28.005 abs PASSED C 0:10.560 - R 0:00.036 random PASSED C 0:08.204 - R 0:00.036 gmp PASSED C 0:08.969 - R 0:00.036 bitmanip1 PASSED C 0:10.602 - R 0:00.069 bitmanip2 PASSED C 0:10.668 - R 0:00.070 exceptions/cardgame PASSED C 0:10.178 - R 0:00.117 io/comp_basic PASSED C 0:19.411 - R 0:00.370 vector_math/vec3_int PASSED C 0:12.664 - R 0:00.068 exceptions/hotpotato PASSED C 0:10.945 - R 0:00.069 vector_math/vec2_int PASSED C 0:13.405 - R 0:00.035 vector_math/vec2_ldouble PASSED C 0:09.985 - R 0:00.037 exceptions/hotpotato_checked PASSED C 0:11.282 - R 0:00.067 vector_math/vec4_int PASSED C 0:13.227 - R 0:00.035 io/manipulatorsOutput2 PASSED C 0:10.703 - R 0:00.035 bitmanip3 PASSED C 0:12.466 - R 0:00.069 vector_math/vec3_float PASSED C 0:14.673 - R 0:00.039 vector_math/vec4_float PASSED C 0:14.486 - R 0:00.035 vector_math/vec2_float PASSED C 0:15.684 - R 0:00.068 mathX PASSED C 0:12.540 - R 0:00.036 include/includes PASSED C 0:23.848 - R 0:00.036 io/manipulatorsOutput1 PASSED C 0:13.640 - R 0:00.034 math PASSED C 0:13.788 - R 0:00.037 io/manipulatorsOutput3 PASSED C 0:14.045 - R 0:00.066 concurrency/unified_locking/mcs PASSED C 0:14.013 - R 0:28.128 PRNG PASSED C 0:15.908 - R 0:01.973 heap PASSED C 0:10.751 - R 0:18.730 io/io-acquire-no-io PASSED C 0:13.343 - R 0:15.411 concurrency/waituntil/repeat_close PASSED C 0:13.616 - R 0:30.102 rational PASSED C 0:26.746 - R 0:00.034 concurrency/waituntil/channels PASSED C 0:14.097 - R 0:34.224 ...ency/unified_locking/futex_mutex PASSED C 0:14.681 - R 0:42.133 concurrency/actors/dynamic PASSED C 0:21.564 - R 0:38.773 concurrency/monitor PASSED C 0:12.256 - R 0:49.988 ...ency/waituntil/channel_zero_size PASSED C 0:13.226 - R 0:40.970 concurrency/waituntil/all_types PASSED C 0:35.065 - R 0:22.204 ...urrency/unified_locking/mcs_spin PASSED C 0:14.752 - R 0:50.733 .../unified_locking/spin_queue_lock PASSED C 0:14.418 - R 0:50.857 concurrency/multi-monitor PASSED C 0:14.327 - R 1:06.136 concurrency/waituntil/locks PASSED C 0:15.730 - R 1:01.713 concurrency/unified_locking/locks PASSED C 0:16.251 - R 1:37.660 concurrency/mutexstmt/locks PASSED C 0:12.293 - R 2:13.651 375 passes, 0 failures, 0 timeouts, 0 cancelled, 0 other Tests took 2:26.883 [Pipeline] } [Pipeline] // dir [Pipeline] } [Pipeline] // stage [Pipeline] echo -------- Test: Release -------- [Pipeline] stage [Pipeline] { (Test: Release) [Pipeline] dir Running in /var/lib/jenkins/workspace/Cforall_master@tmp [Pipeline] { [Pipeline] sh + nproc + make -j 96 --no-print-directory -C tests timeout=600 global-timeout=14400 tests debug=no archive-errors=/var/lib/jenkins/workspace/Cforall_master@tmp/tests/crashes/full-nodebug Running 375 tests on 96 cores (arm64 - no debug) array-ERR3 PASSED C 0:00.113 - R n/a array-ERR2 PASSED C 0:00.121 - R n/a ...ollections/language-dim-mismatch PASSED C 0:00.373 - R n/a concurrency/mainError PASSED C 0:00.463 - R n/a concurrency/keywordErrors PASSED C 0:00.638 - R n/a castError PASSED C 0:00.903 - R n/a array-collections/symtab-collision PASSED C 0:00.994 - R n/a concurrency/ctor-check PASSED C 0:01.280 - R n/a array-collections/safety-summary PASSED C 0:01.381 - R n/a attr-priority PASSED C 0:01.478 - R 0:00.004 array-ERR1 PASSED C 0:01.486 - R n/a array PASSED C 0:01.760 - R 0:00.072 array-collections/c-dependent PASSED C 0:01.704 - R 0:00.131 cast PASSED C 0:01.953 - R 0:00.085 array-collections/array-raii-c PASSED C 0:02.219 - R 0:00.027 builtins/sync PASSED C 0:02.307 - R 0:00.040 castReturn PASSED C 0:02.282 - R 0:00.129 array-collections/dimexpr-match-c PASSED C 0:02.657 - R 0:00.075 array-collections/array-sbscr-types PASSED C 0:03.131 - R 0:00.023 ...ns/vector-err-retn-perm-it-byval PASSED C 0:03.200 - R n/a concurrency/clib_tls PASSED C 0:03.410 - R 0:00.042 ...ns/vector-err-pass-perm-it-byval PASSED C 0:03.597 - R n/a concurrency/clib PASSED C 0:03.521 - R 0:00.075 array-collections/boxed PASSED C 0:03.637 - R 0:00.026 array-collections/array-basic PASSED C 0:03.723 - R 0:00.021 array-collections/dimexpr-match-cfa PASSED C 0:04.600 - R 0:00.076 collections/string-operator-ERR13 PASSED C 0:05.453 - R n/a collections/string-operator-ERR11 PASSED C 0:05.480 - R n/a collections/string-operator-ERR15 PASSED C 0:05.613 - R n/a collections/string-operator-ERR09 PASSED C 0:05.757 - R n/a collections/string-operator-ERR16 PASSED C 0:05.784 - R n/a avl_test PASSED C 0:05.963 - R 0:00.022 ...urrency/pthread/pthread_key_test PASSED C 0:04.523 - R 0:00.022 alloc-ERROR PASSED C 0:06.519 - R n/a algorithms/range_test PASSED C 0:06.708 - R 0:00.023 complex PASSED C 0:07.127 - R 0:00.022 array-collections/accordion PASSED C 0:07.287 - R 0:00.038 collections/vector-demo PASSED C 0:07.608 - R 0:00.024 collections/string-gc PASSED C 0:08.091 - R 0:00.021 array-collections/array-raii-cfa PASSED C 0:08.306 - R 0:00.024 collections/string-istream PASSED C 0:08.547 - R 0:00.024 concurrency/cluster PASSED C 0:08.741 - R 0:00.040 concurrency/park/start_parked PASSED C 0:08.439 - R 0:00.021 concurrency/futures/abandon PASSED C 0:09.387 - R 0:00.122 concurrency/park/contention PASSED C 0:08.965 - R 0:00.069 concurrency/futures/basic PASSED C 0:09.624 - R 0:00.123 collections/stack PASSED C 0:09.796 - R 0:00.027 collections/multi_list PASSED C 0:09.911 - R 0:00.024 concurrency/mutexstmt/monitors PASSED C 0:09.944 - R 0:00.629 collections/queue PASSED C 0:10.992 - R 0:00.022 collections/string-ctx-manage PASSED C 0:11.052 - R 0:00.028 concurrency/cofor PASSED C 0:11.196 - R 0:00.037 collections/string-ostream PASSED C 0:11.466 - R 0:00.039 concurrency/examples/matrixSum PASSED C 0:11.809 - R 0:00.021 collections/sequence PASSED C 0:11.844 - R 0:00.048 concurrency/examples/gortn PASSED C 0:11.985 - R 0:00.039 collections/string-istream-manip PASSED C 0:12.395 - R 0:00.042 concurrency/join PASSED C 0:12.466 - R 0:00.040 concurrency/migrate PASSED C 0:12.408 - R 0:00.131 collections/string-overwrite PASSED C 0:12.814 - R 0:00.079 concurrency/coroutineYield PASSED C 0:12.905 - R 0:00.036 ...ections/string-overwrite-noshare PASSED C 0:12.998 - R 0:00.120 concurrency/park/force_preempt PASSED C 0:12.235 - R 0:00.269 concurrency/monitor PASSED C 0:11.880 - R 0:01.382 ...rrency/pthread/pthread_attr_test PASSED C 0:11.905 - R 0:00.040 concurrency/examples/datingService PASSED C 0:13.344 - R 0:00.130 ...pthread/pthread_demo_create_join PASSED C 0:12.084 - R 0:00.040 collections/atomic_mpsc PASSED C 0:12.596 - R 0:01.129 const-init PASSED C 0:01.636 - R 0:00.023 ...rrency/pthread/pthread_cond_test PASSED C 0:12.303 - R 0:00.038 ...rrency/pthread/pthread_once_test PASSED C 0:11.902 - R 0:00.073 concurrency/multi-monitor PASSED C 0:12.056 - R 0:02.085 const-ref PASSED C 0:01.717 - R 0:00.044 collections/string-operator PASSED C 0:14.583 - R 0:00.127 collections/string-compare PASSED C 0:14.753 - R 0:00.041 concurrency/examples/quickSort PASSED C 0:14.880 - R 0:00.036 ...rrency/examples/boundedBufferINT PASSED C 0:13.580 - R 0:01.429 concurrency/readyQ/leader_spin PASSED C 0:12.377 - R 0:00.373 concurrency/barrier/generation PASSED C 0:15.169 - R 0:00.120 concurrency/once PASSED C 0:14.893 - R 0:00.038 concurrency/barrier/order PASSED C 0:15.510 - R 0:00.044 concurrency/futures/wait_any PASSED C 0:15.582 - R 0:00.069 ctrl-flow/labelledExit PASSED C 0:01.636 - R 0:00.078 ctrl-flow/loop-inc PASSED C 0:01.596 - R 0:00.072 ...rrency/examples/boundedBufferEXT PASSED C 0:13.488 - R 0:02.484 concurrency/barrier/last PASSED C 0:16.003 - R 0:00.043 concurrency/lockfree_stack PASSED C 0:12.168 - R 0:03.880 concurrency/mutexstmt/tuple PASSED C 0:16.031 - R 0:00.043 concurrency/signal/block PASSED C 0:13.612 - R 0:00.222 concurrency/waitfor/parse PASSED C 0:08.229 - R 0:00.041 concurrency/signal/disjoint FAILED with code -6 C 0:13.449 - R 0:00.037 ERROR Eager signal 2 Cforall Runtime error (UNIX pid:243511): Stack back trace for: /var/lib/jenkins/workspace/Cforall_master@tmp/libcfa/arm64-nodebug/src/.libs/libcfa.so.1 (0) /var/lib/jenkins/workspace/Cforall_master@tmp/libcfa/arm64-nodebug/src/.libs/libcfa.so.1 : + 0x83b60 [0xfffff7ed3b60] (1) /var/lib/jenkins/workspace/Cforall_master@tmp/libcfa/arm64-nodebug/src/.libs/libcfa.so.1 : + 0x3b56c [0xfffff7e8b56c] (2) /var/lib/jenkins/workspace/Cforall_master@tmp/libcfa/arm64-nodebug/src/.libs/libcfa.so.1 : + 0x3cf24 [0xfffff7e8cf24] (3) /var/lib/jenkins/workspace/Cforall_master@tmp/tests/concurrency/signal/disjoint : _X5logicFv_XS8global_t__1 + 0x15c [0xaaaaaaaa3f5c] warning: Can't open file anon_inode:[io_uring] which was expanded to anon_inode:[io_uring] during file-backed mapping note processing [New LWP 243511] [New LWP 243518] [New LWP 243517] [Thread debugging using libthread_db enabled] Using host libthread_db library "/lib/aarch64-linux-gnu/libthread_db.so.1". Core was generated by `/var/lib/jenkins/workspace/Cforall_master@tmp/tests/concurrency/signal/disjoint'. Program terminated with signal SIGABRT, Aborted. #0 __pthread_kill_implementation (threadid=281474842402240, signo=signo@entry=6, no_tid=no_tid@entry=0) at ./nptl/pthread_kill.c:44 warning: 44 ./nptl/pthread_kill.c: No such file or directory [Current thread is 1 (Thread 0xfffff7fe9dc0 (LWP 243511))] ----- #0 __pthread_kill_implementation (threadid=281474842402240, signo=signo@entry=6, no_tid=no_tid@entry=0) at ./nptl/pthread_kill.c:44 #1 0x0000fffff7c27540 in __pthread_kill_internal (signo=6, threadid=) at ./nptl/pthread_kill.c:78 #2 0x0000fffff7bdcb3c in __GI_raise (sig=sig@entry=6) at ../sysdeps/posix/raise.c:26 #3 0x0000fffff7bc7e00 in __GI_abort () at ./stdlib/abort.c:79 #4 0x0000fffff7ed369c in _X7__abortFv_bPKcY17__builtin_va_list__1 (_X11signalAbortb_1=_X11signalAbortb_1@entry=true, _X3fmtPKc_1=_X3fmtPKc_1@entry=0xfffff7ee59c8 "Application interrupted by signal: %s.\n", _X4argsY17__builtin_va_list_1=...) at /var/lib/jenkins/workspace/Cforall_master/libcfa/src/interpose.cfa:263 #5 0x0000fffff7ed3b60 in _X5abortFv_bPKc__1 (_X11signalAbortb_1=_X11signalAbortb_1@entry=true, _X3fmtPKc_1=_X3fmtPKc_1@entry=0xfffff7ee59c8 "Application interrupted by signal: %s.\n") at /var/lib/jenkins/workspace/Cforall_master/libcfa/src/interpose.cfa:301 #6 0x0000fffff7ed3b80 in _X15sigHandler_termFv_iPS21__anonymous_siginfo_tPS10ucontext_t__1 (_X3sigi_1=, _X3sfpPS21__anonymous_siginfo_t_1=, _X3cxtPS10ucontext_t_1=) at /var/lib/jenkins/workspace/Cforall_master/libcfa/src/interpose.cfa:337 #7 #8 __pthread_kill_implementation (threadid=281474842402240, signo=signo@entry=6, no_tid=no_tid@entry=0) at ./nptl/pthread_kill.c:44 #9 0x0000fffff7c27540 in __pthread_kill_internal (signo=6, threadid=) at ./nptl/pthread_kill.c:78 #10 0x0000fffff7bdcb3c in __GI_raise (sig=sig@entry=6) at ../sysdeps/posix/raise.c:26 #11 0x0000fffff7bc7e00 in __GI_abort () at ./stdlib/abort.c:79 #12 0x0000fffff7ed3754 in _X7__abortFv_bPKcY17__builtin_va_list__1 (_X11signalAbortb_1=_X11signalAbortb_1@entry=false, _X3fmtPKc_1=_X3fmtPKc_1@entry=0xfffff7ee4aa0 "%s", _X4argsY17__builtin_va_list_1=...) at /var/lib/jenkins/workspace/Cforall_master/libcfa/src/interpose.cfa:286 #13 0x0000fffff7ed3b60 in _X5abortFv_bPKc__1 (_X11signalAbortb_1=_X11signalAbortb_1@entry=false, _X3fmtPKc_1=_X3fmtPKc_1@entry=0xfffff7ee4aa0 "%s") at /var/lib/jenkins/workspace/Cforall_master/libcfa/src/interpose.cfa:301 #14 0x0000fffff7e8b56c in abort () at /var/lib/jenkins/workspace/Cforall_master/libcfa/src/interpose.cfa:176 #15 0x0000fffff7e8cf24 in _X4endsFv_S8ofstream__1 (_X2osS8ofstream_1=0xfffff7f211c8 <_X9abortFileS8ofstream_1>) at /var/lib/jenkins/workspace/Cforall_master/libcfa/src/fstream.cfa:106 #16 0x0000aaaaaaaa3f5c in _X5logicFv_XS8global_t__1 (_X1aXS8global_t_1=_X1aXS8global_t_1@entry=0xaaaaaaac02b0 <_X7globalsS13__anonymous66_1>) at concurrency/signal/disjoint.cfa:115 #17 0x0000aaaaaaaa3fc0 in _X4mainFv_S9Signaller__1 (__anonymous_object2552=__anonymous_object2552@entry=0xffffffffd070) at concurrency/signal/disjoint.cfa:126 #18 0x0000fffff7f6ad34 in __cfactx_invoke_thread (main=0xaaaaaaaa3f90 <_X4mainFv_S9Signaller__1>, this=0xffffffffd070) at /var/lib/jenkins/workspace/Cforall_master/libcfa/src/concurrency/invoke.c:87 #19 0x0000fffff7f6ad10 in __cfactx_coroutine_unwind (storage=, cor=) at /var/lib/jenkins/workspace/Cforall_master/libcfa/src/concurrency/invoke.c:76 #20 0x0000aaaaaabffff0 in ?? () Backtrace stopped: previous frame inner to this frame (corrupt stack?) ----- Id Target Id Frame * 1 Thread 0xfffff7fe9dc0 (LWP 243511) __pthread_kill_implementation (threadid=281474842402240, signo=signo@entry=6, no_tid=no_tid@entry=0) at ./nptl/pthread_kill.c:44 2 Thread 0xaaaaaab92dc0 (LWP 243518) _X7try_popFPS7thread$_PS7clusterjS20__stats_readyQ_pop_t__1 (_X5statsS20__stats_readyQ_pop_t_1=0xaaaaaab922b0, _X1wj_1=3, _X4cltrPS7cluster_1=0xfffff7fb0980 <_X19storage_mainClusterA0c_1>) at /var/lib/jenkins/workspace/Cforall_master/libcfa/src/concurrency/ready_queue.cfa:213 3 Thread 0xaaaaaab12c00 (LWP 243517) 0x0000fffff7bdda18 in __GI___sigtimedwait (set=set@entry=0xaaaaaab121e8, info=info@entry=0xaaaaaab12268, timeout=timeout@entry=0x0) at ../sysdeps/unix/sysv/linux/sigtimedwait.c:31 Archiving concurrency/signal/disjoint (executable and core) to crashes/full-nodebug/concurrency/signal/disjoint concurrency/signal/wait PASSED C 0:13.444 - R 0:00.071 concurrency/suspend_then PASSED C 0:13.219 - R 0:00.027 errors/declaration PASSED C 0:00.140 - R n/a enum PASSED C 0:01.522 - R 0:00.021 enum_tests/lvalue PASSED C 0:00.885 - R n/a errors/signature PASSED C 0:00.173 - R n/a errors/scope-type PASSED C 0:00.238 - R n/a concurrency/readyQ/barrier_sleeper PASSED C 0:14.577 - R 0:00.323 ...cy/unified_locking/pthread_locks PASSED C 0:11.544 - R 0:00.037 concurrency/sleep PASSED C 0:12.999 - R 0:01.175 collections/string-api-coverage PASSED C 0:17.393 - R 0:00.080 enum_tests/inc-dec PASSED C 0:01.713 - R 0:00.025 alloc PASSED C 0:17.590 - R 0:00.019 errors/scope PASSED C 0:00.839 - R n/a concurrency/waitfor/else PASSED C 0:10.379 - R 0:00.040 ...ions/string-api-coverage-noshare PASSED C 0:17.923 - R 0:00.025 designations PASSED C 0:03.221 - R 0:00.022 .../unified_locking/block_spin_lock PASSED C 0:14.569 - R 0:00.072 ...ency/unified_locking/exp_backoff PASSED C 0:14.705 - R 0:00.040 eval PASSED C 0:01.511 - R 0:00.039 enum_tests/funcEnum PASSED C 0:02.865 - R 0:00.024 concurrency/actors/executor PASSED C 0:18.851 - R 0:00.042 concurrency/thread PASSED C 0:15.241 - R 0:00.041 concurrency/actors/inline PASSED C 0:18.994 - R 0:00.071 concurrency/actors/matrixMultiply PASSED C 0:18.821 - R 0:00.272 concurrency/actors/dynamic PASSED C 0:18.855 - R 0:00.323 enum_tests/structEnum PASSED C 0:02.862 - R 0:00.023 concurrency/actors/pingpong PASSED C 0:19.191 - R 0:00.072 concurrency/waitfor/dtor PASSED C 0:12.084 - R 0:00.169 concurrency/waitfor/barge PASSED C 0:12.702 - R 0:00.067 ...ncy/unified_locking/timeout_lock PASSED C 0:11.954 - R 0:01.132 concurrency/actors/poison PASSED C 0:19.247 - R 0:00.377 concurrency/futures/typed PASSED C 0:19.515 - R 0:00.119 exceptions/try-ctrl-flow PASSED C 0:00.534 - R n/a copyfile PASSED C 0:07.204 - R 0:00.022 ...urrency/waitfor/lexical_priority PASSED C 0:12.313 - R 0:00.021 exceptions/type-check PASSED C 0:00.703 - R n/a concurrency/actors/static PASSED C 0:19.717 - R 0:00.426 concurrency/actors/inherit PASSED C 0:20.000 - R 0:00.318 concurrency/mutexstmt/locks PASSED C 0:13.381 - R 0:06.918 ...fied_locking/mcs_block_spin_lock PASSED C 0:14.826 - R 0:00.040 ctrl-flow/break-misc PASSED C 0:06.826 - R 0:00.025 concurrency/actors/types PASSED C 0:20.326 - R 0:00.225 ...nified_locking/simple_owner_lock PASSED C 0:14.678 - R 0:00.039 counter PASSED C 0:07.197 - R 0:00.038 ctrl-flow/ifwhileCtl PASSED C 0:06.856 - R 0:00.044 ...rrency/pthread/pthread_demo_lock PASSED C 0:12.360 - R 0:06.701 exceptions/try-leave-catch PASSED C 0:01.706 - R 0:00.036 concurrency/waitfor/recurse PASSED C 0:12.647 - R 0:00.171 expression PASSED C 0:01.541 - R 0:00.020 concurrency/unified_locking/mcs PASSED C 0:14.483 - R 0:01.225 coroutine/devicedriver PASSED C 0:08.523 - R 0:00.075 ctrl-flow/loop_else PASSED C 0:06.981 - R 0:00.044 coroutine/fibonacci PASSED C 0:08.400 - R 0:00.024 concurrency/waitfor/statment PASSED C 0:12.889 - R 0:00.036 coroutine/pingpong PASSED C 0:08.473 - R 0:00.021 coroutine/fmtLines PASSED C 0:08.630 - R 0:00.036 concurrency/waitfor/when PASSED C 0:12.716 - R 0:00.171 coroutine/raii PASSED C 0:08.381 - R 0:00.119 coroutine/runningTotal PASSED C 0:08.505 - R 0:00.019 .../unified_locking/fast_block_lock PASSED C 0:18.184 - R 0:00.121 ctrl-flow/fallthrough PASSED C 0:08.296 - R 0:00.038 identParamDeclarator PASSED C 0:01.465 - R 0:00.037 identFuncDeclarator PASSED C 0:01.482 - R 0:00.075 init1-ERROR PASSED C 0:00.870 - R n/a global-monomorph PASSED C 0:01.666 - R 0:00.119 ctrl-flow/goto PASSED C 0:08.359 - R 0:00.038 configs/parsebools PASSED C 0:10.510 - R 0:00.170 exceptions/message PASSED C 0:03.871 - R 0:00.037 configs/parseconfig PASSED C 0:10.402 - R 0:00.022 concurrency/waituntil/timeout PASSED C 0:08.017 - R 0:03.086 enum_tests/anonymous PASSED C 0:07.013 - R 0:00.022 init1 PASSED C 0:01.502 - R 0:00.019 configs/usage PASSED C 0:10.842 - R 0:00.041 enum_tests/stringEnum PASSED C 0:06.832 - R 0:00.021 include/vector-sequence PASSED C 0:02.216 - R 0:00.021 enum_tests/typedIntEnum PASSED C 0:07.118 - R 0:00.041 ctrl-flow/loop_else-WRN1 PASSED C 0:08.819 - R 0:00.003 enum_tests/voidEnum PASSED C 0:06.893 - R 0:00.040 enum_tests/input PASSED C 0:07.659 - R 0:00.037 linking/nostdlib PASSED C 0:01.421 - R 0:00.022 limits PASSED C 0:01.683 - R 0:00.022 enum_tests/enumInlineValue PASSED C 0:08.569 - R 0:00.021 include/vector-collections PASSED C 0:03.495 - R 0:00.037 linkonce PASSED C 0:01.664 - R 0:00.070 exceptions/data-except PASSED C 0:07.041 - R 0:00.039 coroutine/prodcons PASSED C 0:11.314 - R 0:00.025 nested-types-ERR1 PASSED C 0:00.173 - R n/a nested-types-ERR2 PASSED C 0:00.319 - R n/a ctrl-flow/loopctrl PASSED C 0:10.061 - R 0:00.074 exceptions/conditional PASSED C 0:07.748 - R 0:00.036 exceptions/defaults PASSED C 0:07.519 - R 0:00.037 exceptions/cancel/coroutine PASSED C 0:08.282 - R 0:00.022 enum_tests/position PASSED C 0:09.289 - R 0:00.074 div PASSED C 0:10.314 - R 0:00.070 opt-params PASSED C 0:00.153 - R n/a exceptions/finally PASSED C 0:07.840 - R 0:00.073 exceptions/conditional-threads PASSED C 0:08.314 - R 0:00.020 maybe PASSED C 0:02.107 - R 0:00.021 nested-types PASSED C 0:01.568 - R 0:00.021 exceptions/interact PASSED C 0:07.491 - R 0:00.071 exceptions/resume PASSED C 0:07.225 - R 0:00.023 concurrency/preempt PASSED C 0:14.476 - R 0:10.429 enum_tests/planet PASSED C 0:09.917 - R 0:00.025 exceptions/polymorphic PASSED C 0:07.523 - R 0:00.022 concurrency/waituntil/channels PASSED C 0:15.051 - R 0:01.333 exceptions/trash PASSED C 0:07.169 - R 0:00.042 polybits PASSED C 0:00.468 - R n/a nowarn/exception PASSED C 0:01.757 - R 0:00.022 nowarn/no-autogen PASSED C 0:01.632 - R 0:00.074 exceptions/finally-threads PASSED C 0:08.450 - R 0:00.025 exceptions/virtual-poly PASSED C 0:06.914 - R 0:00.039 device/cpu PASSED C 0:11.381 - R 0:00.119 exceptions/terminate PASSED C 0:07.636 - R 0:00.072 nowarn/zero-thunk PASSED C 0:01.611 - R 0:00.023 generator/fibonacci PASSED C 0:06.846 - R 0:00.038 numericConstants PASSED C 0:01.513 - R 0:00.040 nowarn/array PASSED C 0:02.116 - R 0:00.037 generator/fmtLines PASSED C 0:06.696 - R 0:00.045 concurrency/channels/contend PASSED C 0:16.741 - R 0:10.067 generator/suspend_then PASSED C 0:06.912 - R 0:00.022 operators PASSED C 0:01.636 - R 0:00.021 poly-bare-assn PASSED C 0:01.578 - R 0:00.021 nowarn/printf-sizeof PASSED C 0:02.185 - R 0:00.070 concurrency/channels/daisy_chain PASSED C 0:17.134 - R 0:10.065 poly-d-cycle PASSED C 0:01.556 - R 0:00.038 concurrency/channels/churn PASSED C 0:17.201 - R 0:10.083 nowarn/unused PASSED C 0:02.309 - R 0:00.019 hello PASSED C 0:06.710 - R 0:00.075 raii/ctor-autogen-ERR1 PASSED C 0:00.915 - R n/a concurrency/channels/hot_potato PASSED C 0:17.262 - R 0:10.078 poly-member PASSED C 0:01.578 - R 0:00.022 poly-many-arsz PASSED C 0:01.614 - R 0:00.024 poly-selection PASSED C 0:01.573 - R 0:00.021 poly-o-cycle PASSED C 0:01.628 - R 0:00.037 ...ency/waituntil/channel_zero_size PASSED C 0:16.937 - R 0:00.723 fstream_test PASSED C 0:07.775 - R 0:00.022 poly-self-cycle PASSED C 0:01.694 - R 0:00.019 concurrency/channels/big_elems PASSED C 0:17.032 - R 0:10.564 linking/exception-nothreads PASSED C 0:05.495 - R 0:00.022 raii/partial-ERR1 PASSED C 0:00.914 - R n/a concurrency/channels/ping_pong PASSED C 0:17.650 - R 0:10.020 quasiKeyword PASSED C 0:01.647 - R 0:00.021 exceptions/defaults-threads PASSED C 0:10.045 - R 0:00.071 exceptions/resume-threads PASSED C 0:08.738 - R 0:00.129 identity PASSED C 0:06.950 - R 0:00.126 var-assert PASSED C 0:00.206 - R n/a typedefRedef-ERR1 PASSED C 0:00.240 - R n/a genericUnion PASSED C 0:07.893 - R 0:00.042 include/vector-fstream PASSED C 0:07.050 - R 0:00.075 exceptions/terminate-threads PASSED C 0:09.233 - R 0:00.023 concurrency/waituntil/one_chan PASSED C 0:17.070 - R 0:00.319 raii/typeof-member PASSED C 0:01.624 - R 0:00.026 raii/init_once PASSED C 0:01.864 - R 0:00.038 exceptions/fibonacci_nonlocal PASSED C 0:10.805 - R 0:00.040 raii/partial PASSED C 0:01.691 - R 0:00.124 io/eofType PASSED C 0:07.076 - R 0:00.022 raii/ctor-autogen PASSED C 0:02.388 - R 0:00.021 exceptions/virtual-cast PASSED C 0:09.375 - R 0:00.019 typedefRedef PASSED C 0:01.470 - R 0:00.037 include/stdincludes PASSED C 0:08.266 - R 0:00.040 tuple/tupleCast PASSED C 0:01.692 - R 0:00.039 switch PASSED C 0:01.776 - R 0:00.021 tuple/tupleMember PASSED C 0:01.639 - R 0:00.071 tuple/tupleFunction PASSED C 0:01.715 - R 0:00.039 linking/mangling/anon PASSED C 0:06.975 - R 0:00.042 meta/fork+exec PASSED C 0:05.388 - R 0:00.120 concurrency/channels/pub_sub PASSED C 0:19.306 - R 0:10.073 variableDeclarator PASSED C 0:01.636 - R 0:00.023 result PASSED C 0:02.405 - R 0:00.039 typeof PASSED C 0:01.663 - R 0:00.072 withconflict PASSED C 0:00.854 - R n/a simpleGenericTriple PASSED C 0:02.231 - R 0:00.040 linking/exception-withthreads PASSED C 0:07.143 - R 0:00.128 tuple/tuplePolymorphism PASSED C 0:01.982 - R 0:00.022 exceptions/cor_resumer PASSED C 0:12.136 - R 0:00.045 concurrency/futures/future_except PASSED C 0:29.651 - R 0:00.043 forall PASSED C 0:10.278 - R 0:00.070 warnings/self-assignment PASSED C 0:01.492 - R 0:00.005 smart-pointers PASSED C 0:02.757 - R 0:00.073 voidPtr PASSED C 0:01.567 - R 0:00.070 KRfunctions PASSED C 0:01.349 - R 0:00.002 errors/completeType PASSED C 0:00.843 - R n/a ...collections/dimexpr-match-c-ERRS PASSED C 0:01.163 - R n/a list/dlist-insert-remove PASSED C 0:07.235 - R 0:00.022 function-operator PASSED C 0:10.629 - R 0:00.040 concurrency/channels/zero_size PASSED C 0:20.497 - R 0:10.118 literals PASSED C 0:07.008 - R 0:00.073 ...llections/dimexpr-match-cfa-ERRS PASSED C 0:01.657 - R n/a declarationSpecifier PASSED C 0:01.498 - R 0:00.002 attributes PASSED C 0:01.613 - R 0:00.004 list/dlist2-insert-remove PASSED C 0:07.567 - R 0:00.021 raii/memberCtors-ERR1 PASSED C 0:04.354 - R n/a exceptions/pingpong_nonlocal PASSED C 0:12.557 - R 0:00.070 extension PASSED C 0:01.458 - R 0:00.004 concurrency/waituntil/locks PASSED C 0:16.118 - R 0:04.394 functions PASSED C 0:01.504 - R 0:00.002 linking/weakso_nothd PASSED C 0:08.915 - R 0:00.021 meta/arch PASSED C 0:00.912 - R n/a alloc2 PASSED C 0:31.580 - R 0:00.027 gccExtensions PASSED C 0:01.568 - R 0:00.003 raii/dtor-early-exit-ERR2 PASSED C 0:05.129 - R n/a linking/nothreads PASSED C 0:09.291 - R 0:00.037 exceptions/cancel/thread PASSED C 0:14.688 - R 0:00.036 raii/dtor-early-exit-ERR1 PASSED C 0:05.719 - R n/a linking/io-acquire PASSED C 0:10.058 - R 0:00.021 arithmeticConversions PASSED C 0:03.257 - R 0:00.019 concurrency/waituntil/basic_else PASSED C 0:22.976 - R 0:00.036 zero_one-ERR1 PASSED C 0:03.770 - R n/a io/manipulatorsInput-uchunk PASSED C 0:10.608 - R 0:00.070 quotedKeyword PASSED C 0:06.842 - R 0:00.020 polymorphism PASSED C 0:07.223 - R 0:00.022 io/io PASSED C 0:11.595 - R 0:00.019 tuple/tupleVariadic PASSED C 0:05.939 - R 0:00.019 raii/boxed-types PASSED C 0:07.431 - R 0:00.020 raii/memberCtors PASSED C 0:07.144 - R 0:00.037 raii/globals PASSED C 0:07.435 - R 0:00.019 sizeof PASSED C 0:06.901 - R 0:00.019 shortCircuit PASSED C 0:07.050 - R 0:00.019 references PASSED C 0:07.564 - R 0:00.019 tuplearray PASSED C 0:06.888 - R 0:00.018 malloc PASSED C 0:10.898 - R 0:00.020 linking/withthreads PASSED C 0:11.803 - R 0:00.020 concurrency/preempt2 PASSED C 0:13.005 - R 0:20.301 io/io-acquire-in PASSED C 0:12.889 - R 0:00.034 io/io-acquire-out PASSED C 0:12.679 - R 0:00.037 concurrency/unified_locking/locks PASSED C 0:16.026 - R 0:13.224 io/io-acquire PASSED C 0:13.416 - R 0:00.035 tuple/tupleAssign PASSED C 0:07.760 - R 0:00.019 io/io-acquire2 PASSED C 0:13.154 - R 0:00.034 heap PASSED C 0:10.259 - R 0:04.690 meta/dumpable PASSED C 0:11.670 - R 0:00.018 strstream PASSED C 0:08.092 - R 0:00.021 userLiterals PASSED C 0:07.814 - R 0:00.018 zero_one PASSED C 0:06.892 - R 0:00.020 io/manipulatorsOutput4 PASSED C 0:13.459 - R 0:00.035 raii/dtor-early-exit PASSED C 0:09.207 - R 0:00.019 time PASSED C 0:08.996 - R 0:00.020 vector PASSED C 0:08.563 - R 0:00.036 io/away_fair PASSED C 0:15.164 - R 0:00.035 sum PASSED C 0:09.458 - R 0:00.019 searchsort PASSED C 0:10.013 - R 0:00.019 vector_math/vec2_double PASSED C 0:09.846 - R 0:00.019 swap PASSED C 0:10.370 - R 0:00.019 io/many_read PASSED C 0:15.952 - R 0:00.037 abs PASSED C 0:09.021 - R 0:00.037 io/comp_fair PASSED C 0:16.789 - R 0:00.067 concurrency/waituntil/channel_close PASSED C 0:18.915 - R 0:10.049 vector_math/vec2_uint PASSED C 0:10.644 - R 0:00.018 minmax PASSED C 0:14.986 - R 0:00.018 random PASSED C 0:08.989 - R 0:00.019 concurrency/waituntil/futures PASSED C 0:29.701 - R 0:00.019 io/manipulatorsInput PASSED C 0:09.818 - R 0:00.019 ato PASSED C 0:10.756 - R 0:00.019 exceptions/hotpotato PASSED C 0:10.901 - R 0:00.019 ...collections/array-md-sbscr-cases PASSED C 0:11.307 - R 0:00.019 vector_math/vec2_ldouble PASSED C 0:10.010 - R 0:00.018 exceptions/cardgame PASSED C 0:11.455 - R 0:00.020 gmp PASSED C 0:11.010 - R 0:00.019 io/comp_basic PASSED C 0:19.974 - R 0:00.035 exceptions/hotpotato_checked PASSED C 0:11.925 - R 0:00.020 bitmanip3 PASSED C 0:13.062 - R 0:00.036 bitmanip2 PASSED C 0:13.550 - R 0:00.036 bitmanip1 PASSED C 0:13.862 - R 0:00.036 mathX PASSED C 0:13.018 - R 0:00.034 include/includes PASSED C 0:23.064 - R 0:00.019 math PASSED C 0:13.831 - R 0:00.018 io/manipulatorsOutput2 PASSED C 0:14.674 - R 0:00.018 concurrency/waituntil/all_types PASSED C 0:35.885 - R 0:00.121 vector_math/vec3_int PASSED C 0:17.057 - R 0:00.019 PRNG PASSED C 0:16.466 - R 0:00.420 vector_math/vec2_float PASSED C 0:18.903 - R 0:00.018 vector_math/vec4_int PASSED C 0:18.501 - R 0:00.018 vector_math/vec4_float PASSED C 0:18.968 - R 0:00.038 io/io-acquire-no-io PASSED C 0:12.426 - R 0:13.644 vector_math/vec2_int PASSED C 0:20.319 - R 0:00.023 vector_math/vec3_float PASSED C 0:20.783 - R 0:00.039 ...ency/unified_locking/futex_mutex PASSED C 0:14.542 - R 0:32.834 io/manipulatorsOutput1 PASSED C 0:22.410 - R 0:00.024 rational PASSED C 0:29.152 - R 0:00.020 concurrency/waituntil/repeat_close PASSED C 0:17.906 - R 0:30.078 io/manipulatorsOutput3 PASSED C 0:31.847 - R 0:00.024 .../unified_locking/spin_queue_lock PASSED C 0:14.471 - R 0:50.409 ...urrency/unified_locking/mcs_spin PASSED C 0:14.734 - R 0:51.351 374 passes, 1 failures, 0 timeouts, 0 cancelled, 0 other Tests took 1:12.755 make: *** [Makefile:986: all-local] Error 1 [Pipeline] } [Pipeline] // dir [Pipeline] } [Pipeline] // stage [Pipeline] echo Archiving core dumps [Pipeline] dir Running in /var/lib/jenkins/workspace/Cforall_master@tmp [Pipeline] { [Pipeline] fileExists [Pipeline] sh + /var/lib/jenkins/workspace/Cforall_master/tools/jenkins/archive-gen.sh [Pipeline] archiveArtifacts Archiving artifacts Recording fingerprints [Pipeline] } [Pipeline] // dir [Pipeline] } [Pipeline] // wrap [Pipeline] } [Pipeline] // node [Pipeline] echo hudson.AbortException: script returned exit code 2 [Pipeline] node Running on Brokk 5 in /var/lib/jenkins/workspace/Cforall_master_2 [Pipeline] { [Pipeline] echo Notifying users of result [Pipeline] echo Reusing previously constructed message [Pipeline] echo Would send email to: cforall@lists.uwaterloo.ca [Pipeline] echo With title: [cforall git][BUILD# 3856 - FAILURE] - branch master [Pipeline] echo Content:

This is an automated email from the Jenkins build machine. It was generated because of a git hooks/post-receive script following a ref change which was pushed to the C∀ repository.

- Status --------------------------------------------------------------

BUILD# 3856 - FAILURE

Check console output at https://cforall.uwaterloo.ca/jenkins/job/Cforall/job/master/3856/ to view the results.

- Changes -------------------------------------------------------------

The branch master has been updated.
      from  262e12b24a19d992dad599c1cc6143374ac571f4 (commit)

- Log -----------------------------------------------------------------


-----------------------------------------------------------------------

Summary of changes:

[Pipeline] } [Pipeline] // node [Pipeline] echo Build Completed [Pipeline] End of Pipeline ERROR: script returned exit code 2 Finished: FAILURE [Pipeline] error [Pipeline] } Failed in branch gcc_11_arm64_new Build Cforall » master #3860 completed: SUCCESS [Pipeline] echo SUCCESS [Pipeline] } Build Cforall » master #3852 completed: SUCCESS [Pipeline] echo SUCCESS [Pipeline] } Build Cforall » master #3857 completed: SUCCESS [Pipeline] echo SUCCESS [Pipeline] } [Pipeline] // parallel [Pipeline] } [Pipeline] // stage [Pipeline] } [Pipeline] // wrap [Pipeline] echo error caught [Pipeline] node Running on Brokk 4 in /var/lib/jenkins/workspace/Cforall_Full_Build [Pipeline] { [Pipeline] echo notifying users [Pipeline] emailext Sending email to: cforall@lists.uwaterloo.ca [Pipeline] } [Pipeline] // node [Pipeline] } [Pipeline] // node [Pipeline] End of Pipeline ERROR: FAILURE Finished: FAILURE