SED C 0:10.559 - R 0:00.125
22:53:48 concurrency/waituntil/timeout PASSED C 0:08.101 - R 0:03.693
22:53:48 concurrency/signal/disjoint PASSED C 0:12.761 - R 0:07.156
22:53:48 init1-ERROR PASSED C 0:00.818 - R n/a
22:53:48 ...rrency/pthread/pthread_demo_lock PASSED C 0:12.194 - R 0:08.664
22:53:48 global-monomorph PASSED C 0:01.625 - R 0:00.045
22:53:48 identParamDeclarator PASSED C 0:01.409 - R 0:00.037
22:53:48 coroutine/pingpong PASSED C 0:10.022 - R 0:00.123
22:53:48 enum_tests/anonymous PASSED C 0:06.976 - R 0:00.125
22:53:48 identFuncDeclarator PASSED C 0:01.544 - R 0:00.075
22:53:48 init1 PASSED C 0:01.424 - R 0:00.021
22:53:48 concurrency/waitfor/recurse PASSED C 0:12.234 - R 0:03.392
22:53:48 ctrl-flow/loop_else-WRN1 PASSED C 0:08.215 - R 0:00.003
22:53:48 enum_tests/input PASSED C 0:07.207 - R 0:00.072
22:53:48 enum_tests/enumInlineValue PASSED C 0:08.009 - R 0:00.022
22:53:48 ctrl-flow/loopctrl PASSED C 0:08.798 - R 0:00.040
22:53:48 include/vector-sequence PASSED C 0:02.373 - R 0:00.128
22:53:48 enum_tests/typedIntEnum PASSED C 0:06.826 - R 0:00.021
22:53:48 enum_tests/voidEnum PASSED C 0:06.827 - R 0:00.074
22:53:48 coroutine/prodcons PASSED C 0:11.569 - R 0:00.181
22:53:48 limits PASSED C 0:01.578 - R 0:00.021
22:53:48 include/vector-collections PASSED C 0:03.192 - R 0:00.041
22:53:48 exceptions/data-except PASSED C 0:06.710 - R 0:00.042
22:53:48 div PASSED C 0:09.931 - R 0:00.039
22:53:48 exceptions/finally PASSED C 0:06.806 - R 0:00.121
22:53:48 exceptions/conditional PASSED C 0:07.434 - R 0:00.068
22:53:48 enum_tests/stringEnum PASSED C 0:08.282 - R 0:00.123
22:53:48 linking/nostdlib PASSED C 0:01.669 - R 0:00.042
22:53:48 exceptions/defaults PASSED C 0:07.442 - R 0:00.037
22:53:48 concurrency/preempt PASSED C 0:14.122 - R 0:10.675
22:53:48 exceptions/interact PASSED C 0:07.354 - R 0:00.038
22:53:48 nested-types-ERR1 PASSED C 0:00.249 - R n/a
22:53:48 exceptions/polymorphic PASSED C 0:07.191 - R 0:00.038
22:53:48 exceptions/resume PASSED C 0:07.092 - R 0:00.127
22:53:48 linkonce PASSED C 0:01.744 - R 0:00.039
22:53:48 nested-types-ERR2 PASSED C 0:00.277 - R n/a
22:53:48 concurrency/channels/churn PASSED C 0:16.181 - R 0:10.155
22:53:48 exceptions/trash PASSED C 0:06.893 - R 0:00.071
22:53:48 exceptions/conditional-threads PASSED C 0:08.415 - R 0:00.070
22:53:48 exceptions/cancel/coroutine PASSED C 0:08.630 - R 0:00.071
22:53:48 device/cpu PASSED C 0:11.069 - R 0:00.174
22:53:48 concurrency/channels/contend PASSED C 0:16.266 - R 0:10.330
22:53:48 concurrency/channels/daisy_chain PASSED C 0:16.468 - R 0:10.144
22:53:48 enum_tests/position PASSED C 0:09.412 - R 0:00.171
22:53:48 concurrency/waitfor/dtor PASSED C 0:12.387 - R 0:07.399
22:53:48 concurrency/channels/hot_potato PASSED C 0:16.745 - R 0:10.169
22:53:48 opt-params PASSED C 0:00.475 - R n/a
22:53:48 concurrency/channels/zero_size PASSED C 0:17.011 - R 0:10.182
22:53:48 enum_tests/planet PASSED C 0:10.736 - R 0:00.133
22:53:48 concurrency/channels/pub_sub PASSED C 0:17.172 - R 0:10.238
22:53:48 exceptions/virtual-poly PASSED C 0:07.304 - R 0:00.077
22:53:48 concurrency/channels/ping_pong PASSED C 0:17.466 - R 0:10.146
22:53:48 generator/fmtLines PASSED C 0:06.983 - R 0:00.061
22:53:48 maybe PASSED C 0:02.222 - R 0:00.039
22:53:48 exceptions/finally-threads PASSED C 0:09.174 - R 0:00.076
22:53:48 generator/fibonacci PASSED C 0:07.168 - R 0:00.038
22:53:48 polybits PASSED C 0:00.518 - R n/a
22:53:48 nested-types PASSED C 0:02.059 - R 0:00.038
22:53:48 exceptions/terminate PASSED C 0:08.425 - R 0:00.075
22:53:48 fstream_test PASSED C 0:07.466 - R 0:00.024
22:53:48 nowarn/array PASSED C 0:01.895 - R 0:00.022
22:53:48 genericUnion PASSED C 0:07.147 - R 0:00.036
22:53:48 hello PASSED C 0:06.825 - R 0:00.073
22:53:48 linking/exception-nothreads PASSED C 0:04.838 - R 0:00.044
22:53:48 nowarn/exception PASSED C 0:01.914 - R 0:00.040
22:53:48 generator/suspend_then PASSED C 0:07.200 - R 0:00.081
22:53:48 nowarn/no-autogen PASSED C 0:01.833 - R 0:00.122
22:53:48 nowarn/unused PASSED C 0:01.844 - R 0:00.038
22:53:48 numericConstants PASSED C 0:01.618 - R 0:00.070
22:53:48 exceptions/resume-threads PASSED C 0:08.835 - R 0:00.073
22:53:48 operators PASSED C 0:01.659 - R 0:00.043
22:53:48 nowarn/printf-sizeof PASSED C 0:01.892 - R 0:00.037
22:53:48 nowarn/zero-thunk PASSED C 0:01.708 - R 0:00.121
22:53:48 poly-d-cycle PASSED C 0:01.564 - R 0:00.040
22:53:48 forall PASSED C 0:08.077 - R 0:00.039
22:53:48 identity PASSED C 0:06.944 - R 0:00.038
22:53:48 exceptions/defaults-threads PASSED C 0:10.005 - R 0:00.037
22:53:48 poly-bare-assn PASSED C 0:01.751 - R 0:00.039
22:53:48 concurrency/channels/big_elems PASSED C 0:16.672 - R 0:11.737
22:53:48 poly-many-arsz PASSED C 0:01.757 - R 0:00.048
22:53:48 poly-member PASSED C 0:01.744 - R 0:00.040
22:53:48 exceptions/terminate-threads PASSED C 0:09.025 - R 0:00.076
22:53:48 poly-o-cycle PASSED C 0:01.716 - R 0:00.126
22:53:48 concurrency/waituntil/basic_else PASSED C 0:19.262 - R 0:00.073
22:53:48 raii/ctor-autogen-ERR1 PASSED C 0:00.995 - R n/a
22:53:48 include/vector-fstream PASSED C 0:07.150 - R 0:00.038
22:53:48 poly-selection PASSED C 0:01.810 - R 0:00.036
22:53:48 exceptions/virtual-cast PASSED C 0:08.888 - R 0:00.041
22:53:48 typedefRedef-ERR1 PASSED C 0:00.174 - R n/a
22:53:48 raii/partial-ERR1 PASSED C 0:00.953 - R n/a
22:53:48 include/stdincludes PASSED C 0:07.552 - R 0:00.070
22:53:48 poly-self-cycle PASSED C 0:01.794 - R 0:00.039
22:53:48 var-assert PASSED C 0:00.232 - R n/a
22:53:48 quasiKeyword PASSED C 0:01.731 - R 0:00.069
22:53:48 raii/typeof-member PASSED C 0:01.501 - R 0:00.039
22:53:48 raii/partial PASSED C 0:01.595 - R 0:00.023
22:53:48 raii/init_once PASSED C 0:01.722 - R 0:00.045
22:53:48 raii/ctor-autogen PASSED C 0:02.314 - R 0:00.039
22:53:48 tuple/tupleMember PASSED C 0:01.503 - R 0:00.039
22:53:48 io/eofType PASSED C 0:08.189 - R 0:00.042
22:53:48 exceptions/fibonacci_nonlocal PASSED C 0:11.745 - R 0:00.044
22:53:48 simpleGenericTriple PASSED C 0:01.963 - R 0:00.040
22:53:48 exceptions/cor_resumer PASSED C 0:12.108 - R 0:00.072
22:53:48 function-operator PASSED C 0:09.645 - R 0:00.073
22:53:48 tuple/tupleCast PASSED C 0:01.703 - R 0:00.072
22:53:48 tuple/tupleFunction PASSED C 0:01.757 - R 0:00.049
22:53:48 result PASSED C 0:02.157 - R 0:00.037
22:53:48 typedefRedef PASSED C 0:01.626 - R 0:00.041
22:53:48 typeof PASSED C 0:01.515 - R 0:00.041
22:53:48 switch PASSED C 0:02.194 - R 0:00.038
22:53:48 smart-pointers PASSED C 0:02.319 - R 0:00.072
22:53:48 tuple/tuplePolymorphism PASSED C 0:01.978 - R 0:00.072
22:53:48 variableDeclarator PASSED C 0:01.690 - R 0:00.119
22:53:48 meta/fork+exec PASSED C 0:05.052 - R 0:00.272
22:53:48 linking/exception-withthreads PASSED C 0:07.545 - R 0:00.128
22:53:48 withconflict PASSED C 0:00.827 - R n/a
22:53:48 linking/mangling/anon PASSED C 0:07.354 - R 0:00.072
22:53:48 ...collections/dimexpr-match-c-ERRS PASSED C 0:01.050 - R n/a
22:53:48 KRfunctions PASSED C 0:01.414 - R 0:00.003
22:53:48 warnings/self-assignment PASSED C 0:01.571 - R 0:00.006
22:53:48 exceptions/cancel/thread PASSED C 0:13.851 - R 0:00.072
22:53:48 voidPtr PASSED C 0:01.683 - R 0:00.073
22:53:48 concurrency/futures/future_except PASSED C 0:31.973 - R 0:00.126
22:53:48 raii/memberCtors-ERR1 PASSED C 0:04.227 - R n/a
22:53:48 list/dlist-insert-remove PASSED C 0:07.348 - R 0:00.175
22:53:48 literals PASSED C 0:07.230 - R 0:00.122
22:53:48 ...llections/dimexpr-match-cfa-ERRS PASSED C 0:01.709 - R n/a
22:53:48 attributes PASSED C 0:01.621 - R 0:00.003
22:53:48 errors/completeType PASSED C 0:00.912 - R n/a
22:53:48 io/manipulatorsInput-uchunk PASSED C 0:09.750 - R 0:00.178
22:53:48 declarationSpecifier PASSED C 0:01.543 - R 0:00.002
22:53:48 io/manipulatorsOutput4 PASSED C 0:10.067 - R 0:00.071
22:53:48 linking/io-acquire PASSED C 0:09.192 - R 0:00.036
22:53:48 concurrency/waituntil/one_chan PASSED C 0:13.006 - R 0:09.976
22:53:48 raii/dtor-early-exit-ERR2 PASSED C 0:05.187 - R n/a
22:53:48 linking/nothreads PASSED C 0:08.913 - R 0:00.043
22:53:48 extension PASSED C 0:01.459 - R 0:00.003
22:53:48 arithmeticConversions PASSED C 0:02.965 - R 0:00.121
22:53:48 raii/dtor-early-exit-ERR1 PASSED C 0:05.760 - R n/a
22:53:48 tuple/tupleVariadic PASSED C 0:04.917 - R 0:00.038
22:53:48 functions PASSED C 0:01.577 - R 0:00.002
22:53:48 meta/arch PASSED C 0:00.902 - R n/a
22:53:48 gccExtensions PASSED C 0:01.620 - R 0:00.002
22:53:48 list/dlist2-insert-remove PASSED C 0:09.110 - R 0:00.070
22:53:48 collections/atomic_mpsc PASSED C 0:12.973 - R 0:21.068
22:53:48 zero_one-ERR1 PASSED C 0:03.827 - R n/a
22:53:48 exceptions/pingpong_nonlocal PASSED C 0:15.476 - R 0:00.070
22:53:48 quotedKeyword PASSED C 0:06.927 - R 0:00.038
22:53:48 raii/boxed-types PASSED C 0:06.833 - R 0:00.035
22:53:48 meta/dumpable PASSED C 0:09.406 - R 0:00.041
22:53:48 io/io PASSED C 0:12.498 - R 0:00.038
22:53:48 raii/globals PASSED C 0:07.186 - R 0:00.037
22:53:48 linking/weakso_nothd PASSED C 0:10.849 - R 0:00.038
22:53:48 shortCircuit PASSED C 0:06.919 - R 0:00.037
22:53:48 raii/memberCtors PASSED C 0:07.224 - R 0:00.038
22:53:48 malloc PASSED C 0:09.891 - R 0:00.038
22:53:48 polymorphism PASSED C 0:07.880 - R 0:00.037
22:53:48 references PASSED C 0:07.326 - R 0:00.040
22:53:48 tuplearray PASSED C 0:06.808 - R 0:00.038
22:53:48 concurrency/preempt2 PASSED C 0:12.696 - R 0:21.726
22:53:48 io/io-acquire PASSED C 0:12.762 - R 0:00.273
22:53:48 io/io-acquire2 PASSED C 0:12.754 - R 0:00.318
22:53:48 strstream PASSED C 0:07.587 - R 0:00.025
22:53:48 tuple/tupleAssign PASSED C 0:07.638 - R 0:00.038
22:53:48 linking/withthreads PASSED C 0:11.828 - R 0:00.038
22:53:48 userLiterals PASSED C 0:07.318 - R 0:00.040
22:53:48 io/io-acquire-out PASSED C 0:13.410 - R 0:00.220
22:53:48 concurrency/waituntil/channel_close PASSED C 0:16.890 - R 0:10.099
22:53:48 sizeof PASSED C 0:08.452 - R 0:00.036
22:53:48 io/io-acquire-in PASSED C 0:13.987 - R 0:00.220
22:53:48 zero_one PASSED C 0:06.578 - R 0:00.039
22:53:48 time PASSED C 0:08.570 - R 0:00.036
22:53:48 raii/dtor-early-exit PASSED C 0:09.363 - R 0:00.035
22:53:48 io/away_fair FAILED with code -6 C 0:14.941 - R 0:00.220
22:53:48starting
22:53:48100
22:53:48200
22:53:48300
22:53:48400
22:53:48500
22:53:48600
22:53:48700
22:53:48800
22:53:48900
22:53:481000
22:53:48done
22:53:48Processor (0xfffff7fb12c0) tearing down ring with 4294967295 entries allocated but not submitted, out of 256
22:53:48Cforall Runtime error (UNIX pid:522495):
22:53:48Stack back trace for: /var/lib/jenkins/workspace/Cforall_master@tmp/libcfa/arm64-debug/src/.libs/libcfa.so.1
22:53:48(0) /var/lib/jenkins/workspace/Cforall_master@tmp/libcfa/arm64-debug/src/.libs/libcfa.so.1 : + 0xef278 [0xfffff7e5f278]
22:53:48(1) /var/lib/jenkins/workspace/Cforall_master@tmp/libcfa/arm64-debug/src/.libs/libcfa.so.1 : __cabi_abort + 0 [0xfffff7e5ea90]
22:53:48(2) /var/lib/jenkins/workspace/Cforall_master@tmp/libcfa/arm64-debug/src/.libs/libcfa.so.1 : _X4endsFv_S8ofstream__1 + 0x88 [0xfffff7dae848]
22:53:48(3) /var/lib/jenkins/workspace/Cforall_master@tmp/libcfa/arm64-debug/src/.libs/libcfa.so.1 : _X15_operator_bitorQ1_0_0_1__X19basic_ostream_tableKS18basic_ostream_data_BD0__Fv_BD0j__1 + 0x38 [0xfffff7db8e30]
22:53:48(4) /var/lib/jenkins/workspace/Cforall_master@tmp/libcfa/arm64-debug/src/.libs/libcfathread.so.1 : + 0x4b7dc [0xfffff7f3b7dc]
22:53:48(5) /var/lib/jenkins/workspace/Cforall_master@tmp/libcfa/arm64-debug/src/.libs/libcfathread.so.1 : + 0x4a63c [0xfffff7f3a63c]
22:53:48(6) /var/lib/jenkins/workspace/Cforall_master@tmp/libcfa/arm64-debug/src/.libs/libcfathread.so.1 : + 0x4bbd8 [0xfffff7f3bbd8]
22:53:48(7) /var/lib/jenkins/workspace/Cforall_master@tmp/libcfa/arm64-debug/src/.libs/libcfathread.so.1 : + 0x56ebc [0xfffff7f46ebc]
22:53:48(8) /lib/ld-linux-aarch64.so.1 : + 0xf00 [0xfffff7fbef00]
22:53:48(9) /lib/ld-linux-aarch64.so.1 : + 0x4910 [0xfffff7fc2910]
22:53:48(10) /lib/aarch64-linux-gnu/libc.so.6 : + 0x3f228 [0xfffff7aff228]
22:53:4822:53:48warning: Can't open file anon_inode:[io_uring] which was expanded to anon_inode:[io_uring] during file-backed mapping note processing
22:53:48[New LWP 522495]
22:53:48[Thread debugging using libthread_db enabled]
22:53:48Using host libthread_db library "/lib/aarch64-linux-gnu/libthread_db.so.1".
22:53:48Core was generated by `/var/lib/jenkins/workspace/Cforall_master@tmp/tests/io/away_fair'.
22:53:48Program terminated with signal SIGABRT, Aborted.
22:53:48#0 __pthread_kill_implementation (threadid=281474842402240, signo=signo@entry=6, no_tid=no_tid@entry=0) at ./nptl/pthread_kill.c:44
22:53:4822:53:48warning: 44 ./nptl/pthread_kill.c: No such file or directory
22:53:48-----
22:53:48#0 __pthread_kill_implementation (threadid=281474842402240, signo=signo@entry=6, no_tid=no_tid@entry=0) at ./nptl/pthread_kill.c:44
22:53:48#1 0x0000fffff7b47540 in __pthread_kill_internal (signo=6, threadid=<optimized out>) at ./nptl/pthread_kill.c:78
22:53:48#2 0x0000fffff7afcb3c in __GI_raise (sig=sig@entry=6) at ../sysdeps/posix/raise.c:26
22:53:48#3 0x0000fffff7ae7e00 in __GI_abort () at ./stdlib/abort.c:79
22:53:48#4 0x0000fffff7e5efd8 in _X7__abortFv_bPKcY17__builtin_va_list__1 (_X11signalAbortb_1=true, _X3fmtPKc_1=0xfffff7e7e6e0 "Application interrupted by signal: %s.\n", _X4argsY17__builtin_va_list_1=...) at /var/lib/jenkins/workspace/Cforall_master/libcfa/src/interpose.cfa:263
22:53:48#5 0x0000fffff7e5f278 in _X5abortFv_bPKc__1 (_X11signalAbortb_1=true, _X3fmtPKc_1=0xfffff7e7e6e0 "Application interrupted by signal: %s.\n") at /var/lib/jenkins/workspace/Cforall_master/libcfa/src/interpose.cfa:301
22:53:48#6 0x0000fffff7e5f43c in _X15sigHandler_termFv_iPS21__anonymous_siginfo_tPS10ucontext_t__1 (_X3sigi_1=6, _X3sfpPS21__anonymous_siginfo_t_1=0xfffff7ee1f30 <stack+60832>, _X3cxtPS10ucontext_t_1=0xfffff7ee1fb0 <stack+60960>) at /var/lib/jenkins/workspace/Cforall_master/libcfa/src/interpose.cfa:337
22:53:48#7 <signal handler called>
22:53:48#8 __pthread_kill_implementation (threadid=281474842402240, signo=signo@entry=6, no_tid=no_tid@entry=0) at ./nptl/pthread_kill.c:44
22:53:48#9 0x0000fffff7b47540 in __pthread_kill_internal (signo=6, threadid=<optimized out>) at ./nptl/pthread_kill.c:78
22:53:48#10 0x0000fffff7afcb3c in __GI_raise (sig=sig@entry=6) at ../sysdeps/posix/raise.c:26
22:53:48#11 0x0000fffff7ae7e00 in __GI_abort () at ./stdlib/abort.c:79
22:53:48#12 0x0000fffff7e5f110 in _X7__abortFv_bPKcY17__builtin_va_list__1 (_X11signalAbortb_1=false, _X3fmtPKc_1=0xfffff7e7e440 "%s", _X4argsY17__builtin_va_list_1=...) at /var/lib/jenkins/workspace/Cforall_master/libcfa/src/interpose.cfa:286
22:53:48#13 0x0000fffff7e5f278 in _X5abortFv_bPKc__1 (_X11signalAbortb_1=false, _X3fmtPKc_1=0xfffff7e7e440 "%s") at /var/lib/jenkins/workspace/Cforall_master/libcfa/src/interpose.cfa:301
22:53:48#14 0x0000fffff7e5ea90 in abort () at /var/lib/jenkins/workspace/Cforall_master/libcfa/src/interpose.cfa:176
22:53:48#15 0x0000fffff7dae848 in _X4endsFv_S8ofstream__1 (_X2osS8ofstream_1=0xfffff7ec1368 <_X9abortFileS8ofstream_1>) at /var/lib/jenkins/workspace/Cforall_master/libcfa/src/fstream.cfa:106
22:53:48#16 0x0000fffff7db8e30 in _X15_operator_bitorQ1_0_0_1__X19basic_ostream_tableKS18basic_ostream_data_BD0__Fv_BD0j__1 (_X19basic_ostream_tableKS18basic_ostream_data_Y6ostype__1=0xfffff7ec13d8 <_X19ofstream_basic_dataS18basic_ostream_data_S8ofstream__1>, _X2osY6ostype_1=0xfffff7ec1368 <_X9abortFileS8ofstream_1>, _X1tj_1=256) at /var/lib/jenkins/workspace/Cforall_master/libcfa/src/iostream.cfa:98
22:53:48#17 0x0000fffff7f3b7dc in _X19__io_uring_teardownFv_S11io_context$__1 (_X4thisS11io_context$_1=0xaaaaaaad4b00) at /var/lib/jenkins/workspace/Cforall_master/libcfa/src/concurrency/io/setup.cfa:288
22:53:48#18 0x0000fffff7f3a63c in _X11_destructorFv_S11io_context$__1 (_X4thisS11io_context$_1=0xaaaaaaad4b00) at /var/lib/jenkins/workspace/Cforall_master/libcfa/src/concurrency/io/setup.cfa:125
22:53:48#19 0x0000fffff7f3bbd8 in _X13__cfa_io_stopFv_PS9processor__1 (_X4procPS9processor_1=0xfffff7fb12c0 <_X21storage_mainProcessorA0c_1>) at /var/lib/jenkins/workspace/Cforall_master/libcfa/src/concurrency/io/setup.cfa:313
22:53:48#20 0x0000fffff7f46ebc in _X17__kernel_shutdownFv___1 () at /var/lib/jenkins/workspace/Cforall_master/libcfa/src/concurrency/kernel/startup.cfa:312
22:53:48#21 0x0000fffff7fbef00 in _dl_call_fini (closure_map=closure_map@entry=0xfffff7ff72d0) at ./elf/dl-call_fini.c:43
22:53:48#22 0x0000fffff7fc2910 in _dl_fini () at ./elf/dl-fini.c:114
22:53:48#23 0x0000fffff7aff228 in __run_exit_handlers (status=0, listp=0xfffff7c70670 <__exit_funcs>, run_list_atexit=run_list_atexit@entry=true, run_dtors=run_dtors@entry=true) at ./stdlib/exit.c:108
22:53:48#24 0x0000fffff7aff30c in __GI_exit (status=<optimized out>) at ./stdlib/exit.c:138
22:53:48#25 0x0000fffff7ae84c8 in __libc_start_call_main (main=main@entry=0xaaaaaaaa4e08 <main>, argc=argc@entry=1, argv=argv@entry=0xfffffffff238) at ../sysdeps/nptl/libc_start_call_main.h:74
22:53:48#26 0x0000fffff7ae8598 in __libc_start_main_impl (main=0xaaaaaaaa4e08 <main>, argc=1, argv=0xfffffffff238, init=<optimized out>, fini=<optimized out>, rtld_fini=<optimized out>, stack_end=<optimized out>) at ../csu/libc-start.c:360
22:53:48#27 0x0000aaaaaaaa31f0 in _start ()
22:53:48-----
22:53:48 Id Target Id Frame
22:53:48* 1 Thread 0xfffff7fe9dc0 (LWP 522495) __pthread_kill_implementation (threadid=281474842402240, signo=signo@entry=6, no_tid=no_tid@entry=0) at ./nptl/pthread_kill.c:44
22:53:4822:53:48Archiving io/away_fair (executable and core) to crashes/full-debug/io/away_fair
22:53:48 vector PASSED C 0:08.730 - R 0:00.035
22:53:48 sum PASSED C 0:09.574 - R 0:00.035
22:53:48 swap PASSED C 0:09.601 - R 0:00.036
22:53:48 io/many_read PASSED C 0:15.101 - R 0:00.069
22:53:48 searchsort PASSED C 0:09.979 - R 0:00.034
22:53:48 ...collections/array-md-sbscr-cases PASSED C 0:08.202 - R 0:00.040
22:53:48 ...rrency/examples/boundedBufferEXT PASSED C 0:12.421 - R 0:26.318
22:53:48 io/comp_basic PASSED C 0:16.758 - R 0:00.418
22:53:48 io/comp_fair PASSED C 0:16.726 - R 0:00.475
22:53:48 vector_math/vec2_uint PASSED C 0:09.500 - R 0:00.035
22:53:48 minmax PASSED C 0:13.562 - R 0:00.037
22:53:48 vector_math/vec2_double PASSED C 0:10.299 - R 0:00.037
22:53:48 abs PASSED C 0:09.427 - R 0:00.037
22:53:48 ato PASSED C 0:09.609 - R 0:00.035
22:53:48 io/manipulatorsInput PASSED C 0:08.209 - R 0:00.035
22:53:48 random PASSED C 0:08.399 - R 0:00.036
22:53:48 bitmanip2 PASSED C 0:10.469 - R 0:00.068
22:53:48 gmp PASSED C 0:09.264 - R 0:00.036
22:53:48 ...rrency/examples/boundedBufferINT PASSED C 0:12.745 - R 0:28.839
22:53:48 bitmanip1 PASSED C 0:10.728 - R 0:00.068
22:53:48 concurrency/waituntil/futures PASSED C 0:32.068 - R 0:00.068
22:53:48 vector_math/vec2_ldouble PASSED C 0:09.416 - R 0:00.036
22:53:48 vector_math/vec3_int PASSED C 0:12.684 - R 0:00.035
22:53:48 exceptions/cardgame PASSED C 0:10.650 - R 0:00.118
22:53:48 io/manipulatorsOutput2 PASSED C 0:09.968 - R 0:00.037
22:53:48 exceptions/hotpotato PASSED C 0:10.710 - R 0:00.067
22:53:48 bitmanip3 PASSED C 0:11.581 - R 0:00.067
22:53:48 vector_math/vec2_int PASSED C 0:13.909 - R 0:00.037
22:53:48 vector_math/vec4_int PASSED C 0:13.771 - R 0:00.037
22:53:48 exceptions/hotpotato_checked PASSED C 0:12.132 - R 0:00.067
22:53:48 include/includes PASSED C 0:22.505 - R 0:00.036
22:53:48 vector_math/vec3_float PASSED C 0:14.392 - R 0:00.036
22:53:48 vector_math/vec2_float PASSED C 0:15.253 - R 0:00.074
22:53:48 vector_math/vec4_float PASSED C 0:14.532 - R 0:00.036
22:53:48 math PASSED C 0:13.474 - R 0:00.035
22:53:48 mathX PASSED C 0:14.154 - R 0:00.037
22:53:48 io/manipulatorsOutput3 PASSED C 0:14.264 - R 0:00.119
22:53:48 io/manipulatorsOutput1 PASSED C 0:15.237 - R 0:00.037
22:53:48 io/io-acquire-no-io PASSED C 0:12.346 - R 0:13.204
22:53:48 PRNG PASSED C 0:17.291 - R 0:02.124
22:53:48 heap PASSED C 0:09.908 - R 0:20.378
22:53:48 concurrency/unified_locking/mcs PASSED C 0:14.967 - R 0:32.691
22:53:48 ...ency/waituntil/channel_zero_size PASSED C 0:12.937 - R 0:31.090
22:53:48 concurrency/actors/dynamic PASSED C 0:22.082 - R 0:32.853
22:53:48 rational PASSED C 0:27.284 - R 0:00.039
22:53:48 ...ency/unified_locking/futex_mutex PASSED C 0:13.903 - R 0:40.014
22:53:48 concurrency/waituntil/repeat_close PASSED C 0:16.837 - R 0:30.133
22:53:48 concurrency/waituntil/channels PASSED C 0:13.600 - R 0:38.069
22:53:48 concurrency/waituntil/all_types PASSED C 0:35.187 - R 0:20.746
22:53:48 concurrency/monitor PASSED C 0:12.208 - R 0:57.233
22:53:48 concurrency/multi-monitor PASSED C 0:12.074 - R 0:57.765
22:53:48 ...urrency/unified_locking/mcs_spin PASSED C 0:14.309 - R 0:51.542
22:53:48 .../unified_locking/spin_queue_lock PASSED C 0:13.939 - R 0:52.286
22:53:48 concurrency/waituntil/locks PASSED C 0:15.151 - R 1:10.423
22:53:48 concurrency/unified_locking/locks PASSED C 0:15.270 - R 1:40.216
22:53:48 concurrency/mutexstmt/locks PASSED C 0:12.274 - R 2:15.406
22:53:48374 passes, 1 failures, 0 timeouts, 0 cancelled, 0 other
22:53:48Tests took 2:28.625
22:53:48make: *** [Makefile:986: all-local] Error 1
22:53:48[Pipeline] }
22:53:48[Pipeline] // dir
22:53:48[Pipeline] }
22:53:48[Pipeline] // stage
22:53:48[Pipeline] echo
22:53:48Archiving core dumps
22:53:48[Pipeline] dir
22:53:48Running in /var/lib/jenkins/workspace/Cforall_master@tmp
22:53:48[Pipeline] {
22:53:48[Pipeline] fileExists
22:53:48[Pipeline] sh
22:53:48+ /var/lib/jenkins/workspace/Cforall_master/tools/jenkins/archive-gen.sh
22:53:48[Pipeline] archiveArtifacts
22:53:48Archiving artifacts
22:53:48Recording fingerprints
22:53:48[Pipeline] }
22:53:48[Pipeline] // dir
22:53:48[Pipeline] }
22:53:48[Pipeline] // wrap
22:53:48[Pipeline] }
22:53:48[Pipeline] // node
22:53:48[Pipeline] echo
22:53:48hudson.AbortException: script returned exit code 2
22:53:48[Pipeline] node
22:53:48Running on Brokk 1 in /var/lib/jenkins/workspace/Cforall_master
22:53:48[Pipeline] {
22:53:48[Pipeline] echo
22:53:48Notifying users of result
22:53:48[Pipeline] echo
22:53:48Reusing previously constructed message
22:53:48[Pipeline] echo
22:53:48Would send email to: cforall@lists.uwaterloo.ca
22:53:48[Pipeline] echo
22:53:48With title: [cforall git][BUILD# 3805 - FAILURE] - branch master
22:53:48[Pipeline] echo
22:53:48Content:
22:53:48<p>This is an automated email from the Jenkins build machine. It was
22:53:48generated because of a git hooks/post-receive script following
22:53:48a ref change which was pushed to the Cā repository.</p>
22:53:4822:53:48<p>- Status --------------------------------------------------------------</p>
22:53:4822:53:48<p>BUILD# 3805 - FAILURE</p>
22:53:48<p>Check console output at https://cforall.uwaterloo.ca/jenkins/job/Cforall/job/master/3805/ to view the results.</p>
22:53:4822:53:48<p>- Changes -------------------------------------------------------------</p>
22:53:4822:53:48<pre>
22:53:48The branch master has been updated.
22:53:48 from 1c69e6eb208437ab9d5e7868cd58d734741ff97e (commit)
22:53:48</pre>
22:53:4822:53:48<p>- Log -----------------------------------------------------------------</p>
22:53:4822:53:48<pre>
22:53:4822:53:48</pre>
22:53:4822:53:48<p>-----------------------------------------------------------------------</p>
22:53:48<pre>
22:53:48Summary of changes:
22:53:4822:53:48</pre>
22:53:4822:53:48[Pipeline] }
22:53:48[Pipeline] // node
22:53:48[Pipeline] echo
22:53:48Build Completed
22:53:48[Pipeline] End of Pipeline
22:53:48ERROR: script returned exit code 2
22:53:48Finished: FAILURE