Skip to content

Console Output

Skipping 729 KB.. Full Log
xILi1BRfsEwJg4BPVmJZon5OYl66vk9+Xrp1RRGDFNSy5Py84vycVD1nCI1qPENFAZBe8P8qXzHQfXwgU/RApuiBTel+MuFMv/J9JgZGLwbWssSc0lSguQIIRX6luUmpRW1rpspyT3nQDTUNCHTW3AYADYItFvIAAAA=       	...ency/waituntil/channel_zero_size  PASSED     C 0:12.613 - R 0:00.519
23:35:48        	concurrency/waituntil/channels       PASSED     C 0:13.965 - R 0:00.972
23:35:48        	concurrency/waituntil/one_chan       PASSED     C 0:12.565 - R 0:00.270
23:35:48        	const-init                           PASSED     C 0:01.180 - R 0:00.006
23:35:48        	concurrency/waituntil/basic_else     PASSED     C 0:17.956 - R 0:00.006
23:35:48        	const-ref                            PASSED     C 0:01.087 - R 0:00.011
23:35:48        	concurrency/waituntil/timeout        PASSED     C 0:06.900 - R 0:03.025
23:35:48        	configs/parsebools                   PASSED     C 0:09.760 - R 0:00.067
23:35:48        	concurrency/unified_locking/locks    PASSED     C 0:14.862 - R 0:24.584
23:35:48        	configs/parseconfig                  PASSED     C 0:09.104 - R 0:00.007
23:35:48        	copyfile                             PASSED     C 0:06.042 - R 0:00.012
23:35:48        	configs/usage                        PASSED     C 0:09.733 - R 0:00.011
23:35:48        	coroutine/fmtLines                   PASSED     C 0:07.392 - R 0:00.007
23:35:48        	coroutine/fibonacci                  PASSED     C 0:07.710 - R 0:00.006
23:35:48        	coroutine/devicedriver               PASSED     C 0:08.092 - R 0:00.033
23:35:48        	concurrency/waituntil/channel_close  PASSED     C 0:16.794 - R 0:10.044
23:35:48        	coroutine/pingpong                   PASSED     C 0:07.314 - R 0:00.007
23:35:48        	...ency/unified_locking/futex_mutex  PASSED     C 0:13.143 - R 0:36.559
23:35:48        	ctrl-flow/labelledExit               PASSED     C 0:01.162 - R 0:00.006
23:35:48        	coroutine/raii                       PASSED     C 0:07.484 - R 0:00.039
23:35:48        	ctrl-flow/loop-inc                   PASSED     C 0:01.064 - R 0:00.005
23:35:48        	concurrency/waituntil/futures        PASSED     C 0:29.741 - R 0:00.010
23:35:48        	counter                              PASSED     C 0:05.997 - R 0:00.017
23:35:48        	ctrl-flow/break-misc                 PASSED     C 0:06.367 - R 0:00.014
23:35:48        	ctrl-flow/fallthrough                PASSED     C 0:06.278 - R 0:00.019
23:35:48        	coroutine/runningTotal               PASSED     C 0:07.586 - R 0:00.014
23:35:48        	coroutine/prodcons                   PASSED     C 0:10.153 - R 0:00.019
23:35:48        	ctrl-flow/goto                       PASSED     C 0:06.011 - R 0:00.006
23:35:48        	enum                                 PASSED     C 0:01.368 - R 0:00.035
23:35:48        	concurrency/waituntil/all_types      PASSED     C 0:35.012 - R 0:00.921
23:35:48        	designations                         PASSED     C 0:03.140 - R 0:00.011
23:35:48        	ctrl-flow/ifwhileCtl                 PASSED     C 0:06.786 - R 0:00.005
23:35:48        	enum_tests/inc-dec                   PASSED     C 0:01.316 - R 0:00.020
23:35:48        	enum_tests/lvalue                    PASSED     C 0:00.700 - R n/a
23:35:48        	enum_tests/funcEnum                  PASSED     C 0:02.256 - R 0:00.014
23:35:48        	concurrency/waituntil/locks          PASSED     C 0:15.500 - R 0:19.061
23:35:48        	ctrl-flow/loop_else                  PASSED     C 0:07.212 - R 0:00.011
23:35:48        	ctrl-flow/loop_else-WRN1             PASSED     C 0:07.215 - R 0:00.001
23:35:48        	enum_tests/structEnum                PASSED     C 0:02.535 - R 0:00.017
23:35:48        	enum_tests/anonymous                 PASSED     C 0:06.776 - R 0:00.019
23:35:48        	errors/declaration                   PASSED     C 0:00.105 - R n/a
23:35:48        	enum_tests/enumInlineValue           PASSED     C 0:06.860 - R 0:00.006
23:35:48        	errors/scope-type                    PASSED     C 0:00.145 - R n/a
23:35:48        	errors/signature                     PASSED     C 0:00.102 - R n/a
23:35:48        	errors/scope                         PASSED     C 0:00.670 - R n/a
23:35:48        	eval                                 PASSED     C 0:01.089 - R 0:00.005
23:35:48        	div                                  PASSED     C 0:08.722 - R 0:00.020
23:35:48        	ctrl-flow/loopctrl                   PASSED     C 0:09.898 - R 0:00.007
23:35:48        	enum_tests/input                     PASSED     C 0:06.895 - R 0:00.010
23:35:48        	enum_tests/stringEnum                PASSED     C 0:06.559 - R 0:00.017
23:35:48        	device/cpu                           PASSED     C 0:11.618 - R 0:00.009
23:35:48        	enum_tests/typedIntEnum              PASSED     C 0:06.134 - R 0:00.006
23:35:48        	enum_tests/position                  PASSED     C 0:08.588 - R 0:00.019
23:35:48        	enum_tests/planet                    PASSED     C 0:08.747 - R 0:00.009
23:35:48        	enum_tests/voidEnum                  PASSED     C 0:06.280 - R 0:00.005
23:35:48        	exceptions/conditional               PASSED     C 0:06.277 - R 0:00.019
23:35:48        	exceptions/cancel/coroutine          PASSED     C 0:07.575 - R 0:00.020
23:35:48        	exceptions/data-except               PASSED     C 0:06.755 - R 0:00.020
23:35:48        	exceptions/conditional-threads       PASSED     C 0:07.702 - R 0:00.009
23:35:48        	exceptions/message                   PASSED     C 0:02.782 - R 0:00.005
23:35:48        	exceptions/defaults                  PASSED     C 0:06.960 - R 0:00.006
23:35:48        	.../unified_locking/spin_queue_lock  PASSED     C 0:13.277 - R 0:50.407
23:35:48        	...urrency/unified_locking/mcs_spin  PASSED     C 0:14.243 - R 0:51.690
23:35:48        	exceptions/finally                   PASSED     C 0:06.414 - R 0:00.005
23:35:48        	concurrency/waituntil/repeat_close   PASSED     C 0:14.011 - R 0:30.077
23:35:48        	exceptions/cancel/thread             PASSED     C 0:11.170 - R 0:00.009
23:35:48        	exceptions/try-ctrl-flow             PASSED     C 0:00.338 - R n/a
23:35:48        	exceptions/defaults-threads          PASSED     C 0:07.992 - R 0:00.009
23:35:48        	exceptions/interact                  PASSED     C 0:06.619 - R 0:00.005
23:35:48        	exceptions/type-check                PASSED     C 0:00.473 - R n/a
23:35:48        	exceptions/finally-threads           PASSED     C 0:07.819 - R 0:00.009
23:35:48        	exceptions/try-leave-catch           PASSED     C 0:01.223 - R 0:00.005
23:35:48        	exceptions/cor_resumer               PASSED     C 0:11.139 - R 0:00.009
23:35:48        	expression                           PASSED     C 0:01.124 - R 0:00.005
23:35:48        	exceptions/fibonacci_nonlocal        PASSED     C 0:09.781 - R 0:00.009
23:35:48        	exceptions/polymorphic               PASSED     C 0:06.774 - R 0:00.007
23:35:48        	exceptions/resume                    PASSED     C 0:06.676 - R 0:00.005
23:35:48        	global-monomorph                     PASSED     C 0:01.094 - R 0:00.005
23:35:48        	exceptions/terminate                 PASSED     C 0:06.701 - R 0:00.005
23:35:48        	exceptions/trash                     PASSED     C 0:06.261 - R 0:00.005
23:35:48        	exceptions/resume-threads            PASSED     C 0:07.852 - R 0:00.009
23:35:48        	exceptions/virtual-poly              PASSED     C 0:06.311 - R 0:00.005
23:35:48        	exceptions/terminate-threads         PASSED     C 0:07.932 - R 0:00.009
23:35:48        	identFuncDeclarator                  PASSED     C 0:01.115 - R 0:00.005
23:35:48        	fstream_test                         PASSED     C 0:06.203 - R 0:00.005
23:35:48        	exceptions/pingpong_nonlocal         PASSED     C 0:11.497 - R 0:00.007
23:35:48        	generator/fibonacci                  PASSED     C 0:06.098 - R 0:00.009
23:35:48        	identParamDeclarator                 PASSED     C 0:01.109 - R 0:00.005
23:35:48        	generator/fmtLines                   PASSED     C 0:06.144 - R 0:00.009
23:35:48        	forall                               PASSED     C 0:07.392 - R 0:00.007
23:35:48        	exceptions/virtual-cast              PASSED     C 0:08.216 - R 0:00.005
23:35:48        	init1-ERROR                          PASSED     C 0:00.615 - R n/a
23:35:48        	init1                                PASSED     C 0:01.120 - R 0:00.005
23:35:48        	generator/suspend_then               PASSED     C 0:06.112 - R 0:00.005
23:35:48        	include/vector-sequence              PASSED     C 0:01.708 - R 0:00.005
23:35:48        	include/vector-collections           PASSED     C 0:02.892 - R 0:00.005
23:35:48        	genericUnion                         PASSED     C 0:06.369 - R 0:00.006
23:35:48        	function-operator                    PASSED     C 0:09.568 - R 0:00.005
23:35:48        	hello                                PASSED     C 0:06.169 - R 0:00.006
23:35:48        	identity                             PASSED     C 0:06.331 - R 0:00.004
23:35:48        	include/vector-fstream               PASSED     C 0:06.234 - R 0:00.005
23:35:48        	include/stdincludes                  PASSED     C 0:07.871 - R 0:00.018
23:35:48        	io/eofType                           PASSED     C 0:06.342 - R 0:00.013
23:35:48        	limits                               PASSED     C 0:01.457 - R 0:00.006
23:35:48        	io/io                                PASSED     C 0:10.587 - R 0:00.007
23:35:48        	heap                                 PASSED     C 0:08.782 - R 0:06.539
23:35:48        	linking/exception-nothreads          PASSED     C 0:04.578 - R 0:00.005
23:35:48        	io/io-acquire                        PASSED     C 0:12.326 - R 0:00.034
23:35:48        	io/io-acquire-in                     PASSED     C 0:11.735 - R 0:00.169
23:35:48        	io/away_fair                         PASSED     C 0:14.360 - R 0:00.012
23:35:48        	io/io-acquire-out                    PASSED     C 0:11.768 - R 0:00.018
23:35:48        	linking/nostdlib                     PASSED     C 0:01.123 - R 0:00.006
23:35:48        	io/manipulatorsInput-uchunk          PASSED     C 0:10.134 - R 0:00.021
23:35:48        	linkonce                             PASSED     C 0:01.248 - R 0:00.005
23:35:48        	io/comp_basic                        PASSED     C 0:15.785 - R 0:00.068
23:35:48        	io/comp_fair                         PASSED     C 0:15.860 - R 0:00.117
23:35:48        	io/io-acquire2                       PASSED     C 0:12.907 - R 0:00.117
23:35:48        	maybe                                PASSED     C 0:01.569 - R 0:00.006
23:35:48        	linking/exception-withthreads        PASSED     C 0:06.378 - R 0:00.007
23:35:48        	io/manipulatorsOutput4               PASSED     C 0:12.573 - R 0:00.019
23:35:48        	io/io-acquire-no-io                  PASSED     C 0:11.542 - R 0:05.238
23:35:48        	linking/mangling/anon                PASSED     C 0:06.439 - R 0:00.005
23:35:48        	nested-types-ERR1                    PASSED     C 0:00.108 - R n/a
23:35:48        	nested-types-ERR2                    PASSED     C 0:00.186 - R n/a
23:35:48        	nested-types                         PASSED     C 0:01.118 - R 0:00.005
23:35:48        	nowarn/array                         PASSED     C 0:01.245 - R 0:00.006
23:35:48        	linking/io-acquire                   PASSED     C 0:08.701 - R 0:00.006
23:35:48        	list/dlist-insert-remove             PASSED     C 0:06.310 - R 0:00.005
23:35:48        	nowarn/exception                     PASSED     C 0:01.288 - R 0:00.005
23:35:48        	nowarn/no-autogen                    PASSED     C 0:01.079 - R 0:00.005
23:35:48        	linking/nothreads                    PASSED     C 0:08.043 - R 0:00.009
23:35:48        	io/many_read                         PASSED     C 0:15.296 - R 0:00.012
23:35:48        	opt-params                           PASSED     C 0:00.077 - R n/a
23:35:48        	linking/weakso_nothd                 PASSED     C 0:08.183 - R 0:00.010
23:35:48        	nowarn/printf-sizeof                 PASSED     C 0:01.314 - R 0:00.014
23:35:48        	literals                             PASSED     C 0:06.489 - R 0:00.005
23:35:48        	nowarn/unused                        PASSED     C 0:01.129 - R 0:00.005
23:35:48        	nowarn/zero-thunk                    PASSED     C 0:01.095 - R 0:00.006
23:35:48        	list/dlist2-insert-remove            PASSED     C 0:06.807 - R 0:00.005
23:35:48        	numericConstants                     PASSED     C 0:01.089 - R 0:00.005
23:35:48        	operators                            PASSED     C 0:01.090 - R 0:00.005
23:35:48        	include/includes                     PASSED     C 0:24.383 - R 0:00.007
23:35:48        	meta/fork+exec                       PASSED     C 0:05.407 - R 0:00.018
23:35:48        	poly-bare-assn                       PASSED     C 0:01.128 - R 0:00.006
23:35:48        	polybits                             PASSED     C 0:00.223 - R n/a
23:35:48        	poly-d-cycle                         PASSED     C 0:01.224 - R 0:00.005
23:35:48        	poly-many-arsz                       PASSED     C 0:01.162 - R 0:00.005
23:35:48        	poly-member                          PASSED     C 0:01.136 - R 0:00.005
23:35:48        	poly-selection                       PASSED     C 0:01.102 - R 0:00.006
23:35:48        	poly-o-cycle                         PASSED     C 0:01.164 - R 0:00.006
23:35:48        	poly-self-cycle                      PASSED     C 0:01.245 - R 0:00.006
23:35:48        	raii/ctor-autogen-ERR1               PASSED     C 0:00.681 - R n/a
23:35:48        	quasiKeyword                         PASSED     C 0:01.255 - R 0:00.006
23:35:48        	raii/ctor-autogen                    PASSED     C 0:01.645 - R 0:00.006
23:35:48        	raii/init_once                       PASSED     C 0:01.398 - R 0:00.009
23:35:48        	linking/withthreads                  PASSED     C 0:10.947 - R 0:00.006
23:35:48        	raii/partial-ERR1                    PASSED     C 0:00.674 - R n/a
23:35:48        	malloc                               PASSED     C 0:09.893 - R 0:00.005
23:35:48        	raii/partial                         PASSED     C 0:01.157 - R 0:00.005
23:35:48        	raii/typeof-member                   PASSED     C 0:01.033 - R 0:00.005
23:35:48        	meta/dumpable                        PASSED     C 0:08.688 - R 0:00.005
23:35:48        	result                               PASSED     C 0:01.764 - R 0:00.005
23:35:48        	raii/dtor-early-exit-ERR1            PASSED     C 0:04.797 - R n/a
23:35:48        	raii/memberCtors-ERR1                PASSED     C 0:03.977 - R n/a
23:35:48        	raii/dtor-early-exit-ERR2            PASSED     C 0:04.782 - R n/a
23:35:48        	quotedKeyword                        PASSED     C 0:06.123 - R 0:00.005
23:35:48        	simpleGenericTriple                  PASSED     C 0:01.489 - R 0:00.006
23:35:48        	raii/boxed-types                     PASSED     C 0:06.210 - R 0:00.007
23:35:48        	polymorphism                         PASSED     C 0:06.507 - R 0:00.006
23:35:48        	smart-pointers                       PASSED     C 0:01.502 - R 0:00.005
23:35:48        	raii/globals                         PASSED     C 0:06.266 - R 0:00.007
23:35:48        	minmax                               PASSED     C 0:12.101 - R 0:00.005
23:35:48        	switch                               PASSED     C 0:01.138 - R 0:00.005
23:35:48        	raii/memberCtors                     PASSED     C 0:06.542 - R 0:00.009
23:35:48        	tuple/tupleCast                      PASSED     C 0:01.105 - R 0:00.005
23:35:48        	tuple/tupleFunction                  PASSED     C 0:01.210 - R 0:00.005
23:35:48        	tuple/tupleMember                    PASSED     C 0:01.140 - R 0:00.006
23:35:48        	raii/dtor-early-exit                 PASSED     C 0:08.586 - R 0:00.006
23:35:48        	typedefRedef-ERR1                    PASSED     C 0:00.109 - R n/a
23:35:48        	tuple/tuplePolymorphism              PASSED     C 0:01.522 - R 0:00.005
23:35:48        	references                           PASSED     C 0:06.578 - R 0:00.005
23:35:48        	shortCircuit                         PASSED     C 0:06.158 - R 0:00.005
23:35:48        	var-assert                           PASSED     C 0:00.132 - R n/a
23:35:48        	typedefRedef                         PASSED     C 0:01.070 - R 0:00.009
23:35:48        	typeof                               PASSED     C 0:01.048 - R 0:00.005
23:35:48        	variableDeclarator                   PASSED     C 0:01.078 - R 0:00.005
23:35:48        	sizeof                               PASSED     C 0:06.106 - R 0:00.005
23:35:48        	strstream                            PASSED     C 0:06.659 - R 0:00.005
23:35:48        	searchsort                           PASSED     C 0:09.051 - R 0:00.009
23:35:48        	tuple/tupleVariadic                  PASSED     C 0:04.740 - R 0:00.005
23:35:48        	tuple/tupleAssign                    PASSED     C 0:06.832 - R 0:00.006
23:35:48        	tuplearray                           PASSED     C 0:06.186 - R 0:00.005
23:35:48        	time                                 PASSED     C 0:08.393 - R 0:00.006
23:35:48        	sum                                  PASSED     C 0:08.878 - R 0:00.005
23:35:48        	voidPtr                              PASSED     C 0:01.037 - R 0:00.004
23:35:48        	withconflict                         PASSED     C 0:00.588 - R n/a
23:35:48        	swap                                 PASSED     C 0:09.549 - R 0:00.005
23:35:48        	warnings/self-assignment             PASSED     C 0:01.017 - R 0:00.001
23:35:48        	userLiterals                         PASSED     C 0:07.235 - R 0:00.011
23:35:48        	KRfunctions                          PASSED     C 0:00.952 - R 0:00.001
23:35:48        	vector                               PASSED     C 0:07.562 - R 0:00.005
23:35:48        	...collections/dimexpr-match-c-ERRS  PASSED     C 0:01.017 - R n/a
23:35:48        	vector_math/vec2_double              PASSED     C 0:09.160 - R 0:00.005
23:35:48        	zero_one-ERR1                        PASSED     C 0:03.453 - R n/a
23:35:48        	...llections/dimexpr-match-cfa-ERRS  PASSED     C 0:01.334 - R n/a
23:35:48        	arithmeticConversions                PASSED     C 0:02.849 - R 0:00.005
23:35:48        	attributes                           PASSED     C 0:01.192 - R 0:00.012
23:35:48        	vector_math/vec2_uint                PASSED     C 0:09.113 - R 0:00.007
23:35:48        	zero_one                             PASSED     C 0:06.255 - R 0:00.005
23:35:48        	abs                                  PASSED     C 0:08.549 - R 0:00.005
23:35:48        	declarationSpecifier                 PASSED     C 0:01.075 - R 0:00.001
23:35:48        	errors/completeType                  PASSED     C 0:00.624 - R n/a
23:35:48        	vector_math/vec2_float               PASSED     C 0:17.382 - R 0:00.009
23:35:48        	vector_math/vec3_int                 PASSED     C 0:15.478 - R 0:00.011
23:35:48        	ato                                  PASSED     C 0:09.535 - R 0:00.008
23:35:48        	vector_math/vec2_int                 PASSED     C 0:18.164 - R 0:00.009
23:35:48        	extension                            PASSED     C 0:01.090 - R 0:00.001
23:35:48        	functions                            PASSED     C 0:01.037 - R 0:00.002
23:35:48        	vector_math/vec4_int                 PASSED     C 0:16.759 - R 0:00.020
23:35:48        	gccExtensions                        PASSED     C 0:01.028 - R 0:00.005
23:35:48        	vector_math/vec4_float               PASSED     C 0:18.459 - R 0:00.009
23:35:48        	vector_math/vec3_float               PASSED     C 0:19.224 - R 0:00.025
23:35:48        	concurrency/pthread/bounded_buffer   PASSED     C 0:11.454 - R 0:00.033
23:35:48        	configs/parsenums                    PASSED     C 0:10.100 - R 0:00.068
23:35:48        	meta/arch                            PASSED     C 0:00.579 - R n/a
23:35:48        	PRNG                                 PASSED     C 0:16.491 - R 0:00.421
23:35:48        	bitmanip1                            PASSED     C 0:13.998 - R 0:00.011
23:35:48        	bitmanip2                            PASSED     C 0:14.157 - R 0:00.017
23:35:48        	bitmanip3                            PASSED     C 0:13.505 - R 0:00.017
23:35:48        	rational                             PASSED     C 0:31.900 - R 0:00.009
23:35:48        	exceptions/cardgame                  PASSED     C 0:10.308 - R 0:00.009
23:35:48        	exceptions/hotpotato_checked         PASSED     C 0:10.618 - R 0:00.009
23:35:48        	exceptions/hotpotato                 PASSED     C 0:10.596 - R 0:00.009
23:35:48        	io/manipulatorsInput                 PASSED     C 0:09.395 - R 0:00.009
23:35:48        	random                               PASSED     C 0:09.136 - R 0:00.005
23:35:48        	vector_math/vec2_ldouble             PASSED     C 0:08.942 - R 0:00.005
23:35:48        	nested_function                      PASSED     C 0:10.755 - R 0:00.019
23:35:48        	io/manipulatorsOutput2               PASSED     C 0:12.368 - R 0:00.005
23:35:48        	math                                 PASSED     C 0:12.444 - R 0:00.010
23:35:48        	mathX                                PASSED     C 0:13.010 - R 0:00.018
23:35:48        	io/manipulatorsOutput1               PASSED     C 0:19.211 - R 0:00.011
23:35:48        	concurrency/barrier/last             TIMEOUT    C 0:13.529 - R10:00.250
23:35:48 Cforall Runtime error (UNIX pid:1401393): Application interrupted by signal: Aborted.
23:35:48 Stack back trace for: /var/lib/jenkins/workspace/Cforall_master_2@tmp/libcfa/x86-nodebug/src/.libs/libcfa.so.1
23:35:48 (0) linux-gate.so.1 : __kernel_vsyscall + 0x9  [0xf7fc7579]
23:35:48 (1) /lib32/libc.so.6 :  + 0x874be  [0xf7b9b4be]
23:35:48 (2) /lib32/libc.so.6 : pthread_mutex_lock + 0x179  [0xf7ba2419]
23:35:48 (3) /lib/ld-linux.so.2 : _dl_allocate_tls_init + 0x46  [0xf7fda0a6]
23:35:48 (4) /lib/ld-linux.so.2 : _dl_allocate_tls + 0x1b  [0xf7fda34b]
23:35:48 (5) /lib32/libc.so.6 : pthread_create + 0x6fb  [0xf7b9f78b]
23:35:48 (6) /var/lib/jenkins/workspace/Cforall_master_2@tmp/libcfa/x86-nodebug/src/.libs/libcfathread.so.1 :  + 0x27a0c  [0xf7f99a0c]
23:35:48 (7) /var/lib/jenkins/workspace/Cforall_master_2@tmp/libcfa/x86-nodebug/src/.libs/libcfathread.so.1 : _X12_constructorFv_S9processorPKcS7clusterPS7thread$__1 + 0x10d  [0xf7f99b5d]
23:35:48 (8) /var/lib/jenkins/workspace/Cforall_master_2@tmp/libcfa/x86-nodebug/src/.libs/libcfathread.so.1 : _X12_constructorFv_S9processorPKcS7cluster__1 + 0x22  [0xf7f99b92]
23:35:48 (9) /var/lib/jenkins/workspace/Cforall_master_2@tmp/tests/concurrency/barrier/last : _X4mainFi___1 + 0x99  [0x56557a39]
23:35:48 
23:35:48 warning: Can't open file anon_inode:[io_uring] which was expanded to anon_inode:[io_uring] during file-backed mapping note processing
23:35:48 [New LWP 1401393]
23:35:48 [New LWP 1401394]
23:35:48 [New LWP 1401396]
23:35:48 [New LWP 1401395]
23:35:48 [New LWP 1401398]
23:35:48 [New LWP 1401399]
23:35:48 [New LWP 1401397]
23:35:48 [Thread debugging using libthread_db enabled]
23:35:48 Using host libthread_db library "/lib/x86_64-linux-gnu/libthread_db.so.1".
23:35:48 Core was generated by `/var/lib/jenkins/workspace/Cforall_master_2@tmp/tests/concurrency/barrier/last'.
23:35:48 Program terminated with signal SIGABRT, Aborted.
23:35:48 #0  0xf7fc7579 in __kernel_vsyscall ()
23:35:48 [Current thread is 1 (Thread 0xf7b12a00 (LWP 1401393))]
23:35:48 -----
23:35:48 #0  0xf7fc7579 in __kernel_vsyscall ()
23:35:48 #1  0xf7ba0e57 in ?? () from /lib32/libc.so.6
23:35:48 #2  0xf7b4fc41 in raise () from /lib32/libc.so.6
23:35:48 #3  0xf7b372b7 in abort () from /lib32/libc.so.6
23:35:48 #4  0xf7f0bf10 in _X7__abortFv_bPKcY17__builtin_va_list__1 (_X11signalAbortb_1=<optimized out>, _X3fmtPKc_1=<optimized out>, _X4argsY17__builtin_va_list_1=<optimized out>) at /var/lib/jenkins/workspace/Cforall_master_2/libcfa/src/interpose.cfa:286
23:35:48 #5  0xf7f0c2a6 in _X5abortFv_bPKc__1 (_X11signalAbortb_1=true, _X3fmtPKc_1=0xf7f279d4 "Application interrupted by signal: %s.\n") at /var/lib/jenkins/workspace/Cforall_master_2/libcfa/src/interpose.cfa:301
23:35:48 #6  0xf7f0c2da in _X15sigHandler_termFv_iPS21__anonymous_siginfo_tPS10ucontext_t__1 (_X3sigi_1=6, _X3sfpPS21__anonymous_siginfo_t_1=0xf7f70c0c <stack+64316>, _X3cxtPS10ucontext_t_1=0xf7f70c8c <stack+64444>) at /var/lib/jenkins/workspace/Cforall_master_2/libcfa/src/interpose.cfa:337
23:35:48 #7  <signal handler called>
23:35:48 #8  0xf7fc7579 in __kernel_vsyscall ()
23:35:48 #9  0xf7b9b4be in ?? () from /lib32/libc.so.6
23:35:48 #10 0xf7ba2419 in pthread_mutex_lock () from /lib32/libc.so.6
23:35:48 #11 0xf7fda0a6 in _dl_allocate_tls_init () from /lib/ld-linux.so.2
23:35:48 #12 0xf7fda34b in _dl_allocate_tls () from /lib/ld-linux.so.2
23:35:48 #13 0xf7b9f78b in pthread_create () from /lib32/libc.so.6
23:35:48 #14 0xf7f99a0c in _X16__create_pthreadFPv_PmFPv_Pv_Pv__1 (_X7pthreadPm_1=0xffffd210, _X5startFPv_Pv__1=0xf7f98f30 <_X18__invoke_processorFPv_Pv__1>, _X3argPv_1=0xffffd1c0) at /var/lib/jenkins/workspace/Cforall_master_2/libcfa/src/concurrency/kernel/startup.cfa:810
23:35:48 #15 0xf7f99b5d in _X12_constructorFv_S9processorPKcS7clusterPS7thread$__1 (_X4thisS9processor_1=0xffffd1c0, _X4namePKc_1=0x5655909e "Anonymous Processor", _X5_cltrS7cluster_1=0xf7fbc900 <_X19storage_mainClusterA0c_1>, _X5initTPS7thread$_1=0x0) at /var/lib/jenkins/workspace/Cforall_master_2/libcfa/src/concurrency/kernel/startup.cfa:589
23:35:48 #16 0xf7f99b92 in _X12_constructorFv_S9processorPKcS7cluster__1 (_X4thisS9processor_1=0xffffd1c0, _X4namePKc_1=0x5655909e "Anonymous Processor", _X5_cltrS7cluster_1=0xf7fbc900 <_X19storage_mainClusterA0c_1>) at /var/lib/jenkins/workspace/Cforall_master_2/libcfa/src/concurrency/kernel/startup.cfa:593
23:35:48 #17 0x56557a39 in _X12_constructorFv_S9processor__1 (_X4thisS9processor_1=0xffffd1c0) at /var/lib/jenkins/workspace/Cforall_master_2/libcfa/src/concurrency/kernel.hfa:164
23:35:48 #18 _X4mainFi___1 () at concurrency/barrier/last.cfa:72
23:35:48 #19 0x565573b2 in invoke_main (envp=0xffffd3ec, argv=0xffffd3e4, argc=1) at concurrency/barrier/last.cfa:32
23:35:48 #20 main (_X4argci_1=1, _X4argvPPc_1=0xffffd3e4, _X4envpPPc_1=0xffffd3ec) at concurrency/barrier/last.cfa:53
23:35:48 -----
23:35:48   Id   Target Id                       Frame 
23:35:48 * 1    Thread 0xf7b12a00 (LWP 1401393) 0xf7fc7579 in __kernel_vsyscall ()
23:35:48   2    Thread 0x565a7ec0 (LWP 1401394) 0xf7fc7579 in __kernel_vsyscall ()
23:35:48   3    Thread 0x5669a340 (LWP 1401396) 0xf7fc7579 in __kernel_vsyscall ()
23:35:48   4    Thread 0x56627f80 (LWP 1401395) 0xf7fc7579 in __kernel_vsyscall ()
23:35:48   5    Thread 0x5671a4c0 (LWP 1401398) 0xf7fc7579 in __kernel_vsyscall ()
23:35:48   6    Thread 0x5679a340 (LWP 1401399) 0xf7fc7579 in __kernel_vsyscall ()
23:35:48   7    Thread 0x566da400 (LWP 1401397) 0xf7fc7579 in __kernel_vsyscall ()
23:35:48 
23:35:48 Archiving concurrency/barrier/last (executable and core) to crashes/full-nodebug/concurrency/barrier/last
23:35:48 374 passes, 0 failures, 1 timeouts, 0 cancelled, 0 other
23:35:48 Tests took 10:39.095
23:35:48 make: *** [Makefile:986: all-local] Error 1
23:35:48 [Pipeline] }
23:35:48 [Pipeline] // dir
23:35:48 [Pipeline] }
23:35:48 [Pipeline] // stage
23:35:48 [Pipeline] echo
23:35:48 Archiving core dumps
23:35:48 [Pipeline] dir
23:35:48 Running in /var/lib/jenkins/workspace/Cforall_master_2@tmp
23:35:48 [Pipeline] {
23:35:48 [Pipeline] fileExists
23:35:48 [Pipeline] sh
23:35:48 + /var/lib/jenkins/workspace/Cforall_master_2/tools/jenkins/archive-gen.sh
23:35:48 [Pipeline] archiveArtifacts
23:35:48 Archiving artifacts
23:35:48 Recording fingerprints
23:35:48 [Pipeline] }
23:35:48 [Pipeline] // dir
23:35:48 [Pipeline] }
23:35:48 [Pipeline] // wrap
23:35:48 [Pipeline] }
23:35:48 [Pipeline] // node
23:35:48 [Pipeline] echo
23:35:48 hudson.AbortException: script returned exit code 2
23:35:48 [Pipeline] node
23:35:48 Running on Algol in /var/lib/jenkins/workspace/Cforall_master
23:35:48 [Pipeline] {
23:35:48 [Pipeline] echo
23:35:48 Notifying users of result
23:35:48 [Pipeline] echo
23:35:48 Reusing previously constructed message
23:35:48 [Pipeline] echo
23:35:48 Would send email to: cforall@lists.uwaterloo.ca
23:35:48 [Pipeline] echo
23:35:48 With title: [cforall git][BUILD# 3760 - FAILURE] - branch master
23:35:48 [Pipeline] echo
23:35:48 Content: 
23:35:48 <p>This is an automated email from the Jenkins build machine. It was
23:35:48 generated because of a git hooks/post-receive script following
23:35:48 a ref change which was pushed to the Cāˆ€ repository.</p>
23:35:48 
23:35:48 <p>- Status --------------------------------------------------------------</p>
23:35:48 
23:35:48 <p>BUILD# 3760 - FAILURE</p>
23:35:48 <p>Check console output at https://cforall.uwaterloo.ca/jenkins/job/Cforall/job/master/3760/ to view the results.</p>
23:35:48 
23:35:48 <p>- Changes -------------------------------------------------------------</p>
23:35:48 
23:35:48 <pre>
23:35:48 The branch master has been updated.
23:35:48       from  e98b4ec769cbe797fd14db5f82f2fef821a3e1f0 (commit)
23:35:48 </pre>
23:35:48 
23:35:48 <p>- Log -----------------------------------------------------------------</p>
23:35:48 
23:35:48 <pre>
23:35:48 
23:35:48 </pre>
23:35:48 
23:35:48 <p>-----------------------------------------------------------------------</p>
23:35:48 <pre>
23:35:48 Summary of changes:
23:35:48 
23:35:48 </pre>
23:35:48 
23:35:48 [Pipeline] }
23:35:48 [Pipeline] // node
23:35:48 [Pipeline] echo
23:35:48 Build Completed
23:35:48 [Pipeline] End of Pipeline
23:35:48 ERROR: script returned exit code 2
23:35:48 Finished: FAILURE