Started by timer Running as Jenkins Build User Obtained Jenkins/FullBuild from git cforall@plg.uwaterloo.ca:software/cfa/cfa-cc [Pipeline] Start of Pipeline [Pipeline] node Running on Brokk 3 in /var/lib/jenkins/workspace/Cforall_Full_Build [Pipeline] { [Pipeline] checkout The recommended git tool is: NONE using credential git_key_aug2025 Fetching changes from the remote Git repository Checking out Revision e98b4ec769cbe797fd14db5f82f2fef821a3e1f0 (refs/remotes/origin/master) > git rev-parse --resolve-git-dir /var/lib/jenkins/workspace/Cforall_Full_Build/.git # timeout=10 > git config remote.origin.url cforall@plg.uwaterloo.ca:software/cfa/cfa-cc # timeout=10 Fetching upstream changes from cforall@plg.uwaterloo.ca:software/cfa/cfa-cc > git --version # timeout=10 > git --version # 'git version 2.43.0' using GIT_SSH to set credentials Git key use to connect to the cforall git repo (August 2025) Verifying host key using known hosts file > git fetch --tags --force --progress -- cforall@plg.uwaterloo.ca:software/cfa/cfa-cc +refs/heads/*:refs/remotes/origin/* # timeout=10 > git rev-parse refs/remotes/origin/master^{commit} # timeout=10 > git config core.sparsecheckout # timeout=10 > git checkout -f e98b4ec769cbe797fd14db5f82f2fef821a3e1f0 # timeout=10 Commit message: "alvin thesis scratch ideas" > git rev-list --no-walk d02a308a0ad31eef41dc7f5220a818ad6794538b # timeout=10 [Pipeline] wrap [Pipeline] { [Pipeline] stage [Pipeline] { (Build) [Pipeline] parallel [Pipeline] { (Branch: gcc_10_x86_new) [Pipeline] { (Branch: gcc_11_x86_new) [Pipeline] { (Branch: gcc_12_x86_new) [Pipeline] { (Branch: gcc_9_x64_new) [Pipeline] { (Branch: gcc_10_x64_new) [Pipeline] { (Branch: gcc_11_x64_new) [Pipeline] { (Branch: gcc_12_x64_new) [Pipeline] { (Branch: gcc_10_arm64_new) [Pipeline] { (Branch: gcc_11_arm64_new) [Pipeline] { (Branch: gcc_12_arm64_new) [Pipeline] { (Branch: clang_x64_new) [Pipeline] sleep Sleeping for 2 min 0 sec [Pipeline] sleep Sleeping for 3 min 0 sec [Pipeline] sleep Sleeping for 2 min 0 sec [Pipeline] sleep No need to sleep any longer [Pipeline] sleep Sleeping for 4 min 0 sec [Pipeline] sleep Sleeping for 2 min 0 sec [Pipeline] sleep Sleeping for 4 min 0 sec [Pipeline] sleep Sleeping for 4 min 0 sec [Pipeline] sleep Sleeping for 4 min 0 sec [Pipeline] sleep Sleeping for 4 min 0 sec [Pipeline] sleep Sleeping for 1 min 0 sec [Pipeline] build Scheduling project: Cforall » master Starting building: Cforall » master #3755 [Pipeline] build Scheduling project: Cforall » master Starting building: Cforall » master #3756 [Pipeline] build Scheduling project: Cforall » master [Pipeline] build Scheduling project: Cforall » master [Pipeline] build Scheduling project: Cforall » master Starting building: Cforall » master #3758 Starting building: Cforall » master #3757 Starting building: Cforall » master #3759 [Pipeline] build Scheduling project: Cforall » master Starting building: Cforall » master #3760 [Pipeline] build Scheduling project: Cforall » master [Pipeline] build Scheduling project: Cforall » master [Pipeline] build Scheduling project: Cforall » master [Pipeline] build Scheduling project: Cforall » master [Pipeline] build Scheduling project: Cforall » master Starting building: Cforall » master #3761 Starting building: Cforall » master #3765 Starting building: Cforall » master #3763 Starting building: Cforall » master #3764 Starting building: Cforall » master #3762 Build Cforall » master #3763 completed: SUCCESS [Pipeline] echo SUCCESS [Pipeline] } Build Cforall » master #3755 completed: SUCCESS [Pipeline] echo SUCCESS [Pipeline] } Build Cforall » master #3756 completed: SUCCESS [Pipeline] echo SUCCESS [Pipeline] } Build Cforall » master #3759 completed: SUCCESS [Pipeline] echo SUCCESS [Pipeline] } Build Cforall » master #3757 completed: SUCCESS [Pipeline] echo SUCCESS [Pipeline] } Build Cforall » master #3762 completed: SUCCESS [Pipeline] echo SUCCESS [Pipeline] } Build Cforall » master #3761 completed: SUCCESS [Pipeline] echo SUCCESS [Pipeline] } Build Cforall » master #3764 completed: SUCCESS [Pipeline] echo SUCCESS [Pipeline] } Build Cforall » master #3765 completed: SUCCESS [Pipeline] echo SUCCESS [Pipeline] } Build Cforall » master #3758 completed: SUCCESS [Pipeline] echo SUCCESS [Pipeline] } Build Cforall » master #3760 completed: FAILURE [Pipeline] echo FAILURE [Pipeline] sh + wget -q -O - https://cforall.uwaterloo.ca/jenkins/job/Cforall/job/master/3760/consoleText Started by upstream project "Cforall_Full_Build" build number 422 originally caused by: Started by timer Running as Jenkins Build User > git rev-parse --resolve-git-dir /var/lib/jenkins/caches/git-914b6fdde163b7e17ee75d99ca23f18a/.git # timeout=10 Setting origin to cforall@plg.uwaterloo.ca:software/cfa/cfa-cc > git config remote.origin.url cforall@plg.uwaterloo.ca:software/cfa/cfa-cc # timeout=10 Fetching origin... Fetching upstream changes from origin > git --version # timeout=10 > git --version # 'git version 2.43.0' > git config --get remote.origin.url # timeout=10 using GIT_SSH to set credentials Git key use to connect to the cforall git repo (August 2025) Verifying host key using known hosts file > git fetch --no-tags --force --progress -- origin +refs/heads/*:refs/remotes/origin/* # timeout=10 Seen branch in repository origin/ADT Seen branch in repository origin/aaron-thesis Seen branch in repository origin/arm-eh Seen branch in repository origin/ast-experimental Seen branch in repository origin/cleanup-dtors Seen branch in repository origin/ctor Seen branch in repository origin/deferred_resn Seen branch in repository origin/demangler Seen branch in repository origin/enum Seen branch in repository origin/forall-pointer-decay Seen branch in repository origin/gc_noraii Seen branch in repository origin/jacob/cs343-translation Seen branch in repository origin/jenkins-sandbox Seen branch in repository origin/master Seen branch in repository origin/memory Seen branch in repository origin/new-ast Seen branch in repository origin/new-ast-unique-expr Seen branch in repository origin/new-env Seen branch in repository origin/no_list Seen branch in repository origin/persistent-indexer Seen branch in repository origin/pthread-emulation Seen branch in repository origin/qualifiedEnum Seen branch in repository origin/resolv-new Seen branch in repository origin/string Seen branch in repository origin/stuck-waitfor-destruct Seen branch in repository origin/with_gc Seen 26 remote branches Obtained Jenkinsfile from e98b4ec769cbe797fd14db5f82f2fef821a3e1f0 [Pipeline] Start of Pipeline [Pipeline] node Running on Algol in /var/lib/jenkins/workspace/Cforall_master [Pipeline] { [Pipeline] wrap [Pipeline] { [Pipeline] properties WARNING: Unknown parameter(s) found for class type 'hudson.model.ChoiceParameterDefinition': defaultValue WARNING: Unknown parameter(s) found for class type 'hudson.model.ChoiceParameterDefinition': defaultValue [Pipeline] checkout The recommended git tool is: NONE using credential git_key_aug2025 Fetching changes from the remote Git repository Cleaning workspace Fetching without tags Checking out Revision e98b4ec769cbe797fd14db5f82f2fef821a3e1f0 (master) Commit message: "alvin thesis scratch ideas" [Pipeline] load [Pipeline] { (Jenkins/tools.groovy) [Pipeline] } [Pipeline] // load [Pipeline] echo Compiler : gcc-11 (g++-11/gcc-11) Architecture : x86 Arc Flags : --host=i386 Run All Tests : true Run Benchmark : true Build Documentation : false Publish : true Silent : true [Pipeline] } [Pipeline] // wrap [Pipeline] } [Pipeline] // node [Pipeline] node > git rev-parse --resolve-git-dir /var/lib/jenkins/workspace/Cforall_master/.git # timeout=10 > git config remote.origin.url cforall@plg.uwaterloo.ca:software/cfa/cfa-cc # timeout=10 > git rev-parse --verify HEAD # timeout=10 Resetting working tree > git reset --hard # timeout=10 > git clean -fdx # timeout=10 Fetching upstream changes from cforall@plg.uwaterloo.ca:software/cfa/cfa-cc > git --version # timeout=10 > git --version # 'git version 2.43.0' using GIT_SSH to set credentials Git key use to connect to the cforall git repo (August 2025) Verifying host key using known hosts file > git fetch --no-tags --force --progress -- cforall@plg.uwaterloo.ca:software/cfa/cfa-cc +refs/heads/*:refs/remotes/origin/* # timeout=10 > git config core.sparsecheckout # timeout=10 > git checkout -f e98b4ec769cbe797fd14db5f82f2fef821a3e1f0 # timeout=10 > git rev-list --no-walk e98b4ec769cbe797fd14db5f82f2fef821a3e1f0 # timeout=10 Still waiting to schedule task ‘Ada’ is offline ‘Algol’ doesn’t have label ‘x86’ ‘Brokk 1’ doesn’t have label ‘x86’ ‘Brokk 4’ doesn’t have label ‘x86’ ‘Brokk 6’ doesn’t have label ‘x86’ ‘Cobol’ is offline ‘Python’ is offline ‘Ruby’ is offline Running on Brokk 0 in /var/lib/jenkins/workspace/Cforall_master_2 [Pipeline] { [Pipeline] wrap [Pipeline] { [Pipeline] pwd [Pipeline] pwd [Pipeline] echo -------- Cleanup -------- [Pipeline] stage [Pipeline] { (Cleanup) [Pipeline] dir Running in /var/lib/jenkins/workspace/Cforall_master_2@tmp [Pipeline] { [Pipeline] deleteDir [Pipeline] } [Pipeline] // dir [Pipeline] } [Pipeline] // stage [Pipeline] echo -------- Checkout -------- [Pipeline] stage [Pipeline] { (Checkout) [Pipeline] checkout The recommended git tool is: NONE using credential git_key_aug2025 Fetching changes from the remote Git repository Cleaning workspace Fetching without tags > git rev-parse --resolve-git-dir /var/lib/jenkins/workspace/Cforall_master_2/.git # timeout=10 > git config remote.origin.url cforall@plg.uwaterloo.ca:software/cfa/cfa-cc # timeout=10 > git rev-parse --verify HEAD # timeout=10 Resetting working tree > git reset --hard # timeout=10 > git clean -fdx # timeout=10 Fetching upstream changes from cforall@plg.uwaterloo.ca:software/cfa/cfa-cc > git --version # timeout=10 > git --version # 'git version 2.43.0' using GIT_SSH to set credentials Git key use to connect to the cforall git repo (August 2025) Verifying host key using known hosts file > git fetch --no-tags --force --progress -- cforall@plg.uwaterloo.ca:software/cfa/cfa-cc +refs/heads/*:refs/remotes/origin/* # timeout=10 Checking out Revision e98b4ec769cbe797fd14db5f82f2fef821a3e1f0 (master) Commit message: "alvin thesis scratch ideas" [Pipeline] echo Constructing new git message [Pipeline] sh + git rev-list e98b4ec769cbe797fd14db5f82f2fef821a3e1f0..e98b4ec769cbe797fd14db5f82f2fef821a3e1f0 [Pipeline] sh > git config core.sparsecheckout # timeout=10 > git checkout -f e98b4ec769cbe797fd14db5f82f2fef821a3e1f0 # timeout=10 + git cat-file -t e98b4ec769cbe797fd14db5f82f2fef821a3e1f0 [Pipeline] sh + git rev-list --format=short e98b4ec769cbe797fd14db5f82f2fef821a3e1f0...e98b4ec769cbe797fd14db5f82f2fef821a3e1f0 [Pipeline] sh + git diff --stat --color e98b4ec769cbe797fd14db5f82f2fef821a3e1f0 e98b4ec769cbe797fd14db5f82f2fef821a3e1f0 [Pipeline] echo

- Changes -------------------------------------------------------------

The branch master has been updated.
      from  e98b4ec769cbe797fd14db5f82f2fef821a3e1f0 (commit)

- Log -----------------------------------------------------------------


-----------------------------------------------------------------------

Summary of changes:

[Pipeline] } [Pipeline] // stage [Pipeline] echo -------- Build : configure -------- [Pipeline] stage [Pipeline] { (Build : configure) [Pipeline] dir Running in /var/lib/jenkins/workspace/Cforall_master_2 [Pipeline] { [Pipeline] sh + ./autogen.sh Running aclocal in root Running libtoolize in root libtoolize: putting auxiliary files in AC_CONFIG_AUX_DIR, 'automake'. libtoolize: linking file 'automake/ltmain.sh' libtoolize: putting macros in AC_CONFIG_MACRO_DIRS, 'automake'. libtoolize: linking file 'automake/libtool.m4' libtoolize: linking file 'automake/ltoptions.m4' libtoolize: linking file 'automake/ltsugar.m4' libtoolize: linking file 'automake/ltversion.m4' libtoolize: linking file 'automake/lt~obsolete.m4' Running autoconf in root Running automake in root configure.ac:223: installing 'automake/compile' configure.ac:138: installing 'automake/config.guess' configure.ac:138: installing 'automake/config.sub' configure.ac:17: installing 'automake/install-sh' benchmark/Makefile.am: installing 'automake/depcomp' parallel-tests: installing 'automake/test-driver' configure.ac: installing 'automake/ylwrap' Running aclocal in libcfa Running libtoolize in libcfa libtoolize: putting auxiliary files in AC_CONFIG_AUX_DIR, 'automake'. libtoolize: linking file 'automake/ltmain.sh' libtoolize: putting macros in AC_CONFIG_MACRO_DIRS, 'automake'. libtoolize: linking file 'automake/libtool.m4' libtoolize: linking file 'automake/ltoptions.m4' libtoolize: linking file 'automake/ltsugar.m4' libtoolize: linking file 'automake/ltversion.m4' libtoolize: linking file 'automake/lt~obsolete.m4' Running autoconf in libcfa Running automake in libcfa configure.ac:119: installing 'automake/compile' configure.ac:119: installing 'automake/config.guess' configure.ac:119: installing 'automake/config.sub' configure.ac:12: installing 'automake/install-sh' src/Makefile.am: installing 'automake/depcomp' [Pipeline] } [Pipeline] // dir [Pipeline] dir Running in /var/lib/jenkins/workspace/Cforall_master_2@tmp [Pipeline] { [Pipeline] sh + /var/lib/jenkins/workspace/Cforall_master_2/configure CXX=g++-11 CC=gcc-11 --host=i386 AR=gcc-ar RANLIB=gcc-ranlib --with-target-hosts=host:debug,host:nodebug --quiet --prefix=/var/lib/jenkins/workspace/Cforall_master_2@tmp [Pipeline] sh + nproc + make -j 16 --no-print-directory configure-libcfa libcfa/x86-debug/config.data Configuring libcfa (/var/lib/jenkins/workspace/Cforall_master_2/libcfa/configure) with ''CXX=g++-11' 'CC=gcc-11' 'AR=gcc-ar' 'RANLIB=gcc-ranlib' '--prefix=/var/lib/jenkins/workspace/Cforall_master_2@tmp' DRIVER_DIR=/var/lib/jenkins/workspace/Cforall_master_2@tmp/driver/ ARCHITECTURE=x86 CONFIGURATION=debug CFA_VERSION=1:0:0' from /var/lib/jenkins/workspace/Cforall_master_2@tmp / libcfa/x86-debug/ libcfa/x86-nodebug/config.data Configuring libcfa (/var/lib/jenkins/workspace/Cforall_master_2/libcfa/configure) with ''CXX=g++-11' 'CC=gcc-11' 'AR=gcc-ar' 'RANLIB=gcc-ranlib' '--prefix=/var/lib/jenkins/workspace/Cforall_master_2@tmp' DRIVER_DIR=/var/lib/jenkins/workspace/Cforall_master_2@tmp/driver/ ARCHITECTURE=x86 CONFIGURATION=nodebug CFA_VERSION=1:0:0' from /var/lib/jenkins/workspace/Cforall_master_2@tmp / libcfa/x86-nodebug/ checking whether make supports nested variables... checking whether make supports nested variables... yes checking for a BSD-compatible install... yes checking for a BSD-compatible install... /usr/bin/install -c checking whether build environment is sane... /usr/bin/install -c checking whether build environment is sane... yes yes checking for a race-free mkdir -p... checking for a race-free mkdir -p... /usr/bin/mkdir -p checking for gawk... gawk checking whether make sets $(MAKE)... /usr/bin/mkdir -p checking for gawk... gawk checking whether make sets $(MAKE)... yes yes checking for distributated build... no checking for distributated build... no checking build system type... checking build system type... x86_64-pc-linux-gnu checking host system type... x86_64-pc-linux-gnu checking how to print strings... x86_64-pc-linux-gnu checking host system type... x86_64-pc-linux-gnu checking how to print strings... printf checking whether make supports the include directive... printf checking whether make supports the include directive... yes (GNU style) checking for gcc... gcc-11 yes (GNU style) checking for gcc... gcc-11 checking whether the C compiler works... checking whether the C compiler works... yes checking for C compiler default output file name... a.out checking for suffix of executables... yes checking for C compiler default output file name... a.out checking for suffix of executables... checking whether we are cross compiling... checking whether we are cross compiling... no checking for suffix of object files... no checking for suffix of object files... o checking whether the compiler supports GNU C... o checking whether the compiler supports GNU C... yes checking whether gcc-11 accepts -g... yes checking whether gcc-11 accepts -g... yes checking for gcc-11 option to enable C11 features... yes checking for gcc-11 option to enable C11 features... none needed checking whether gcc-11 understands -c and -o together... none needed checking whether gcc-11 understands -c and -o together... yes checking dependency style of gcc-11... yes checking dependency style of gcc-11... gcc3 checking for a sed that does not truncate output... /usr/bin/sed checking for grep that handles long lines and -e... /usr/bin/grep checking for egrep... gcc3 checking for a sed that does not truncate output... /usr/bin/grep -E checking for fgrep... /usr/bin/grep -F checking for ld used by gcc-11... /usr/bin/sed checking for grep that handles long lines and -e... /usr/bin/grep checking for egrep... /usr/bin/ld checking if the linker (/usr/bin/ld) is GNU ld... /usr/bin/grep -E checking for fgrep... yes checking for BSD- or MS-compatible name lister (nm)... /usr/bin/grep -F checking for ld used by gcc-11... /usr/bin/nm -B checking the name lister (/usr/bin/nm -B) interface... /usr/bin/ld checking if the linker (/usr/bin/ld) is GNU ld... yes checking for BSD- or MS-compatible name lister (nm)... /usr/bin/nm -B checking the name lister (/usr/bin/nm -B) interface... BSD nm checking whether ln -s works... yes checking the maximum length of command line arguments... 1572864 BSD nm checking whether ln -s works... yes checking the maximum length of command line arguments... checking how to convert x86_64-pc-linux-gnu file names to x86_64-pc-linux-gnu format... func_convert_file_noop checking how to convert x86_64-pc-linux-gnu file names to toolchain format... func_convert_file_noop checking for /usr/bin/ld option to reload object files... -r checking for file... file checking for objdump... objdump checking how to recognize dependent libraries... pass_all checking for dlltool... no checking how to associate runtime and link libraries... printf %s\n checking for archiver @FILE support... 1572864 checking how to convert x86_64-pc-linux-gnu file names to x86_64-pc-linux-gnu format... func_convert_file_noop checking how to convert x86_64-pc-linux-gnu file names to toolchain format... func_convert_file_noop checking for /usr/bin/ld option to reload object files... -r checking for file... file checking for objdump... objdump checking how to recognize dependent libraries... pass_all checking for dlltool... no checking how to associate runtime and link libraries... printf %s\n checking for archiver @FILE support... @ checking for strip... strip checking for ranlib... gcc-ranlib checking command to parse /usr/bin/nm -B output from gcc-11 object... @ checking for strip... strip checking for ranlib... gcc-ranlib checking command to parse /usr/bin/nm -B output from gcc-11 object... ok checking for sysroot... no checking for a working dd... /usr/bin/dd checking how to truncate binary pipes... /usr/bin/dd bs=4096 count=1 ok checking for sysroot... no checking for a working dd... /usr/bin/dd checking how to truncate binary pipes... checking for mt... mt checking if mt is a manifest tool... /usr/bin/dd bs=4096 count=1 no checking for stdio.h... checking for mt... mt checking if mt is a manifest tool... no checking for stdio.h... yes checking for stdlib.h... yes checking for stdlib.h... yes checking for string.h... yes checking for string.h... yes checking for inttypes.h... yes checking for inttypes.h... yes checking for stdint.h... yes checking for stdint.h... yes checking for strings.h... yes checking for strings.h... yes checking for sys/stat.h... yes checking for sys/stat.h... yes checking for sys/types.h... yes checking for sys/types.h... yes checking for unistd.h... yes checking for unistd.h... yes checking for dlfcn.h... yes checking for dlfcn.h... yes checking for objdir... .libs yes checking for objdir... .libs checking if gcc-11 supports -fno-rtti -fno-exceptions... checking if gcc-11 supports -fno-rtti -fno-exceptions... no checking for gcc-11 option to produce PIC... -fPIC -DPIC checking if gcc-11 PIC flag -fPIC -DPIC works... no checking for gcc-11 option to produce PIC... -fPIC -DPIC checking if gcc-11 PIC flag -fPIC -DPIC works... yes checking if gcc-11 static flag -static works... yes checking if gcc-11 static flag -static works... yes checking if gcc-11 supports -c -o file.o... yes checking if gcc-11 supports -c -o file.o... yes checking if gcc-11 supports -c -o file.o... (cached) yes checking whether the gcc-11 linker (/usr/bin/ld -m elf_x86_64) supports shared libraries... yes checking if gcc-11 supports -c -o file.o... (cached) yes checking whether the gcc-11 linker (/usr/bin/ld -m elf_x86_64) supports shared libraries... yes checking whether -lc should be explicitly linked in... yes checking whether -lc should be explicitly linked in... no checking dynamic linker characteristics... no checking dynamic linker characteristics... GNU/Linux ld.so checking how to hardcode library paths into programs... immediate checking whether stripping libraries is possible... yes checking if libtool supports shared libraries... yes checking whether to build shared libraries... yes checking whether to build static libraries... no GNU/Linux ld.so checking how to hardcode library paths into programs... immediate checking whether stripping libraries is possible... yes checking if libtool supports shared libraries... yes checking whether to build shared libraries... yes checking whether to build static libraries... no checking whether the compiler supports GNU C++... checking whether the compiler supports GNU C++... yes checking whether g++-11 accepts -g... yes checking whether g++-11 accepts -g... yes checking for g++-11 option to enable C++11 features... yes checking for g++-11 option to enable C++11 features... none needed checking dependency style of g++-11... none needed checking dependency style of g++-11... gcc3 checking how to run the C++ preprocessor... gcc3 checking how to run the C++ preprocessor... g++-11 -E g++-11 -E checking for ld used by g++-11... /usr/bin/ld -m elf_x86_64 checking if the linker (/usr/bin/ld -m elf_x86_64) is GNU ld... yes checking whether the g++-11 linker (/usr/bin/ld -m elf_x86_64) supports shared libraries... checking for ld used by g++-11... yes /usr/bin/ld -m elf_x86_64 checking if the linker (/usr/bin/ld -m elf_x86_64) is GNU ld... yes checking whether the g++-11 linker (/usr/bin/ld -m elf_x86_64) supports shared libraries... yes checking for g++-11 option to produce PIC... -fPIC -DPIC checking if g++-11 PIC flag -fPIC -DPIC works... checking for g++-11 option to produce PIC... -fPIC -DPIC checking if g++-11 PIC flag -fPIC -DPIC works... yes checking if g++-11 static flag -static works... yes checking if g++-11 static flag -static works... yes checking if g++-11 supports -c -o file.o... yes checking if g++-11 supports -c -o file.o... yes checking if g++-11 supports -c -o file.o... (cached) yes checking whether the g++-11 linker (/usr/bin/ld -m elf_x86_64) supports shared libraries... yes checking dynamic linker characteristics... (cached) GNU/Linux ld.so checking how to hardcode library paths into programs... immediate checking for gcc... (cached) gcc-11 yes checking if g++-11 supports -c -o file.o... (cached) yes checking whether the g++-11 linker (/usr/bin/ld -m elf_x86_64) supports shared libraries... yes checking dynamic linker characteristics... (cached) GNU/Linux ld.so checking how to hardcode library paths into programs... immediate checking for gcc... (cached) gcc-11 checking whether the compiler supports GNU C... (cached) yes checking whether gcc-11 accepts -g... (cached) yes checking for gcc-11 option to enable C11 features... (cached) none needed checking whether gcc-11 understands -c and -o together... (cached) yes checking dependency style of gcc-11... (cached) gcc3 checking dependency style of gcc-11... checking whether the compiler supports GNU C... (cached) yes checking whether gcc-11 accepts -g... (cached) yes checking for gcc-11 option to enable C11 features... (cached) none needed checking whether gcc-11 understands -c and -o together... (cached) yes checking dependency style of gcc-11... (cached) gcc3 checking dependency style of gcc-11... gcc3 checking whether make sets $(MAKE)... (cached) yes checking for linux/rseq.h... gcc3 checking whether make sets $(MAKE)... (cached) yes checking for linux/rseq.h... yes checking for rseq_available in -lrseq... yes checking for rseq_available in -lrseq... no checking for gcc-11 options needed to detect all undeclared functions... no checking for gcc-11 options needed to detect all undeclared functions... none needed checking for linux/io_uring.h... yes checking for liburing.h... none needed checking for linux/io_uring.h... yes checking for liburing.h... no checking whether IORING_OP_NOP is declared... yes checking whether IORING_OP_READV is declared... no checking whether IORING_OP_NOP is declared... yes checking whether IORING_OP_WRITEV is declared... yes checking whether IORING_OP_READV is declared... yes checking whether IORING_OP_FSYNC is declared... yes checking whether IORING_OP_WRITEV is declared... yes checking whether IORING_OP_READ_FIXED is declared... yes checking whether IORING_OP_FSYNC is declared... yes checking whether IORING_OP_WRITE_FIXED is declared... yes checking whether IORING_OP_READ_FIXED is declared... yes checking whether IORING_OP_POLL_ADD is declared... yes checking whether IORING_OP_WRITE_FIXED is declared... yes checking whether IORING_OP_POLL_REMOVE is declared... yes checking whether IORING_OP_POLL_ADD is declared... yes checking whether IORING_OP_SYNC_FILE_RANGE is declared... yes checking whether IORING_OP_POLL_REMOVE is declared... yes checking whether IORING_OP_SENDMSG is declared... yes checking whether IORING_OP_SYNC_FILE_RANGE is declared... yes checking whether IORING_OP_RECVMSG is declared... yes checking whether IORING_OP_SENDMSG is declared... yes checking whether IORING_OP_TIMEOUT is declared... yes checking whether IORING_OP_RECVMSG is declared... yes checking whether IORING_OP_TIMEOUT_REMOVE is declared... yes checking whether IORING_OP_TIMEOUT is declared... yes checking whether IORING_OP_ACCEPT is declared... yes checking whether IORING_OP_TIMEOUT_REMOVE is declared... yes checking whether IORING_OP_ASYNC_CANCEL is declared... yes checking whether IORING_OP_ACCEPT is declared... yes checking whether IORING_OP_LINK_TIMEOUT is declared... yes checking whether IORING_OP_ASYNC_CANCEL is declared... yes checking whether IORING_OP_CONNECT is declared... yes checking whether IORING_OP_LINK_TIMEOUT is declared... yes checking whether IORING_OP_FALLOCATE is declared... yes checking whether IORING_OP_CONNECT is declared... yes checking whether IORING_OP_OPENAT is declared... yes checking whether IORING_OP_FALLOCATE is declared... yes checking whether IORING_OP_CLOSE is declared... yes checking whether IORING_OP_OPENAT is declared... yes checking whether IORING_OP_FILES_UPDATE is declared... yes checking whether IORING_OP_CLOSE is declared... yes checking whether IORING_OP_STATX is declared... yes checking whether IORING_OP_FILES_UPDATE is declared... yes checking whether IORING_OP_READ is declared... yes checking whether IORING_OP_STATX is declared... yes checking whether IORING_OP_WRITE is declared... yes checking whether IORING_OP_READ is declared... yes checking whether IORING_OP_FADVISE is declared... yes checking whether IORING_OP_WRITE is declared... yes checking whether IORING_OP_MADVISE is declared... yes checking whether IORING_OP_FADVISE is declared... yes checking whether IORING_OP_SEND is declared... yes checking whether IORING_OP_MADVISE is declared... yes checking whether IORING_OP_RECV is declared... yes checking whether IORING_OP_SEND is declared... yes checking whether IORING_OP_OPENAT2 is declared... yes checking whether IORING_OP_RECV is declared... yes checking whether IORING_OP_EPOLL_CTL is declared... yes checking whether IORING_OP_OPENAT2 is declared... yes checking whether IORING_OP_SPLICE is declared... yes checking whether IORING_OP_EPOLL_CTL is declared... yes checking whether IORING_OP_PROVIDE_BUFFERS is declared... yes checking whether IORING_OP_SPLICE is declared... yes checking whether IORING_OP_REMOVE_BUFFER is declared... yes checking whether IORING_OP_PROVIDE_BUFFERS is declared... no checking whether IORING_OP_TEE is declared... yes checking whether IORING_OP_REMOVE_BUFFER is declared... yes checking whether IOSQE_FIXED_FILE is declared... no checking whether IORING_OP_TEE is declared... yes checking whether IOSQE_IO_DRAIN is declared... yes checking whether IOSQE_FIXED_FILE is declared... yes checking whether IOSQE_IO_LINK is declared... yes checking whether IOSQE_IO_DRAIN is declared... yes checking whether IOSQE_IO_HARDLINK is declared... yes checking whether IOSQE_IO_LINK is declared... yes checking whether IOSQE_ASYNC is declared... yes checking whether IOSQE_IO_HARDLINK is declared... yes checking whether IOSQE_BUFFER_SELECT is declared... yes checking whether IOSQE_ASYNC is declared... yes checking whether SPLICE_F_FD_IN_FIXED is declared... yes checking whether IOSQE_BUFFER_SELECT is declared... yes checking whether IORING_SETUP_ATTACH_WQ is declared... yes checking whether SPLICE_F_FD_IN_FIXED is declared... yes checking whether IORING_REGISTER_IOWQ_MAX_WORKERS is declared... yes checking whether IORING_SETUP_ATTACH_WQ is declared... yes checking for preadv2... yes checking whether IORING_REGISTER_IOWQ_MAX_WORKERS is declared... yes checking for pwritev2... yes checking for preadv2... yes yes checking for pwritev2... checking that generated files are newer than configure... done configure: creating ./config.status yes checking that generated files are newer than configure... done configure: creating ./config.status config.status: creating Makefile config.status: creating src/Makefile config.status: creating prelude/Makefile config.status: creating src/concurrency/io/call.cfa config.status: creating Makefile config.status: creating src/Makefile /var/lib/jenkins/workspace/Cforall_master_2/libcfa/src/concurrency/io/call.cfa.in:144: SyntaxWarning: invalid escape sequence '\(' sig = re.search("(.*) (.*)\((.*)\)", signature) config.status: creating prelude/defines.hfa config.status: creating prelude/Makefile config.status: executing depfiles commands config.status: creating src/concurrency/io/call.cfa /var/lib/jenkins/workspace/Cforall_master_2/libcfa/src/concurrency/io/call.cfa.in:144: SyntaxWarning: invalid escape sequence '\(' sig = re.search("(.*) (.*)\((.*)\)", signature) config.status: creating prelude/defines.hfa config.status: executing libtool commands Cforall library configuraton completed. Type "make -j 8 install". config.status: executing depfiles commands config.status: executing libtool commands Cforall library configuraton completed. Type "make -j 8 install". [Pipeline] } [Pipeline] // dir [Pipeline] } [Pipeline] // stage [Pipeline] echo -------- Build : cfa-cpp -------- [Pipeline] stage [Pipeline] { (Build : cfa-cpp) [Pipeline] dir Running in /var/lib/jenkins/workspace/Cforall_master_2@tmp [Pipeline] { [Pipeline] sh + nproc + make -j 16 --no-print-directory -C driver CXX as.o CXX cc1.o CXX cfa.o CXXLD as CXXLD cc1 CXXLD cfa [Pipeline] sh + nproc + make -j 16 --no-print-directory -C src YACC Parser/parser.cc updating Parser/parser.output updating Parser/parser.hh make all-am CXX main.o CXX CompilationState.o CXX MakeLibCfa.o LEX Parser/lex.cc CXX AST/Attribute.o CXX AST/Copy.o CXX AST/Create.o CXX AST/Decl.o CXX AST/DeclReplacer.o CXX AST/Expr.o CXX AST/GenericSubstitution.o CXX AST/Init.o CXX AST/Inspect.o CXX AST/LinkageSpec.o CXX AST/Node.o CXX AST/Pass.o CXX AST/Print.o CXX AST/Stmt.o CXX AST/SymbolTable.o CXX AST/Type.o CXX AST/TypeEnvironment.o CXX AST/TypeSubstitution.o CXX AST/Util.o CXX CodeGen/CodeGenerator.o CXX CodeGen/GenType.o CXX CodeGen/OperatorTable.o CXX CodeGen/FixMain.o CXX CodeGen/FixNames.o CXX CodeGen/Generate.o CXX CodeGen/LinkOnce.o CXX Concurrency/Actors.o CXX Concurrency/Corun.o CXX Concurrency/Keywords.o CXX Concurrency/Waitfor.o CXX Concurrency/Waituntil.o CXX Common/Assert.o CXX Common/CodeLocationTools.o CXX Common/DeclStats.o CXX Common/Eval.o CXX Common/Examine.o CXX Common/Indenter.o CXX Common/ResolvProtoDump.o CXX Common/SemanticError.o CXX Common/Stats/Counter.o CXX Common/Stats/Heap.o CXX Common/Stats/ResolveTime.o CXX Common/Stats/Stats.o CXX Common/Stats/Time.o CXX Common/Symbol.o CXX Common/UniqueName.o CXX Common/DebugMalloc.o CXX ControlStruct/ExceptDecl.o CXX ControlStruct/ExceptTranslate.o CXX ControlStruct/FixLabels.o CXX ControlStruct/HoistControlDecls.o CXX ControlStruct/LabelGenerator.o CXX ControlStruct/MultiLevelExit.o CXX ControlStruct/TranslateEnumRange.o CXX GenPoly/GenPoly.o CXX GenPoly/Lvalue2.o CXX GenPoly/Box.o CXX GenPoly/FindFunction.o CXX GenPoly/InstantiateGeneric.o CXX GenPoly/Lvalue.o CXX GenPoly/ScrubTypeVars.o CXX GenPoly/Specialize.o CXX InitTweak/GenInit.o CXX InitTweak/InitTweak.o CXX InitTweak/FixGlobalInit.o CXX InitTweak/FixInit.o CXX Parser/DeclarationNode.o CXX Parser/ExpressionNode.o CXX Parser/InitializerNode.o CXX Parser/lex.o CXX Parser/ParseNode.o CXX Parser/parser.o CXX Parser/RunParser.o In file included from /usr/include/x86_64-linux-gnu/c++/11/32/bits/os_defines.h:39, from /usr/include/x86_64-linux-gnu/c++/11/32/bits/c++config.h:586, from /usr/include/c++/11/cstdio:41, from /var/lib/jenkins/workspace/Cforall_master_2/src/Parser/parser.yy:41: /usr/include/features.h:415:4: warning: #warning _FORTIFY_SOURCE requires GCC 4.1 or later [-Wcpp] 415 | # warning _FORTIFY_SOURCE requires GCC 4.1 or later | ^~~~~~~ CXX Parser/StatementNode.o CXX Parser/TypeData.o CXX Parser/TypedefTable.o CXX ResolvExpr/AdjustExprType.o CXX ResolvExpr/Candidate.o CXX ResolvExpr/CandidateFinder.o CXX ResolvExpr/CastCost.o CXX ResolvExpr/CommonType.o CXX ResolvExpr/ConversionCost.o CXX ResolvExpr/CurrentObject.o CXX ResolvExpr/ExplodedArg.o CXX ResolvExpr/FindOpenVars.o CXX ResolvExpr/PolyCost.o CXX ResolvExpr/PtrsAssignable.o CXX ResolvExpr/PtrsCastable.o CXX ResolvExpr/RenameVars.o CXX ResolvExpr/Resolver.o CXX ResolvExpr/ResolveTypeof.o CXX ResolvExpr/SatisfyAssertions.o CXX ResolvExpr/SpecCost.o CXX ResolvExpr/Unify.o CXX ResolvExpr/CandidatePrinter.o CXX ResolvExpr/EraseWith.o CXX SymTab/FixFunction.o CXX SymTab/GenImplicitCall.o CXX SymTab/Mangler.o CXX SymTab/ManglerCommon.o CXX Tuples/Explode.o CXX Tuples/TupleAssignment.o CXX Tuples/TupleExpansion.o CXX Tuples/Tuples.o CXX Validate/Autogen.o CXX Validate/CheckAssertions.o CXX Validate/CompoundLiteral.o CXX Validate/EliminateTypedef.o CXX Validate/EnumAndPointerDecay.o CXX Validate/FindSpecialDecls.o CXX Validate/FixQualifiedTypes.o CXX Validate/FixReturnTypes.o CXX Validate/ForallPointerDecay.o CXX Validate/GenericParameter.o CXX Validate/HoistStruct.o CXX Validate/HoistTypeDecls.o CXX Validate/ImplementEnumFunc.o CXX Validate/InitializerLength.o CXX Validate/LabelAddressFixer.o CXX Validate/LinkInstanceTypes.o CXX Validate/ReplaceTypedef.o CXX Validate/ReturnCheck.o CXX Validate/VerifyCtorDtorAssign.o CXX Virtual/ExpandCasts.o CXX Virtual/Tables.o CXX Virtual/VirtualDtor.o CXXLD ../driver/cfa-cpp [Pipeline] } [Pipeline] // dir [Pipeline] } [Pipeline] // stage [Pipeline] echo -------- Build : libcfa(debug) -------- [Pipeline] stage [Pipeline] { (Build : libcfa(debug)) [Pipeline] dir Running in /var/lib/jenkins/workspace/Cforall_master_2@tmp [Pipeline] { [Pipeline] sh + nproc + make -j 16 --no-print-directory -C libcfa/x86-debug Making all in prelude mkdir .deps touch .deps/builtins.Po (CDPATH="${ZSH_VERSION+.}:" && cd /var/lib/jenkins/workspace/Cforall_master_2/libcfa && /bin/bash '/var/lib/jenkins/workspace/Cforall_master_2/libcfa/automake/missing' autoheader) rm -f stamp-h1 touch /var/lib/jenkins/workspace/Cforall_master_2/libcfa/prelude/defines.hfa.in cd .. && /bin/bash ./config.status prelude/defines.hfa config.status: creating prelude/defines.hfa config.status: prelude/defines.hfa is unchanged make all-am GEN builtins.cfa GEN gcc-builtins.c GEN prelude.cfa GEN extras.cfa GEN extras.cfa GEN gcc-builtins.cfa GEN bootloader.c Making all in src CFA common.lo CFA fstream.lo CFA heap.lo CFA iostream.lo CFA limits.lo CFA iterator.lo CFA memory.lo CFA math.lo CFA parseargs.lo CFA parseconfig.lo CFA rational.lo CFA stdlib.lo CFA strstream.lo CFA time.lo CFA assert.lo CFA bits/debug.lo CC exception.lo CFA interpose.lo CFA prelude-inline.lo CFA startup.lo CC virtual.lo GEN prelude.lo CFA concurrency/locks.lo CFA concurrency/monitor.lo CFA concurrency/mutex.lo CFA concurrency/select.lo CFA concurrency/thread.lo CFA concurrency/cofor.lo CFA interpose_thread.lo CPPAS concurrency/CtxSwitch-x86.lo CC concurrency/invoke.lo CFA concurrency/io.lo CFA concurrency/kernel/startup.lo CFA concurrency/preemption.lo CFA concurrency/ready_queue.lo CFA concurrency/stats.lo CFA concurrency/pthread.lo CFA bits/weakso_locks.lo CFA algorithms/range_iterator.lo CFA collections/maybe.lo CFA collections/pair.lo CFA collections/result.lo CFA collections/string.lo CFA collections/string_res.lo CFA collections/vector.lo CFA device/cpu.lo CFA concurrency/alarm.lo CFA concurrency/coroutine.lo CFA concurrency/exception.lo CFA concurrency/kernel.lo CFA concurrency/kernel/cluster.lo CFA concurrency/clib/cfathread.lo CFA concurrency/io/setup.lo CFA concurrency/io/call.lo /usr/include/linux/io_uring.h:83:43: warning: 'packed' attribute ignored for field of type 'union __io_uring_sqe____anonymous56' [-Wattributes] 83 | } __attribute__((packed)); | ^ /usr/include/linux/io_uring.h:83:43: warning: 'packed' attribute ignored for field of type 'union __io_uring_sqe____anonymous132' [-Wattributes] 83 | } __attribute__((packed)); | ^ CCLD libcfa.la /usr/bin/ld: warning: .libs/common.o: requires executable stack (because the .note.GNU-stack section is executable) /usr/bin/ld: .libs/exception.o: warning: relocation against `__gcfa_personality_v0' in read-only section `.rodata' /usr/bin/ld: warning: creating DT_TEXTREL in a shared object /usr/include/linux/io_uring.h:83:43: warning: 'packed' attribute ignored for field of type 'union __io_uring_sqe____anonymous67' [-Wattributes] 83 | } __attribute__((packed)); | ^ concurrency/io/call.cfa: In function '_X15async_epoll_ctlFv_S11io_future_tiiiPS11epoll_eventy__1': concurrency/io/call.cfa:381:87: warning: cast from pointer to integer of different size [-Wpointer-to-int-cast] 381 | sqe->off = (typeof(sqe->off))event; | ^ concurrency/io/call.cfa: In function '_X13async_accept4Fv_S11io_future_tiU26__anonymous___SOCKADDR_ARGPjiy__1': concurrency/io/call.cfa:710:89: warning: cast from pointer to integer of different size [-Wpointer-to-int-cast] 710 | sqe->addr2 = (typeof(sqe->addr2))addrlen; | ^ /usr/include/linux/io_uring.h:83:43: warning: 'packed' attribute ignored for field of type 'union __io_uring_sqe____anonymous122' [-Wattributes] 83 | } __attribute__((packed)); | ^ /usr/include/linux/io_uring.h:83:43: warning: 'packed' attribute ignored for field of type 'union __io_uring_sqe____anonymous122' [-Wattributes] 83 | } __attribute__((packed)); | ^ /usr/include/linux/io_uring.h:83:43: warning: 'packed' attribute ignored for field of type 'union __io_uring_sqe____anonymous34' [-Wattributes] 83 | } __attribute__((packed)); | ^ /usr/include/linux/io_uring.h:83:43: warning: 'packed' attribute ignored for field of type 'union __io_uring_sqe____anonymous99' [-Wattributes] 83 | } __attribute__((packed)); | ^ CCLD libcfathread.la /usr/bin/ld: warning: concurrency/.libs/alarm.o: requires executable stack (because the .note.GNU-stack section is executable) make[1]: Nothing to be done for 'all-am'. [Pipeline] } [Pipeline] // dir [Pipeline] } [Pipeline] // stage [Pipeline] echo -------- Build : libcfa(nodebug) -------- [Pipeline] stage [Pipeline] { (Build : libcfa(nodebug)) [Pipeline] dir Running in /var/lib/jenkins/workspace/Cforall_master_2@tmp [Pipeline] { [Pipeline] sh + nproc + make -j 16 --no-print-directory -C libcfa/x86-nodebug Making all in prelude mkdir .deps touch .deps/builtins.Po cd .. && /bin/bash ./config.status prelude/defines.hfa config.status: creating prelude/defines.hfa config.status: prelude/defines.hfa is unchanged make all-am GEN gcc-builtins.c GEN builtins.cfa GEN prelude.cfa GEN extras.cfa GEN extras.cfa GEN gcc-builtins.cfa GEN bootloader.c Making all in src CFA common.lo CFA fstream.lo CFA heap.lo CFA iostream.lo CFA iterator.lo CFA limits.lo CFA math.lo CFA memory.lo CFA parseargs.lo CFA parseconfig.lo CFA rational.lo CFA stdlib.lo CFA time.lo CFA strstream.lo CFA assert.lo CFA bits/debug.lo CC exception.lo /var/lib/jenkins/workspace/Cforall_master_2/libcfa/src/exception.c: In function '__cfaehm_allocate_exception': /var/lib/jenkins/workspace/Cforall_master_2/libcfa/src/exception.c:142:17: warning: ignoring return value of 'write' declared with attribute 'warn_unused_result' [-Wunused-result] 142 | write( 2, "abort2\n", 7 ); | ^~~~~~~~~~~~~~~~~~~~~~~~~ /var/lib/jenkins/workspace/Cforall_master_2/libcfa/src/exception.c: In function '__cfaehm_exception_cleanup': /var/lib/jenkins/workspace/Cforall_master_2/libcfa/src/exception.c:127:17: warning: ignoring return value of 'write' declared with attribute 'warn_unused_result' [-Wunused-result] 127 | write( 2, "abort1\n", 7 ); | ^~~~~~~~~~~~~~~~~~~~~~~~~ /var/lib/jenkins/workspace/Cforall_master_2/libcfa/src/exception.c: In function '__cfaehm_cancel_stack': /var/lib/jenkins/workspace/Cforall_master_2/libcfa/src/exception.c:230:9: warning: ignoring return value of 'write' declared with attribute 'warn_unused_result' [-Wunused-result] 230 | write( 2, "abort3\n", 7 ); | ^~~~~~~~~~~~~~~~~~~~~~~~~ /var/lib/jenkins/workspace/Cforall_master_2/libcfa/src/exception.c: In function '__cfaehm_begin_unwind': /var/lib/jenkins/workspace/Cforall_master_2/libcfa/src/exception.c:252:17: warning: ignoring return value of 'write' declared with attribute 'warn_unused_result' [-Wunused-result] 252 | write( 2, "abort4\n", 7 ); | ^~~~~~~~~~~~~~~~~~~~~~~~~ /var/lib/jenkins/workspace/Cforall_master_2/libcfa/src/exception.c:278:17: warning: ignoring return value of 'write' declared with attribute 'warn_unused_result' [-Wunused-result] 278 | write( 2, "abort5\n", 7 ); | ^~~~~~~~~~~~~~~~~~~~~~~~~ /var/lib/jenkins/workspace/Cforall_master_2/libcfa/src/exception.c: In function '__cfaehm_rethrow_terminate': /var/lib/jenkins/workspace/Cforall_master_2/libcfa/src/exception.c:308:9: warning: ignoring return value of 'write' declared with attribute 'warn_unused_result' [-Wunused-result] 308 | write( 2, "abort7\n", 7 ); | ^~~~~~~~~~~~~~~~~~~~~~~~~ /var/lib/jenkins/workspace/Cforall_master_2/libcfa/src/exception.c: In function '__cfaehm_rethrow_adapter': /var/lib/jenkins/workspace/Cforall_master_2/libcfa/src/exception.c:300:9: warning: ignoring return value of 'write' declared with attribute 'warn_unused_result' [-Wunused-result] 300 | write( 2, "abort6\n", 7 ); | ^~~~~~~~~~~~~~~~~~~~~~~~~ CFA interpose.lo CFA prelude-inline.lo CFA startup.lo CC virtual.lo GEN prelude.lo CFA concurrency/locks.lo CFA concurrency/monitor.lo CFA concurrency/mutex.lo CFA concurrency/select.lo CFA concurrency/thread.lo CFA concurrency/cofor.lo CFA interpose_thread.lo CPPAS concurrency/CtxSwitch-x86.lo CC concurrency/invoke.lo CFA concurrency/io.lo CFA concurrency/kernel/startup.lo CFA concurrency/preemption.lo CFA concurrency/ready_queue.lo CFA concurrency/stats.lo CFA concurrency/pthread.lo CFA bits/weakso_locks.lo CFA algorithms/range_iterator.lo CFA collections/maybe.lo CFA collections/pair.lo CFA collections/result.lo CFA collections/string.lo CFA collections/string_res.lo CFA collections/vector.lo CFA device/cpu.lo CFA concurrency/alarm.lo CFA concurrency/coroutine.lo CFA concurrency/exception.lo CFA concurrency/kernel.lo CFA concurrency/kernel/cluster.lo CFA concurrency/clib/cfathread.lo CFA concurrency/io/setup.lo CFA concurrency/io/call.lo /usr/include/linux/io_uring.h:83:43: warning: 'packed' attribute ignored for field of type 'union __io_uring_sqe____anonymous132' [-Wattributes] 83 | } __attribute__((packed)); | ^ /usr/include/bits/socket2.h:70:95: warning: '_X12_constructorFv_U26__anonymous___SOCKADDR_ARGU26__anonymous___SOCKADDR_ARG_autogen___1' is static but used in inline function 'recvfrom' which is not static 70 | return __recvfrom_chk (__fd, __buf, __n, sz, __flags, __addr, __addr_len); | ^ /usr/include/bits/socket2.h:70:125: warning: '_X11_destructorFv_U26__anonymous___SOCKADDR_ARG_autogen___1' is static but used in inline function 'recvfrom' which is not static 70 | return __recvfrom_chk (__fd, __buf, __n, sz, __flags, __addr, __addr_len); | ^ /usr/include/bits/socket2.h:68:104: warning: '_X12_constructorFv_U26__anonymous___SOCKADDR_ARGU26__anonymous___SOCKADDR_ARG_autogen___1' is static but used in inline function 'recvfrom' which is not static 68 | return __recvfrom_chk_warn (__fd, __buf, __n, sz, __flags, __addr, | ^ /usr/include/bits/socket2.h:68:129: warning: '_X11_destructorFv_U26__anonymous___SOCKADDR_ARG_autogen___1' is static but used in inline function 'recvfrom' which is not static 68 | return __recvfrom_chk_warn (__fd, __buf, __n, sz, __flags, __addr, | ^ /usr/include/bits/socket2.h:66:97: warning: '_X12_constructorFv_U26__anonymous___SOCKADDR_ARGU26__anonymous___SOCKADDR_ARG_autogen___1' is static but used in inline function 'recvfrom' which is not static 66 | return __recvfrom_alias (__fd, __buf, __n, __flags, __addr, __addr_len); | ^ /usr/include/bits/socket2.h:66:129: warning: '_X11_destructorFv_U26__anonymous___SOCKADDR_ARG_autogen___1' is static but used in inline function 'recvfrom' which is not static 66 | return __recvfrom_alias (__fd, __buf, __n, __flags, __addr, __addr_len); | ^ /usr/include/linux/io_uring.h:83:43: warning: 'packed' attribute ignored for field of type 'union __io_uring_sqe____anonymous56' [-Wattributes] 83 | } __attribute__((packed)); | ^ /usr/include/bits/socket2.h:70:95: warning: '_X12_constructorFv_U26__anonymous___SOCKADDR_ARGU26__anonymous___SOCKADDR_ARG_autogen___1' is static but used in inline function 'recvfrom' which is not static 70 | return __recvfrom_chk (__fd, __buf, __n, sz, __flags, __addr, __addr_len); | ^ /usr/include/bits/socket2.h:70:125: warning: '_X11_destructorFv_U26__anonymous___SOCKADDR_ARG_autogen___1' is static but used in inline function 'recvfrom' which is not static 70 | return __recvfrom_chk (__fd, __buf, __n, sz, __flags, __addr, __addr_len); | ^ /usr/include/bits/socket2.h:68:104: warning: '_X12_constructorFv_U26__anonymous___SOCKADDR_ARGU26__anonymous___SOCKADDR_ARG_autogen___1' is static but used in inline function 'recvfrom' which is not static 68 | return __recvfrom_chk_warn (__fd, __buf, __n, sz, __flags, __addr, | ^ /usr/include/bits/socket2.h:68:129: warning: '_X11_destructorFv_U26__anonymous___SOCKADDR_ARG_autogen___1' is static but used in inline function 'recvfrom' which is not static 68 | return __recvfrom_chk_warn (__fd, __buf, __n, sz, __flags, __addr, | ^ /usr/include/bits/socket2.h:66:97: warning: '_X12_constructorFv_U26__anonymous___SOCKADDR_ARGU26__anonymous___SOCKADDR_ARG_autogen___1' is static but used in inline function 'recvfrom' which is not static 66 | return __recvfrom_alias (__fd, __buf, __n, __flags, __addr, __addr_len); | ^ /usr/include/bits/socket2.h:66:129: warning: '_X11_destructorFv_U26__anonymous___SOCKADDR_ARG_autogen___1' is static but used in inline function 'recvfrom' which is not static 66 | return __recvfrom_alias (__fd, __buf, __n, __flags, __addr, __addr_len); | ^ CCLD libcfa.la /usr/bin/ld: warning: .libs/common.o: requires executable stack (because the .note.GNU-stack section is executable) /usr/bin/ld: .libs/exception.o: warning: relocation against `__gcfa_personality_v0' in read-only section `.text' /usr/bin/ld: warning: creating DT_TEXTREL in a shared object /usr/include/linux/io_uring.h:83:43: warning: 'packed' attribute ignored for field of type 'union __io_uring_sqe____anonymous67' [-Wattributes] 83 | } __attribute__((packed)); | ^ concurrency/io/call.cfa: In function '_X15async_epoll_ctlFv_S11io_future_tiiiPS11epoll_eventy__1': concurrency/io/call.cfa:381:87: warning: cast from pointer to integer of different size [-Wpointer-to-int-cast] 381 | sqe->off = (typeof(sqe->off))event; | ^ concurrency/io/call.cfa: In function '_X13async_accept4Fv_S11io_future_tiU26__anonymous___SOCKADDR_ARGPjiy__1': concurrency/io/call.cfa:710:89: warning: cast from pointer to integer of different size [-Wpointer-to-int-cast] 710 | sqe->addr2 = (typeof(sqe->addr2))addrlen; | ^ concurrency/io/call.cfa: At top level: /usr/include/bits/socket2.h:70:94: warning: '_X12_constructorFv_U26__anonymous___SOCKADDR_ARGU26__anonymous___SOCKADDR_ARG_autogen___1' is static but used in inline function 'recvfrom' which is not static 70 | return __recvfrom_chk (__fd, __buf, __n, sz, __flags, __addr, __addr_len); | ^ /usr/include/bits/socket2.h:70:124: warning: '_X11_destructorFv_U26__anonymous___SOCKADDR_ARG_autogen___1' is static but used in inline function 'recvfrom' which is not static 70 | return __recvfrom_chk (__fd, __buf, __n, sz, __flags, __addr, __addr_len); | ^ /usr/include/bits/socket2.h:68:103: warning: '_X12_constructorFv_U26__anonymous___SOCKADDR_ARGU26__anonymous___SOCKADDR_ARG_autogen___1' is static but used in inline function 'recvfrom' which is not static 68 | return __recvfrom_chk_warn (__fd, __buf, __n, sz, __flags, __addr, | ^ /usr/include/bits/socket2.h:68:128: warning: '_X11_destructorFv_U26__anonymous___SOCKADDR_ARG_autogen___1' is static but used in inline function 'recvfrom' which is not static 68 | return __recvfrom_chk_warn (__fd, __buf, __n, sz, __flags, __addr, | ^ /usr/include/bits/socket2.h:66:96: warning: '_X12_constructorFv_U26__anonymous___SOCKADDR_ARGU26__anonymous___SOCKADDR_ARG_autogen___1' is static but used in inline function 'recvfrom' which is not static 66 | return __recvfrom_alias (__fd, __buf, __n, __flags, __addr, __addr_len); | ^ /usr/include/bits/socket2.h:66:128: warning: '_X11_destructorFv_U26__anonymous___SOCKADDR_ARG_autogen___1' is static but used in inline function 'recvfrom' which is not static 66 | return __recvfrom_alias (__fd, __buf, __n, __flags, __addr, __addr_len); | ^ /usr/include/linux/io_uring.h:83:43: warning: 'packed' attribute ignored for field of type 'union __io_uring_sqe____anonymous122' [-Wattributes] 83 | } __attribute__((packed)); | ^ /usr/include/bits/socket2.h:70:95: warning: '_X12_constructorFv_U26__anonymous___SOCKADDR_ARGU26__anonymous___SOCKADDR_ARG_autogen___1' is static but used in inline function 'recvfrom' which is not static 70 | return __recvfrom_chk (__fd, __buf, __n, sz, __flags, __addr, __addr_len); | ^ /usr/include/bits/socket2.h:70:125: warning: '_X11_destructorFv_U26__anonymous___SOCKADDR_ARG_autogen___1' is static but used in inline function 'recvfrom' which is not static 70 | return __recvfrom_chk (__fd, __buf, __n, sz, __flags, __addr, __addr_len); | ^ /usr/include/bits/socket2.h:68:104: warning: '_X12_constructorFv_U26__anonymous___SOCKADDR_ARGU26__anonymous___SOCKADDR_ARG_autogen___1' is static but used in inline function 'recvfrom' which is not static 68 | return __recvfrom_chk_warn (__fd, __buf, __n, sz, __flags, __addr, | ^ /usr/include/bits/socket2.h:68:129: warning: '_X11_destructorFv_U26__anonymous___SOCKADDR_ARG_autogen___1' is static but used in inline function 'recvfrom' which is not static 68 | return __recvfrom_chk_warn (__fd, __buf, __n, sz, __flags, __addr, | ^ /usr/include/bits/socket2.h:66:97: warning: '_X12_constructorFv_U26__anonymous___SOCKADDR_ARGU26__anonymous___SOCKADDR_ARG_autogen___1' is static but used in inline function 'recvfrom' which is not static 66 | return __recvfrom_alias (__fd, __buf, __n, __flags, __addr, __addr_len); | ^ /usr/include/bits/socket2.h:66:129: warning: '_X11_destructorFv_U26__anonymous___SOCKADDR_ARG_autogen___1' is static but used in inline function 'recvfrom' which is not static 66 | return __recvfrom_alias (__fd, __buf, __n, __flags, __addr, __addr_len); | ^ /usr/include/linux/io_uring.h:83:43: warning: 'packed' attribute ignored for field of type 'union __io_uring_sqe____anonymous122' [-Wattributes] 83 | } __attribute__((packed)); | ^ /usr/include/bits/socket2.h:70:95: warning: '_X12_constructorFv_U26__anonymous___SOCKADDR_ARGU26__anonymous___SOCKADDR_ARG_autogen___1' is static but used in inline function 'recvfrom' which is not static 70 | return __recvfrom_chk (__fd, __buf, __n, sz, __flags, __addr, __addr_len); | ^ /usr/include/bits/socket2.h:70:125: warning: '_X11_destructorFv_U26__anonymous___SOCKADDR_ARG_autogen___1' is static but used in inline function 'recvfrom' which is not static 70 | return __recvfrom_chk (__fd, __buf, __n, sz, __flags, __addr, __addr_len); | ^ /usr/include/bits/socket2.h:68:104: warning: '_X12_constructorFv_U26__anonymous___SOCKADDR_ARGU26__anonymous___SOCKADDR_ARG_autogen___1' is static but used in inline function 'recvfrom' which is not static 68 | return __recvfrom_chk_warn (__fd, __buf, __n, sz, __flags, __addr, | ^ /usr/include/bits/socket2.h:68:129: warning: '_X11_destructorFv_U26__anonymous___SOCKADDR_ARG_autogen___1' is static but used in inline function 'recvfrom' which is not static 68 | return __recvfrom_chk_warn (__fd, __buf, __n, sz, __flags, __addr, | ^ /usr/include/bits/socket2.h:66:97: warning: '_X12_constructorFv_U26__anonymous___SOCKADDR_ARGU26__anonymous___SOCKADDR_ARG_autogen___1' is static but used in inline function 'recvfrom' which is not static 66 | return __recvfrom_alias (__fd, __buf, __n, __flags, __addr, __addr_len); | ^ /usr/include/bits/socket2.h:66:129: warning: '_X11_destructorFv_U26__anonymous___SOCKADDR_ARG_autogen___1' is static but used in inline function 'recvfrom' which is not static 66 | return __recvfrom_alias (__fd, __buf, __n, __flags, __addr, __addr_len); | ^ /usr/include/linux/io_uring.h:83:43: warning: 'packed' attribute ignored for field of type 'union __io_uring_sqe____anonymous34' [-Wattributes] 83 | } __attribute__((packed)); | ^ /usr/include/bits/socket2.h:70:94: warning: '_X12_constructorFv_U26__anonymous___SOCKADDR_ARGU26__anonymous___SOCKADDR_ARG_autogen___1' is static but used in inline function 'recvfrom' which is not static 70 | return __recvfrom_chk (__fd, __buf, __n, sz, __flags, __addr, __addr_len); | ^ /usr/include/bits/socket2.h:70:124: warning: '_X11_destructorFv_U26__anonymous___SOCKADDR_ARG_autogen___1' is static but used in inline function 'recvfrom' which is not static 70 | return __recvfrom_chk (__fd, __buf, __n, sz, __flags, __addr, __addr_len); | ^ /usr/include/bits/socket2.h:68:103: warning: '_X12_constructorFv_U26__anonymous___SOCKADDR_ARGU26__anonymous___SOCKADDR_ARG_autogen___1' is static but used in inline function 'recvfrom' which is not static 68 | return __recvfrom_chk_warn (__fd, __buf, __n, sz, __flags, __addr, | ^ /usr/include/bits/socket2.h:68:128: warning: '_X11_destructorFv_U26__anonymous___SOCKADDR_ARG_autogen___1' is static but used in inline function 'recvfrom' which is not static 68 | return __recvfrom_chk_warn (__fd, __buf, __n, sz, __flags, __addr, | ^ /usr/include/bits/socket2.h:66:96: warning: '_X12_constructorFv_U26__anonymous___SOCKADDR_ARGU26__anonymous___SOCKADDR_ARG_autogen___1' is static but used in inline function 'recvfrom' which is not static 66 | return __recvfrom_alias (__fd, __buf, __n, __flags, __addr, __addr_len); | ^ /usr/include/bits/socket2.h:66:128: warning: '_X11_destructorFv_U26__anonymous___SOCKADDR_ARG_autogen___1' is static but used in inline function 'recvfrom' which is not static 66 | return __recvfrom_alias (__fd, __buf, __n, __flags, __addr, __addr_len); | ^ /usr/include/linux/io_uring.h:83:43: warning: 'packed' attribute ignored for field of type 'union __io_uring_sqe____anonymous99' [-Wattributes] 83 | } __attribute__((packed)); | ^ /usr/include/bits/socket2.h:70:95: warning: '_X12_constructorFv_U26__anonymous___SOCKADDR_ARGU26__anonymous___SOCKADDR_ARG_autogen___1' is static but used in inline function 'recvfrom' which is not static 70 | return __recvfrom_chk (__fd, __buf, __n, sz, __flags, __addr, __addr_len); | ^ /usr/include/bits/socket2.h:70:125: warning: '_X11_destructorFv_U26__anonymous___SOCKADDR_ARG_autogen___1' is static but used in inline function 'recvfrom' which is not static 70 | return __recvfrom_chk (__fd, __buf, __n, sz, __flags, __addr, __addr_len); | ^ /usr/include/bits/socket2.h:68:104: warning: '_X12_constructorFv_U26__anonymous___SOCKADDR_ARGU26__anonymous___SOCKADDR_ARG_autogen___1' is static but used in inline function 'recvfrom' which is not static 68 | return __recvfrom_chk_warn (__fd, __buf, __n, sz, __flags, __addr, | ^ /usr/include/bits/socket2.h:68:129: warning: '_X11_destructorFv_U26__anonymous___SOCKADDR_ARG_autogen___1' is static but used in inline function 'recvfrom' which is not static 68 | return __recvfrom_chk_warn (__fd, __buf, __n, sz, __flags, __addr, | ^ /usr/include/bits/socket2.h:66:97: warning: '_X12_constructorFv_U26__anonymous___SOCKADDR_ARGU26__anonymous___SOCKADDR_ARG_autogen___1' is static but used in inline function 'recvfrom' which is not static 66 | return __recvfrom_alias (__fd, __buf, __n, __flags, __addr, __addr_len); | ^ /usr/include/bits/socket2.h:66:129: warning: '_X11_destructorFv_U26__anonymous___SOCKADDR_ARG_autogen___1' is static but used in inline function 'recvfrom' which is not static 66 | return __recvfrom_alias (__fd, __buf, __n, __flags, __addr, __addr_len); | ^ CCLD libcfathread.la /usr/bin/ld: warning: concurrency/.libs/coroutine.o: requires executable stack (because the .note.GNU-stack section is executable) make[1]: Nothing to be done for 'all-am'. [Pipeline] } [Pipeline] // dir [Pipeline] } [Pipeline] // stage [Pipeline] echo -------- Build : install -------- [Pipeline] stage [Pipeline] { (Build : install) [Pipeline] dir Running in /var/lib/jenkins/workspace/Cforall_master_2@tmp [Pipeline] { [Pipeline] sh + nproc + make -j 16 --no-print-directory install Making install in driver make install-exec-hook /usr/bin/mkdir -p '/var/lib/jenkins/workspace/Cforall_master_2@tmp/lib/cfa/' /usr/bin/install -c cfa '/var/lib/jenkins/workspace/Cforall_master_2@tmp/bin//cfa' /bin/bash ../libtool --mode=install /usr/bin/install -c as cc1 '/var/lib/jenkins/workspace/Cforall_master_2@tmp/lib/cfa/' libtool: install: /usr/bin/install -c as /var/lib/jenkins/workspace/Cforall_master_2@tmp/lib/cfa/as libtool: install: /usr/bin/install -c cc1 /var/lib/jenkins/workspace/Cforall_master_2@tmp/lib/cfa/cc1 Making install in src make install-am make[3]: Nothing to be done for 'install-exec-am'. /usr/bin/mkdir -p '/var/lib/jenkins/workspace/Cforall_master_2@tmp/lib/cfa/' /bin/bash ../libtool --mode=install /usr/bin/install -c ../driver/cfa-cpp '/var/lib/jenkins/workspace/Cforall_master_2@tmp/lib/cfa/' libtool: install: /usr/bin/install -c ../driver/cfa-cpp /var/lib/jenkins/workspace/Cforall_master_2@tmp/lib/cfa/cfa-cpp Making install in . (CDPATH="${ZSH_VERSION+.}:" && cd /var/lib/jenkins/workspace/Cforall_master_2 && /bin/bash '/var/lib/jenkins/workspace/Cforall_master_2/automake/missing' autoheader) rm -f stamp-h1 touch /var/lib/jenkins/workspace/Cforall_master_2/src/config.h.in cd . && /bin/bash ./config.status config.h config.status: creating config.h config.status: config.h is unchanged make[2]: Nothing to be done for 'install-exec-am'. /usr/bin/mkdir -p '/var/lib/jenkins/workspace/Cforall_master_2@tmp/share/man/man1' /usr/bin/install -c -m 644 /var/lib/jenkins/workspace/Cforall_master_2/doc/man/cfa.1 '/var/lib/jenkins/workspace/Cforall_master_2@tmp/share/man/man1' Making install in libcfa/x86-debug Making install in prelude make[3]: Nothing to be done for 'install-exec-am'. /usr/bin/mkdir -p '/var/lib/jenkins/workspace/Cforall_master_2@tmp/lib/cfa/x86-debug/' /usr/bin/install -c -m 644 gcc-builtins.cfa builtins.cfa extras.cfa prelude.cfa bootloader.c defines.hfa '/var/lib/jenkins/workspace/Cforall_master_2@tmp/lib/cfa/x86-debug/' Making install in src /usr/bin/mkdir -p '/var/lib/jenkins/workspace/Cforall_master_2@tmp/lib/cfa/x86-debug/' /bin/bash ../libtool --mode=install /usr/bin/install -c libcfa.la libcfathread.la '/var/lib/jenkins/workspace/Cforall_master_2@tmp/lib/cfa/x86-debug/' /usr/bin/mkdir -p '/var/lib/jenkins/workspace/Cforall_master_2@tmp/include/cfa/' /usr/bin/mkdir -p '/var/lib/jenkins/workspace/Cforall_master_2@tmp/include/cfa//stdhdr/sys' /usr/bin/install -c -m 644 /var/lib/jenkins/workspace/Cforall_master_2/libcfa/src/stdhdr/sys/socket.h /var/lib/jenkins/workspace/Cforall_master_2/libcfa/src/stdhdr/sys/time.h /var/lib/jenkins/workspace/Cforall_master_2/libcfa/src/stdhdr/sys/mman.h '/var/lib/jenkins/workspace/Cforall_master_2@tmp/include/cfa//stdhdr/sys' /usr/bin/mkdir -p '/var/lib/jenkins/workspace/Cforall_master_2@tmp/include/cfa//algorithms' /usr/bin/install -c -m 644 /var/lib/jenkins/workspace/Cforall_master_2/libcfa/src/algorithms/range_iterator.hfa '/var/lib/jenkins/workspace/Cforall_master_2@tmp/include/cfa//algorithms' /usr/bin/mkdir -p '/var/lib/jenkins/workspace/Cforall_master_2@tmp/include/cfa//concurrency/kernel' /usr/bin/install -c -m 644 /var/lib/jenkins/workspace/Cforall_master_2/libcfa/src/concurrency/kernel/cluster.hfa /var/lib/jenkins/workspace/Cforall_master_2/libcfa/src/concurrency/kernel/fwd.hfa '/var/lib/jenkins/workspace/Cforall_master_2@tmp/include/cfa//concurrency/kernel' /usr/bin/install -c -m 644 /var/lib/jenkins/workspace/Cforall_master_2/libcfa/src/common.hfa /var/lib/jenkins/workspace/Cforall_master_2/libcfa/src/fstream.hfa /var/lib/jenkins/workspace/Cforall_master_2/libcfa/src/heap.hfa /var/lib/jenkins/workspace/Cforall_master_2/libcfa/src/iostream.hfa /var/lib/jenkins/workspace/Cforall_master_2/libcfa/src/iterator.hfa /var/lib/jenkins/workspace/Cforall_master_2/libcfa/src/limits.hfa /var/lib/jenkins/workspace/Cforall_master_2/libcfa/src/math.hfa /var/lib/jenkins/workspace/Cforall_master_2/libcfa/src/memory.hfa /var/lib/jenkins/workspace/Cforall_master_2/libcfa/src/parseargs.hfa /var/lib/jenkins/workspace/Cforall_master_2/libcfa/src/parseconfig.hfa /var/lib/jenkins/workspace/Cforall_master_2/libcfa/src/rational.hfa /var/lib/jenkins/workspace/Cforall_master_2/libcfa/src/stdlib.hfa /var/lib/jenkins/workspace/Cforall_master_2/libcfa/src/strstream.hfa /var/lib/jenkins/workspace/Cforall_master_2/libcfa/src/time.hfa /var/lib/jenkins/workspace/Cforall_master_2/libcfa/src/Exception.hfa /var/lib/jenkins/workspace/Cforall_master_2/libcfa/src/bitmanip.hfa /var/lib/jenkins/workspace/Cforall_master_2/libcfa/src/clock.hfa /var/lib/jenkins/workspace/Cforall_master_2/libcfa/src/exception.hfa /var/lib/jenkins/workspace/Cforall_master_2/libcfa/src/exception.h /var/lib/jenkins/workspace/Cforall_master_2/libcfa/src/gmp.hfa /var/lib/jenkins/workspace/Cforall_master_2/libcfa/src/math.trait.hfa /var/lib/jenkins/workspace/Cforall_master_2/libcfa/src/raii.hfa /var/lib/jenkins/workspace/Cforall_master_2/libcfa/src/time_t.hfa /var/lib/jenkins/workspace/Cforall_master_2/libcfa/src/virtual_dtor.hfa '/var/lib/jenkins/workspace/Cforall_master_2@tmp/include/cfa//.' /usr/bin/mkdir -p '/var/lib/jenkins/workspace/Cforall_master_2@tmp/include/cfa//concurrency' /usr/bin/install -c -m 644 /var/lib/jenkins/workspace/Cforall_master_2/libcfa/src/concurrency/iofwd.hfa /var/lib/jenkins/workspace/Cforall_master_2/libcfa/src/concurrency/barrier.hfa /var/lib/jenkins/workspace/Cforall_master_2/libcfa/src/concurrency/alarm.hfa /var/lib/jenkins/workspace/Cforall_master_2/libcfa/src/concurrency/coroutine.hfa /var/lib/jenkins/workspace/Cforall_master_2/libcfa/src/concurrency/exception.hfa /var/lib/jenkins/workspace/Cforall_master_2/libcfa/src/concurrency/kernel.hfa /var/lib/jenkins/workspace/Cforall_master_2/libcfa/src/concurrency/locks.hfa /var/lib/jenkins/workspace/Cforall_master_2/libcfa/src/concurrency/monitor.hfa /var/lib/jenkins/workspace/Cforall_master_2/libcfa/src/concurrency/mutex.hfa /var/lib/jenkins/workspace/Cforall_master_2/libcfa/src/concurrency/select.hfa /var/lib/jenkins/workspace/Cforall_master_2/libcfa/src/concurrency/thread.hfa /var/lib/jenkins/workspace/Cforall_master_2/libcfa/src/concurrency/cofor.hfa /var/lib/jenkins/workspace/Cforall_master_2/libcfa/src/concurrency/invoke.h /var/lib/jenkins/workspace/Cforall_master_2/libcfa/src/concurrency/future.hfa /var/lib/jenkins/workspace/Cforall_master_2/libcfa/src/concurrency/once.hfa /var/lib/jenkins/workspace/Cforall_master_2/libcfa/src/concurrency/mutex_stmt.hfa /var/lib/jenkins/workspace/Cforall_master_2/libcfa/src/concurrency/channel.hfa /var/lib/jenkins/workspace/Cforall_master_2/libcfa/src/concurrency/actor.hfa '/var/lib/jenkins/workspace/Cforall_master_2@tmp/include/cfa//concurrency' /usr/bin/mkdir -p '/var/lib/jenkins/workspace/Cforall_master_2@tmp/include/cfa//concurrency/clib' /usr/bin/install -c -m 644 /var/lib/jenkins/workspace/Cforall_master_2/libcfa/src/concurrency/clib/cfathread.h '/var/lib/jenkins/workspace/Cforall_master_2@tmp/include/cfa//concurrency/clib' /usr/bin/mkdir -p '/var/lib/jenkins/workspace/Cforall_master_2@tmp/include/cfa//device' /usr/bin/install -c -m 644 /var/lib/jenkins/workspace/Cforall_master_2/libcfa/src/device/cpu.hfa '/var/lib/jenkins/workspace/Cforall_master_2@tmp/include/cfa//device' /usr/bin/mkdir -p '/var/lib/jenkins/workspace/Cforall_master_2@tmp/include/cfa//stdhdr/libltdl' libtool: install: /usr/bin/install -c .libs/libcfa.so.1.0.0 /var/lib/jenkins/workspace/Cforall_master_2@tmp/lib/cfa/x86-debug/libcfa.so.1.0.0 /usr/bin/install -c -m 644 /var/lib/jenkins/workspace/Cforall_master_2/libcfa/src/stdhdr/libltdl/lt_dlloader.h '/var/lib/jenkins/workspace/Cforall_master_2@tmp/include/cfa//stdhdr/libltdl' /usr/bin/mkdir -p '/var/lib/jenkins/workspace/Cforall_master_2@tmp/include/cfa//vec' /usr/bin/install -c -m 644 /var/lib/jenkins/workspace/Cforall_master_2/libcfa/src/vec/vec.hfa /var/lib/jenkins/workspace/Cforall_master_2/libcfa/src/vec/vec2.hfa /var/lib/jenkins/workspace/Cforall_master_2/libcfa/src/vec/vec3.hfa /var/lib/jenkins/workspace/Cforall_master_2/libcfa/src/vec/vec4.hfa '/var/lib/jenkins/workspace/Cforall_master_2@tmp/include/cfa//vec' /usr/bin/mkdir -p '/var/lib/jenkins/workspace/Cforall_master_2@tmp/include/cfa//bits' libtool: install: (cd /var/lib/jenkins/workspace/Cforall_master_2@tmp/lib/cfa/x86-debug && { ln -s -f libcfa.so.1.0.0 libcfa.so.1 || { rm -f libcfa.so.1 && ln -s libcfa.so.1.0.0 libcfa.so.1; }; }) /usr/bin/install -c -m 644 /var/lib/jenkins/workspace/Cforall_master_2/libcfa/src/bits/weakso_locks.hfa /var/lib/jenkins/workspace/Cforall_master_2/libcfa/src/bits/algorithm.hfa /var/lib/jenkins/workspace/Cforall_master_2/libcfa/src/bits/align.hfa /var/lib/jenkins/workspace/Cforall_master_2/libcfa/src/bits/collections.hfa /var/lib/jenkins/workspace/Cforall_master_2/libcfa/src/bits/debug.hfa /var/lib/jenkins/workspace/Cforall_master_2/libcfa/src/bits/defs.hfa /var/lib/jenkins/workspace/Cforall_master_2/libcfa/src/bits/locks.hfa /var/lib/jenkins/workspace/Cforall_master_2/libcfa/src/bits/collection.hfa /var/lib/jenkins/workspace/Cforall_master_2/libcfa/src/bits/stack.hfa /var/lib/jenkins/workspace/Cforall_master_2/libcfa/src/bits/queue.hfa /var/lib/jenkins/workspace/Cforall_master_2/libcfa/src/bits/sequence.hfa /var/lib/jenkins/workspace/Cforall_master_2/libcfa/src/bits/atomic.hfa /var/lib/jenkins/workspace/Cforall_master_2/libcfa/src/bits/random.hfa '/var/lib/jenkins/workspace/Cforall_master_2@tmp/include/cfa//bits' libtool: install: (cd /var/lib/jenkins/workspace/Cforall_master_2@tmp/lib/cfa/x86-debug && { ln -s -f libcfa.so.1.0.0 libcfa.so || { rm -f libcfa.so && ln -s libcfa.so.1.0.0 libcfa.so; }; }) /usr/bin/mkdir -p '/var/lib/jenkins/workspace/Cforall_master_2@tmp/include/cfa//stdhdr' /usr/bin/install -c -m 644 /var/lib/jenkins/workspace/Cforall_master_2/libcfa/src/stdhdr/signal.h /var/lib/jenkins/workspace/Cforall_master_2/libcfa/src/stdhdr/wchar.h /var/lib/jenkins/workspace/Cforall_master_2/libcfa/src/stdhdr/stdatomic.h /var/lib/jenkins/workspace/Cforall_master_2/libcfa/src/stdhdr/stdalign.h /var/lib/jenkins/workspace/Cforall_master_2/libcfa/src/stdhdr/stdlib.h /var/lib/jenkins/workspace/Cforall_master_2/libcfa/src/stdhdr/assert.h /var/lib/jenkins/workspace/Cforall_master_2/libcfa/src/stdhdr/complex.h /var/lib/jenkins/workspace/Cforall_master_2/libcfa/src/stdhdr/tgmath.h /var/lib/jenkins/workspace/Cforall_master_2/libcfa/src/stdhdr/unwind.h /var/lib/jenkins/workspace/Cforall_master_2/libcfa/src/stdhdr/setjmp.h /var/lib/jenkins/workspace/Cforall_master_2/libcfa/src/stdhdr/stdint.h /var/lib/jenkins/workspace/Cforall_master_2/libcfa/src/stdhdr/gmp.h /var/lib/jenkins/workspace/Cforall_master_2/libcfa/src/stdhdr/fenv.h /var/lib/jenkins/workspace/Cforall_master_2/libcfa/src/stdhdr/locale.h /var/lib/jenkins/workspace/Cforall_master_2/libcfa/src/stdhdr/ctype.h /var/lib/jenkins/workspace/Cforall_master_2/libcfa/src/stdhdr/inttypes.h /var/lib/jenkins/workspace/Cforall_master_2/libcfa/src/stdhdr/unistd.h /var/lib/jenkins/workspace/Cforall_master_2/libcfa/src/stdhdr/malloc.h /var/lib/jenkins/workspace/Cforall_master_2/libcfa/src/stdhdr/time.h /var/lib/jenkins/workspace/Cforall_master_2/libcfa/src/stdhdr/threads.h /var/lib/jenkins/workspace/Cforall_master_2/libcfa/src/stdhdr/wctype.h /var/lib/jenkins/workspace/Cforall_master_2/libcfa/src/stdhdr/limits.h /var/lib/jenkins/workspace/Cforall_master_2/libcfa/src/stdhdr/stdio.h /var/lib/jenkins/workspace/Cforall_master_2/libcfa/src/stdhdr/pthread.h /var/lib/jenkins/workspace/Cforall_master_2/libcfa/src/stdhdr/stdarg.h /var/lib/jenkins/workspace/Cforall_master_2/libcfa/src/stdhdr/stdbool.h /var/lib/jenkins/workspace/Cforall_master_2/libcfa/src/stdhdr/iso646.h /var/lib/jenkins/workspace/Cforall_master_2/libcfa/src/stdhdr/string.h /var/lib/jenkins/workspace/Cforall_master_2/libcfa/src/stdhdr/float.h /var/lib/jenkins/workspace/Cforall_master_2/libcfa/src/stdhdr/math.h /var/lib/jenkins/workspace/Cforall_master_2/libcfa/src/stdhdr/errno.h /var/lib/jenkins/workspace/Cforall_master_2/libcfa/src/stdhdr/stddef.h /var/lib/jenkins/workspace/Cforall_master_2/libcfa/src/stdhdr/stdnoreturn.h /var/lib/jenkins/workspace/Cforall_master_2/libcfa/src/stdhdr/uchar.h '/var/lib/jenkins/workspace/Cforall_master_2@tmp/include/cfa//stdhdr' /usr/bin/mkdir -p '/var/lib/jenkins/workspace/Cforall_master_2@tmp/include/cfa//collections' libtool: install: /usr/bin/install -c .libs/libcfa.lai /var/lib/jenkins/workspace/Cforall_master_2@tmp/lib/cfa/x86-debug/libcfa.la /usr/bin/install -c -m 644 /var/lib/jenkins/workspace/Cforall_master_2/libcfa/src/collections/maybe.hfa /var/lib/jenkins/workspace/Cforall_master_2/libcfa/src/collections/pair.hfa /var/lib/jenkins/workspace/Cforall_master_2/libcfa/src/collections/result.hfa /var/lib/jenkins/workspace/Cforall_master_2/libcfa/src/collections/string.hfa /var/lib/jenkins/workspace/Cforall_master_2/libcfa/src/collections/string_res.hfa /var/lib/jenkins/workspace/Cforall_master_2/libcfa/src/collections/vector.hfa /var/lib/jenkins/workspace/Cforall_master_2/libcfa/src/collections/array.hfa /var/lib/jenkins/workspace/Cforall_master_2/libcfa/src/collections/list.hfa /var/lib/jenkins/workspace/Cforall_master_2/libcfa/src/collections/list2.hfa /var/lib/jenkins/workspace/Cforall_master_2/libcfa/src/collections/lockfree.hfa /var/lib/jenkins/workspace/Cforall_master_2/libcfa/src/collections/string_sharectx.hfa /var/lib/jenkins/workspace/Cforall_master_2/libcfa/src/collections/vector2.hfa '/var/lib/jenkins/workspace/Cforall_master_2@tmp/include/cfa//collections' libtool: install: /usr/bin/install -c .libs/libcfathread.so.1.0.0 /var/lib/jenkins/workspace/Cforall_master_2@tmp/lib/cfa/x86-debug/libcfathread.so.1.0.0 libtool: install: (cd /var/lib/jenkins/workspace/Cforall_master_2@tmp/lib/cfa/x86-debug && { ln -s -f libcfathread.so.1.0.0 libcfathread.so.1 || { rm -f libcfathread.so.1 && ln -s libcfathread.so.1.0.0 libcfathread.so.1; }; }) libtool: install: (cd /var/lib/jenkins/workspace/Cforall_master_2@tmp/lib/cfa/x86-debug && { ln -s -f libcfathread.so.1.0.0 libcfathread.so || { rm -f libcfathread.so && ln -s libcfathread.so.1.0.0 libcfathread.so; }; }) libtool: install: /usr/bin/install -c .libs/libcfathread.lai /var/lib/jenkins/workspace/Cforall_master_2@tmp/lib/cfa/x86-debug/libcfathread.la libtool: warning: remember to run 'libtool --finish /var/lib/jenkins/workspace/Cforall_master_2@tmp/lib/cfa/x86-debug/' make[3]: Nothing to be done for 'install-exec-am'. make[3]: Nothing to be done for 'install-data-am'. Making install in libcfa/x86-nodebug Making install in prelude touch .deps/builtins.Po make[3]: Nothing to be done for 'install-exec-am'. /usr/bin/mkdir -p '/var/lib/jenkins/workspace/Cforall_master_2@tmp/lib/cfa/x86-nodebug/' /usr/bin/install -c -m 644 gcc-builtins.cfa builtins.cfa extras.cfa prelude.cfa bootloader.c defines.hfa '/var/lib/jenkins/workspace/Cforall_master_2@tmp/lib/cfa/x86-nodebug/' Making install in src /usr/bin/mkdir -p '/var/lib/jenkins/workspace/Cforall_master_2@tmp/lib/cfa/x86-nodebug/' /bin/bash ../libtool --mode=install /usr/bin/install -c libcfa.la libcfathread.la '/var/lib/jenkins/workspace/Cforall_master_2@tmp/lib/cfa/x86-nodebug/' /usr/bin/mkdir -p '/var/lib/jenkins/workspace/Cforall_master_2@tmp/include/cfa/' /usr/bin/mkdir -p '/var/lib/jenkins/workspace/Cforall_master_2@tmp/include/cfa//stdhdr/sys' /usr/bin/install -c -m 644 /var/lib/jenkins/workspace/Cforall_master_2/libcfa/src/stdhdr/sys/socket.h /var/lib/jenkins/workspace/Cforall_master_2/libcfa/src/stdhdr/sys/time.h /var/lib/jenkins/workspace/Cforall_master_2/libcfa/src/stdhdr/sys/mman.h '/var/lib/jenkins/workspace/Cforall_master_2@tmp/include/cfa//stdhdr/sys' /usr/bin/mkdir -p '/var/lib/jenkins/workspace/Cforall_master_2@tmp/include/cfa//algorithms' /usr/bin/install -c -m 644 /var/lib/jenkins/workspace/Cforall_master_2/libcfa/src/algorithms/range_iterator.hfa '/var/lib/jenkins/workspace/Cforall_master_2@tmp/include/cfa//algorithms' /usr/bin/mkdir -p '/var/lib/jenkins/workspace/Cforall_master_2@tmp/include/cfa//concurrency/kernel' /usr/bin/install -c -m 644 /var/lib/jenkins/workspace/Cforall_master_2/libcfa/src/concurrency/kernel/cluster.hfa /var/lib/jenkins/workspace/Cforall_master_2/libcfa/src/concurrency/kernel/fwd.hfa '/var/lib/jenkins/workspace/Cforall_master_2@tmp/include/cfa//concurrency/kernel' /usr/bin/install -c -m 644 /var/lib/jenkins/workspace/Cforall_master_2/libcfa/src/common.hfa /var/lib/jenkins/workspace/Cforall_master_2/libcfa/src/fstream.hfa /var/lib/jenkins/workspace/Cforall_master_2/libcfa/src/heap.hfa /var/lib/jenkins/workspace/Cforall_master_2/libcfa/src/iostream.hfa /var/lib/jenkins/workspace/Cforall_master_2/libcfa/src/iterator.hfa /var/lib/jenkins/workspace/Cforall_master_2/libcfa/src/limits.hfa /var/lib/jenkins/workspace/Cforall_master_2/libcfa/src/math.hfa /var/lib/jenkins/workspace/Cforall_master_2/libcfa/src/memory.hfa /var/lib/jenkins/workspace/Cforall_master_2/libcfa/src/parseargs.hfa /var/lib/jenkins/workspace/Cforall_master_2/libcfa/src/parseconfig.hfa /var/lib/jenkins/workspace/Cforall_master_2/libcfa/src/rational.hfa /var/lib/jenkins/workspace/Cforall_master_2/libcfa/src/stdlib.hfa /var/lib/jenkins/workspace/Cforall_master_2/libcfa/src/strstream.hfa /var/lib/jenkins/workspace/Cforall_master_2/libcfa/src/time.hfa /var/lib/jenkins/workspace/Cforall_master_2/libcfa/src/Exception.hfa /var/lib/jenkins/workspace/Cforall_master_2/libcfa/src/bitmanip.hfa /var/lib/jenkins/workspace/Cforall_master_2/libcfa/src/clock.hfa /var/lib/jenkins/workspace/Cforall_master_2/libcfa/src/exception.hfa /var/lib/jenkins/workspace/Cforall_master_2/libcfa/src/exception.h /var/lib/jenkins/workspace/Cforall_master_2/libcfa/src/gmp.hfa /var/lib/jenkins/workspace/Cforall_master_2/libcfa/src/math.trait.hfa /var/lib/jenkins/workspace/Cforall_master_2/libcfa/src/raii.hfa /var/lib/jenkins/workspace/Cforall_master_2/libcfa/src/time_t.hfa /var/lib/jenkins/workspace/Cforall_master_2/libcfa/src/virtual_dtor.hfa '/var/lib/jenkins/workspace/Cforall_master_2@tmp/include/cfa//.' /usr/bin/mkdir -p '/var/lib/jenkins/workspace/Cforall_master_2@tmp/include/cfa//concurrency' /usr/bin/install -c -m 644 /var/lib/jenkins/workspace/Cforall_master_2/libcfa/src/concurrency/iofwd.hfa /var/lib/jenkins/workspace/Cforall_master_2/libcfa/src/concurrency/barrier.hfa /var/lib/jenkins/workspace/Cforall_master_2/libcfa/src/concurrency/alarm.hfa /var/lib/jenkins/workspace/Cforall_master_2/libcfa/src/concurrency/coroutine.hfa /var/lib/jenkins/workspace/Cforall_master_2/libcfa/src/concurrency/exception.hfa /var/lib/jenkins/workspace/Cforall_master_2/libcfa/src/concurrency/kernel.hfa /var/lib/jenkins/workspace/Cforall_master_2/libcfa/src/concurrency/locks.hfa /var/lib/jenkins/workspace/Cforall_master_2/libcfa/src/concurrency/monitor.hfa /var/lib/jenkins/workspace/Cforall_master_2/libcfa/src/concurrency/mutex.hfa /var/lib/jenkins/workspace/Cforall_master_2/libcfa/src/concurrency/select.hfa /var/lib/jenkins/workspace/Cforall_master_2/libcfa/src/concurrency/thread.hfa /var/lib/jenkins/workspace/Cforall_master_2/libcfa/src/concurrency/cofor.hfa /var/lib/jenkins/workspace/Cforall_master_2/libcfa/src/concurrency/invoke.h /var/lib/jenkins/workspace/Cforall_master_2/libcfa/src/concurrency/future.hfa /var/lib/jenkins/workspace/Cforall_master_2/libcfa/src/concurrency/once.hfa /var/lib/jenkins/workspace/Cforall_master_2/libcfa/src/concurrency/mutex_stmt.hfa /var/lib/jenkins/workspace/Cforall_master_2/libcfa/src/concurrency/channel.hfa /var/lib/jenkins/workspace/Cforall_master_2/libcfa/src/concurrency/actor.hfa '/var/lib/jenkins/workspace/Cforall_master_2@tmp/include/cfa//concurrency' /usr/bin/mkdir -p '/var/lib/jenkins/workspace/Cforall_master_2@tmp/include/cfa//concurrency/clib' /usr/bin/install -c -m 644 /var/lib/jenkins/workspace/Cforall_master_2/libcfa/src/concurrency/clib/cfathread.h '/var/lib/jenkins/workspace/Cforall_master_2@tmp/include/cfa//concurrency/clib' /usr/bin/mkdir -p '/var/lib/jenkins/workspace/Cforall_master_2@tmp/include/cfa//device' /usr/bin/install -c -m 644 /var/lib/jenkins/workspace/Cforall_master_2/libcfa/src/device/cpu.hfa '/var/lib/jenkins/workspace/Cforall_master_2@tmp/include/cfa//device' /usr/bin/mkdir -p '/var/lib/jenkins/workspace/Cforall_master_2@tmp/include/cfa//stdhdr/libltdl' /usr/bin/install -c -m 644 /var/lib/jenkins/workspace/Cforall_master_2/libcfa/src/stdhdr/libltdl/lt_dlloader.h '/var/lib/jenkins/workspace/Cforall_master_2@tmp/include/cfa//stdhdr/libltdl' /usr/bin/mkdir -p '/var/lib/jenkins/workspace/Cforall_master_2@tmp/include/cfa//vec' /usr/bin/install -c -m 644 /var/lib/jenkins/workspace/Cforall_master_2/libcfa/src/vec/vec.hfa /var/lib/jenkins/workspace/Cforall_master_2/libcfa/src/vec/vec2.hfa /var/lib/jenkins/workspace/Cforall_master_2/libcfa/src/vec/vec3.hfa /var/lib/jenkins/workspace/Cforall_master_2/libcfa/src/vec/vec4.hfa '/var/lib/jenkins/workspace/Cforall_master_2@tmp/include/cfa//vec' libtool: install: /usr/bin/install -c .libs/libcfa.so.1.0.0 /var/lib/jenkins/workspace/Cforall_master_2@tmp/lib/cfa/x86-nodebug/libcfa.so.1.0.0 /usr/bin/mkdir -p '/var/lib/jenkins/workspace/Cforall_master_2@tmp/include/cfa//bits' /usr/bin/install -c -m 644 /var/lib/jenkins/workspace/Cforall_master_2/libcfa/src/bits/weakso_locks.hfa /var/lib/jenkins/workspace/Cforall_master_2/libcfa/src/bits/algorithm.hfa /var/lib/jenkins/workspace/Cforall_master_2/libcfa/src/bits/align.hfa /var/lib/jenkins/workspace/Cforall_master_2/libcfa/src/bits/collections.hfa /var/lib/jenkins/workspace/Cforall_master_2/libcfa/src/bits/debug.hfa /var/lib/jenkins/workspace/Cforall_master_2/libcfa/src/bits/defs.hfa /var/lib/jenkins/workspace/Cforall_master_2/libcfa/src/bits/locks.hfa /var/lib/jenkins/workspace/Cforall_master_2/libcfa/src/bits/collection.hfa /var/lib/jenkins/workspace/Cforall_master_2/libcfa/src/bits/stack.hfa /var/lib/jenkins/workspace/Cforall_master_2/libcfa/src/bits/queue.hfa /var/lib/jenkins/workspace/Cforall_master_2/libcfa/src/bits/sequence.hfa /var/lib/jenkins/workspace/Cforall_master_2/libcfa/src/bits/atomic.hfa /var/lib/jenkins/workspace/Cforall_master_2/libcfa/src/bits/random.hfa '/var/lib/jenkins/workspace/Cforall_master_2@tmp/include/cfa//bits' /usr/bin/mkdir -p '/var/lib/jenkins/workspace/Cforall_master_2@tmp/include/cfa//stdhdr' libtool: install: (cd /var/lib/jenkins/workspace/Cforall_master_2@tmp/lib/cfa/x86-nodebug && { ln -s -f libcfa.so.1.0.0 libcfa.so.1 || { rm -f libcfa.so.1 && ln -s libcfa.so.1.0.0 libcfa.so.1; }; }) /usr/bin/install -c -m 644 /var/lib/jenkins/workspace/Cforall_master_2/libcfa/src/stdhdr/signal.h /var/lib/jenkins/workspace/Cforall_master_2/libcfa/src/stdhdr/wchar.h /var/lib/jenkins/workspace/Cforall_master_2/libcfa/src/stdhdr/stdatomic.h /var/lib/jenkins/workspace/Cforall_master_2/libcfa/src/stdhdr/stdalign.h /var/lib/jenkins/workspace/Cforall_master_2/libcfa/src/stdhdr/stdlib.h /var/lib/jenkins/workspace/Cforall_master_2/libcfa/src/stdhdr/assert.h /var/lib/jenkins/workspace/Cforall_master_2/libcfa/src/stdhdr/complex.h /var/lib/jenkins/workspace/Cforall_master_2/libcfa/src/stdhdr/tgmath.h /var/lib/jenkins/workspace/Cforall_master_2/libcfa/src/stdhdr/unwind.h /var/lib/jenkins/workspace/Cforall_master_2/libcfa/src/stdhdr/setjmp.h /var/lib/jenkins/workspace/Cforall_master_2/libcfa/src/stdhdr/stdint.h /var/lib/jenkins/workspace/Cforall_master_2/libcfa/src/stdhdr/gmp.h /var/lib/jenkins/workspace/Cforall_master_2/libcfa/src/stdhdr/fenv.h /var/lib/jenkins/workspace/Cforall_master_2/libcfa/src/stdhdr/locale.h /var/lib/jenkins/workspace/Cforall_master_2/libcfa/src/stdhdr/ctype.h /var/lib/jenkins/workspace/Cforall_master_2/libcfa/src/stdhdr/inttypes.h /var/lib/jenkins/workspace/Cforall_master_2/libcfa/src/stdhdr/unistd.h /var/lib/jenkins/workspace/Cforall_master_2/libcfa/src/stdhdr/malloc.h /var/lib/jenkins/workspace/Cforall_master_2/libcfa/src/stdhdr/time.h /var/lib/jenkins/workspace/Cforall_master_2/libcfa/src/stdhdr/threads.h /var/lib/jenkins/workspace/Cforall_master_2/libcfa/src/stdhdr/wctype.h /var/lib/jenkins/workspace/Cforall_master_2/libcfa/src/stdhdr/limits.h /var/lib/jenkins/workspace/Cforall_master_2/libcfa/src/stdhdr/stdio.h /var/lib/jenkins/workspace/Cforall_master_2/libcfa/src/stdhdr/pthread.h /var/lib/jenkins/workspace/Cforall_master_2/libcfa/src/stdhdr/stdarg.h /var/lib/jenkins/workspace/Cforall_master_2/libcfa/src/stdhdr/stdbool.h /var/lib/jenkins/workspace/Cforall_master_2/libcfa/src/stdhdr/iso646.h /var/lib/jenkins/workspace/Cforall_master_2/libcfa/src/stdhdr/string.h /var/lib/jenkins/workspace/Cforall_master_2/libcfa/src/stdhdr/float.h /var/lib/jenkins/workspace/Cforall_master_2/libcfa/src/stdhdr/math.h /var/lib/jenkins/workspace/Cforall_master_2/libcfa/src/stdhdr/errno.h /var/lib/jenkins/workspace/Cforall_master_2/libcfa/src/stdhdr/stddef.h /var/lib/jenkins/workspace/Cforall_master_2/libcfa/src/stdhdr/stdnoreturn.h /var/lib/jenkins/workspace/Cforall_master_2/libcfa/src/stdhdr/uchar.h '/var/lib/jenkins/workspace/Cforall_master_2@tmp/include/cfa//stdhdr' libtool: install: (cd /var/lib/jenkins/workspace/Cforall_master_2@tmp/lib/cfa/x86-nodebug && { ln -s -f libcfa.so.1.0.0 libcfa.so || { rm -f libcfa.so && ln -s libcfa.so.1.0.0 libcfa.so; }; }) /usr/bin/mkdir -p '/var/lib/jenkins/workspace/Cforall_master_2@tmp/include/cfa//collections' /usr/bin/install -c -m 644 /var/lib/jenkins/workspace/Cforall_master_2/libcfa/src/collections/maybe.hfa /var/lib/jenkins/workspace/Cforall_master_2/libcfa/src/collections/pair.hfa /var/lib/jenkins/workspace/Cforall_master_2/libcfa/src/collections/result.hfa /var/lib/jenkins/workspace/Cforall_master_2/libcfa/src/collections/string.hfa /var/lib/jenkins/workspace/Cforall_master_2/libcfa/src/collections/string_res.hfa /var/lib/jenkins/workspace/Cforall_master_2/libcfa/src/collections/vector.hfa /var/lib/jenkins/workspace/Cforall_master_2/libcfa/src/collections/array.hfa /var/lib/jenkins/workspace/Cforall_master_2/libcfa/src/collections/list.hfa /var/lib/jenkins/workspace/Cforall_master_2/libcfa/src/collections/list2.hfa /var/lib/jenkins/workspace/Cforall_master_2/libcfa/src/collections/lockfree.hfa /var/lib/jenkins/workspace/Cforall_master_2/libcfa/src/collections/string_sharectx.hfa /var/lib/jenkins/workspace/Cforall_master_2/libcfa/src/collections/vector2.hfa '/var/lib/jenkins/workspace/Cforall_master_2@tmp/include/cfa//collections' libtool: install: /usr/bin/install -c .libs/libcfa.lai /var/lib/jenkins/workspace/Cforall_master_2@tmp/lib/cfa/x86-nodebug/libcfa.la libtool: install: /usr/bin/install -c .libs/libcfathread.so.1.0.0 /var/lib/jenkins/workspace/Cforall_master_2@tmp/lib/cfa/x86-nodebug/libcfathread.so.1.0.0 libtool: install: (cd /var/lib/jenkins/workspace/Cforall_master_2@tmp/lib/cfa/x86-nodebug && { ln -s -f libcfathread.so.1.0.0 libcfathread.so.1 || { rm -f libcfathread.so.1 && ln -s libcfathread.so.1.0.0 libcfathread.so.1; }; }) libtool: install: (cd /var/lib/jenkins/workspace/Cforall_master_2@tmp/lib/cfa/x86-nodebug && { ln -s -f libcfathread.so.1.0.0 libcfathread.so || { rm -f libcfathread.so && ln -s libcfathread.so.1.0.0 libcfathread.so; }; }) libtool: install: /usr/bin/install -c .libs/libcfathread.lai /var/lib/jenkins/workspace/Cforall_master_2@tmp/lib/cfa/x86-nodebug/libcfathread.la libtool: warning: remember to run 'libtool --finish /var/lib/jenkins/workspace/Cforall_master_2@tmp/lib/cfa/x86-nodebug/' make[3]: Nothing to be done for 'install-exec-am'. make[3]: Nothing to be done for 'install-data-am'. [Pipeline] } [Pipeline] // dir [Pipeline] } [Pipeline] // stage [Pipeline] sh + free -h total used free shared buff/cache available Mem: 62Gi 1.9Gi 58Gi 4.9Mi 3.5Gi 60Gi Swap: 8.0Gi 0B 8.0Gi [Pipeline] sh + ulimit -a time(seconds) unlimited file(blocks) unlimited data(kbytes) unlimited stack(kbytes) 8192 coredump(blocks) 0 memory(kbytes) unlimited locked memory(kbytes) 8238436 process 257124 nofiles 1048576 vmemory(kbytes) unlimited locks unlimited rtprio 0 [Pipeline] echo -------- Test: Debug -------- [Pipeline] stage [Pipeline] { (Test: Debug) [Pipeline] dir Running in /var/lib/jenkins/workspace/Cforall_master_2@tmp [Pipeline] { [Pipeline] sh + nproc + make -j 16 --no-print-directory -C tests timeout=600 global-timeout=14400 tests debug=yes archive-errors=/var/lib/jenkins/workspace/Cforall_master_2@tmp/tests/crashes/full-debug Running 375 tests on 16 cores (x86 - debug) array-ERR3 PASSED C 0:00.063 - R n/a array-ERR2 PASSED C 0:00.070 - R n/a ...ollections/language-dim-mismatch PASSED C 0:00.262 - R n/a array-ERR1 PASSED C 0:01.071 - R n/a array-collections/safety-summary PASSED C 0:00.707 - R n/a array PASSED C 0:01.127 - R 0:00.021 array-collections/c-dependent PASSED C 0:01.480 - R 0:00.022 array-collections/array-raii-c PASSED C 0:01.680 - R 0:00.013 array-collections/symtab-collision PASSED C 0:00.612 - R n/a array-collections/dimexpr-match-c PASSED C 0:02.084 - R 0:00.013 array-collections/array-sbscr-types PASSED C 0:02.137 - R 0:00.020 array-collections/boxed PASSED C 0:02.566 - R 0:00.010 array-collections/array-basic PASSED C 0:02.619 - R 0:00.019 castError PASSED C 0:00.949 - R n/a attr-priority PASSED C 0:01.672 - R 0:00.003 cast PASSED C 0:01.449 - R 0:00.022 builtins/sync PASSED C 0:01.651 - R 0:00.010 array-collections/dimexpr-match-cfa PASSED C 0:03.247 - R 0:00.020 castReturn PASSED C 0:01.440 - R 0:00.007 alloc-ERROR PASSED C 0:06.538 - R n/a avl_test PASSED C 0:05.710 - R 0:00.011 array-collections/accordion PASSED C 0:07.035 - R 0:00.006 algorithms/range_test PASSED C 0:07.471 - R 0:00.006 array-collections/array-raii-cfa PASSED C 0:08.294 - R 0:00.007 collections/stack PASSED C 0:08.918 - R 0:00.006 collections/multi_list PASSED C 0:09.377 - R 0:00.006 alloc PASSED C 0:12.209 - R 0:00.010 collections/queue PASSED C 0:10.085 - R 0:00.007 collections/string-gc PASSED C 0:06.758 - R 0:00.008 collections/sequence PASSED C 0:10.689 - R 0:00.007 collections/string-operator-ERR09 PASSED C 0:05.298 - R n/a collections/string-compare PASSED C 0:10.433 - R 0:00.006 collections/string-ctx-manage PASSED C 0:10.487 - R 0:00.007 collections/string-istream PASSED C 0:07.522 - R 0:00.006 alloc2 PASSED C 0:16.237 - R 0:00.007 collections/string-operator-ERR11 PASSED C 0:05.286 - R n/a ...ns/vector-err-retn-perm-it-byval PASSED C 0:02.618 - R n/a ...ns/vector-err-pass-perm-it-byval PASSED C 0:03.053 - R n/a ...ions/string-api-coverage-noshare PASSED C 0:13.966 - R 0:00.006 collections/string-operator PASSED C 0:09.704 - R 0:00.009 collections/string-operator-ERR13 PASSED C 0:05.297 - R n/a collections/string-istream-manip PASSED C 0:10.364 - R 0:00.012 collections/string-operator-ERR15 PASSED C 0:05.298 - R n/a collections/string-api-coverage PASSED C 0:14.672 - R 0:00.010 collections/string-operator-ERR16 PASSED C 0:05.305 - R n/a collections/vector-demo PASSED C 0:05.537 - R 0:00.006 complex PASSED C 0:06.344 - R 0:00.020 collections/string-ostream PASSED C 0:09.440 - R 0:00.006 collections/atomic_mpsc PASSED C 0:11.651 - R 0:09.947 collections/string-overwrite PASSED C 0:11.803 - R 0:00.009 ...ections/string-overwrite-noshare PASSED C 0:11.939 - R 0:00.011 concurrency/barrier/generation PASSED C 0:13.126 - R 0:00.424 concurrency/barrier/last PASSED C 0:13.520 - R 0:00.104 concurrency/actors/inline PASSED C 0:17.218 - R 0:00.037 concurrency/actors/executor PASSED C 0:17.741 - R 0:00.038 concurrency/actors/poison PASSED C 0:17.412 - R 0:00.074 concurrency/actors/pingpong PASSED C 0:17.726 - R 0:00.068 concurrency/actors/static PASSED C 0:17.345 - R 0:00.226 concurrency/actors/inherit PASSED C 0:17.905 - R 0:00.068 concurrency/actors/matrixMultiply PASSED C 0:17.632 - R 0:00.718 concurrency/actors/types PASSED C 0:17.836 - R 0:00.120 concurrency/barrier/order PASSED C 0:13.809 - R 0:00.071 concurrency/ctor-check PASSED C 0:00.882 - R n/a concurrency/clib_tls PASSED C 0:02.445 - R 0:00.014 concurrency/clib PASSED C 0:02.443 - R 0:00.221 concurrency/actors/dynamic PASSED C 0:17.560 - R 0:03.632 concurrency/cluster PASSED C 0:07.722 - R 0:00.017 concurrency/cofor PASSED C 0:09.856 - R 0:00.009 concurrency/coroutineYield PASSED C 0:11.218 - R 0:00.035 concurrency/examples/gortn PASSED C 0:10.908 - R 0:00.012 concurrency/channels/big_elems PASSED C 0:15.132 - R 0:10.628 concurrency/examples/datingService PASSED C 0:11.166 - R 0:00.019 concurrency/channels/churn PASSED C 0:14.970 - R 0:10.075 concurrency/examples/matrixSum PASSED C 0:10.766 - R 0:00.010 concurrency/keywordErrors PASSED C 0:00.368 - R n/a concurrency/channels/contend PASSED C 0:14.795 - R 0:10.065 concurrency/channels/daisy_chain PASSED C 0:14.589 - R 0:10.058 concurrency/mainError PASSED C 0:00.288 - R n/a concurrency/futures/abandon PASSED C 0:08.252 - R 0:00.118 concurrency/futures/basic PASSED C 0:07.757 - R 0:00.069 ...rrency/examples/boundedBufferINT PASSED C 0:11.355 - R 0:07.090 ...rrency/examples/boundedBufferEXT PASSED C 0:11.521 - R 0:07.288 concurrency/examples/quickSort PASSED C 0:13.016 - R 0:00.016 concurrency/channels/hot_potato PASSED C 0:14.666 - R 0:10.045 concurrency/channels/ping_pong PASSED C 0:15.819 - R 0:10.041 concurrency/channels/pub_sub PASSED C 0:15.183 - R 0:10.058 concurrency/channels/zero_size PASSED C 0:14.853 - R 0:10.047 concurrency/join PASSED C 0:11.029 - R 0:00.018 concurrency/migrate PASSED C 0:11.409 - R 0:00.069 concurrency/lockfree_stack PASSED C 0:10.775 - R 0:02.030 concurrency/futures/wait_any PASSED C 0:14.391 - R 0:00.019 concurrency/park/contention PASSED C 0:07.920 - R 0:00.168 concurrency/futures/typed PASSED C 0:17.560 - R 0:00.172 concurrency/mutexstmt/monitors PASSED C 0:08.950 - R 0:02.974 concurrency/park/start_parked PASSED C 0:08.206 - R 0:00.036 concurrency/mutexstmt/tuple PASSED C 0:13.445 - R 0:00.013 concurrency/once PASSED C 0:13.456 - R 0:00.121 ...urrency/pthread/pthread_key_test PASSED C 0:03.399 - R 0:00.014 concurrency/park/force_preempt PASSED C 0:11.837 - R 0:00.318 ...rrency/pthread/pthread_attr_test PASSED C 0:11.114 - R 0:00.011 ...rrency/pthread/pthread_cond_test PASSED C 0:10.904 - R 0:00.011 ...pthread/pthread_demo_create_join PASSED C 0:11.750 - R 0:00.023 concurrency/monitor PASSED C 0:10.886 - R 0:14.263 concurrency/futures/future_except PASSED C 0:27.231 - R 0:00.023 ...rrency/pthread/pthread_once_test PASSED C 0:11.102 - R 0:00.034 concurrency/readyQ/barrier_sleeper PASSED C 0:13.547 - R 0:00.483 concurrency/readyQ/leader_spin PASSED C 0:11.639 - R 0:01.633 concurrency/multi-monitor PASSED C 0:10.958 - R 0:17.931 concurrency/signal/block PASSED C 0:11.636 - R 0:01.376 ...rrency/pthread/pthread_demo_lock PASSED C 0:11.110 - R 0:07.289 concurrency/signal/wait PASSED C 0:11.982 - R 0:00.219 concurrency/signal/disjoint PASSED C 0:11.518 - R 0:02.124 concurrency/preempt PASSED C 0:13.023 - R 0:11.800 concurrency/suspend_then PASSED C 0:11.469 - R 0:00.035 concurrency/sleep PASSED C 0:11.468 - R 0:01.171 concurrency/thread PASSED C 0:13.740 - R 0:00.019 ...ency/unified_locking/exp_backoff PASSED C 0:12.935 - R 0:00.037 .../unified_locking/block_spin_lock PASSED C 0:12.924 - R 0:00.420 concurrency/preempt2 PASSED C 0:11.462 - R 0:20.625 .../unified_locking/fast_block_lock PASSED C 0:13.817 - R 0:00.035 ...cy/unified_locking/pthread_locks PASSED C 0:10.154 - R 0:00.423 ...ncy/unified_locking/timeout_lock PASSED C 0:09.951 - R 0:01.123 ...fied_locking/mcs_block_spin_lock PASSED C 0:13.724 - R 0:00.117 ...nified_locking/simple_owner_lock PASSED C 0:13.318 - R 0:00.036 concurrency/waitfor/barge PASSED C 0:11.603 - R 0:00.422 concurrency/waitfor/else PASSED C 0:09.571 - R 0:00.007 concurrency/waitfor/parse PASSED C 0:07.318 - R 0:00.022 ...urrency/waitfor/lexical_priority PASSED C 0:11.107 - R 0:00.009 concurrency/waitfor/dtor PASSED C 0:10.983 - R 0:01.374 concurrency/waitfor/recurse PASSED C 0:11.267 - R 0:01.474 concurrency/waitfor/statment PASSED C 0:11.565 - R 0:00.035 concurrency/unified_locking/mcs PASSED C 0:13.116 - R 0:11.701 concurrency/waitfor/when PASSED C 0:11.535 - R 0:00.272 concurrency/waituntil/basic_else PASSED C 0:19.204 - R 0:00.013 ...ency/waituntil/channel_zero_size PASSED C 0:12.193 - R 0:05.479 configs/parsebools PASSED C 0:08.883 - R 0:00.035 concurrency/waituntil/timeout PASSED C 0:07.055 - R 0:03.123 concurrency/waituntil/one_chan PASSED C 0:11.236 - R 0:01.219 const-init PASSED C 0:01.083 - R 0:00.010 const-ref PASSED C 0:01.126 - R 0:00.005 copyfile PASSED C 0:06.022 - R 0:00.007 concurrency/waituntil/channel_close PASSED C 0:16.321 - R 0:10.045 configs/parseconfig PASSED C 0:08.629 - R 0:00.008 configs/usage PASSED C 0:08.710 - R 0:00.033 coroutine/devicedriver PASSED C 0:07.521 - R 0:00.036 concurrency/waituntil/channels PASSED C 0:12.025 - R 0:14.707 coroutine/fibonacci PASSED C 0:07.833 - R 0:00.033 concurrency/waituntil/futures PASSED C 0:27.691 - R 0:00.037 coroutine/fmtLines PASSED C 0:07.419 - R 0:00.023 coroutine/pingpong PASSED C 0:08.242 - R 0:00.007 ...ency/unified_locking/futex_mutex PASSED C 0:12.813 - R 0:37.416 counter PASSED C 0:06.160 - R 0:00.035 coroutine/raii PASSED C 0:07.562 - R 0:00.018 coroutine/runningTotal PASSED C 0:07.647 - R 0:00.019 ctrl-flow/break-misc PASSED C 0:06.747 - R 0:00.012 ctrl-flow/labelledExit PASSED C 0:01.097 - R 0:00.011 ctrl-flow/loop-inc PASSED C 0:01.498 - R 0:00.010 ctrl-flow/fallthrough PASSED C 0:06.437 - R 0:00.020 coroutine/prodcons PASSED C 0:09.968 - R 0:00.036 designations PASSED C 0:02.253 - R 0:00.010 enum PASSED C 0:01.140 - R 0:00.020 ctrl-flow/goto PASSED C 0:06.368 - R 0:00.019 ctrl-flow/ifwhileCtl PASSED C 0:06.458 - R 0:00.018 concurrency/waituntil/all_types PASSED C 0:34.150 - R 0:08.247 ctrl-flow/loop_else PASSED C 0:06.584 - R 0:00.022 enum_tests/funcEnum PASSED C 0:01.981 - R 0:00.006 enum_tests/lvalue PASSED C 0:00.841 - R n/a enum_tests/inc-dec PASSED C 0:01.735 - R 0:00.020 ctrl-flow/loopctrl PASSED C 0:07.618 - R 0:00.013 ctrl-flow/loop_else-WRN1 PASSED C 0:08.218 - R 0:00.001 enum_tests/anonymous PASSED C 0:05.921 - R 0:00.007 ...urrency/unified_locking/mcs_spin PASSED C 0:12.831 - R 0:46.250 errors/declaration PASSED C 0:00.148 - R n/a errors/scope PASSED C 0:00.660 - R n/a div PASSED C 0:08.595 - R 0:00.005 errors/signature PASSED C 0:00.096 - R n/a errors/scope-type PASSED C 0:00.143 - R n/a enum_tests/structEnum PASSED C 0:02.237 - R 0:00.005 enum_tests/enumInlineValue PASSED C 0:07.539 - R 0:00.021 device/cpu PASSED C 0:09.849 - R 0:00.019 .../unified_locking/spin_queue_lock PASSED C 0:12.920 - R 0:46.288 eval PASSED C 0:01.139 - R 0:00.005 enum_tests/input PASSED C 0:07.176 - R 0:00.007 enum_tests/stringEnum PASSED C 0:06.072 - R 0:00.017 enum_tests/planet PASSED C 0:07.949 - R 0:00.007 enum_tests/typedIntEnum PASSED C 0:06.233 - R 0:00.020 enum_tests/voidEnum PASSED C 0:05.819 - R 0:00.006 concurrency/waituntil/repeat_close PASSED C 0:12.924 - R 0:30.047 enum_tests/position PASSED C 0:08.643 - R 0:00.006 exceptions/conditional PASSED C 0:06.296 - R 0:00.006 exceptions/data-except PASSED C 0:06.607 - R 0:00.019 exceptions/message PASSED C 0:02.427 - R 0:00.006 exceptions/cancel/coroutine PASSED C 0:08.103 - R 0:00.010 exceptions/conditional-threads PASSED C 0:07.632 - R 0:00.009 exceptions/defaults PASSED C 0:06.620 - R 0:00.005 exceptions/finally PASSED C 0:06.242 - R 0:00.007 exceptions/cancel/thread PASSED C 0:11.107 - R 0:00.008 exceptions/try-ctrl-flow PASSED C 0:00.335 - R n/a exceptions/cor_resumer PASSED C 0:10.881 - R 0:00.007 exceptions/defaults-threads PASSED C 0:08.121 - R 0:00.011 exceptions/interact PASSED C 0:06.373 - R 0:00.009 exceptions/finally-threads PASSED C 0:07.634 - R 0:00.010 exceptions/type-check PASSED C 0:00.435 - R n/a exceptions/try-leave-catch PASSED C 0:01.178 - R 0:00.007 expression PASSED C 0:01.159 - R 0:00.007 exceptions/fibonacci_nonlocal PASSED C 0:09.210 - R 0:00.008 exceptions/polymorphic PASSED C 0:06.276 - R 0:00.005 exceptions/resume PASSED C 0:06.499 - R 0:00.006 concurrency/mutexstmt/locks PASSED C 0:11.018 - R 1:31.881 concurrency/waituntil/locks PASSED C 0:13.809 - R 0:42.654 exceptions/terminate PASSED C 0:06.497 - R 0:00.006 global-monomorph PASSED C 0:01.110 - R 0:00.006 exceptions/resume-threads PASSED C 0:08.326 - R 0:00.011 exceptions/trash PASSED C 0:06.254 - R 0:00.006 identFuncDeclarator PASSED C 0:01.082 - R 0:00.007 exceptions/terminate-threads PASSED C 0:08.333 - R 0:00.012 identParamDeclarator PASSED C 0:01.113 - R 0:00.006 exceptions/virtual-poly PASSED C 0:06.325 - R 0:00.006 exceptions/pingpong_nonlocal PASSED C 0:11.650 - R 0:00.019 fstream_test PASSED C 0:06.185 - R 0:00.007 forall PASSED C 0:06.968 - R 0:00.006 generator/fibonacci PASSED C 0:06.025 - R 0:00.019 exceptions/virtual-cast PASSED C 0:07.959 - R 0:00.007 generator/fmtLines PASSED C 0:06.036 - R 0:00.008 init1-ERROR PASSED C 0:00.620 - R n/a init1 PASSED C 0:01.124 - R 0:00.019 generator/suspend_then PASSED C 0:06.106 - R 0:00.020 include/vector-sequence PASSED C 0:01.818 - R 0:00.005 genericUnion PASSED C 0:06.221 - R 0:00.036 include/vector-collections PASSED C 0:02.710 - R 0:00.035 function-operator PASSED C 0:08.692 - R 0:00.006 hello PASSED C 0:06.574 - R 0:00.021 identity PASSED C 0:06.946 - R 0:00.020 include/stdincludes PASSED C 0:06.549 - R 0:00.007 include/vector-fstream PASSED C 0:06.391 - R 0:00.019 io/eofType PASSED C 0:06.447 - R 0:00.019 limits PASSED C 0:01.600 - R 0:00.021 io/io PASSED C 0:10.175 - R 0:00.034 linking/exception-nothreads PASSED C 0:04.466 - R 0:00.020 io/manipulatorsOutput4 PASSED C 0:08.643 - R 0:00.024 io/io-acquire-in PASSED C 0:12.460 - R 0:00.036 io/io-acquire PASSED C 0:12.581 - R 0:00.221 io/manipulatorsInput-uchunk PASSED C 0:09.395 - R 0:00.118 io/away_fair PASSED C 0:14.404 - R 0:00.167 io/io-acquire-out PASSED C 0:12.319 - R 0:00.066 io/io-acquire2 PASSED C 0:12.007 - R 0:00.069 linking/nostdlib PASSED C 0:01.296 - R 0:00.020 io/io-acquire-no-io PASSED C 0:11.448 - R 0:02.373 linkonce PASSED C 0:01.422 - R 0:00.021 io/comp_fair PASSED C 0:15.697 - R 0:00.522 io/comp_basic PASSED C 0:16.314 - R 0:00.222 linking/exception-withthreads PASSED C 0:06.672 - R 0:00.010 maybe PASSED C 0:01.388 - R 0:00.019 io/many_read PASSED C 0:14.934 - R 0:00.022 linking/mangling/anon PASSED C 0:06.543 - R 0:00.027 nested-types-ERR1 PASSED C 0:00.128 - R n/a nested-types-ERR2 PASSED C 0:00.181 - R n/a include/includes PASSED C 0:22.803 - R 0:00.006 nested-types PASSED C 0:01.123 - R 0:00.006 list/dlist-insert-remove PASSED C 0:06.575 - R 0:00.009 linking/io-acquire PASSED C 0:08.662 - R 0:00.006 literals PASSED C 0:06.819 - R 0:00.014 nowarn/array PASSED C 0:01.582 - R 0:00.019 list/dlist2-insert-remove PASSED C 0:07.154 - R 0:00.035 linking/nothreads PASSED C 0:08.443 - R 0:00.007 nowarn/exception PASSED C 0:01.324 - R 0:00.018 opt-params PASSED C 0:00.129 - R n/a nowarn/no-autogen PASSED C 0:01.220 - R 0:00.018 nowarn/printf-sizeof PASSED C 0:01.364 - R 0:00.009 meta/fork+exec PASSED C 0:04.760 - R 0:00.069 nowarn/unused PASSED C 0:01.173 - R 0:00.022 nowarn/zero-thunk PASSED C 0:01.266 - R 0:00.014 linking/weakso_nothd PASSED C 0:08.973 - R 0:00.007 numericConstants PASSED C 0:01.279 - R 0:00.021 operators PASSED C 0:01.243 - R 0:00.009 polybits PASSED C 0:00.235 - R n/a poly-bare-assn PASSED C 0:01.202 - R 0:00.023 poly-d-cycle PASSED C 0:01.336 - R 0:00.006 poly-many-arsz PASSED C 0:01.314 - R 0:00.022 poly-member PASSED C 0:01.261 - R 0:00.039 poly-o-cycle PASSED C 0:01.295 - R 0:00.020 poly-selection PASSED C 0:01.067 - R 0:00.011 poly-self-cycle PASSED C 0:01.365 - R 0:00.018 raii/ctor-autogen-ERR1 PASSED C 0:00.817 - R n/a quasiKeyword PASSED C 0:01.431 - R 0:00.023 meta/dumpable PASSED C 0:08.554 - R 0:00.011 linking/withthreads PASSED C 0:11.191 - R 0:00.008 malloc PASSED C 0:09.656 - R 0:00.017 raii/ctor-autogen PASSED C 0:01.998 - R 0:00.021 raii/init_once PASSED C 0:01.593 - R 0:00.007 heap PASSED C 0:08.747 - R 0:22.642 raii/partial-ERR1 PASSED C 0:00.791 - R n/a raii/typeof-member PASSED C 0:01.053 - R 0:00.012 raii/partial PASSED C 0:01.160 - R 0:00.006 result PASSED C 0:01.456 - R 0:00.007 raii/dtor-early-exit-ERR2 PASSED C 0:04.666 - R n/a raii/dtor-early-exit-ERR1 PASSED C 0:04.782 - R n/a minmax PASSED C 0:10.782 - R 0:00.005 simpleGenericTriple PASSED C 0:01.236 - R 0:00.006 raii/memberCtors-ERR1 PASSED C 0:04.018 - R n/a polymorphism PASSED C 0:06.462 - R 0:00.007 quotedKeyword PASSED C 0:06.386 - R 0:00.005 smart-pointers PASSED C 0:01.316 - R 0:00.005 raii/boxed-types PASSED C 0:06.948 - R 0:00.007 raii/globals PASSED C 0:06.428 - R 0:00.007 switch PASSED C 0:01.195 - R 0:00.007 raii/memberCtors PASSED C 0:06.661 - R 0:00.006 tuple/tupleCast PASSED C 0:01.099 - R 0:00.005 tuple/tupleFunction PASSED C 0:01.264 - R 0:00.011 tuple/tupleMember PASSED C 0:01.232 - R 0:00.005 raii/dtor-early-exit PASSED C 0:08.680 - R 0:00.007 typedefRedef-ERR1 PASSED C 0:00.113 - R n/a tuple/tuplePolymorphism PASSED C 0:01.348 - R 0:00.005 shortCircuit PASSED C 0:06.114 - R 0:00.007 references PASSED C 0:06.488 - R 0:00.006 var-assert PASSED C 0:00.134 - R n/a typedefRedef PASSED C 0:01.054 - R 0:00.011 typeof PASSED C 0:01.064 - R 0:00.007 variableDeclarator PASSED C 0:01.088 - R 0:00.006 sizeof PASSED C 0:06.539 - R 0:00.006 searchsort PASSED C 0:08.581 - R 0:00.009 strstream PASSED C 0:06.600 - R 0:00.012 tuple/tupleVariadic PASSED C 0:04.155 - R 0:00.007 tuple/tupleAssign PASSED C 0:07.002 - R 0:00.007 sum PASSED C 0:08.575 - R 0:00.009 time PASSED C 0:08.208 - R 0:00.007 swap PASSED C 0:08.855 - R 0:00.007 tuplearray PASSED C 0:06.453 - R 0:00.021 withconflict PASSED C 0:00.588 - R n/a voidPtr PASSED C 0:01.098 - R 0:00.006 warnings/self-assignment PASSED C 0:01.044 - R 0:00.003 userLiterals PASSED C 0:06.687 - R 0:00.005 KRfunctions PASSED C 0:01.037 - R 0:00.003 vector PASSED C 0:08.039 - R 0:00.009 ...collections/dimexpr-match-c-ERRS PASSED C 0:00.763 - R n/a vector_math/vec2_double PASSED C 0:08.854 - R 0:00.007 zero_one-ERR1 PASSED C 0:03.379 - R n/a arithmeticConversions PASSED C 0:02.598 - R 0:00.018 ...llections/dimexpr-match-cfa-ERRS PASSED C 0:01.400 - R n/a attributes PASSED C 0:01.412 - R 0:00.001 vector_math/vec2_uint PASSED C 0:08.904 - R 0:00.010 zero_one PASSED C 0:06.181 - R 0:00.021 vector_math/vec2_float PASSED C 0:12.973 - R 0:00.007 vector_math/vec2_int PASSED C 0:12.691 - R 0:00.006 vector_math/vec3_int PASSED C 0:11.353 - R 0:00.007 errors/completeType PASSED C 0:00.611 - R n/a declarationSpecifier PASSED C 0:01.073 - R 0:00.003 abs PASSED C 0:08.393 - R 0:00.019 vector_math/vec3_float PASSED C 0:13.254 - R 0:00.014 vector_math/vec4_float PASSED C 0:13.009 - R 0:00.036 vector_math/vec4_int PASSED C 0:11.803 - R 0:00.006 extension PASSED C 0:01.042 - R 0:00.003 functions PASSED C 0:01.081 - R 0:00.002 gccExtensions PASSED C 0:01.054 - R 0:00.001 ato PASSED C 0:09.116 - R 0:00.019 bitmanip1 PASSED C 0:10.548 - R 0:00.011 bitmanip2 PASSED C 0:09.870 - R 0:00.018 meta/arch PASSED C 0:00.588 - R n/a rational PASSED C 0:27.746 - R 0:00.007 configs/parsenums PASSED C 0:08.965 - R 0:00.067 bitmanip3 PASSED C 0:11.412 - R 0:00.012 concurrency/pthread/bounded_buffer PASSED C 0:11.178 - R 0:00.017 exceptions/cardgame PASSED C 0:09.860 - R 0:00.017 concurrency/unified_locking/locks PASSED C 0:14.029 - R 2:03.416 io/manipulatorsInput PASSED C 0:07.794 - R 0:00.009 PRNG PASSED C 0:16.298 - R 0:01.822 exceptions/hotpotato_checked PASSED C 0:10.091 - R 0:00.009 exceptions/hotpotato PASSED C 0:10.137 - R 0:00.009 io/manipulatorsOutput2 PASSED C 0:09.242 - R 0:00.009 random PASSED C 0:07.973 - R 0:00.005 io/manipulatorsOutput1 PASSED C 0:12.883 - R 0:00.009 mathX PASSED C 0:12.237 - R 0:00.017 vector_math/vec2_ldouble PASSED C 0:08.600 - R 0:00.009 math PASSED C 0:11.710 - R 0:00.010 nested_function PASSED C 0:10.766 - R 0:00.019 375 passes, 0 failures, 0 timeouts, 0 cancelled, 0 other Tests took 3:47.700 [Pipeline] } [Pipeline] // dir [Pipeline] } [Pipeline] // stage [Pipeline] echo -------- Test: Release -------- [Pipeline] stage [Pipeline] { (Test: Release) [Pipeline] dir Running in /var/lib/jenkins/workspace/Cforall_master_2@tmp [Pipeline] { [Pipeline] sh + nproc + make -j 16 --no-print-directory -C tests timeout=600 global-timeout=14400 tests debug=no archive-errors=/var/lib/jenkins/workspace/Cforall_master_2@tmp/tests/crashes/full-nodebug Running 375 tests on 16 cores (x86 - no debug) array-ERR3 PASSED C 0:00.076 - R n/a array-ERR2 PASSED C 0:00.098 - R n/a ...ollections/language-dim-mismatch PASSED C 0:00.456 - R n/a array-ERR1 PASSED C 0:01.074 - R n/a array PASSED C 0:01.204 - R 0:00.011 array-collections/c-dependent PASSED C 0:01.321 - R 0:00.025 array-collections/array-raii-c PASSED C 0:01.554 - R 0:00.022 array-collections/safety-summary PASSED C 0:01.136 - R n/a array-collections/symtab-collision PASSED C 0:00.740 - R n/a attr-priority PASSED C 0:01.076 - R 0:00.001 array-collections/array-sbscr-types PASSED C 0:02.371 - R 0:00.020 castError PASSED C 0:00.842 - R n/a array-collections/dimexpr-match-c PASSED C 0:02.949 - R 0:00.019 cast PASSED C 0:01.391 - R 0:00.022 array-collections/array-basic PASSED C 0:03.385 - R 0:00.005 builtins/sync PASSED C 0:01.837 - R 0:00.021 array-collections/dimexpr-match-cfa PASSED C 0:03.561 - R 0:00.007 castReturn PASSED C 0:01.362 - R 0:00.009 array-collections/boxed PASSED C 0:03.740 - R 0:00.020 alloc-ERROR PASSED C 0:06.726 - R n/a array-collections/accordion PASSED C 0:07.088 - R 0:00.017 avl_test PASSED C 0:06.387 - R 0:00.007 algorithms/range_test PASSED C 0:08.028 - R 0:00.006 array-collections/array-raii-cfa PASSED C 0:08.946 - R 0:00.005 collections/multi_list PASSED C 0:09.845 - R 0:00.011 collections/stack PASSED C 0:09.445 - R 0:00.005 collections/queue PASSED C 0:10.515 - R 0:00.007 collections/string-gc PASSED C 0:06.786 - R 0:00.010 collections/string-operator-ERR09 PASSED C 0:05.339 - R n/a collections/sequence PASSED C 0:11.548 - R 0:00.019 collections/string-ctx-manage PASSED C 0:11.164 - R 0:00.006 collections/string-istream PASSED C 0:07.970 - R 0:00.020 collections/atomic_mpsc PASSED C 0:11.995 - R 0:01.222 alloc PASSED C 0:16.872 - R 0:00.008 collections/string-compare PASSED C 0:13.415 - R 0:00.005 collections/string-operator-ERR11 PASSED C 0:05.399 - R n/a collections/string-operator-ERR13 PASSED C 0:05.665 - R n/a ...ns/vector-err-pass-perm-it-byval PASSED C 0:03.266 - R n/a collections/string-operator-ERR16 PASSED C 0:05.371 - R n/a collections/string-operator-ERR15 PASSED C 0:05.492 - R n/a collections/string-istream-manip PASSED C 0:11.793 - R 0:00.007 ...ns/vector-err-retn-perm-it-byval PASSED C 0:02.782 - R n/a collections/vector-demo PASSED C 0:06.858 - R 0:00.005 collections/string-api-coverage PASSED C 0:18.625 - R 0:00.006 ...ions/string-api-coverage-noshare PASSED C 0:19.172 - R 0:00.006 complex PASSED C 0:06.257 - R 0:00.005 collections/string-operator PASSED C 0:16.021 - R 0:00.006 collections/string-ostream PASSED C 0:10.099 - R 0:00.006 collections/string-overwrite PASSED C 0:12.988 - R 0:00.007 alloc2 PASSED C 0:27.831 - R 0:00.006 ...ections/string-overwrite-noshare PASSED C 0:12.869 - R 0:00.010 concurrency/actors/dynamic PASSED C 0:16.884 - R 0:00.318 concurrency/actors/executor PASSED C 0:16.988 - R 0:00.018 concurrency/actors/inline PASSED C 0:16.901 - R 0:00.036 concurrency/actors/matrixMultiply PASSED C 0:16.980 - R 0:00.268 concurrency/barrier/generation PASSED C 0:13.523 - R 0:00.068 concurrency/actors/inherit PASSED C 0:17.513 - R 0:00.118 concurrency/actors/poison PASSED C 0:16.926 - R 0:00.119 concurrency/actors/pingpong PASSED C 0:17.543 - R 0:00.068 concurrency/barrier/order PASSED C 0:13.564 - R 0:00.017 concurrency/clib_tls PASSED C 0:03.105 - R 0:00.009 concurrency/clib PASSED C 0:03.143 - R 0:00.066 concurrency/actors/types PASSED C 0:17.707 - R 0:00.066 concurrency/actors/static PASSED C 0:17.907 - R 0:00.069 concurrency/ctor-check PASSED C 0:00.836 - R n/a concurrency/cluster PASSED C 0:07.877 - R 0:00.009 concurrency/cofor PASSED C 0:10.513 - R 0:00.009 concurrency/coroutineYield PASSED C 0:12.529 - R 0:00.017 concurrency/channels/big_elems PASSED C 0:15.572 - R 0:10.565 concurrency/examples/gortn PASSED C 0:10.984 - R 0:00.009 concurrency/examples/datingService PASSED C 0:11.775 - R 0:00.009 ...rrency/examples/boundedBufferEXT PASSED C 0:11.886 - R 0:01.218 ...rrency/examples/boundedBufferINT PASSED C 0:11.995 - R 0:01.323 concurrency/channels/churn PASSED C 0:15.786 - R 0:10.013 concurrency/channels/daisy_chain PASSED C 0:15.690 - R 0:10.049 concurrency/channels/contend PASSED C 0:15.739 - R 0:10.051 concurrency/mainError PASSED C 0:00.279 - R n/a concurrency/keywordErrors PASSED C 0:00.381 - R n/a concurrency/examples/matrixSum PASSED C 0:11.046 - R 0:00.007 concurrency/futures/abandon PASSED C 0:08.078 - R 0:00.018 concurrency/futures/basic PASSED C 0:07.892 - R 0:00.065 concurrency/channels/hot_potato PASSED C 0:15.386 - R 0:10.041 concurrency/channels/ping_pong PASSED C 0:15.489 - R 0:10.041 concurrency/examples/quickSort PASSED C 0:13.417 - R 0:00.008 concurrency/channels/zero_size PASSED C 0:15.474 - R 0:10.052 concurrency/channels/pub_sub PASSED C 0:15.997 - R 0:10.045 concurrency/join PASSED C 0:11.078 - R 0:00.009 concurrency/migrate PASSED C 0:11.278 - R 0:00.036 concurrency/lockfree_stack PASSED C 0:11.118 - R 0:02.379 concurrency/futures/wait_any PASSED C 0:14.419 - R 0:00.012 concurrency/monitor PASSED C 0:11.099 - R 0:02.279 concurrency/mutexstmt/monitors PASSED C 0:09.239 - R 0:00.466 concurrency/park/contention PASSED C 0:07.991 - R 0:00.068 concurrency/futures/typed PASSED C 0:17.493 - R 0:00.019 concurrency/park/start_parked PASSED C 0:07.995 - R 0:00.009 concurrency/multi-monitor PASSED C 0:11.198 - R 0:03.483 ...urrency/pthread/pthread_key_test PASSED C 0:03.910 - R 0:00.005 concurrency/park/force_preempt PASSED C 0:11.205 - R 0:00.267 concurrency/mutexstmt/tuple PASSED C 0:13.801 - R 0:00.005 concurrency/once PASSED C 0:13.343 - R 0:00.018 concurrency/mutexstmt/locks PASSED C 0:12.126 - R 0:05.990 ...rrency/pthread/pthread_attr_test PASSED C 0:10.891 - R 0:00.008 ...rrency/pthread/pthread_cond_test PASSED C 0:10.932 - R 0:00.011 ...pthread/pthread_demo_create_join PASSED C 0:10.867 - R 0:00.006 concurrency/futures/future_except PASSED C 0:26.866 - R 0:00.009 ...rrency/pthread/pthread_once_test PASSED C 0:10.855 - R 0:00.020 concurrency/readyQ/leader_spin PASSED C 0:11.109 - R 0:00.770 concurrency/readyQ/barrier_sleeper PASSED C 0:13.206 - R 0:00.221 ...rrency/pthread/pthread_demo_lock PASSED C 0:11.048 - R 0:04.977 concurrency/signal/block PASSED C 0:12.260 - R 0:00.217 concurrency/signal/disjoint PASSED C 0:12.141 - R 0:00.366 concurrency/signal/wait PASSED C 0:12.033 - R 0:00.065 concurrency/sleep PASSED C 0:11.644 - R 0:01.122 concurrency/suspend_then PASSED C 0:11.943 - R 0:00.019 concurrency/thread PASSED C 0:13.056 - R 0:00.008 .../unified_locking/block_spin_lock PASSED C 0:13.199 - R 0:00.020 ...ency/unified_locking/exp_backoff PASSED C 0:13.229 - R 0:00.011 .../unified_locking/fast_block_lock PASSED C 0:13.192 - R 0:00.019 concurrency/preempt PASSED C 0:13.123 - R 0:16.260 ...cy/unified_locking/pthread_locks PASSED C 0:10.377 - R 0:00.020 concurrency/preempt2 PASSED C 0:11.954 - R 0:19.968 ...fied_locking/mcs_block_spin_lock PASSED C 0:13.251 - R 0:00.017 concurrency/unified_locking/mcs PASSED C 0:13.970 - R 0:01.778 ...nified_locking/simple_owner_lock PASSED C 0:13.496 - R 0:00.012 ...ncy/unified_locking/timeout_lock PASSED C 0:10.838 - R 0:01.124 concurrency/waitfor/parse PASSED C 0:06.992 - R 0:00.007 concurrency/waitfor/else PASSED C 0:09.298 - R 0:00.017 concurrency/waitfor/barge PASSED C 0:11.308 - R 0:00.069 concurrency/waitfor/dtor PASSED C 0:11.153 - R 0:00.217 ...urrency/waitfor/lexical_priority PASSED C 0:11.480 - R 0:00.018 concurrency/waitfor/recurse PASSED C 0:11.369 - R 0:00.167 concurrency/waitfor/statment PASSED C 0:11.388 - R 0:00.011 concurrency/waitfor/when PASSED C 0:11.351 - R 0:00.033 ...ency/waituntil/channel_zero_size PASSED C 0:12.613 - R 0:00.519 concurrency/waituntil/channels PASSED C 0:13.965 - R 0:00.972 concurrency/waituntil/one_chan PASSED C 0:12.565 - R 0:00.270 const-init PASSED C 0:01.180 - R 0:00.006 concurrency/waituntil/basic_else PASSED C 0:17.956 - R 0:00.006 const-ref PASSED C 0:01.087 - R 0:00.011 concurrency/waituntil/timeout PASSED C 0:06.900 - R 0:03.025 configs/parsebools PASSED C 0:09.760 - R 0:00.067 concurrency/unified_locking/locks PASSED C 0:14.862 - R 0:24.584 configs/parseconfig PASSED C 0:09.104 - R 0:00.007 copyfile PASSED C 0:06.042 - R 0:00.012 configs/usage PASSED C 0:09.733 - R 0:00.011 coroutine/fmtLines PASSED C 0:07.392 - R 0:00.007 coroutine/fibonacci PASSED C 0:07.710 - R 0:00.006 coroutine/devicedriver PASSED C 0:08.092 - R 0:00.033 concurrency/waituntil/channel_close PASSED C 0:16.794 - R 0:10.044 coroutine/pingpong PASSED C 0:07.314 - R 0:00.007 ...ency/unified_locking/futex_mutex PASSED C 0:13.143 - R 0:36.559 ctrl-flow/labelledExit PASSED C 0:01.162 - R 0:00.006 coroutine/raii PASSED C 0:07.484 - R 0:00.039 ctrl-flow/loop-inc PASSED C 0:01.064 - R 0:00.005 concurrency/waituntil/futures PASSED C 0:29.741 - R 0:00.010 counter PASSED C 0:05.997 - R 0:00.017 ctrl-flow/break-misc PASSED C 0:06.367 - R 0:00.014 ctrl-flow/fallthrough PASSED C 0:06.278 - R 0:00.019 coroutine/runningTotal PASSED C 0:07.586 - R 0:00.014 coroutine/prodcons PASSED C 0:10.153 - R 0:00.019 ctrl-flow/goto PASSED C 0:06.011 - R 0:00.006 enum PASSED C 0:01.368 - R 0:00.035 concurrency/waituntil/all_types PASSED C 0:35.012 - R 0:00.921 designations PASSED C 0:03.140 - R 0:00.011 ctrl-flow/ifwhileCtl PASSED C 0:06.786 - R 0:00.005 enum_tests/inc-dec PASSED C 0:01.316 - R 0:00.020 enum_tests/lvalue PASSED C 0:00.700 - R n/a enum_tests/funcEnum PASSED C 0:02.256 - R 0:00.014 concurrency/waituntil/locks PASSED C 0:15.500 - R 0:19.061 ctrl-flow/loop_else PASSED C 0:07.212 - R 0:00.011 ctrl-flow/loop_else-WRN1 PASSED C 0:07.215 - R 0:00.001 enum_tests/structEnum PASSED C 0:02.535 - R 0:00.017 enum_tests/anonymous PASSED C 0:06.776 - R 0:00.019 errors/declaration PASSED C 0:00.105 - R n/a enum_tests/enumInlineValue PASSED C 0:06.860 - R 0:00.006 errors/scope-type PASSED C 0:00.145 - R n/a errors/signature PASSED C 0:00.102 - R n/a errors/scope PASSED C 0:00.670 - R n/a eval PASSED C 0:01.089 - R 0:00.005 div PASSED C 0:08.722 - R 0:00.020 ctrl-flow/loopctrl PASSED C 0:09.898 - R 0:00.007 enum_tests/input PASSED C 0:06.895 - R 0:00.010 enum_tests/stringEnum PASSED C 0:06.559 - R 0:00.017 device/cpu PASSED C 0:11.618 - R 0:00.009 enum_tests/typedIntEnum PASSED C 0:06.134 - R 0:00.006 enum_tests/position PASSED C 0:08.588 - R 0:00.019 enum_tests/planet PASSED C 0:08.747 - R 0:00.009 enum_tests/voidEnum PASSED C 0:06.280 - R 0:00.005 exceptions/conditional PASSED C 0:06.277 - R 0:00.019 exceptions/cancel/coroutine PASSED C 0:07.575 - R 0:00.020 exceptions/data-except PASSED C 0:06.755 - R 0:00.020 exceptions/conditional-threads PASSED C 0:07.702 - R 0:00.009 exceptions/message PASSED C 0:02.782 - R 0:00.005 exceptions/defaults PASSED C 0:06.960 - R 0:00.006 .../unified_locking/spin_queue_lock PASSED C 0:13.277 - R 0:50.407 ...urrency/unified_locking/mcs_spin PASSED C 0:14.243 - R 0:51.690 exceptions/finally PASSED C 0:06.414 - R 0:00.005 concurrency/waituntil/repeat_close PASSED C 0:14.011 - R 0:30.077 exceptions/cancel/thread PASSED C 0:11.170 - R 0:00.009 exceptions/try-ctrl-flow PASSED C 0:00.338 - R n/a exceptions/defaults-threads PASSED C 0:07.992 - R 0:00.009 exceptions/interact PASSED C 0:06.619 - R 0:00.005 exceptions/type-check PASSED C 0:00.473 - R n/a exceptions/finally-threads PASSED C 0:07.819 - R 0:00.009 exceptions/try-leave-catch PASSED C 0:01.223 - R 0:00.005 exceptions/cor_resumer PASSED C 0:11.139 - R 0:00.009 expression PASSED C 0:01.124 - R 0:00.005 exceptions/fibonacci_nonlocal PASSED C 0:09.781 - R 0:00.009 exceptions/polymorphic PASSED C 0:06.774 - R 0:00.007 exceptions/resume PASSED C 0:06.676 - R 0:00.005 global-monomorph PASSED C 0:01.094 - R 0:00.005 exceptions/terminate PASSED C 0:06.701 - R 0:00.005 exceptions/trash PASSED C 0:06.261 - R 0:00.005 exceptions/resume-threads PASSED C 0:07.852 - R 0:00.009 exceptions/virtual-poly PASSED C 0:06.311 - R 0:00.005 exceptions/terminate-threads PASSED C 0:07.932 - R 0:00.009 identFuncDeclarator PASSED C 0:01.115 - R 0:00.005 fstream_test PASSED C 0:06.203 - R 0:00.005 exceptions/pingpong_nonlocal PASSED C 0:11.497 - R 0:00.007 generator/fibonacci PASSED C 0:06.098 - R 0:00.009 identParamDeclarator PASSED C 0:01.109 - R 0:00.005 generator/fmtLines PASSED C 0:06.144 - R 0:00.009 forall PASSED C 0:07.392 - R 0:00.007 exceptions/virtual-cast PASSED C 0:08.216 - R 0:00.005 init1-ERROR PASSED C 0:00.615 - R n/a init1 PASSED C 0:01.120 - R 0:00.005 generator/suspend_then PASSED C 0:06.112 - R 0:00.005 include/vector-sequence PASSED C 0:01.708 - R 0:00.005 include/vector-collections PASSED C 0:02.892 - R 0:00.005 genericUnion PASSED C 0:06.369 - R 0:00.006 function-operator PASSED C 0:09.568 - R 0:00.005 hello PASSED C 0:06.169 - R 0:00.006 identity PASSED C 0:06.331 - R 0:00.004 include/vector-fstream PASSED C 0:06.234 - R 0:00.005 include/stdincludes PASSED C 0:07.871 - R 0:00.018 io/eofType PASSED C 0:06.342 - R 0:00.013 limits PASSED C 0:01.457 - R 0:00.006 io/io PASSED C 0:10.587 - R 0:00.007 heap PASSED C 0:08.782 - R 0:06.539 linking/exception-nothreads PASSED C 0:04.578 - R 0:00.005 io/io-acquire PASSED C 0:12.326 - R 0:00.034 io/io-acquire-in PASSED C 0:11.735 - R 0:00.169 io/away_fair PASSED C 0:14.360 - R 0:00.012 io/io-acquire-out PASSED C 0:11.768 - R 0:00.018 linking/nostdlib PASSED C 0:01.123 - R 0:00.006 io/manipulatorsInput-uchunk PASSED C 0:10.134 - R 0:00.021 linkonce PASSED C 0:01.248 - R 0:00.005 io/comp_basic PASSED C 0:15.785 - R 0:00.068 io/comp_fair PASSED C 0:15.860 - R 0:00.117 io/io-acquire2 PASSED C 0:12.907 - R 0:00.117 maybe PASSED C 0:01.569 - R 0:00.006 linking/exception-withthreads PASSED C 0:06.378 - R 0:00.007 io/manipulatorsOutput4 PASSED C 0:12.573 - R 0:00.019 io/io-acquire-no-io PASSED C 0:11.542 - R 0:05.238 linking/mangling/anon PASSED C 0:06.439 - R 0:00.005 nested-types-ERR1 PASSED C 0:00.108 - R n/a nested-types-ERR2 PASSED C 0:00.186 - R n/a nested-types PASSED C 0:01.118 - R 0:00.005 nowarn/array PASSED C 0:01.245 - R 0:00.006 linking/io-acquire PASSED C 0:08.701 - R 0:00.006 list/dlist-insert-remove PASSED C 0:06.310 - R 0:00.005 nowarn/exception PASSED C 0:01.288 - R 0:00.005 nowarn/no-autogen PASSED C 0:01.079 - R 0:00.005 linking/nothreads PASSED C 0:08.043 - R 0:00.009 io/many_read PASSED C 0:15.296 - R 0:00.012 opt-params PASSED C 0:00.077 - R n/a linking/weakso_nothd PASSED C 0:08.183 - R 0:00.010 nowarn/printf-sizeof PASSED C 0:01.314 - R 0:00.014 literals PASSED C 0:06.489 - R 0:00.005 nowarn/unused PASSED C 0:01.129 - R 0:00.005 nowarn/zero-thunk PASSED C 0:01.095 - R 0:00.006 list/dlist2-insert-remove PASSED C 0:06.807 - R 0:00.005 numericConstants PASSED C 0:01.089 - R 0:00.005 operators PASSED C 0:01.090 - R 0:00.005 include/includes PASSED C 0:24.383 - R 0:00.007 meta/fork+exec PASSED C 0:05.407 - R 0:00.018 poly-bare-assn PASSED C 0:01.128 - R 0:00.006 polybits PASSED C 0:00.223 - R n/a poly-d-cycle PASSED C 0:01.224 - R 0:00.005 poly-many-arsz PASSED C 0:01.162 - R 0:00.005 poly-member PASSED C 0:01.136 - R 0:00.005 poly-selection PASSED C 0:01.102 - R 0:00.006 poly-o-cycle PASSED C 0:01.164 - R 0:00.006 poly-self-cycle PASSED C 0:01.245 - R 0:00.006 raii/ctor-autogen-ERR1 PASSED C 0:00.681 - R n/a quasiKeyword PASSED C 0:01.255 - R 0:00.006 raii/ctor-autogen PASSED C 0:01.645 - R 0:00.006 raii/init_once PASSED C 0:01.398 - R 0:00.009 linking/withthreads PASSED C 0:10.947 - R 0:00.006 raii/partial-ERR1 PASSED C 0:00.674 - R n/a malloc PASSED C 0:09.893 - R 0:00.005 raii/partial PASSED C 0:01.157 - R 0:00.005 raii/typeof-member PASSED C 0:01.033 - R 0:00.005 meta/dumpable PASSED C 0:08.688 - R 0:00.005 result PASSED C 0:01.764 - R 0:00.005 raii/dtor-early-exit-ERR1 PASSED C 0:04.797 - R n/a raii/memberCtors-ERR1 PASSED C 0:03.977 - R n/a raii/dtor-early-exit-ERR2 PASSED C 0:04.782 - R n/a quotedKeyword PASSED C 0:06.123 - R 0:00.005 simpleGenericTriple PASSED C 0:01.489 - R 0:00.006 raii/boxed-types PASSED C 0:06.210 - R 0:00.007 polymorphism PASSED C 0:06.507 - R 0:00.006 smart-pointers PASSED C 0:01.502 - R 0:00.005 raii/globals PASSED C 0:06.266 - R 0:00.007 minmax PASSED C 0:12.101 - R 0:00.005 switch PASSED C 0:01.138 - R 0:00.005 raii/memberCtors PASSED C 0:06.542 - R 0:00.009 tuple/tupleCast PASSED C 0:01.105 - R 0:00.005 tuple/tupleFunction PASSED C 0:01.210 - R 0:00.005 tuple/tupleMember PASSED C 0:01.140 - R 0:00.006 raii/dtor-early-exit PASSED C 0:08.586 - R 0:00.006 typedefRedef-ERR1 PASSED C 0:00.109 - R n/a tuple/tuplePolymorphism PASSED C 0:01.522 - R 0:00.005 references PASSED C 0:06.578 - R 0:00.005 shortCircuit PASSED C 0:06.158 - R 0:00.005 var-assert PASSED C 0:00.132 - R n/a typedefRedef PASSED C 0:01.070 - R 0:00.009 typeof PASSED C 0:01.048 - R 0:00.005 variableDeclarator PASSED C 0:01.078 - R 0:00.005 sizeof PASSED C 0:06.106 - R 0:00.005 strstream PASSED C 0:06.659 - R 0:00.005 searchsort PASSED C 0:09.051 - R 0:00.009 tuple/tupleVariadic PASSED C 0:04.740 - R 0:00.005 tuple/tupleAssign PASSED C 0:06.832 - R 0:00.006 tuplearray PASSED C 0:06.186 - R 0:00.005 time PASSED C 0:08.393 - R 0:00.006 sum PASSED C 0:08.878 - R 0:00.005 voidPtr PASSED C 0:01.037 - R 0:00.004 withconflict PASSED C 0:00.588 - R n/a swap PASSED C 0:09.549 - R 0:00.005 warnings/self-assignment PASSED C 0:01.017 - R 0:00.001 userLiterals PASSED C 0:07.235 - R 0:00.011 KRfunctions PASSED C 0:00.952 - R 0:00.001 vector PASSED C 0:07.562 - R 0:00.005 ...collections/dimexpr-match-c-ERRS PASSED C 0:01.017 - R n/a vector_math/vec2_double PASSED C 0:09.160 - R 0:00.005 zero_one-ERR1 PASSED C 0:03.453 - R n/a ...llections/dimexpr-match-cfa-ERRS PASSED C 0:01.334 - R n/a arithmeticConversions PASSED C 0:02.849 - R 0:00.005 attributes PASSED C 0:01.192 - R 0:00.012 vector_math/vec2_uint PASSED C 0:09.113 - R 0:00.007 zero_one PASSED C 0:06.255 - R 0:00.005 abs PASSED C 0:08.549 - R 0:00.005 declarationSpecifier PASSED C 0:01.075 - R 0:00.001 errors/completeType PASSED C 0:00.624 - R n/a vector_math/vec2_float PASSED C 0:17.382 - R 0:00.009 vector_math/vec3_int PASSED C 0:15.478 - R 0:00.011 ato PASSED C 0:09.535 - R 0:00.008 vector_math/vec2_int PASSED C 0:18.164 - R 0:00.009 extension PASSED C 0:01.090 - R 0:00.001 functions PASSED C 0:01.037 - R 0:00.002 vector_math/vec4_int PASSED C 0:16.759 - R 0:00.020 gccExtensions PASSED C 0:01.028 - R 0:00.005 vector_math/vec4_float PASSED C 0:18.459 - R 0:00.009 vector_math/vec3_float PASSED C 0:19.224 - R 0:00.025 concurrency/pthread/bounded_buffer PASSED C 0:11.454 - R 0:00.033 configs/parsenums PASSED C 0:10.100 - R 0:00.068 meta/arch PASSED C 0:00.579 - R n/a PRNG PASSED C 0:16.491 - R 0:00.421 bitmanip1 PASSED C 0:13.998 - R 0:00.011 bitmanip2 PASSED C 0:14.157 - R 0:00.017 bitmanip3 PASSED C 0:13.505 - R 0:00.017 rational PASSED C 0:31.900 - R 0:00.009 exceptions/cardgame PASSED C 0:10.308 - R 0:00.009 exceptions/hotpotato_checked PASSED C 0:10.618 - R 0:00.009 exceptions/hotpotato PASSED C 0:10.596 - R 0:00.009 io/manipulatorsInput PASSED C 0:09.395 - R 0:00.009 random PASSED C 0:09.136 - R 0:00.005 vector_math/vec2_ldouble PASSED C 0:08.942 - R 0:00.005 nested_function PASSED C 0:10.755 - R 0:00.019 io/manipulatorsOutput2 PASSED C 0:12.368 - R 0:00.005 math PASSED C 0:12.444 - R 0:00.010 mathX PASSED C 0:13.010 - R 0:00.018 io/manipulatorsOutput1 PASSED C 0:19.211 - R 0:00.011 concurrency/barrier/last TIMEOUT C 0:13.529 - R10:00.250 Cforall Runtime error (UNIX pid:1401393): Application interrupted by signal: Aborted. Stack back trace for: /var/lib/jenkins/workspace/Cforall_master_2@tmp/libcfa/x86-nodebug/src/.libs/libcfa.so.1 (0) linux-gate.so.1 : __kernel_vsyscall + 0x9 [0xf7fc7579] (1) /lib32/libc.so.6 : + 0x874be [0xf7b9b4be] (2) /lib32/libc.so.6 : pthread_mutex_lock + 0x179 [0xf7ba2419] (3) /lib/ld-linux.so.2 : _dl_allocate_tls_init + 0x46 [0xf7fda0a6] (4) /lib/ld-linux.so.2 : _dl_allocate_tls + 0x1b [0xf7fda34b] (5) /lib32/libc.so.6 : pthread_create + 0x6fb [0xf7b9f78b] (6) /var/lib/jenkins/workspace/Cforall_master_2@tmp/libcfa/x86-nodebug/src/.libs/libcfathread.so.1 : + 0x27a0c [0xf7f99a0c] (7) /var/lib/jenkins/workspace/Cforall_master_2@tmp/libcfa/x86-nodebug/src/.libs/libcfathread.so.1 : _X12_constructorFv_S9processorPKcS7clusterPS7thread$__1 + 0x10d [0xf7f99b5d] (8) /var/lib/jenkins/workspace/Cforall_master_2@tmp/libcfa/x86-nodebug/src/.libs/libcfathread.so.1 : _X12_constructorFv_S9processorPKcS7cluster__1 + 0x22 [0xf7f99b92] (9) /var/lib/jenkins/workspace/Cforall_master_2@tmp/tests/concurrency/barrier/last : _X4mainFi___1 + 0x99 [0x56557a39] warning: Can't open file anon_inode:[io_uring] which was expanded to anon_inode:[io_uring] during file-backed mapping note processing [New LWP 1401393] [New LWP 1401394] [New LWP 1401396] [New LWP 1401395] [New LWP 1401398] [New LWP 1401399] [New LWP 1401397] [Thread debugging using libthread_db enabled] Using host libthread_db library "/lib/x86_64-linux-gnu/libthread_db.so.1". Core was generated by `/var/lib/jenkins/workspace/Cforall_master_2@tmp/tests/concurrency/barrier/last'. Program terminated with signal SIGABRT, Aborted. #0 0xf7fc7579 in __kernel_vsyscall () [Current thread is 1 (Thread 0xf7b12a00 (LWP 1401393))] ----- #0 0xf7fc7579 in __kernel_vsyscall () #1 0xf7ba0e57 in ?? () from /lib32/libc.so.6 #2 0xf7b4fc41 in raise () from /lib32/libc.so.6 #3 0xf7b372b7 in abort () from /lib32/libc.so.6 #4 0xf7f0bf10 in _X7__abortFv_bPKcY17__builtin_va_list__1 (_X11signalAbortb_1=, _X3fmtPKc_1=, _X4argsY17__builtin_va_list_1=) at /var/lib/jenkins/workspace/Cforall_master_2/libcfa/src/interpose.cfa:286 #5 0xf7f0c2a6 in _X5abortFv_bPKc__1 (_X11signalAbortb_1=true, _X3fmtPKc_1=0xf7f279d4 "Application interrupted by signal: %s.\n") at /var/lib/jenkins/workspace/Cforall_master_2/libcfa/src/interpose.cfa:301 #6 0xf7f0c2da in _X15sigHandler_termFv_iPS21__anonymous_siginfo_tPS10ucontext_t__1 (_X3sigi_1=6, _X3sfpPS21__anonymous_siginfo_t_1=0xf7f70c0c , _X3cxtPS10ucontext_t_1=0xf7f70c8c ) at /var/lib/jenkins/workspace/Cforall_master_2/libcfa/src/interpose.cfa:337 #7 #8 0xf7fc7579 in __kernel_vsyscall () #9 0xf7b9b4be in ?? () from /lib32/libc.so.6 #10 0xf7ba2419 in pthread_mutex_lock () from /lib32/libc.so.6 #11 0xf7fda0a6 in _dl_allocate_tls_init () from /lib/ld-linux.so.2 #12 0xf7fda34b in _dl_allocate_tls () from /lib/ld-linux.so.2 #13 0xf7b9f78b in pthread_create () from /lib32/libc.so.6 #14 0xf7f99a0c in _X16__create_pthreadFPv_PmFPv_Pv_Pv__1 (_X7pthreadPm_1=0xffffd210, _X5startFPv_Pv__1=0xf7f98f30 <_X18__invoke_processorFPv_Pv__1>, _X3argPv_1=0xffffd1c0) at /var/lib/jenkins/workspace/Cforall_master_2/libcfa/src/concurrency/kernel/startup.cfa:810 #15 0xf7f99b5d in _X12_constructorFv_S9processorPKcS7clusterPS7thread$__1 (_X4thisS9processor_1=0xffffd1c0, _X4namePKc_1=0x5655909e "Anonymous Processor", _X5_cltrS7cluster_1=0xf7fbc900 <_X19storage_mainClusterA0c_1>, _X5initTPS7thread$_1=0x0) at /var/lib/jenkins/workspace/Cforall_master_2/libcfa/src/concurrency/kernel/startup.cfa:589 #16 0xf7f99b92 in _X12_constructorFv_S9processorPKcS7cluster__1 (_X4thisS9processor_1=0xffffd1c0, _X4namePKc_1=0x5655909e "Anonymous Processor", _X5_cltrS7cluster_1=0xf7fbc900 <_X19storage_mainClusterA0c_1>) at /var/lib/jenkins/workspace/Cforall_master_2/libcfa/src/concurrency/kernel/startup.cfa:593 #17 0x56557a39 in _X12_constructorFv_S9processor__1 (_X4thisS9processor_1=0xffffd1c0) at /var/lib/jenkins/workspace/Cforall_master_2/libcfa/src/concurrency/kernel.hfa:164 #18 _X4mainFi___1 () at concurrency/barrier/last.cfa:72 #19 0x565573b2 in invoke_main (envp=0xffffd3ec, argv=0xffffd3e4, argc=1) at concurrency/barrier/last.cfa:32 #20 main (_X4argci_1=1, _X4argvPPc_1=0xffffd3e4, _X4envpPPc_1=0xffffd3ec) at concurrency/barrier/last.cfa:53 ----- Id Target Id Frame * 1 Thread 0xf7b12a00 (LWP 1401393) 0xf7fc7579 in __kernel_vsyscall () 2 Thread 0x565a7ec0 (LWP 1401394) 0xf7fc7579 in __kernel_vsyscall () 3 Thread 0x5669a340 (LWP 1401396) 0xf7fc7579 in __kernel_vsyscall () 4 Thread 0x56627f80 (LWP 1401395) 0xf7fc7579 in __kernel_vsyscall () 5 Thread 0x5671a4c0 (LWP 1401398) 0xf7fc7579 in __kernel_vsyscall () 6 Thread 0x5679a340 (LWP 1401399) 0xf7fc7579 in __kernel_vsyscall () 7 Thread 0x566da400 (LWP 1401397) 0xf7fc7579 in __kernel_vsyscall () Archiving concurrency/barrier/last (executable and core) to crashes/full-nodebug/concurrency/barrier/last 374 passes, 0 failures, 1 timeouts, 0 cancelled, 0 other Tests took 10:39.095 make: *** [Makefile:986: all-local] Error 1 [Pipeline] } [Pipeline] // dir [Pipeline] } [Pipeline] // stage [Pipeline] echo Archiving core dumps [Pipeline] dir Running in /var/lib/jenkins/workspace/Cforall_master_2@tmp [Pipeline] { [Pipeline] fileExists [Pipeline] sh + /var/lib/jenkins/workspace/Cforall_master_2/tools/jenkins/archive-gen.sh [Pipeline] archiveArtifacts Archiving artifacts Recording fingerprints [Pipeline] } [Pipeline] // dir [Pipeline] } [Pipeline] // wrap [Pipeline] } [Pipeline] // node [Pipeline] echo hudson.AbortException: script returned exit code 2 [Pipeline] node Running on Algol in /var/lib/jenkins/workspace/Cforall_master [Pipeline] { [Pipeline] echo Notifying users of result [Pipeline] echo Reusing previously constructed message [Pipeline] echo Would send email to: cforall@lists.uwaterloo.ca [Pipeline] echo With title: [cforall git][BUILD# 3760 - FAILURE] - branch master [Pipeline] echo Content:

This is an automated email from the Jenkins build machine. It was generated because of a git hooks/post-receive script following a ref change which was pushed to the C∀ repository.

- Status --------------------------------------------------------------

BUILD# 3760 - FAILURE

Check console output at https://cforall.uwaterloo.ca/jenkins/job/Cforall/job/master/3760/ to view the results.

- Changes -------------------------------------------------------------

The branch master has been updated.
      from  e98b4ec769cbe797fd14db5f82f2fef821a3e1f0 (commit)

- Log -----------------------------------------------------------------


-----------------------------------------------------------------------

Summary of changes:

[Pipeline] } [Pipeline] // node [Pipeline] echo Build Completed [Pipeline] End of Pipeline ERROR: script returned exit code 2 Finished: FAILURE [Pipeline] error [Pipeline] } Failed in branch gcc_11_x86_new [Pipeline] // parallel [Pipeline] } [Pipeline] // stage [Pipeline] } [Pipeline] // wrap [Pipeline] echo error caught [Pipeline] node Running on Brokk 4 in /var/lib/jenkins/workspace/Cforall_Full_Build [Pipeline] { [Pipeline] echo notifying users [Pipeline] emailext Sending email to: cforall@lists.uwaterloo.ca [Pipeline] } [Pipeline] // node [Pipeline] } [Pipeline] // node [Pipeline] End of Pipeline ERROR: FAILURE Finished: FAILURE