Skip to content

Console Output

Skipping 567 KB.. Full Log
yUJEd53xKamIHO7AAAAzR+LCAAAAAAAAP9b85aBtbiIQSOjNKU4P0+vIKc0PTOvWK8kMze1uCQxtyC1SC8ExvbLL0llgABGJgYmLwaB3MycnMzi4My85FTXgvzkDB8G3tScxILi1BRfsEwJg4BPVmJZon5OYl66vk9+Xrp1RRGDFNSy5Py84vycVD1nCI1qPENFAZBecK3WxhPoPj6QKXogU/TApnQ/mXCmX/k+EwOjFwNrWWJOaSrQXAGEIr/S3KTUorY1U2W5pzzohpoGBOzbLwMAKoszBPIAAAA=       	...urrency/waitfor/lexical_priority  PASSED     C 0:09.428 - R 0:00.009
22:55:26        	concurrency/waitfor/dtor             PASSED     C 0:09.916 - R 0:01.328
22:55:26        	concurrency/unified_locking/mcs      PASSED     C 0:11.441 - R 0:08.289
22:55:26        	concurrency/waitfor/statment         PASSED     C 0:10.292 - R 0:00.057
22:55:26        	concurrency/waitfor/recurse          PASSED     C 0:09.575 - R 0:01.583
22:55:26        	concurrency/waitfor/when             PASSED     C 0:10.613 - R 0:00.126
22:55:26        	concurrency/waituntil/basic_else     PASSED     C 0:14.278 - R 0:00.021
22:55:26        	...ency/waituntil/channel_zero_size  PASSED     C 0:10.091 - R 0:05.177
22:55:26        	concurrency/waituntil/one_chan       PASSED     C 0:09.800 - R 0:01.069
22:55:26        	concurrency/waituntil/timeout        PASSED     C 0:05.766 - R 0:03.179
22:55:26        	const-init                           PASSED     C 0:00.892 - R 0:00.020
22:55:26        	configs/parsebools                   PASSED     C 0:07.691 - R 0:00.035
22:55:26        	const-ref                            PASSED     C 0:00.943 - R 0:00.020
22:55:26        	concurrency/waituntil/channels       PASSED     C 0:09.880 - R 0:08.993
22:55:26        	configs/parseconfig                  PASSED     C 0:08.031 - R 0:00.020
22:55:26        	copyfile                             PASSED     C 0:05.412 - R 0:00.008
22:55:26        	concurrency/waituntil/channel_close  PASSED     C 0:12.666 - R 0:10.051
22:55:26        	configs/usage                        PASSED     C 0:07.532 - R 0:00.011
22:55:26        	coroutine/devicedriver               PASSED     C 0:06.424 - R 0:00.036
22:55:26        	coroutine/fibonacci                  PASSED     C 0:06.235 - R 0:00.011
22:55:26        	concurrency/waituntil/futures        FAILED with code -6    C 0:21.604 - R 0:00.167
22:55:26 start
22:55:26 Cforall Runtime error (UNIX pid:1065401): Attempting to fulfil a future that has already been fulfilled
22:55:26 Stack back trace for: /var/lib/jenkins/workspace/Cforall_master_2@tmp/libcfa/x64-debug/src/.libs/libcfa.so.1
22:55:26 (0) /var/lib/jenkins/workspace/Cforall_master_2@tmp/libcfa/x64-debug/src/.libs/libcfa.so.1 : _X5abortFv_bPKc__1 + 0  [0x7ffff7e98020]
22:55:26 
22:55:26 warning: Can't open file anon_inode:[io_uring] which was expanded to anon_inode:[io_uring] during file-backed mapping note processing
22:55:26 [New LWP 1065401]
22:55:26 [New LWP 1065402]
22:55:26 [New LWP 1065403]
22:55:26 [Thread debugging using libthread_db enabled]
22:55:26 Using host libthread_db library "/lib/x86_64-linux-gnu/libthread_db.so.1".
22:55:26 Core was generated by `/var/lib/jenkins/workspace/Cforall_master_2@tmp/tests/concurrency/waituntil/fut'.
22:55:26 Program terminated with signal SIGABRT, Aborted.
22:55:26 #0  __pthread_kill_implementation (no_tid=0, signo=6, threadid=<optimized out>) at ./nptl/pthread_kill.c:44
22:55:26 
22:55:26 warning: 44	./nptl/pthread_kill.c: No such file or directory
22:55:26 [Current thread is 1 (Thread 0x7ffff7c97900 (LWP 1065401))]
22:55:26 -----
22:55:26 #0  __pthread_kill_implementation (no_tid=0, signo=6, threadid=<optimized out>) at ./nptl/pthread_kill.c:44
22:55:26 #1  __pthread_kill_internal (signo=6, threadid=<optimized out>) at ./nptl/pthread_kill.c:78
22:55:26 #2  __GI___pthread_kill (threadid=<optimized out>, signo=signo@entry=6) at ./nptl/pthread_kill.c:89
22:55:26 #3  0x00007ffff7a4527e in __GI_raise (sig=sig@entry=6) at ../sysdeps/posix/raise.c:26
22:55:26 #4  0x00007ffff7a288ff in __GI_abort () at ./stdlib/abort.c:79
22:55:26 #5  0x00007ffff7e97e34 in _X7__abortFv_bPKcY17__builtin_va_list__1 (_X11signalAbortb_1=true, _X3fmtPKc_1=0x7ffff7eb8a68 "Application interrupted by signal: %s.\n", _X4argsY17__builtin_va_list_1=0x7ffff7f04d60 <stack+63952>) at /var/lib/jenkins/workspace/Cforall_master_2/libcfa/src/interpose.cfa:263
22:55:26 #6  0x00007ffff7e980dc in _X5abortFv_bPKc__1 (_X11signalAbortb_1=true, _X3fmtPKc_1=0x7ffff7eb8a68 "Application interrupted by signal: %s.\n") at /var/lib/jenkins/workspace/Cforall_master_2/libcfa/src/interpose.cfa:301
22:55:26 #7  0x00007ffff7e98294 in _X15sigHandler_termFv_iPS21__anonymous_siginfo_tPS10ucontext_t__1 (_X3sigi_1=6, _X3sfpPS21__anonymous_siginfo_t_1=0x7ffff7f04fb0 <stack+64544>, _X3cxtPS10ucontext_t_1=0x7ffff7f04e80 <stack+64240>) at /var/lib/jenkins/workspace/Cforall_master_2/libcfa/src/interpose.cfa:337
22:55:26 #8  <signal handler called>
22:55:26 #9  __pthread_kill_implementation (no_tid=0, signo=6, threadid=<optimized out>) at ./nptl/pthread_kill.c:44
22:55:26 #10 __pthread_kill_internal (signo=6, threadid=<optimized out>) at ./nptl/pthread_kill.c:78
22:55:26 #11 __GI___pthread_kill (threadid=<optimized out>, signo=signo@entry=6) at ./nptl/pthread_kill.c:89
22:55:26 #12 0x00007ffff7a4527e in __GI_raise (sig=sig@entry=6) at ../sysdeps/posix/raise.c:26
22:55:26 #13 0x00007ffff7a288ff in __GI_abort () at ./stdlib/abort.c:79
22:55:26 #14 0x00007ffff7e97f69 in _X7__abortFv_bPKcY17__builtin_va_list__1 (_X11signalAbortb_1=false, _X3fmtPKc_1=0x5555555652f8 "Attempting to fulfil a future that has already been fulfilled", _X4argsY17__builtin_va_list_1=0x5555557abbe0) at /var/lib/jenkins/workspace/Cforall_master_2/libcfa/src/interpose.cfa:286
22:55:26 #15 0x00007ffff7e98020 in _X5abortFv_PKc__1 (_X3fmtPKc_1=0x5555555652f8 "Attempting to fulfil a future that has already been fulfilled") at /var/lib/jenkins/workspace/Cforall_master_2/libcfa/src/interpose.cfa:293
22:55:26 #16 0x000055555555c45d in _X6fulfilQ1_0_0_4__X16_operator_assignFBD0_BD0BD0__X12_constructorFv_BD0__X12_constructorFv_BD0BD0__X11_destructorFv_BD0__Fb_S6future_BD0_BD0__1 (_adapterFv_PY1TY1T__MP=0x5555557abf0c, _adapterFY1T_PY1TY1T_P_MP=0x5555557abef0, _sizeof_Y1T=4, _alignof_Y1T=4, _X16_operator_assignFY1T_Y1TY1T__1=0x7ffff7ea29fd <_X16_operator_assignFi_ii_intrinsic___1>, _X12_constructorFv_Y1T__1=0x7ffff7ea7fc1 <_X12_constructorFv_i_intrinsic___1>, _X12_constructorFv_Y1TY1T__1=0x7ffff7ea7fd0 <_X12_constructorFv_ii_intrinsic___1>, _X11_destructorFv_Y1T__1=0x7ffff7ea8027 <_X11_destructorFv_i_intrinsic___1>, _X3futS6future_Y1T__1=0x55555556a420 <_X1CS6future_i__1>, _X3valY1T_1=0x5555557abd90) at /var/lib/jenkins/workspace/Cforall_master_2/libcfa/src/concurrency/future.hfa:196
22:55:26 #17 0x000055555555c75c in _X14_operator_callQ1_0_0_4__X16_operator_assignFBD0_BD0BD0__X12_constructorFv_BD0__X12_constructorFv_BD0BD0__X11_destructorFv_BD0__Fb_S6future_BD0_BD0__1 (_adapterFv_PY1TY1T__MP=0x5555557abf0c, _adapterFY1T_PY1TY1T_P_MP=0x5555557abef0, _sizeof_Y1T=4, _alignof_Y1T=4, _X16_operator_assignFY1T_Y1TY1T__1=0x7ffff7ea29fd <_X16_operator_assignFi_ii_intrinsic___1>, _X12_constructorFv_Y1T__1=0x7ffff7ea7fc1 <_X12_constructorFv_i_intrinsic___1>, _X12_constructorFv_Y1TY1T__1=0x7ffff7ea7fd0 <_X12_constructorFv_ii_intrinsic___1>, _X11_destructorFv_Y1T__1=0x7ffff7ea8027 <_X11_destructorFv_i_intrinsic___1>, _X3futS6future_Y1T__1=0x55555556a420 <_X1CS6future_i__1>, _X3valY1T_1=0x5555557abeec) at /var/lib/jenkins/workspace/Cforall_master_2/libcfa/src/concurrency/future.hfa:200
22:55:26 #18 0x000055555555cdb9 in _X4mainFv_S6Server__1 (__anonymous_object2711=0x7fffffffd4e0) at concurrency/waituntil/futures.cfa:11
22:55:26 #19 0x00007ffff7f4693f in __cfactx_invoke_thread (main=0x55555555cae5 <_X4mainFv_S6Server__1>, this=0x7fffffffd4e0) at /var/lib/jenkins/workspace/Cforall_master_2/libcfa/src/concurrency/invoke.c:87
22:55:26 #20 0x0000000000000000 in ?? ()
22:55:26 -----
22:55:26   Id   Target Id                           Frame 
22:55:26 * 1    Thread 0x7ffff7c97900 (LWP 1065401) __pthread_kill_implementation (no_tid=0, signo=6, threadid=<optimized out>) at ./nptl/pthread_kill.c:44
22:55:26   2    Thread 0x5555555b9ec0 (LWP 1065402) 0x00007ffff7a45fc8 in __GI___sigtimedwait (set=0x5555555b93f0, info=0x5555555b9470, timeout=0x0) at ../sysdeps/unix/sysv/linux/sigtimedwait.c:31
22:55:26   3    Thread 0x555555649ec0 (LWP 1065403) 0x00007ffff7b1bd6a in __GI___libc_read (nbytes=8, buf=0x555555648fb0, fd=5) at ../sysdeps/unix/sysv/linux/read.c:26
22:55:26 
22:55:26 Archiving concurrency/waituntil/futures (executable and core) to crashes/full-debug/concurrency/waituntil/futures
22:55:26        	coroutine/fmtLines                   PASSED     C 0:06.460 - R 0:00.011
22:55:26        	counter                              PASSED     C 0:05.172 - R 0:00.009
22:55:26        	coroutine/pingpong                   PASSED     C 0:06.999 - R 0:00.026
22:55:26        	coroutine/raii                       PASSED     C 0:06.484 - R 0:00.019
22:55:26        	ctrl-flow/break-misc                 PASSED     C 0:05.224 - R 0:00.007
22:55:26        	coroutine/runningTotal               PASSED     C 0:06.517 - R 0:00.017
22:55:26        	ctrl-flow/loop-inc                   PASSED     C 0:01.051 - R 0:00.019
22:55:26        	ctrl-flow/labelledExit               PASSED     C 0:01.242 - R 0:00.011
22:55:26        	coroutine/prodcons                   PASSED     C 0:08.043 - R 0:00.015
22:55:26        	ctrl-flow/fallthrough                PASSED     C 0:05.256 - R 0:00.007
22:55:26        	ctrl-flow/goto                       PASSED     C 0:05.301 - R 0:00.005
22:55:26        	enum                                 PASSED     C 0:01.060 - R 0:00.020
22:55:26        	designations                         PASSED     C 0:02.085 - R 0:00.007
22:55:26        	concurrency/waituntil/all_types      PASSED     C 0:26.449 - R 0:07.087
22:55:26        	ctrl-flow/ifwhileCtl                 PASSED     C 0:05.061 - R 0:00.005
22:55:26        	ctrl-flow/loop_else                  PASSED     C 0:04.974 - R 0:00.005
22:55:26        	enum_tests/funcEnum                  PASSED     C 0:01.783 - R 0:00.007
22:55:26        	enum_tests/inc-dec                   PASSED     C 0:01.080 - R 0:00.021
22:55:26        	enum_tests/lvalue                    PASSED     C 0:00.520 - R n/a
22:55:26        	ctrl-flow/loop_else-WRN1             PASSED     C 0:06.046 - R 0:00.001
22:55:26        	ctrl-flow/loopctrl                   PASSED     C 0:06.709 - R 0:00.007
22:55:26        	...ency/unified_locking/futex_mutex  PASSED     C 0:11.908 - R 0:41.838
22:55:26        	enum_tests/anonymous                 PASSED     C 0:05.555 - R 0:00.011
22:55:26        	div                                  PASSED     C 0:06.985 - R 0:00.011
22:55:26        	errors/declaration                   PASSED     C 0:00.111 - R n/a
22:55:26        	enum_tests/enumInlineValue           PASSED     C 0:05.886 - R 0:00.009
22:55:26        	errors/scope-type                    PASSED     C 0:00.292 - R n/a
22:55:26        	errors/scope                         PASSED     C 0:00.608 - R n/a
22:55:26        	device/cpu                           PASSED     C 0:08.207 - R 0:00.015
22:55:26        	errors/signature                     PASSED     C 0:00.124 - R n/a
22:55:26        	enum_tests/structEnum                PASSED     C 0:01.897 - R 0:00.008
22:55:26        	eval                                 PASSED     C 0:00.995 - R 0:00.020
22:55:26        	enum_tests/input                     PASSED     C 0:05.773 - R 0:00.007
22:55:26        	...urrency/unified_locking/mcs_spin  PASSED     C 0:11.154 - R 0:43.027
22:55:26        	enum_tests/stringEnum                PASSED     C 0:05.367 - R 0:00.006
22:55:26        	concurrency/mutexstmt/locks          PASSED     C 0:09.499 - R 1:10.763
22:55:26        	enum_tests/planet                    PASSED     C 0:07.008 - R 0:00.005
22:55:26        	enum_tests/position                  PASSED     C 0:07.458 - R 0:00.020
22:55:26        	enum_tests/voidEnum                  PASSED     C 0:05.582 - R 0:00.007
22:55:26        	enum_tests/typedIntEnum              PASSED     C 0:05.805 - R 0:00.021
22:55:26        	exceptions/conditional               PASSED     C 0:05.807 - R 0:00.006
22:55:26        	exceptions/cancel/coroutine          PASSED     C 0:06.790 - R 0:00.019
22:55:26        	exceptions/data-except               PASSED     C 0:05.398 - R 0:00.010
22:55:26        	exceptions/conditional-threads       PASSED     C 0:06.545 - R 0:00.029
22:55:26        	exceptions/defaults                  PASSED     C 0:05.667 - R 0:00.006
22:55:26        	exceptions/message                   PASSED     C 0:02.064 - R 0:00.007
22:55:26        	concurrency/waituntil/repeat_close   PASSED     C 0:10.907 - R 0:30.041
22:55:26        	exceptions/cancel/thread             PASSED     C 0:09.518 - R 0:00.011
22:55:26        	exceptions/finally                   PASSED     C 0:06.030 - R 0:00.011
22:55:26        	exceptions/try-ctrl-flow             PASSED     C 0:00.360 - R n/a
22:55:26        	exceptions/interact                  PASSED     C 0:05.954 - R 0:00.006
22:55:26        	.../unified_locking/spin_queue_lock  PASSED     C 0:11.481 - R 0:48.587
22:55:26        	exceptions/defaults-threads          PASSED     C 0:07.895 - R 0:00.020
22:55:26        	exceptions/type-check                PASSED     C 0:00.446 - R n/a
22:55:26        	exceptions/finally-threads           PASSED     C 0:06.603 - R 0:00.011
22:55:26        	exceptions/try-leave-catch           PASSED     C 0:01.139 - R 0:00.006
22:55:26        	exceptions/cor_resumer               PASSED     C 0:10.270 - R 0:00.011
22:55:26        	exceptions/fibonacci_nonlocal        PASSED     C 0:08.426 - R 0:00.011
22:55:26        	expression                           PASSED     C 0:01.167 - R 0:00.007
22:55:26        	exceptions/polymorphic               PASSED     C 0:05.949 - R 0:00.019
22:55:26        	exceptions/resume                    PASSED     C 0:05.826 - R 0:00.014
22:55:26        	exceptions/terminate                 PASSED     C 0:05.511 - R 0:00.005
22:55:26        	global-monomorph                     PASSED     C 0:00.958 - R 0:00.007
22:55:26        	exceptions/trash                     PASSED     C 0:05.208 - R 0:00.006
22:55:26        	exceptions/resume-threads            PASSED     C 0:07.552 - R 0:00.009
22:55:26        	exceptions/terminate-threads         PASSED     C 0:07.145 - R 0:00.039
22:55:26        	identFuncDeclarator                  PASSED     C 0:01.222 - R 0:00.020
22:55:26        	exceptions/virtual-poly              PASSED     C 0:05.999 - R 0:00.008
22:55:26        	fstream_test                         PASSED     C 0:05.473 - R 0:00.025
22:55:26        	generator/fibonacci                  PASSED     C 0:05.920 - R 0:00.006
22:55:26        	exceptions/pingpong_nonlocal         PASSED     C 0:10.788 - R 0:00.043
22:55:26        	forall                               PASSED     C 0:06.543 - R 0:00.035
22:55:26        	generator/fmtLines                   PASSED     C 0:05.532 - R 0:00.017
22:55:26        	identParamDeclarator                 PASSED     C 0:01.247 - R 0:00.022
22:55:26        	exceptions/virtual-cast              PASSED     C 0:07.106 - R 0:00.007
22:55:26        	init1-ERROR                          PASSED     C 0:00.613 - R n/a
22:55:26        	generator/suspend_then               PASSED     C 0:05.403 - R 0:00.015
22:55:26        	init1                                PASSED     C 0:01.072 - R 0:00.007
22:55:26        	genericUnion                         PASSED     C 0:05.536 - R 0:00.008
22:55:26        	include/vector-sequence              PASSED     C 0:01.530 - R 0:00.006
22:55:26        	function-operator                    PASSED     C 0:07.732 - R 0:00.007
22:55:26        	include/vector-collections           PASSED     C 0:02.446 - R 0:00.006
22:55:26        	hello                                PASSED     C 0:05.628 - R 0:00.007
22:55:26        	identity                             PASSED     C 0:05.564 - R 0:00.014
22:55:26        	include/stdincludes                  PASSED     C 0:06.048 - R 0:00.006
22:55:26        	include/vector-fstream               PASSED     C 0:05.480 - R 0:00.005
22:55:26        	io/eofType                           PASSED     C 0:05.811 - R 0:00.020
22:55:26        	concurrency/waituntil/locks          PASSED     C 0:11.608 - R 0:51.128
22:55:26        	io/io                                PASSED     C 0:08.763 - R 0:00.021
22:55:26        	limits                               PASSED     C 0:01.223 - R 0:00.022
22:55:26        	io/io-acquire-in                     PASSED     C 0:10.326 - R 0:00.011
22:55:26        	io/io-acquire                        PASSED     C 0:11.018 - R 0:00.318
22:55:26        	io/manipulatorsOutput4               PASSED     C 0:07.617 - R 0:00.036
22:55:26        	io/io-acquire-out                    PASSED     C 0:10.696 - R 0:00.075
22:55:26        	io/away_fair                         PASSED     C 0:13.149 - R 0:00.120
22:55:26        	io/manipulatorsInput-uchunk          PASSED     C 0:08.371 - R 0:00.019
22:55:26        	linking/exception-nothreads          PASSED     C 0:04.125 - R 0:00.025
22:55:26        	linking/nostdlib                     PASSED     C 0:01.119 - R 0:00.019
22:55:26        	io/comp_basic                        PASSED     C 0:13.682 - R 0:00.321
22:55:26        	io/io-acquire-no-io                  PASSED     C 0:10.074 - R 0:02.477
22:55:26        	io/comp_fair                         PASSED     C 0:13.873 - R 0:00.322
22:55:26        	io/io-acquire2                       PASSED     C 0:10.870 - R 0:00.072
22:55:26        	linkonce                             PASSED     C 0:01.432 - R 0:00.012
22:55:26        	maybe                                PASSED     C 0:01.628 - R 0:00.012
22:55:26        	linking/exception-withthreads        PASSED     C 0:06.182 - R 0:00.020
22:55:26        	include/includes                     PASSED     C 0:19.251 - R 0:00.005
22:55:26        	linking/mangling/anon                PASSED     C 0:06.539 - R 0:00.023
22:55:26        	nested-types-ERR1                    PASSED     C 0:00.118 - R n/a
22:55:26        	nested-types                         PASSED     C 0:01.221 - R 0:00.008
22:55:26        	io/many_read                         PASSED     C 0:12.752 - R 0:00.040
22:55:26        	nested-types-ERR2                    PASSED     C 0:00.273 - R n/a
22:55:26        	list/dlist-insert-remove             PASSED     C 0:05.868 - R 0:00.039
22:55:26        	linking/io-acquire                   PASSED     C 0:08.447 - R 0:00.007
22:55:26        	literals                             PASSED     C 0:05.889 - R 0:00.019
22:55:26        	list/dlist2-insert-remove            PASSED     C 0:06.223 - R 0:00.012
22:55:26        	nowarn/exception                     PASSED     C 0:01.238 - R 0:00.024
22:55:26        	linking/nothreads                    PASSED     C 0:07.593 - R 0:00.007
22:55:26        	opt-params                           PASSED     C 0:00.087 - R n/a
22:55:26        	nowarn/array                         PASSED     C 0:01.504 - R 0:00.022
22:55:26        	meta/fork+exec                       PASSED     C 0:04.043 - R 0:00.017
22:55:26        	nowarn/no-autogen                    PASSED     C 0:01.398 - R 0:00.012
22:55:26        	linking/weakso_nothd                 PASSED     C 0:07.963 - R 0:00.012
22:55:26        	nowarn/unused                        PASSED     C 0:01.116 - R 0:00.020
22:55:26        	nowarn/printf-sizeof                 PASSED     C 0:01.417 - R 0:00.009
22:55:26        	nowarn/zero-thunk                    PASSED     C 0:01.169 - R 0:00.006
22:55:26        	numericConstants                     PASSED     C 0:01.177 - R 0:00.007
22:55:26        	operators                            PASSED     C 0:01.153 - R 0:00.023
22:55:26        	polybits                             PASSED     C 0:00.279 - R n/a
22:55:26        	poly-bare-assn                       PASSED     C 0:01.125 - R 0:00.005
22:55:26        	poly-many-arsz                       PASSED     C 0:01.140 - R 0:00.005
22:55:26        	poly-d-cycle                         PASSED     C 0:01.183 - R 0:00.019
22:55:26        	poly-member                          PASSED     C 0:01.133 - R 0:00.008
22:55:26        	poly-o-cycle                         PASSED     C 0:01.218 - R 0:00.041
22:55:26        	poly-selection                       PASSED     C 0:01.295 - R 0:00.019
22:55:26        	poly-self-cycle                      PASSED     C 0:01.437 - R 0:00.020
22:55:26        	raii/ctor-autogen-ERR1               PASSED     C 0:00.779 - R n/a
22:55:26        	linking/withthreads                  PASSED     C 0:09.496 - R 0:00.040
22:55:26        	quasiKeyword                         PASSED     C 0:01.210 - R 0:00.019
22:55:26        	meta/dumpable                        PASSED     C 0:07.942 - R 0:00.007
22:55:26        	malloc                               PASSED     C 0:08.619 - R 0:00.007
22:55:26        	raii/ctor-autogen                    PASSED     C 0:01.539 - R 0:00.006
22:55:26        	raii/partial-ERR1                    PASSED     C 0:00.602 - R n/a
22:55:26        	raii/partial                         PASSED     C 0:01.058 - R 0:00.019
22:55:26        	raii/init_once                       PASSED     C 0:01.413 - R 0:00.006
22:55:26        	raii/typeof-member                   PASSED     C 0:01.195 - R 0:00.005
22:55:26        	heap                                 PASSED     C 0:07.685 - R 0:21.593
22:55:26        	result                               PASSED     C 0:01.341 - R 0:00.007
22:55:26        	minmax                               PASSED     C 0:09.492 - R 0:00.006
22:55:26        	raii/dtor-early-exit-ERR2            PASSED     C 0:03.888 - R n/a
22:55:26        	raii/dtor-early-exit-ERR1            PASSED     C 0:04.016 - R n/a
22:55:26        	raii/memberCtors-ERR1                PASSED     C 0:03.562 - R n/a
22:55:26        	simpleGenericTriple                  PASSED     C 0:01.194 - R 0:00.007
22:55:26        	quotedKeyword                        PASSED     C 0:05.208 - R 0:00.019
22:55:26        	raii/boxed-types                     PASSED     C 0:05.598 - R 0:00.007
22:55:26        	smart-pointers                       PASSED     C 0:01.296 - R 0:00.007
22:55:26        	polymorphism                         PASSED     C 0:06.153 - R 0:00.006
22:55:26        	switch                               PASSED     C 0:01.019 - R 0:00.006
22:55:26        	raii/globals                         PASSED     C 0:05.512 - R 0:00.011
22:55:26        	raii/memberCtors                     PASSED     C 0:05.567 - R 0:00.024
22:55:26        	tuple/tupleCast                      PASSED     C 0:01.024 - R 0:00.006
22:55:26        	tuple/tupleFunction                  PASSED     C 0:01.130 - R 0:00.007
22:55:26        	tuple/tupleMember                    PASSED     C 0:01.202 - R 0:00.007
22:55:26        	raii/dtor-early-exit                 PASSED     C 0:07.403 - R 0:00.009
22:55:26        	typedefRedef-ERR1                    PASSED     C 0:00.131 - R n/a
22:55:26        	tuple/tuplePolymorphism              PASSED     C 0:01.274 - R 0:00.006
22:55:26        	references                           PASSED     C 0:05.672 - R 0:00.006
22:55:26        	var-assert                           PASSED     C 0:00.134 - R n/a
22:55:26        	typedefRedef                         PASSED     C 0:01.029 - R 0:00.006
22:55:26        	typeof                               PASSED     C 0:01.014 - R 0:00.007
22:55:26        	shortCircuit                         PASSED     C 0:05.292 - R 0:00.007
22:55:26        	variableDeclarator                   PASSED     C 0:01.126 - R 0:00.006
22:55:26        	sizeof                               PASSED     C 0:05.285 - R 0:00.020
22:55:26        	tuple/tupleVariadic                  PASSED     C 0:03.682 - R 0:00.006
22:55:26        	strstream                            PASSED     C 0:06.205 - R 0:00.006
22:55:26        	searchsort                           PASSED     C 0:07.944 - R 0:00.007
22:55:26        	tuple/tupleAssign                    PASSED     C 0:06.348 - R 0:00.007
22:55:26        	sum                                  PASSED     C 0:07.547 - R 0:00.006
22:55:26        	tuplearray                           PASSED     C 0:05.619 - R 0:00.010
22:55:26        	time                                 PASSED     C 0:07.484 - R 0:00.010
22:55:26        	voidPtr                              PASSED     C 0:01.019 - R 0:00.005
22:55:26        	swap                                 PASSED     C 0:08.503 - R 0:00.006
22:55:26        	withconflict                         PASSED     C 0:00.517 - R n/a
22:55:26        	userLiterals                         PASSED     C 0:05.887 - R 0:00.021
22:55:26        	warnings/self-assignment             PASSED     C 0:00.941 - R 0:00.001
22:55:26        	KRfunctions                          PASSED     C 0:00.897 - R 0:00.001
22:55:26        	vector                               PASSED     C 0:06.827 - R 0:00.007
22:55:26        	zero_one-ERR1                        PASSED     C 0:02.887 - R n/a
22:55:26        	vector_math/vec2_double              PASSED     C 0:07.912 - R 0:00.019
22:55:26        	arithmeticConversions                PASSED     C 0:02.324 - R 0:00.019
22:55:26        	...collections/dimexpr-match-c-ERRS  PASSED     C 0:00.674 - R n/a
22:55:26        	vector_math/vec2_uint                PASSED     C 0:07.875 - R 0:00.009
22:55:26        	...llections/dimexpr-match-cfa-ERRS  PASSED     C 0:01.306 - R n/a
22:55:26        	attributes                           PASSED     C 0:01.179 - R 0:00.001
22:55:26        	zero_one                             PASSED     C 0:05.415 - R 0:00.011
22:55:26        	vector_math/vec2_int                 PASSED     C 0:10.866 - R 0:00.008
22:55:26        	vector_math/vec2_float               PASSED     C 0:11.337 - R 0:00.007
22:55:26        	vector_math/vec3_int                 PASSED     C 0:10.454 - R 0:00.007
22:55:26        	declarationSpecifier                 PASSED     C 0:00.925 - R 0:00.001
22:55:26        	abs                                  PASSED     C 0:07.353 - R 0:00.009
22:55:26        	errors/completeType                  PASSED     C 0:00.558 - R n/a
22:55:26        	...collections/array-md-sbscr-cases  PASSED     C 0:06.633 - R 0:00.010
22:55:26        	vector_math/vec4_float               PASSED     C 0:11.748 - R 0:00.009
22:55:26        	vector_math/vec4_int                 PASSED     C 0:10.408 - R 0:00.007
22:55:26        	vector_math/vec3_float               PASSED     C 0:12.211 - R 0:00.010
22:55:26        	extension                            PASSED     C 0:00.986 - R 0:00.001
22:55:26        	rational                             PASSED     C 0:21.257 - R 0:00.022
22:55:26        	gccExtensions                        PASSED     C 0:00.968 - R 0:00.001
22:55:26        	functions                            PASSED     C 0:00.980 - R 0:00.001
22:55:26        	ato                                  PASSED     C 0:07.982 - R 0:00.005
22:55:26        	bitmanip1                            PASSED     C 0:08.885 - R 0:00.022
22:55:26        	bitmanip2                            PASSED     C 0:08.574 - R 0:00.018
22:55:26        	meta/arch                            PASSED     C 0:00.534 - R n/a
22:55:26        	configs/parsenums                    PASSED     C 0:07.718 - R 0:00.117
22:55:26        	bitmanip3                            PASSED     C 0:10.273 - R 0:00.023
22:55:26        	concurrency/pthread/bounded_buffer   PASSED     C 0:10.414 - R 0:00.168
22:55:26        	PRNG                                 PASSED     C 0:13.223 - R 0:02.825
22:55:26        	exceptions/cardgame                  PASSED     C 0:08.656 - R 0:00.017
22:55:26        	io/manipulatorsInput                 PASSED     C 0:06.951 - R 0:00.006
22:55:26        	gmp                                  PASSED     C 0:07.069 - R 0:00.009
22:55:26        	exceptions/hotpotato_checked         PASSED     C 0:09.114 - R 0:00.010
22:55:26        	exceptions/hotpotato                 PASSED     C 0:09.356 - R 0:00.009
22:55:26        	io/manipulatorsOutput2               PASSED     C 0:08.607 - R 0:00.009
22:55:26        	concurrency/unified_locking/locks    PASSED     C 0:11.834 - R 1:54.723
22:55:26        	io/manipulatorsOutput1               PASSED     C 0:11.090 - R 0:00.010
22:55:26        	io/manipulatorsOutput3               PASSED     C 0:11.163 - R 0:00.009
22:55:26        	random                               PASSED     C 0:06.786 - R 0:00.005
22:55:26        	mathX                                PASSED     C 0:10.563 - R 0:00.019
22:55:26        	vector_math/vec2_ldouble             PASSED     C 0:07.533 - R 0:00.005
22:55:26        	math                                 PASSED     C 0:10.333 - R 0:00.011
22:55:26        	nested_function                      PASSED     C 0:09.775 - R 0:00.020
22:55:26 377 passes, 1 failures, 0 timeouts, 0 cancelled, 0 other
22:55:26 Tests took  3:19.992
22:55:26 make: *** [Makefile:986: all-local] Error 1
22:55:26 [Pipeline] }
22:55:26 [Pipeline] // dir
22:55:26 [Pipeline] }
22:55:26 [Pipeline] // stage
22:55:26 [Pipeline] echo
22:55:26 Archiving core dumps
22:55:26 [Pipeline] dir
22:55:26 Running in /var/lib/jenkins/workspace/Cforall_master_2@tmp
22:55:26 [Pipeline] {
22:55:26 [Pipeline] fileExists
22:55:26 [Pipeline] sh
22:55:26 + /var/lib/jenkins/workspace/Cforall_master_2/tools/jenkins/archive-gen.sh
22:55:26 [Pipeline] archiveArtifacts
22:55:26 Archiving artifacts
22:55:26 Recording fingerprints
22:55:26 [Pipeline] }
22:55:26 [Pipeline] // dir
22:55:26 [Pipeline] }
22:55:26 [Pipeline] // wrap
22:55:26 [Pipeline] }
22:55:26 [Pipeline] // node
22:55:26 [Pipeline] echo
22:55:26 hudson.AbortException: script returned exit code 2
22:55:26 [Pipeline] node
22:55:26 Running on Brokk 5 in /var/lib/jenkins/workspace/Cforall_master_2
22:55:26 [Pipeline] {
22:55:26 [Pipeline] echo
22:55:26 Notifying users of result
22:55:26 [Pipeline] echo
22:55:26 Reusing previously constructed message
22:55:26 [Pipeline] echo
22:55:26 Would send email to: cforall@lists.uwaterloo.ca
22:55:26 [Pipeline] echo
22:55:26 With title: [cforall git][BUILD# 3664 - FAILURE] - branch master
22:55:26 [Pipeline] echo
22:55:26 Content: 
22:55:26 <p>This is an automated email from the Jenkins build machine. It was
22:55:26 generated because of a git hooks/post-receive script following
22:55:26 a ref change which was pushed to the Cāˆ€ repository.</p>
22:55:26 
22:55:26 <p>- Status --------------------------------------------------------------</p>
22:55:26 
22:55:26 <p>BUILD# 3664 - FAILURE</p>
22:55:26 <p>Check console output at https://cforall.uwaterloo.ca/jenkins/job/Cforall/job/master/3664/ to view the results.</p>
22:55:26 
22:55:26 <p>- Changes -------------------------------------------------------------</p>
22:55:26 
22:55:26 <pre>
22:55:26 The branch master has been updated.
22:55:26       from  4ff8cb209307cd30c3626d4fbe3cc2d2ce4219ea (commit)
22:55:26 </pre>
22:55:26 
22:55:26 <p>- Log -----------------------------------------------------------------</p>
22:55:26 
22:55:26 <pre>
22:55:26 
22:55:26 </pre>
22:55:26 
22:55:26 <p>-----------------------------------------------------------------------</p>
22:55:26 <pre>
22:55:26 Summary of changes:
22:55:26 
22:55:26 </pre>
22:55:26 
22:55:26 [Pipeline] }
22:55:26 [Pipeline] // node
22:55:26 [Pipeline] echo
22:55:26 Build Completed
22:55:26 [Pipeline] End of Pipeline
22:55:26 ERROR: script returned exit code 2
22:55:26 Finished: FAILURE