Console Output

Skipping 527 KB.. Full Log
23:14:08        	searchsort                                 PASSED     C 0:14.203 - R 0:00.016
23:14:08        	tuple/tupleCast                            PASSED     C 0:00.977 - R 0:00.016
23:14:08        	tuple/tupleFunction                        PASSED     C 0:01.117 - R 0:00.016
23:14:08        	sum                                        PASSED     C 0:12.883 - R 0:00.016
23:14:08        	tuple/tupleMember                          PASSED     C 0:01.068 - R 0:00.016
23:14:08        	tuple/tuplePolymorphism                    PASSED     C 0:01.349 - R 0:00.016
23:14:08        	typedefRedef                               PASSED     C 0:00.918 - R 0:00.002
23:14:08        	typedefRedef-ERR1                          PASSED     C 0:00.106 - R n/a
23:14:08        	tuple/tupleVariadic                        PASSED     C 0:02.677 - R 0:00.016
23:14:08        	typeof                                     PASSED     C 0:00.975 - R 0:00.016
23:14:08        	swap                                       PASSED     C 0:13.997 - R 0:00.017
23:14:08        	time                                       PASSED     C 0:12.165 - R 0:00.017
23:14:08        	tuple/tupleAssign                          PASSED     C 0:11.294 - R 0:00.016
23:14:08        	rational                                   PASSED     C 0:29.452 - R 0:00.016
23:14:08        	userLiterals                               PASSED     C 0:09.862 - R 0:00.016
23:14:08        	variableDeclarator                         PASSED     C 0:00.950 - R 0:00.002
23:14:08        	unified_locking/fast                       PASSED     C 0:18.049 - R 0:00.128
23:14:08        	unified_locking/lin_backoff                PASSED     C 0:18.057 - R 0:00.135
23:14:08        	unified_locking/timeout_lock               PASSED     C 0:14.684 - R 0:01.117
23:14:08        	vector                                     PASSED     C 0:15.413 - R 0:00.052
23:14:08        	vector_math/vec2_double                    PASSED     C 0:15.148 - R 0:00.045
23:14:08        	unified_locking/mcs                        PASSED     C 0:17.907 - R 0:20.097
23:14:08        	vector_math/vec2_float                     PASSED     C 0:26.503 - R 0:00.016
23:14:08        	vector_math/vec2_uint                      PASSED     C 0:14.178 - R 0:00.016
23:14:08        	vector_math/vec2_int                       PASSED     C 0:27.108 - R 0:00.038
23:14:08        	voidPtr                                    PASSED     C 0:01.245 - R 0:00.049
23:14:08        	warnings/self-assignment                   PASSED     C 0:01.105 - R 0:00.001
23:14:08        	KRfunctions                                PASSED     C 0:01.055 - R 0:00.029
23:14:08        	vector_math/vec3_float                     PASSED     C 0:24.985 - R 0:00.016
23:14:08        	vector_math/vec3_int                       PASSED     C 0:20.009 - R 0:00.017
23:14:08        	abs                                        PASSED     C 0:12.864 - R 0:00.042
23:14:08        	attributes                                 PASSED     C 0:01.035 - R 0:00.002
23:14:08        	vector_math/vec4_int                       PASSED     C 0:20.893 - R 0:00.033
23:14:08        	vector_math/vec4_float                     PASSED     C 0:23.282 - R 0:00.037
23:14:08        	array-container/array-md-sbscr-cases       PASSED     C 0:12.017 - R 0:00.016
23:14:08        	declarationSpecifier                       PASSED     C 0:01.246 - R 0:00.002
23:14:08        	errors/completeType                        PASSED     C 0:00.691 - R n/a
23:14:08        	ato                                        PASSED     C 0:12.093 - R 0:00.034
23:14:08        	extension                                  PASSED     C 0:01.201 - R 0:00.001
23:14:08        	functions                                  PASSED     C 0:01.026 - R 0:00.010
23:14:08        	gccExtensions                              PASSED     C 0:00.963 - R 0:00.019
23:14:08        	bitmanip1                                  PASSED     C 0:19.378 - R 0:00.038
23:14:08        	io/manipulatorsInput                       PASSED     C 0:14.021 - R 0:00.016
23:14:08        	bitmanip2                                  PASSED     C 0:24.329 - R 0:00.049
23:14:08        	unified_locking/locks                      PASSED     C 0:15.922 - R 1:15.207
23:14:08        	meta/archVast                              PASSED     C 0:00.498 - R n/a
23:14:08        	io/manipulatorsOutput1                     PASSED     C 0:23.171 - R 0:00.016
23:14:08        	io/manipulatorsOutput2                     PASSED     C 0:16.557 - R 0:00.016
23:14:08        	random                                     PASSED     C 0:10.684 - R 0:00.016
23:14:08        	bitmanip3                                  PASSED     C 0:36.736 - R 0:00.032
23:14:08        	vector_math/vec2_ldouble                   PASSED     C 0:10.820 - R 0:00.016
23:14:08        	math                                       PASSED     C 0:21.376 - R 0:00.017
23:14:08        	mathX                                      PASSED     C 0:34.224 - R 0:00.034
23:14:08 Tests took  7:23.849
23:14:08 [Pipeline] sh
23:14:08 + make --no-print-directory -C tests timeouts=--timeout=600 --global-timeout=14400 all-tests debug=no archiveerrors=/var/lib/jenkins/workspace/Cforall_master@tmp/tests/crashes/full-nodebug
23:14:08 Running 222 tests on 6 cores (Default AST (new):x86 - no debug)
23:14:08        	array-container/language-dim-mismatch      PASSED     C 0:00.120 - R n/a
23:14:08        	array                                      PASSED     C 0:01.662 - R 0:00.009
23:14:08        	builtins/sync                              PASSED     C 0:02.124 - R 0:00.001
23:14:08        	array-container/array-basic                PASSED     C 0:05.142 - R 0:00.012
23:14:08        	cast                                       PASSED     C 0:01.361 - R 0:00.012
23:14:08        	castError                                  PASSED     C 0:00.758 - R n/a
23:14:08        	avl_test                                   PASSED     C 0:06.563 - R 0:00.011
23:14:08        	alloc-ERROR                                PASSED     C 0:09.263 - R n/a
23:14:08        	collections/multi_list                     PASSED     C 0:13.806 - R 0:00.004
23:14:08        	alloc                                      PASSED     C 0:22.322 - R 0:00.004
23:14:08        	collections/atomic_mpsc                    PASSED     C 0:18.144 - R 0:02.169
23:14:08        	collections/queue                          PASSED     C 0:22.250 - R 0:00.004
23:14:08        	collections/sequence                       PASSED     C 0:23.130 - R 0:00.004
23:14:08        	collections/stack                          PASSED     C 0:15.631 - R 0:00.008
23:14:08        	collections/string-gc                      PASSED     C 0:09.999 - R 0:00.005
23:14:08        	collections/vector-err-retn-perm-it-byval  PASSED     C 0:01.962 - R n/a
23:14:08        	collections/vector-err-pass-perm-it-byval  PASSED     C 0:02.403 - R n/a
23:14:08        	collections/vector-demo                    PASSED     C 0:05.620 - R 0:00.004
23:14:08        	collections/string-api-coverage            PASSED     C 0:16.584 - R 0:00.004
23:14:08        	collections/string-overwrite               PASSED     C 0:10.011 - R 0:00.013
23:14:08        	alloc2                                     PASSED     C 0:43.594 - R 0:00.004
23:14:08        	concurrent/clib                            PASSED     C 0:05.881 - R 0:00.116
23:14:08        	concurrent/clib_tls                        PASSED     C 0:06.013 - R 0:00.016
23:14:08        	complex                                    PASSED     C 0:09.028 - R 0:00.004
23:14:08        	concurrent/cluster                         PASSED     C 0:11.700 - R 0:00.016
23:14:08        	concurrent/coroutineYield                  PASSED     C 0:18.293 - R 0:00.033
23:14:08        	concurrent/examples/datingService          PASSED     C 0:16.365 - R 0:00.008
23:14:08        	concurrent/examples/boundedBufferINT       PASSED     C 0:16.561 - R 0:02.672
23:14:08        	concurrent/examples/boundedBufferEXT       PASSED     C 0:17.733 - R 0:02.025
23:14:08        	concurrent/examples/gortn                  PASSED     C 0:18.677 - R 0:00.008
23:14:08        	concurrent/examples/matrixSum              PASSED     C 0:17.988 - R 0:00.005
23:14:08        	concurrent/futures/abandon                 PASSED     C 0:12.520 - R 0:00.065
23:14:08        	concurrent/keywordErrors                   PASSED     C 0:00.268 - R n/a
23:14:08        	concurrent/futures/basic                   PASSED     C 0:12.383 - R 0:00.033
23:14:08        	concurrent/examples/quickSort              PASSED     C 0:19.777 - R 0:00.008
23:14:08        	concurrent/futures/typed                   PASSED     C 0:12.972 - R 0:00.065
23:14:08        	concurrent/futures/multi                   PASSED     C 0:15.975 - R 0:00.004
23:14:08        	concurrent/join                            PASSED     C 0:17.848 - R 0:00.004
23:14:08        	concurrent/park/contention                 PASSED     C 0:12.160 - R 0:00.165
23:14:08        	concurrent/mutexstmt/monitors              PASSED     C 0:13.069 - R 0:00.778
23:14:08        	concurrent/mutexstmt/locks                 PASSED     C 0:15.619 - R 0:02.048
23:14:08        	concurrent/monitor                         PASSED     C 0:17.413 - R 0:04.290
23:14:08        	concurrent/multi-monitor                   PASSED     C 0:18.181 - R 0:04.826
23:14:08        	concurrent/park/start_parked               PASSED     C 0:12.511 - R 0:00.008
23:14:08        	concurrent/park/force_preempt              PASSED     C 0:17.948 - R 0:00.265
23:14:08        	concurrent/signal/block                    PASSED     C 0:21.253 - R 0:00.684
23:14:08        	concurrent/semaphore                       PASSED     C 0:22.189 - R 0:00.009
23:14:08        	concurrent/signal/disjoint                 PASSED     C 0:20.938 - R 0:01.083
23:14:08        	concurrent/preempt                         PASSED     C 0:13.497 - R 0:15.043
23:14:08        	concurrent/signal/wait                     PASSED     C 0:21.124 - R 0:00.064
23:14:08        	concurrent/sleep                           PASSED     C 0:21.232 - R 0:01.117
23:14:08        	concurrent/suspend_then                    PASSED     C 0:19.370 - R 0:00.069
23:14:08        	concurrent/spinaphore                      PASSED     C 0:20.721 - R 0:00.115
23:14:08        	concurrent/waitfor/barge                   PASSED     C 0:17.984 - R 0:00.115
23:14:08        	concurrent/thread                          PASSED     C 0:19.253 - R 0:00.004
23:14:08        	const-init                                 PASSED     C 0:01.020 - R 0:00.004
23:14:08        	concurrent/waitfor/else                    PASSED     C 0:15.727 - R 0:00.004
23:14:08        	concurrent/waitfor/dtor                    PASSED     C 0:17.706 - R 0:00.365
23:14:08        	copyfile                                   PASSED     C 0:09.347 - R 0:00.004
23:14:08        	coroutine/devicedriver                     PASSED     C 0:10.934 - R 0:00.004
23:14:08        	coroutine/fibonacci                        PASSED     C 0:10.603 - R 0:00.004
23:14:08        	concurrent/waitfor/recurse                 PASSED     C 0:19.073 - R 0:00.365
23:14:08        	concurrent/waitfor/statment                PASSED     C 0:20.782 - R 0:00.008
23:14:08        	concurrent/waitfor/when                    PASSED     C 0:19.570 - R 0:00.064
23:14:08        	coroutine/fmtLines                         PASSED     C 0:10.851 - R 0:00.009
23:14:08        	designations                               PASSED     C 0:01.268 - R 0:00.004
23:14:08        	coroutine/pingpong                         PASSED     C 0:10.728 - R 0:00.009
23:14:08        	coroutine/raii                             PASSED     C 0:10.759 - R 0:00.004
23:14:08        	counter                                    PASSED     C 0:08.724 - R 0:00.008
23:14:08        	errors/declaration                         PASSED     C 0:00.085 - R n/a
23:14:08        	enum                                       PASSED     C 0:00.971 - R 0:00.004
23:14:08        	errors/signature                           PASSED     C 0:00.097 - R n/a
23:14:08        	errors/scope                               PASSED     C 0:00.178 - R n/a
23:14:08        	coroutine/runningTotal                     PASSED     C 0:10.640 - R 0:00.004
23:14:08        	coroutine/prodcons                         PASSED     C 0:15.352 - R 0:00.004
23:14:08        	exceptions/conditional                     PASSED     C 0:01.132 - R 0:00.004
23:14:08        	exceptions/data-except                     PASSED     C 0:01.133 - R 0:00.004
23:14:08        	exceptions/defaults                        PASSED     C 0:02.117 - R 0:00.004
23:14:08        	exceptions/cancel/coroutine                PASSED     C 0:07.197 - R 0:00.004
23:14:08        	exceptions/finally                         PASSED     C 0:01.240 - R 0:00.004
23:14:08        	exceptions/finally-error                   PASSED     C 0:00.273 - R n/a
23:14:08        	exceptions/conditional-threads             PASSED     C 0:07.243 - R 0:00.004
23:14:08        	div                                        PASSED     C 0:13.119 - R 0:00.004
23:14:08        	exceptions/interact                        PASSED     C 0:01.495 - R 0:00.004
23:14:08        	device/cpu                                 PASSED     C 0:15.995 - R 0:00.004
23:14:08        	exceptions/polymorphic                     PASSED     C 0:01.692 - R 0:00.004
23:14:08        	exceptions/resume                          PASSED     C 0:01.578 - R 0:00.004
23:14:08        	exceptions/cancel/thread                   PASSED     C 0:11.957 - R 0:00.004
23:14:08        	exceptions/terminate                       PASSED     C 0:01.714 - R 0:00.004
23:14:08        	exceptions/trash                           PASSED     C 0:01.236 - R 0:00.014
23:14:08        	exceptions/type-check                      PASSED     C 0:00.263 - R n/a
23:14:08        	exceptions/defaults-threads                PASSED     C 0:08.321 - R 0:00.004
23:14:08        	exceptions/virtual-poly                    PASSED     C 0:01.304 - R 0:00.004
23:14:08        	expression                                 PASSED     C 0:00.996 - R 0:00.002
23:14:08        	exceptions/virtual-cast                    PASSED     C 0:02.819 - R 0:00.004
23:14:08        	exceptions/finally-threads                 PASSED     C 0:07.362 - R 0:00.005
23:14:08        	forall                                     PASSED     C 0:01.769 - R 0:00.001
23:14:08        	exceptions/resume-threads                  PASSED     C 0:07.758 - R 0:00.008
23:14:08        	exceptions/terminate-threads               PASSED     C 0:07.822 - R 0:00.004
23:14:08        	fallthrough                                PASSED     C 0:09.063 - R 0:00.010
23:14:08        	genericUnion                               PASSED     C 0:01.131 - R 0:00.004
23:14:08        	fstream_test                               PASSED     C 0:09.251 - R 0:00.004
23:14:08        	generator/fibonacci                        PASSED     C 0:08.733 - R 0:00.004
23:14:08        	global-monomorph                           PASSED     C 0:01.013 - R 0:00.004
23:14:08        	identFuncDeclarator                        PASSED     C 0:00.927 - R 0:00.001
23:14:08        	generator/fmtLines                         PASSED     C 0:08.984 - R 0:00.004
23:14:08        	identParamDeclarator                       PASSED     C 0:01.025 - R 0:00.004
23:14:08        	generator/suspend_then                     PASSED     C 0:08.790 - R 0:00.004
23:14:08        	function-operator                          PASSED     C 0:14.225 - R 0:00.007
23:14:08        	hello                                      PASSED     C 0:08.895 - R 0:00.004
23:14:08        	identity                                   PASSED     C 0:09.399 - R 0:00.004
23:14:08        	ifwhileCtl                                 PASSED     C 0:09.029 - R 0:00.004
23:14:08        	include/vector-sequence                    PASSED     C 0:01.747 - R 0:00.004
23:14:08        	init1                                      PASSED     C 0:01.103 - R 0:00.010
23:14:08        	include/vector-containers                  PASSED     C 0:05.896 - R 0:00.009
23:14:08        	init1-ERROR                                PASSED     C 0:00.658 - R n/a
23:14:08        	include/stdincludes                        PASSED     C 0:14.003 - R 0:00.009
23:14:08        	include/vector-fstream                     PASSED     C 0:10.979 - R 0:00.026
23:14:08        	heap                                       PASSED     C 0:13.669 - R 0:19.961
23:14:08        	labelledExit                               PASSED     C 0:00.935 - R 0:00.001
23:14:08        	limits                                     PASSED     C 0:01.010 - R 0:00.001
23:14:08        	linking/exception-nothreads                PASSED     C 0:02.749 - R 0:00.004
23:14:08        	include/includes                           PASSED     C 0:37.080 - R 0:00.002
23:14:08        	io/io-acquire                              PASSED     C 0:25.247 - R 0:00.032
23:14:08        	linking/nostdlib                           PASSED     C 0:00.986 - R 0:00.004
23:14:08        	io/many_read                               PASSED     C 0:20.154 - R 0:00.008
23:14:08        	io/io                                      PASSED     C 0:30.898 - R 0:00.004
23:14:08        	linking/exception-withthreads              PASSED     C 0:08.851 - R 0:00.004
23:14:08        	linkonce                                   PASSED     C 0:01.355 - R 0:00.008
23:14:08        	io/manipulatorsOutput4                     PASSED     C 0:29.948 - R 0:00.016
23:14:08        	linking/io-acquire                         PASSED     C 0:12.713 - R 0:00.004
23:14:08        	linking/nothreads                          PASSED     C 0:12.511 - R 0:00.006
23:14:08        	linking/weakso_nothd                       PASSED     C 0:12.423 - R 0:00.004
23:14:08        	maybe                                      PASSED     C 0:01.424 - R 0:00.004
23:14:08        	literals                                   PASSED     C 0:09.331 - R 0:00.004
23:14:08        	nested-types                               PASSED     C 0:00.956 - R 0:00.001
23:14:08        	nested-types-ERR1                          PASSED     C 0:00.102 - R n/a
23:14:08        	nested-types-ERR2                          PASSED     C 0:00.116 - R n/a
23:14:08        	numericConstants                           PASSED     C 0:00.892 - R 0:00.002
23:14:08        	operators                                  PASSED     C 0:01.013 - R 0:00.004
23:14:08        	linking/withthreads                        PASSED     C 0:17.321 - R 0:00.004
23:14:08        	poly-d-cycle                               PASSED     C 0:01.010 - R 0:00.013
23:14:08        	poly-o-cycle                               PASSED     C 0:01.059 - R 0:00.004
23:14:08        	loopctrl                                   PASSED     C 0:13.547 - R 0:00.004
23:14:08        	malloc                                     PASSED     C 0:12.317 - R 0:00.004
23:14:08        	poly-selection                             PASSED     C 0:01.000 - R 0:00.004
23:14:08        	list/dlist-insert-remove                   PASSED     C 0:18.756 - R 0:00.008
23:14:08        	quasiKeyword                               PASSED     C 0:01.015 - R 0:00.001
23:14:08        	raii/ctor-autogen                          PASSED     C 0:01.678 - R 0:00.007
23:14:08        	raii/ctor-autogen-ERR1                     PASSED     C 0:00.595 - R n/a
23:14:08        	minmax                                     PASSED     C 0:17.001 - R 0:00.004
23:14:08        	quotedKeyword                              PASSED     C 0:08.758 - R 0:00.004
23:14:08        	polymorphism                               PASSED     C 0:09.320 - R 0:00.004
23:14:08        	parseconfig                                PASSED     C 0:14.513 - R 0:00.004
23:14:08        	raii/boxed-types                           PASSED     C 0:08.978 - R 0:00.004
23:14:08        	raii/init_once                             PASSED     C 0:01.393 - R 0:00.006
23:14:08        	raii/memberCtors                           PASSED     C 0:01.292 - R 0:00.004
23:14:08        	raii/memberCtors-ERR1                      PASSED     C 0:00.654 - R n/a
23:14:08        	raii/dtor-early-exit-ERR1                  PASSED     C 0:09.232 - R n/a
23:14:08        	raii/dtor-early-exit                       PASSED     C 0:13.953 - R 0:00.004
23:14:08        	result                                     PASSED     C 0:01.793 - R 0:00.004
23:14:08        	raii/dtor-early-exit-ERR2                  PASSED     C 0:09.225 - R n/a
23:14:08        	raii/globals                               PASSED     C 0:09.212 - R 0:00.004
23:14:08        	simpleGenericTriple                        PASSED     C 0:01.583 - R 0:00.004
23:14:08        	smart-pointers                             PASSED     C 0:01.450 - R 0:00.004
23:14:08        	references                                 PASSED     C 0:10.621 - R 0:00.004
23:14:08        	shortCircuit                               PASSED     C 0:08.861 - R 0:00.008
23:14:08        	switch                                     PASSED     C 0:00.921 - R 0:00.001
23:14:08        	strstream                                  PASSED     C 0:09.552 - R 0:00.004
23:14:08        	searchsort                                 PASSED     C 0:16.647 - R 0:00.004
23:14:08        	tuple/tupleCast                            PASSED     C 0:00.968 - R 0:00.004
23:14:08        	sum                                        PASSED     C 0:15.212 - R 0:00.004
23:14:08        	tuple/tupleFunction                        PASSED     C 0:01.167 - R 0:00.004
23:14:08        	tuple/tupleMember                          PASSED     C 0:01.106 - R 0:00.004
23:14:08        	tuple/tuplePolymorphism                    PASSED     C 0:01.651 - R 0:00.005
23:14:08        	typedefRedef                               PASSED     C 0:00.915 - R 0:00.002
23:14:08        	typedefRedef-ERR1                          PASSED     C 0:00.098 - R n/a
23:14:08        	swap                                       PASSED     C 0:16.998 - R 0:00.004
23:14:08        	tuple/tupleVariadic                        PASSED     C 0:02.985 - R 0:00.004
23:14:08        	typeof                                     PASSED     C 0:01.015 - R 0:00.004
23:14:08        	time                                       PASSED     C 0:12.373 - R 0:00.004
23:14:08        	tuple/tupleAssign                          PASSED     C 0:11.576 - R 0:00.009
23:14:08        	rational                                   PASSED     C 0:39.938 - R 0:00.004
23:14:08        	unified_locking/timeout_lock               PASSED     C 0:14.469 - R 0:01.069
23:14:08        	unified_locking/fast                       FAILED with code 1    C 0:17.606 - R 0:00.037
23:14:08 		expected :
23:14:08 		3	Match!
23:14:08 		got :
23:14:08 		3	No Match! 2697660685 vs 3963048320
23:14:08 
23:14:08        	unified_locking/lin_backoff                PASSED     C 0:17.832 - R 0:00.008
23:14:08        	variableDeclarator                         PASSED     C 0:01.009 - R 0:00.006
23:14:08        	userLiterals                               PASSED     C 0:11.234 - R 0:00.004
23:14:08        	unified_locking/mcs                        PASSED     C 0:19.332 - R 0:03.421
23:14:08        	unified_locking/locks                      PASSED     C 0:16.682 - R 0:14.338
23:14:08        	vector                                     PASSED     C 0:14.742 - R 0:00.009
23:14:08        	vector_math/vec2_double                    PASSED     C 0:15.257 - R 0:00.004
23:14:08        	vector_math/vec2_uint                      PASSED     C 0:14.276 - R 0:00.004
23:14:08        	vector_math/vec2_float                     PASSED     C 0:32.557 - R 0:00.004
23:14:08        	voidPtr                                    PASSED     C 0:00.995 - R 0:00.004
23:14:08        	warnings/self-assignment                   PASSED     C 0:00.977 - R 0:00.001
23:14:08        	KRfunctions                                PASSED     C 0:00.867 - R 0:00.002
23:14:08        	vector_math/vec2_int                       PASSED     C 0:35.283 - R 0:00.004
23:14:08        	vector_math/vec3_int                       PASSED     C 0:26.693 - R 0:00.004
23:14:08        	vector_math/vec4_float                     PASSED     C 0:30.060 - R 0:00.004
23:14:08        	attributes                                 PASSED     C 0:01.060 - R 0:00.002
23:14:08        	vector_math/vec3_float                     PASSED     C 0:32.870 - R 0:00.004
23:14:08        	vector_math/vec4_int                       PASSED     C 0:28.934 - R 0:00.004
23:14:08        	abs                                        PASSED     C 0:14.409 - R 0:00.007
23:14:08        	declarationSpecifier                       PASSED     C 0:00.992 - R 0:00.002
23:14:08        	errors/completeType                        PASSED     C 0:00.512 - R n/a
23:14:08        	extension                                  PASSED     C 0:00.923 - R 0:00.002
23:14:08        	functions                                  PASSED     C 0:00.856 - R 0:00.002
23:14:08        	gccExtensions                              PASSED     C 0:00.891 - R 0:00.002
23:14:08        	array-container/array-md-sbscr-cases       PASSED     C 0:14.230 - R 0:00.004
23:14:08        	ato                                        PASSED     C 0:13.582 - R 0:00.004
23:14:08        	io/manipulatorsInput                       PASSED     C 0:14.097 - R 0:00.004
23:14:08        	bitmanip1                                  PASSED     C 0:25.676 - R 0:00.020
23:14:08        	bitmanip2                                  PASSED     C 0:28.124 - R 0:00.017
23:14:08        	meta/archVast                              PASSED     C 0:00.507 - R n/a
23:14:08        	io/manipulatorsOutput2                     PASSED     C 0:22.488 - R 0:00.004
23:14:08        	random                                     PASSED     C 0:12.952 - R 0:00.004
23:14:08        	vector_math/vec2_ldouble                   PASSED     C 0:13.460 - R 0:00.004
23:14:08        	io/manipulatorsOutput1                     PASSED     C 0:37.262 - R 0:00.004
23:14:08        	bitmanip3                                  PASSED     C 0:47.028 - R 0:00.017
23:14:08        	math                                       PASSED     C 0:25.418 - R 0:00.005
23:14:08        	mathX                                      PASSED     C 0:38.120 - R 0:00.017
23:14:08 Tests took  7:04.948
23:14:08 Makefile:865: recipe for target 'all-tests' failed
23:14:08 make: *** [all-tests] Error 1
23:14:08 [Pipeline] }
23:14:08 [Pipeline] // dir
23:14:08 [Pipeline] }
23:14:08 [Pipeline] // stage
23:14:08 [Pipeline] echo
23:14:08 Archiving core dumps
23:14:08 [Pipeline] dir
23:14:08 Running in /var/lib/jenkins/workspace/Cforall_master@tmp
23:14:08 [Pipeline] {
23:14:08 [Pipeline] fileExists
23:14:08 [Pipeline] }
23:14:08 [Pipeline] // dir
23:14:08 [Pipeline] }
23:14:08 [Pipeline] // wrap
23:14:08 [Pipeline] }
23:14:08 [Pipeline] // node
23:14:08 [Pipeline] echo
23:14:08 hudson.AbortException: script returned exit code 2
23:14:08 [Pipeline] node
23:14:08 Running on Brokk 5 in /var/lib/jenkins/workspace/Cforall_master
23:14:08 [Pipeline] {
23:14:08 [Pipeline] echo
23:14:08 Notifying users of result
23:14:08 [Pipeline] echo
23:14:08 Reusing previously constructed message
23:14:08 [Pipeline] echo
23:14:08 Would send email to: cforall@lists.uwaterloo.ca
23:14:08 [Pipeline] echo
23:14:08 With title: [cforall git][BUILD# 16473 - FAILURE] - branch master
23:14:08 [Pipeline] echo
23:14:08 Content: 
23:14:08 <p>This is an automated email from the Jenkins build machine. It was
23:14:08 generated because of a git hooks/post-receive script following
23:14:08 a ref change which was pushed to the C∀ repository.</p>
23:14:08 
23:14:08 <p>- Status --------------------------------------------------------------</p>
23:14:08 
23:14:08 <p>BUILD# 16473 - FAILURE</p>
23:14:08 <p>Check console output at https://cforall.uwaterloo.ca/jenkins/job/Cforall/job/master/16473/ to view the results.</p>
23:14:08 
23:14:08 <p>- Changes -------------------------------------------------------------</p>
23:14:08 
23:14:08 <pre>
23:14:08 The branch master has been updated.
23:14:08       from  3bf3b6b9f9c531d5111a6f933f476aa27e7299da (commit)
23:14:08 </pre>
23:14:08 
23:14:08 <p>- Log -----------------------------------------------------------------</p>
23:14:08 
23:14:08 <pre>
23:14:08 
23:14:08 </pre>
23:14:08 
23:14:08 <p>-----------------------------------------------------------------------</p>
23:14:08 <pre>
23:14:08 Summary of changes:
23:14:08 
23:14:08 </pre>
23:14:08 
23:14:08 [Pipeline] }
23:14:08 [Pipeline] // node
23:14:08 [Pipeline] echo
23:14:08 Build Completed
23:14:08 [Pipeline] End of Pipeline
23:14:08 ERROR: script returned exit code 2
23:14:08 Finished: FAILURE
[Pipeline] error
[Pipeline] }
23:14:08 Failed in branch gcc_08_x86_new
[Pipeline] echo
23:17:49 SUCCESS
[Pipeline] }
[Pipeline] echo
23:19:41 SUCCESS
[Pipeline] }
[Pipeline] // parallel
[Pipeline] }
[Pipeline] // stage
[Pipeline] }
[Pipeline] // wrap
[Pipeline] echo
error caught
[Pipeline] node
Running on Brokk 4 in /var/lib/jenkins/workspace/Cforall_Full_Build
[Pipeline] {
[Pipeline] echo
notifying users
[Pipeline] emailext
Sending email to: cforall@lists.uwaterloo.ca
[Pipeline] }
[Pipeline] // node
[Pipeline] }
[Pipeline] // node
[Pipeline] End of Pipeline
ERROR: FAILURE
Finished: FAILURE