Console Output

Skipping 1,227 KB.. Full Log
23:18:55 1 2 3 4 5 6 7 8 9
23:18:55 1 2 3 4 5 6 7 8 9
23:18:55 1 2 3 4 5 6 7 8 9
23:18:55 1 2 3 4 5 6 7 8 9
23:18:55 1 2 3 4 5 6 7 8 9
23:18:55 1 2 3 4 5 6 7 8 9
23:18:55 1 2 3 4 5 6 7 8 9
23:18:55 1 2 3 4 5 6 7 8 9
23:18:55 1 2 3 4 5 6 7 8 9
23:18:55 1 2 3 4 5 6 7 8 9
23:18:55 1 2 3 4 5 6 7 8 9
23:18:55 1 2 3 4 5 6 7 8 9
23:18:55 1 2 3 4 5 6 7 8 9
23:18:55 1 2 3 4 5 6 7 8 9
23:18:55 1 2 3 4 5 6 7 8 9
23:18:55 1 2 3 4 5 6 7 8 9
23:18:55 1 2 3 4 5 6 7 8 9
23:18:55 1 2 3 4 5 6 7 8 9
23:18:55 1 2 3 4 5 6 7 8 9
23:18:55 1 2 3 4 5 6 7 8 9
23:18:55 1 2 3 4 5 6 7 8 9
23:18:55 1 2 3 4 5 6 7 8 9
23:18:55 1 2 3 4 5 6 7 8 9
23:18:55 1 2 3 4 5 6 7 8 9
23:18:55 1 2 3 4 5 6 7 8 9
23:18:55 1 2 3 4 5 6 7 8 9
23:18:55 1 2 3 4 5 6 7 8 9
23:18:55 1 2 3 4 5 6 7 8 9
23:18:55 1 2 3 4 5 6 7 8 9
23:18:55 1 2 3 4 5 6 7 8 9
23:18:55 1 2 3 4 5 6 7 8 9
23:18:55 1 2 3 4 5 6 7 8 9
23:18:55 1 2 3 4 5 6 7 8 9
23:18:55 1 2 3 4 5 6 7 8 9
23:18:55 1 2 3 4 5 6 7 8 9
23:18:55 1 2 3 4 5 6 7 8 9
23:18:55 1 2 3 4 5 6 7 8 9
23:18:55 1 2 3 4 5 6 7 8 9
23:18:55 1 2 3 4 5 6 7 8 9
23:18:55 1 2 3 4 5 6 7 8 9
23:18:55 1 2 3 4 5 6 7 8 9
23:18:55 1 2 3 4 5 6 7 8 9
23:18:55 1 2 3 4 5 6 7 8 9
23:18:55 1 2 3 4 5 6 7 8 9
23:18:55 1 2 3 4 5 6 7 8 9
23:18:55 1 2 3 4 5 6 7 8 9
23:18:55 1 2 3 4 5 6 7 8 9
23:18:55 1 2 3 4 5 6 7 8 9
23:18:55 1 2 3 4 5 6 7 8 9
23:18:55 1 2 3 4 5 6 7 8 9
23:18:55 1 2 3 4 5 6 7 8 9
23:18:55 1 2 3 4 5 6 7 8 9
23:18:55 1 2 3 4 5 6 7 8 9
23:18:55 1 2 3 4 5 6 7 8 9
23:18:55 1 2 3 4 5 6 7 8 9
23:18:55 1 2 3 4 5 6 7 8 9
23:18:55 1 2 3 4 5 6 7 8 9
23:18:55 1 2 3 4 5 6 7 8 9
23:18:55 1 2 3 4 5 6 7 8 9
23:18:55 1 2 3 4 5 6 7 8 9
23:18:55 1 2 3 4 5 6 7 8 9
23:18:55 1 2 3 4 5 6 7 8 9
23:18:55 1 2 3 4 5 6 7 8 9
23:18:55 1 2 3 4 5 6 7 8 9
23:18:55 1 2 3 4 5 6 7 8 9
23:18:55 1 2 3 4 5 6 7 8 9
23:18:55 1 2 3 4 5 6 7 8 9
23:18:55 1 2 3 4 5 6 7 8 9
23:18:55 1 2 3 4 5 6 7 8 9
23:18:55 1 2 3 4 5 6 7 8 9
23:18:55 1 2 3 4 5 6 7 8 9
23:18:55 1 2 3 4 5 6 7 8 9
23:18:55 1 2 3 4 5 6 7 8 9
23:18:55 1 2 3 4 5 6 7 8 9
23:18:55 1 2 3 4 5 6 7 8 9
23:18:55 1 2 3 4 5 6 7 8 9
23:18:55 1 2 3 4 5 6 7 8 9
23:18:55 1 2 3 4 5 6 7 8 9
23:18:55 1 2 3 4 5 6 7 8 9
23:18:55 1 2 3 4 5 6 7 8 9
23:18:55 1 2 3 4 5 6 7 8 9
23:18:55 1 2 3 4 5 6 7 8 9
23:18:55 1 2 3 4 5 6 7 8 9
23:18:55 1 2 3 4 5 6 7 8 9
23:18:55 1 2 3 4 5 6 7 8 9
23:18:55 1 2 3 4 5 6 7 8 9
23:18:55 1 2 3 4 5 6 7 8 9
23:18:55 1 2 3 4 5 6 7 8 9
23:18:55 1 2 3 4 5 6 7 8 9
23:18:55 1 2 3 4 5 6 7 8 9
23:18:55 1 2 3 4 5 6 7 8 9
23:18:55 1 2 3 4 5 6 7 8 9
23:18:55 1 2 3 4 5 6 7 8 9
23:18:55 1 2 3 4 5 6 7 8 9
23:18:55 1 2 3 4 5 6 7 8 9
23:18:55 1 2 3 4 5 6 7 8 9
23:18:55 1 2 3 4 5 6 7 8 9
23:18:55 1 2 3 4 5 6 7 8 9
23:18:55 1 2 3 4 5 6 7 8 9
23:18:55 1 2 3 4 5 6 7 8 9
23:18:55 1 2 3 4 5 6 7 8 9
23:18:55 1 2 3 4 5 6 7 8 9
23:18:55 1 2 3 4 5 6 7 8 9
23:18:55 1 2 3 4 5 6 7 8 9
23:18:55 1 2 3 4 5 6 7 8 9
23:18:55 1 2 3 4 5 6 7 8 9
23:18:55 1 2 3 4 5 6 7 8 9
23:18:55 1 2 3 4 5 6 7 8 9
23:18:55 1 2 3 4 5 6 7 8 9
23:18:55 1 2 3 4 5 6 7 8 9
23:18:55 1 2 3 4 5 6 7 8 9
23:18:55 1 2 3 4 5 6 7 8 9
23:18:55 1 2 3 4 5 6 7 8 9
23:18:55 1 2 3 4 5 6 7 8 9
23:18:55 1 2 3 4 5 6 7 8 9
23:18:55 1 2 3 4 5 6 7 8 9
23:18:55 1 2 3 4 5 6 7 8 9
23:18:55 1 2 3 4 5 6 7 8 9
23:18:55 1 2 3 4 5 6 7 8 9
23:18:55 1 2 3 4 5 6 7 8 9
23:18:55 1 2 3 4 5 6 7 8 9
23:18:55 1 2 3 4 5 6 7 8 9
23:18:55 1 2 3 4 5 6 7 8 9
23:18:55 1 2 3 4 5 6 7 8 9
23:18:55 1 2 3 4 5 6 7 8 9
23:18:55 1 2 3 4 5 6 7 8 9
23:18:55 1 2 3 4 5 6 7 8 9
23:18:55 1 2 3 4 5 6 7 8 9
23:18:55 1 2 3 4 5 6 7 8 9
23:18:55 1 2 3 4 5 6 7 8 9
23:18:55 1 2 3 4 5 6 7 8 9
23:18:55 1 2 3 4 5 6 7 8 9
23:18:55 1 2 3 4 5 6 7 8 9
23:18:55 1 2 3 4 5 6 7 8 9
23:18:55 1 2 3 4 5 6 7 8 9
23:18:55 1 2 3 4 5 6 7 8 9
23:18:55 1 2 3 4 5 6 7 8 9
23:18:55 1 2 3 4 5 6 7 8 9
23:18:55 1 2 3 4 5 6 7 8 9
23:18:55 1 2 3 4 5 6 7 8 9
23:18:55 1 2 3 4 5 6 7 8 9
23:18:55 1 2 3 4 5 6 7 8 9
23:18:55 1 2 3 4 5 6 7 8 9
23:18:55 1 2 3 4 5 6 7 8 9
23:18:55 1 2 3 4 5 6 7 8 9
23:18:55 1 2 3 4 5 6 7 8 9
23:18:55 1 2 3 4 5 6 7 8 9
23:18:55 1 2 3 4 5 6 7 8 9
23:18:55 1 2 3 4 5 6 7 8 9
23:18:55 1 2 3 4 5 6 7 8 9
23:18:55 1 2 3 4 5 6 7 8 9
23:18:55 1 2 3 4 5 6 7 8 9
23:18:55 1 2 3 4 5 6 7 8 9
23:18:55 1 2 3 4 5 6 7 8 9
23:18:55 1 2 3 4 5 6 7 8 9
23:18:55 1 2 3 4 5 6 7 8 9
23:18:55 1 2 3 4 5 6 7 8 9
23:18:55 1 2 3 4 5 6 7 8 9
23:18:55 1 2 3 4 5 6 7 8 9
23:18:55 1 2 3 4 5 6 7 8 9
23:18:55 1 2 3 4 5 6 7 8 9
23:18:55 1 2 3 4 5 6 7 8 9
23:18:55 1 2 3 4 5 6 7 8 9
23:18:55 1 2 3 4 5 6 7 8 9
23:18:55 1 2 3 4 5 6 7 8 9
23:18:55 1 2 3 4 5 6 7 8 9
23:18:55 1 2 3 4 5 6 7 8 9
23:18:55 1 2 3 4 5 6 7 8 9
23:18:55 1 2 3 4 5 6 7 8 9
23:18:55 1 2 3 4 5 6 7 8 9
23:18:55 1 2 3 4 5 6 7 8 9
23:18:55 1 2 3 4 5 6 7 8 9
23:18:55 1 2 3 4 5 6 7 8 9
23:18:55 1 2 3 4 5 6 7 8 9
23:18:55 1 2 3 4 5 6 7 8 9
23:18:55 1 2 3 4 5 6 7 8 9
23:18:55 1 2 3 4 5 6 7 8 9
23:18:55 1 2 3 4 5 6 7 8 9
23:18:55 1 2 3 4 5 6 7 8 9
23:18:55 1 2 3 4 5 6 7 8 9
23:18:55 1 2 3 4 5 6 7 8 9
23:18:55 1 2 3 4 5 6 7 8 9
23:18:55 1 2 3 4 5 6 7 8 9
23:18:55 1 2 3 4 5 6 7 8 9
23:18:55 1 2 3 4 5 6 7 8 9
23:18:55 1 2 3 4 5 6 7 8 9
23:18:55 1 2 3 4 5 6 7 8 9
23:18:55 1 2 3 4 5 6 7 8 9
23:18:55 1 2 3 4 5 6 7 8 9
23:18:55 1 2 3 4 5 6 7 8 9
23:18:55 1 2 3 4 5 6 7 8 9
23:18:55 1 2 3 4 5 6 7 8 9
23:18:55 1 2 3 4 5 6 7 8 9
23:18:55 1 2 3 4 5 6 7 8 9
23:18:55 1 2 3 4 5 6 7 8 9
23:18:55 1 2 3 4 5 6 7 8 9
23:18:55 1 2 3 4 5 6 7 8 9
23:18:55 1 2 3 4 5 6 7 8 9
23:18:55 1 2 3 4 5 6 7 8 9
23:18:55 1 2 3 4 5 6 7 8 9
23:18:55 1 2 3 4 5 6 7 8 9
23:18:55 1 2 3 4 5 6 7 8 9
23:18:55 1 2 3 4 5 6 7 8 9
23:18:55 1 2 3 4 5 6 7 8 9
23:18:55 1 2 3 4 5 6 7 8 9
23:18:55 1 2 3 4 5 6 7 8 9
23:18:55 1 2 3 4 5 6 7 8 9
23:18:55 1 2 3 4 5 6 7 8 9
23:18:55 1 2 3 4 5 6 7 8 9
23:18:55 1 2 3 4 5 6 7 8 9
23:18:55 1 2 3 4 5 6 7 8 9
23:18:55 1 2 3 4 5 6 7 8 9
23:18:55 1 2 3 4 5 6 7 8 9
23:18:55 1 2 3 4 5 6 7 8 9
23:18:55 1 2 3 4 5 6 7 8 9
23:18:55 1 2 3 4 5 6 7 8 9
23:18:55 1 2 3 4 5 6 7 8 9
23:18:55 1 2 3 4 5 6 7 8 9
23:18:55 1 2 3 4 5 6 7 8 9
23:18:55 1 2 3 4 5 6 7 8 9
23:18:55 1 2 3 4 5 6 7 8 9
23:18:55 1 2 3 4 5 6 7 8 9
23:18:55 1 2 3 4 5 6 7 8 9
23:18:55 1 2 3 4 5 6 7 8 9
23:18:55 1 2 3 4 5 6 7 8 9
23:18:55 1 2 3 4 5 6 7 8 9
23:18:55 1 2 3 4 5 6 7 8 9
23:18:55 1 2 3 4 5 6 7 8 9
23:18:55 1 2 3 4 5 6 7 8 9
23:18:55 1 2 3 4 5 6 7 8 9
23:18:55 1 2 3 4 5 6 7 8 9
23:18:55 1 2 3 4 5 6 7 8 9
23:18:55 1 2 3 4 5 6 7 8 9
23:18:55 1 2 3 4 5 6 7 8 9
23:18:55 1 2 3 4 5 6 7 8 9
23:18:55 1 2 3 4 5 6 7 8 9
23:18:55 1 2 3 4 5 6 7 8 9
23:18:55 1 2 3 4 5 6 7 8 9
23:18:55 1 2 3 4 5 6 7 8 9
23:18:55 1 2 3 4 5 6 7 8 9
23:18:55 1 2 3 4 5 6 7 8 9
23:18:55 1 2 3 4 5 6 7 8 9
23:18:55 1 2 3 4 5 6 7 8 9
23:18:55 1 2 3 4 5 6 7 8 9
23:18:55 1 2 3 4 5 6 7 8 9
23:18:55 1 2 3 4 5 6 7 8 9
23:18:55 1 2 3 4 5 6 7 8 9
23:18:55 1 2 3 4 5 6 7 8 9
23:18:55 1 2 3 4 5 6 7 8 9
23:18:55 1 2 3 4 5 6 7 8 9
23:18:55 1 2 3 4 5 6 7 8 9
23:18:55 1 2 3 4 5 6 7 8 9
23:18:55 1 2 3 4 5 6 7 8 9
23:18:55 1 2 3 4 5 6 7 8 9
23:18:55 1 2 3 4 5 6 7 8 9
23:18:55 1 2 3 4 5 6 7 8 9
23:18:55 1 2 3 4 5 6 7 8 9
23:18:55 1 2 3 4 5 6 7 8 9
23:18:55 1 2 3 4 5 6 7 8 9
23:18:55 1 2 3 4 5 6 7 8 9
23:18:55 1 2 3 4 5 6 7 8 9
23:18:55 1 2 3 4 5 6 7 8 9
23:18:55 1 2 3 4 5 6 7 8 9
23:18:55 1 2 3 4 5 6 7 8 9
23:18:55 1 2 3 4 5 6 7 8 9
23:18:55 1 2 3 4 5 6 7 8 9
23:18:55 1 2 3 4 5 6 7 8 9
23:18:55 1 2 3 4 5 6 7 8 9
23:18:55 1 2 3 4 5 6 7 8 9
23:18:55 1 2 3 4 5 6 7 8 9
23:18:55 1 2 3 4 5 6 7 8 9
23:18:55 1 2 3 4 5 6 7 8 9
23:18:55 1 2 3 4 5 6 7 8 9
23:18:55 1 2 3 4 5 6 7 8 9
23:18:55 1 2 3 4 5 6 7 8 9
23:18:55 1 2 3 4 5 6 7 8 9
23:18:55 1 2 3 4 5 6 7 8 9
23:18:55 1 2 3 4 5 6 7 8 9
23:18:55 1 2 3 4 5 6 7 8 9
23:18:55 1 2 3 4 5 6 7 8 9
23:18:55 1 2 3 4 5 6 7 8 9
23:18:55 1 2 3 4 5 6 7 8 9
23:18:55 1 2 3 4 5 6 7 8 9
23:18:55 1 2 3 4 5 6 7 8 9
23:18:55 1 2 3 4 5 6 7 8 9
23:18:55 1 2 3 4 5 6 7 8 9
23:18:55 Cforall Runtime error (UNIX pid:25803) Application interrupted by signal: Aborted.
23:18:55 Error occurred outside of any thread.
23:18:55 Stack back trace for: /var/lib/jenkins/workspace/Cforall_master@tmp/libcfa/x86-debug/src/.libs/libcfa.so.1
23:18:55 (0) [0xb7fdabc0]
23:18:55 (1) /var/lib/jenkins/workspace/Cforall_master@tmp/libcfa/x86-debug/src/.libs/libcfathread.so.1 :  + 0x3a3d0  [0xb7fa73d0]
23:18:55 (2) [0xb7fdabc0]
23:18:55 (3) [0xb7fdabd1]
23:18:55 (4) /lib/i386-linux-gnu/libc.so.6 : __read + 0x4f  [0xb7d03c6f]
23:18:55 [New LWP 25803]
23:18:55 [New LWP 25806]
23:18:55 [New LWP 25807]
23:18:55 [Thread debugging using libthread_db enabled]
23:18:55 Using host libthread_db library "/lib/i386-linux-gnu/libthread_db.so.1".
23:18:55 Core was generated by `/var/lib/jenkins/workspace/Cforall_master@tmp/tests/io/io-acquire'.
23:18:55 Program terminated with signal SIGABRT, Aborted.
23:18:55 #0  0xb7fdabd1 in __kernel_vsyscall ()
23:18:55 [Current thread is 1 (Thread 0xb7c0f700 (LWP 25803))]
23:18:55 -----
23:18:55 #0  0xb7fdabd1 in __kernel_vsyscall ()
23:18:55 #1  0xb7c59eb9 in __GI_raise (sig=6) at ../sysdeps/unix/sysv/linux/raise.c:54
23:18:55 #2  0xb7c5b417 in __GI_abort () at abort.c:89
23:18:55 #3  0xb7f0ec5f in _X7__abortFv_bPKcY17__builtin_va_list__1 (_X11signalAbortb_1=true, _X3fmtPKc_1=0xb7f2729c "Application interrupted by signal: %s.\n", _X4argsY17__builtin_va_list_1=0xb7f6c518 <stack+64216> "3\246Ø·\374\355", <incomplete sequence \360\267>) at /var/lib/jenkins/workspace/Cforall_master/libcfa/src/interpose.cfa:264
23:18:55 #4  0xb7f0ece0 in _X5abortFv_bPKc__1 (_X11signalAbortb_1=true, _X3fmtPKc_1=0xb7f2729c "Application interrupted by signal: %s.\n") at /var/lib/jenkins/workspace/Cforall_master/libcfa/src/interpose.cfa:279
23:18:55 #5  0xb7f0ee27 in _X15sigHandler_termFv_iPS13__anonymous18PS8ucontext__1 (_X3sigi_1=6, _X3sfpPS13__anonymous18_1=0xb7f6c54c <stack+64268>, _X3cxtPS8ucontext_1=0xb7f6c5cc <stack+64396>) at /var/lib/jenkins/workspace/Cforall_master/libcfa/src/interpose.cfa:315
23:18:55 #6  <signal handler called>
23:18:55 #7  _X20sigHandler_ctxSwitchFv_iPS13__anonymous23PS8ucontext__1 (_X3sigi_1=10, _X3sfpPS13__anonymous23_1=0x806d9cc, _X3cxtPS8ucontext_1=0x806da4c) at /var/lib/jenkins/workspace/Cforall_master/libcfa/src/concurrency/preemption.cfa:645
23:18:55 #8  <signal handler called>
23:18:55 #9  0xb7fdabd1 in __kernel_vsyscall ()
23:18:55 #10 0xb7d03c6f in read () at ../sysdeps/unix/syscall-template.S:84
23:18:55 #11 0xb7f80762 in _X4mainFv_S14processorCtx_t__1 (_X6runnerS14processorCtx_t_1=0xb7fd64a4 <_X21storage_mainProcessorA0c_1+36>) at /var/lib/jenkins/workspace/Cforall_master/libcfa/src/concurrency/kernel.cfa:238
23:18:55 #12 0xb7f98ff4 in __cfactx_invoke_coroutine (main=0xb7f803c3 <_X4mainFv_S14processorCtx_t__1>, this=0xb7fd64a4 <_X21storage_mainProcessorA0c_1+36>) at /var/lib/jenkins/workspace/Cforall_master/libcfa/src/concurrency/invoke.c:46
23:18:55 #13 0x00000000 in ?? ()
23:18:55 -----
23:18:55   Id   Target Id                     Frame 
23:18:55 * 1    Thread 0xb7c0f700 (LWP 25803) 0xb7fdabd1 in __kernel_vsyscall ()
23:18:55   2    Thread 0xb78dab00 (LWP 25806) 0xb7fdabd1 in __kernel_vsyscall ()
23:18:55   3    Thread 0xb70d7b00 (LWP 25807) 0xb7fdabd1 in __kernel_vsyscall ()
23:18:55 
23:18:55 Archiving io/io-acquire (executable and core) to crashes/full-debug/io/io-acquire
23:18:55 Tests took 14:49.324
23:18:55 Makefile:865: recipe for target 'all-tests' failed
23:18:55 make: *** [all-tests] Error 1
23:18:55 [Pipeline] }
23:18:55 [Pipeline] // dir
23:18:55 [Pipeline] }
23:18:55 [Pipeline] // stage
23:18:55 [Pipeline] echo
23:18:55 Archiving core dumps
23:18:55 [Pipeline] dir
23:18:55 Running in /var/lib/jenkins/workspace/Cforall_master@tmp
23:18:55 [Pipeline] {
23:18:55 [Pipeline] fileExists
23:18:55 [Pipeline] sh
23:18:55 + /var/lib/jenkins/workspace/Cforall_master/tools/jenkins/archive-gen.sh
23:18:55 [Pipeline] archiveArtifacts
23:18:55 Archiving artifacts
23:18:55 Recording fingerprints
23:18:55 [Pipeline] }
23:18:55 [Pipeline] // dir
23:18:55 [Pipeline] }
23:18:55 [Pipeline] // wrap
23:18:55 [Pipeline] }
23:18:55 [Pipeline] // node
23:18:55 [Pipeline] echo
23:18:55 hudson.AbortException: script returned exit code 2
23:18:55 [Pipeline] node
23:18:55 Running on Brokk 5 in /var/lib/jenkins/workspace/Cforall_master
23:18:55 [Pipeline] {
23:18:55 [Pipeline] echo
23:18:55 Notifying users of result
23:18:55 [Pipeline] echo
23:18:55 Reusing previously constructed message
23:18:55 [Pipeline] echo
23:18:55 Would send email to: cforall@lists.uwaterloo.ca
23:18:55 [Pipeline] echo
23:18:55 With title: [cforall git][BUILD# 16472 - FAILURE] - branch master
23:18:55 [Pipeline] echo
23:18:55 Content: 
23:18:55 <p>This is an automated email from the Jenkins build machine. It was
23:18:55 generated because of a git hooks/post-receive script following
23:18:55 a ref change which was pushed to the C∀ repository.</p>
23:18:55 
23:18:55 <p>- Status --------------------------------------------------------------</p>
23:18:55 
23:18:55 <p>BUILD# 16472 - FAILURE</p>
23:18:55 <p>Check console output at https://cforall.uwaterloo.ca/jenkins/job/Cforall/job/master/16472/ to view the results.</p>
23:18:55 
23:18:55 <p>- Changes -------------------------------------------------------------</p>
23:18:55 
23:18:55 <pre>
23:18:55 The branch master has been updated.
23:18:55       from  3bf3b6b9f9c531d5111a6f933f476aa27e7299da (commit)
23:18:55 </pre>
23:18:55 
23:18:55 <p>- Log -----------------------------------------------------------------</p>
23:18:55 
23:18:55 <pre>
23:18:55 
23:18:55 </pre>
23:18:55 
23:18:55 <p>-----------------------------------------------------------------------</p>
23:18:55 <pre>
23:18:55 Summary of changes:
23:18:55 
23:18:55 </pre>
23:18:55 
23:18:55 [Pipeline] }
23:18:55 [Pipeline] // node
23:18:55 [Pipeline] echo
23:18:55 Build Completed
23:18:55 [Pipeline] End of Pipeline
23:18:55 ERROR: script returned exit code 2
23:18:55 Finished: FAILURE
[Pipeline] error
[Pipeline] }
23:18:55 Failed in branch gcc_06_x86_new
[Pipeline] echo
23:21:01 SUCCESS
[Pipeline] }
[Pipeline] echo
23:21:40 SUCCESS
[Pipeline] }
[Pipeline] // parallel
[Pipeline] }
[Pipeline] // stage
[Pipeline] }
[Pipeline] // wrap
[Pipeline] echo
error caught
[Pipeline] node
Running on Brokk 4 in /var/lib/jenkins/workspace/Cforall_Full_Build
[Pipeline] {
[Pipeline] echo
notifying users
[Pipeline] emailext
Sending email to: cforall@lists.uwaterloo.ca
[Pipeline] }
[Pipeline] // node
[Pipeline] }
[Pipeline] // node
[Pipeline] End of Pipeline
ERROR: FAILURE
Finished: FAILURE