Console Output

Skipping 532 KB.. Full Log
23:17:05        	searchsort                                 PASSED     C 0:14.168 - R 0:00.016
23:17:05        	tuple/tupleCast                            PASSED     C 0:01.009 - R 0:00.016
23:17:05        	tuple/tupleFunction                        PASSED     C 0:01.096 - R 0:00.016
23:17:05        	sum                                        PASSED     C 0:12.875 - R 0:00.016
23:17:05        	tuple/tupleMember                          PASSED     C 0:01.114 - R 0:00.016
23:17:05        	tuple/tuplePolymorphism                    PASSED     C 0:01.336 - R 0:00.017
23:17:05        	typedefRedef                               PASSED     C 0:00.895 - R 0:00.001
23:17:05        	typedefRedef-ERR1                          PASSED     C 0:00.098 - R n/a
23:17:05        	tuple/tupleVariadic                        PASSED     C 0:02.676 - R 0:00.016
23:17:05        	typeof                                     PASSED     C 0:00.986 - R 0:00.017
23:17:05        	swap                                       PASSED     C 0:13.778 - R 0:00.016
23:17:05        	time                                       PASSED     C 0:12.146 - R 0:00.016
23:17:05        	tuple/tupleAssign                          PASSED     C 0:11.395 - R 0:00.016
23:17:05        	rational                                   PASSED     C 0:29.257 - R 0:00.016
23:17:05        	userLiterals                               PASSED     C 0:09.804 - R 0:00.017
23:17:05        	variableDeclarator                         PASSED     C 0:00.930 - R 0:00.002
23:17:05        	unified_locking/fast                       PASSED     C 0:17.924 - R 0:00.073
23:17:05        	unified_locking/lin_backoff                PASSED     C 0:18.000 - R 0:00.132
23:17:05        	unified_locking/timeout_lock               PASSED     C 0:14.956 - R 0:01.181
23:17:05        	vector                                     PASSED     C 0:15.792 - R 0:00.037
23:17:05        	vector_math/vec2_double                    PASSED     C 0:14.557 - R 0:00.037
23:17:05        	unified_locking/mcs                        PASSED     C 0:18.398 - R 0:21.522
23:17:05        	vector_math/vec2_float                     PASSED     C 0:27.320 - R 0:00.016
23:17:05        	vector_math/vec2_int                       PASSED     C 0:26.619 - R 0:00.040
23:17:05        	vector_math/vec2_uint                      PASSED     C 0:16.204 - R 0:00.026
23:17:05        	voidPtr                                    PASSED     C 0:01.514 - R 0:00.016
23:17:05        	warnings/self-assignment                   PASSED     C 0:01.173 - R 0:00.011
23:17:05        	KRfunctions                                PASSED     C 0:00.994 - R 0:00.023
23:17:05        	vector_math/vec3_float                     PASSED     C 0:24.509 - R 0:00.037
23:17:05        	vector_math/vec3_int                       PASSED     C 0:20.786 - R 0:00.016
23:17:05        	abs                                        PASSED     C 0:13.179 - R 0:00.041
23:17:05        	attributes                                 PASSED     C 0:01.462 - R 0:00.032
23:17:05        	vector_math/vec4_float                     PASSED     C 0:22.538 - R 0:00.033
23:17:05        	vector_math/vec4_int                       PASSED     C 0:21.524 - R 0:00.050
23:17:05        	array-container/array-md-sbscr-cases       PASSED     C 0:11.701 - R 0:00.040
23:17:05        	declarationSpecifier                       PASSED     C 0:01.318 - R 0:00.010
23:17:05        	errors/completeType                        PASSED     C 0:00.669 - R n/a
23:17:05        	extension                                  PASSED     C 0:01.272 - R 0:00.012
23:17:05        	functions                                  PASSED     C 0:00.948 - R 0:00.004
23:17:05        	gccExtensions                              PASSED     C 0:01.401 - R 0:00.022
23:17:05        	ato                                        PASSED     C 0:12.065 - R 0:00.024
23:17:05        	bitmanip1                                  PASSED     C 0:20.515 - R 0:00.032
23:17:05        	io/manipulatorsInput                       PASSED     C 0:13.128 - R 0:00.042
23:17:05        	unified_locking/locks                      PASSED     C 0:15.908 - R 1:15.332
23:17:05        	bitmanip2                                  PASSED     C 0:23.901 - R 0:00.033
23:17:05        	meta/archVast                              PASSED     C 0:00.507 - R n/a
23:17:05        	io/manipulatorsOutput1                     PASSED     C 0:23.280 - R 0:00.016
23:17:05        	random                                     PASSED     C 0:10.679 - R 0:00.016
23:17:05        	io/manipulatorsOutput2                     PASSED     C 0:16.483 - R 0:00.016
23:17:05        	bitmanip3                                  PASSED     C 0:36.021 - R 0:00.032
23:17:05        	vector_math/vec2_ldouble                   PASSED     C 0:10.551 - R 0:00.016
23:17:05        	math                                       PASSED     C 0:22.187 - R 0:00.034
23:17:05        	mathX                                      PASSED     C 0:34.431 - R 0:00.034
23:17:05 Tests took  7:28.184
23:17:05 [Pipeline] sh
23:17:05 + make --no-print-directory -C tests timeouts=--timeout=600 --global-timeout=14400 all-tests debug=no archiveerrors=/var/lib/jenkins/workspace/Cforall_master@tmp/tests/crashes/full-nodebug
23:17:05 Running 222 tests on 6 cores (Default AST (new):x86 - no debug)
23:17:05        	array-container/language-dim-mismatch      PASSED     C 0:00.122 - R n/a
23:17:05        	array                                      PASSED     C 0:01.431 - R 0:00.027
23:17:05        	builtins/sync                              PASSED     C 0:02.074 - R 0:00.012
23:17:05        	array-container/array-basic                PASSED     C 0:04.809 - R 0:00.024
23:17:05        	cast                                       PASSED     C 0:01.551 - R 0:00.001
23:17:05        	castError                                  PASSED     C 0:00.733 - R n/a
23:17:05        	avl_test                                   PASSED     C 0:06.349 - R 0:00.005
23:17:05        	alloc-ERROR                                PASSED     C 0:09.345 - R n/a
23:17:05        	collections/multi_list                     PASSED     C 0:13.710 - R 0:00.004
23:17:05        	alloc                                      PASSED     C 0:23.595 - R 0:00.004
23:17:05        	collections/atomic_mpsc                    PASSED     C 0:18.161 - R 0:02.219
23:17:05        	collections/queue                          PASSED     C 0:22.160 - R 0:00.004
23:17:05        	collections/sequence                       PASSED     C 0:22.811 - R 0:00.004
23:17:05        	collections/stack                          PASSED     C 0:15.366 - R 0:00.004
23:17:05        	collections/string-gc                      PASSED     C 0:09.972 - R 0:00.004
23:17:05        	collections/vector-err-pass-perm-it-byval  PASSED     C 0:02.386 - R n/a
23:17:05        	collections/vector-demo                    PASSED     C 0:05.244 - R 0:00.004
23:17:05        	collections/vector-err-retn-perm-it-byval  PASSED     C 0:01.992 - R n/a
23:17:05        	collections/string-overwrite               PASSED     C 0:10.043 - R 0:00.008
23:17:05        	alloc2                                     PASSED     C 0:39.526 - R 0:00.004
23:17:05        	collections/string-api-coverage            PASSED     C 0:15.893 - R 0:00.004
23:17:05        	concurrent/clib                            PASSED     C 0:06.028 - R 0:00.032
23:17:05        	concurrent/clib_tls                        PASSED     C 0:06.116 - R 0:00.008
23:17:05        	complex                                    PASSED     C 0:09.041 - R 0:00.004
23:17:05        	concurrent/cluster                         PASSED     C 0:11.727 - R 0:00.017
23:17:05        	concurrent/coroutineYield                  PASSED     C 0:18.489 - R 0:00.070
23:17:05        	concurrent/examples/boundedBufferEXT       PASSED     C 0:17.551 - R 0:02.219
23:17:05        	concurrent/examples/datingService          PASSED     C 0:16.342 - R 0:00.009
23:17:05        	concurrent/examples/boundedBufferINT       PASSED     C 0:16.782 - R 0:02.119
23:17:05        	concurrent/examples/gortn                  PASSED     C 0:18.736 - R 0:00.004
23:17:05        	concurrent/examples/matrixSum              PASSED     C 0:17.696 - R 0:00.004
23:17:05        	concurrent/futures/abandon                 PASSED     C 0:12.626 - R 0:00.065
23:17:05        	concurrent/keywordErrors                   PASSED     C 0:00.261 - R n/a
23:17:05        	concurrent/futures/basic                   PASSED     C 0:12.689 - R 0:00.033
23:17:05        	concurrent/examples/quickSort              PASSED     C 0:19.227 - R 0:00.004
23:17:05        	concurrent/futures/multi                   PASSED     C 0:15.787 - R 0:00.004
23:17:05        	concurrent/futures/typed                   PASSED     C 0:13.020 - R 0:00.165
23:17:05        	concurrent/join                            PASSED     C 0:17.785 - R 0:00.008
23:17:05        	concurrent/park/contention                 PASSED     C 0:12.392 - R 0:00.123
23:17:05        	concurrent/mutexstmt/monitors              PASSED     C 0:12.982 - R 0:00.766
23:17:05        	concurrent/monitor                         PASSED     C 0:17.272 - R 0:03.724
23:17:05        	concurrent/mutexstmt/locks                 PASSED     C 0:15.631 - R 0:01.237
23:17:05        	concurrent/multi-monitor                   PASSED     C 0:17.588 - R 0:05.286
23:17:05        	concurrent/park/start_parked               PASSED     C 0:12.576 - R 0:00.008
23:17:05        	concurrent/park/force_preempt              PASSED     C 0:17.644 - R 0:00.265
23:17:05        	concurrent/semaphore                       PASSED     C 0:21.917 - R 0:00.008
23:17:05        	concurrent/signal/block                    PASSED     C 0:22.208 - R 0:00.381
23:17:05        	concurrent/signal/disjoint                 PASSED     C 0:20.262 - R 0:00.675
23:17:05        	concurrent/preempt                         PASSED     C 0:13.683 - R 0:14.692
23:17:05        	concurrent/signal/wait                     PASSED     C 0:20.134 - R 0:00.067
23:17:05        	concurrent/sleep                           PASSED     C 0:21.427 - R 0:01.117
23:17:05        	concurrent/suspend_then                    PASSED     C 0:19.222 - R 0:00.017
23:17:05        	concurrent/spinaphore                      PASSED     C 0:21.024 - R 0:00.115
23:17:05        	concurrent/thread                          PASSED     C 0:19.876 - R 0:00.004
23:17:05        	concurrent/waitfor/barge                   PASSED     C 0:18.013 - R 0:00.115
23:17:05        	const-init                                 PASSED     C 0:00.987 - R 0:00.007
23:17:05        	concurrent/waitfor/dtor                    PASSED     C 0:17.319 - R 0:00.415
23:17:05        	concurrent/waitfor/else                    PASSED     C 0:15.571 - R 0:00.005
23:17:05        	copyfile                                   PASSED     C 0:09.325 - R 0:00.004
23:17:05        	coroutine/devicedriver                     PASSED     C 0:10.930 - R 0:00.004
23:17:05        	coroutine/fibonacci                        PASSED     C 0:10.643 - R 0:00.004
23:17:05        	concurrent/waitfor/recurse                 PASSED     C 0:18.983 - R 0:00.365
23:17:05        	concurrent/waitfor/when                    PASSED     C 0:19.411 - R 0:00.065
23:17:05        	concurrent/waitfor/statment                PASSED     C 0:20.729 - R 0:00.008
23:17:05        	coroutine/fmtLines                         PASSED     C 0:10.859 - R 0:00.008
23:17:05        	designations                               PASSED     C 0:01.253 - R 0:00.004
23:17:05        	coroutine/pingpong                         PASSED     C 0:10.648 - R 0:00.004
23:17:05        	counter                                    PASSED     C 0:08.819 - R 0:00.006
23:17:05        	coroutine/raii                             PASSED     C 0:10.775 - R 0:00.009
23:17:05        	errors/declaration                         PASSED     C 0:00.090 - R n/a
23:17:05        	errors/scope                               PASSED     C 0:00.186 - R n/a
23:17:05        	errors/signature                           PASSED     C 0:00.101 - R n/a
23:17:05        	coroutine/runningTotal                     PASSED     C 0:10.607 - R 0:00.004
23:17:05        	enum                                       PASSED     C 0:00.970 - R 0:00.004
23:17:05        	coroutine/prodcons                         PASSED     C 0:15.259 - R 0:00.004
23:17:05        	exceptions/conditional                     PASSED     C 0:01.163 - R 0:00.004
23:17:05        	exceptions/data-except                     PASSED     C 0:01.128 - R 0:00.004
23:17:05        	exceptions/defaults                        PASSED     C 0:02.096 - R 0:00.004
23:17:05        	exceptions/cancel/coroutine                PASSED     C 0:07.222 - R 0:00.004
23:17:05        	exceptions/finally                         PASSED     C 0:01.217 - R 0:00.004
23:17:05        	exceptions/conditional-threads             PASSED     C 0:07.220 - R 0:00.004
23:17:05        	exceptions/finally-error                   PASSED     C 0:00.255 - R n/a
23:17:05        	div                                        PASSED     C 0:13.174 - R 0:00.008
23:17:05        	exceptions/interact                        PASSED     C 0:01.491 - R 0:00.004
23:17:05        	device/cpu                                 PASSED     C 0:15.934 - R 0:00.004
23:17:05        	exceptions/polymorphic                     PASSED     C 0:01.640 - R 0:00.004
23:17:05        	exceptions/resume                          PASSED     C 0:01.579 - R 0:00.004
23:17:05        	exceptions/cancel/thread                   PASSED     C 0:11.900 - R 0:00.007
23:17:05        	exceptions/terminate                       PASSED     C 0:01.684 - R 0:00.005
23:17:05        	exceptions/type-check                      PASSED     C 0:00.269 - R n/a
23:17:05        	exceptions/defaults-threads                PASSED     C 0:08.314 - R 0:00.004
23:17:05        	exceptions/trash                           PASSED     C 0:01.233 - R 0:00.004
23:17:05        	expression                                 PASSED     C 0:00.968 - R 0:00.002
23:17:05        	exceptions/virtual-poly                    PASSED     C 0:01.299 - R 0:00.004
23:17:05        	exceptions/finally-threads                 PASSED     C 0:07.335 - R 0:00.004
23:17:05        	exceptions/virtual-cast                    PASSED     C 0:02.794 - R 0:00.004
23:17:05        	forall                                     PASSED     C 0:01.758 - R 0:00.004
23:17:05        	exceptions/resume-threads                  PASSED     C 0:07.695 - R 0:00.008
23:17:05        	exceptions/terminate-threads               PASSED     C 0:07.827 - R 0:00.004
23:17:05        	fallthrough                                PASSED     C 0:09.151 - R 0:00.004
23:17:05        	genericUnion                               PASSED     C 0:01.119 - R 0:00.004
23:17:05        	generator/fibonacci                        PASSED     C 0:08.726 - R 0:00.004
23:17:05        	fstream_test                               PASSED     C 0:09.283 - R 0:00.004
23:17:05        	global-monomorph                           PASSED     C 0:01.055 - R 0:00.006
23:17:05        	identFuncDeclarator                        PASSED     C 0:00.938 - R 0:00.002
23:17:05        	generator/fmtLines                         PASSED     C 0:08.932 - R 0:00.004
23:17:05        	identParamDeclarator                       PASSED     C 0:01.002 - R 0:00.004
23:17:05        	generator/suspend_then                     PASSED     C 0:08.767 - R 0:00.004
23:17:05        	function-operator                          PASSED     C 0:13.916 - R 0:00.004
23:17:05        	hello                                      PASSED     C 0:08.811 - R 0:00.004
23:17:05        	identity                                   PASSED     C 0:09.533 - R 0:00.004
23:17:05        	ifwhileCtl                                 PASSED     C 0:08.926 - R 0:00.004
23:17:05        	include/vector-sequence                    PASSED     C 0:01.729 - R 0:00.004
23:17:05        	init1                                      PASSED     C 0:01.090 - R 0:00.002
23:17:05        	include/vector-containers                  PASSED     C 0:05.759 - R 0:00.009
23:17:05        	init1-ERROR                                PASSED     C 0:00.705 - R n/a
23:17:05        	include/stdincludes                        PASSED     C 0:13.320 - R 0:00.001
23:17:05        	include/vector-fstream                     PASSED     C 0:14.743 - R 0:00.013
23:17:05        	heap                                       PASSED     C 0:13.676 - R 0:18.202
23:17:05        	labelledExit                               PASSED     C 0:00.945 - R 0:00.002
23:17:05        	limits                                     PASSED     C 0:00.974 - R 0:00.001
23:17:05        	linking/exception-nothreads                PASSED     C 0:02.743 - R 0:00.004
23:17:05        	io/io-acquire                              PASSED     C 0:24.260 - R 0:00.065
23:17:05        	include/includes                           PASSED     C 0:37.491 - R 0:00.002
23:17:05        	linking/nostdlib                           PASSED     C 0:00.961 - R 0:00.010
23:17:05        	linking/exception-withthreads              PASSED     C 0:08.625 - R 0:00.004
23:17:05        	io/io                                      PASSED     C 0:30.804 - R 0:00.004
23:17:05        	io/many_read                               PASSED     C 0:19.505 - R 0:00.004
23:17:05        	io/manipulatorsOutput4                     PASSED     C 0:28.351 - R 0:00.038
23:17:05        	linkonce                                   PASSED     C 0:01.267 - R 0:00.004
23:17:05        	linking/io-acquire                         PASSED     C 0:12.932 - R 0:00.004
23:17:05        	linking/nothreads                          PASSED     C 0:12.315 - R 0:00.004
23:17:05        	literals                                   PASSED     C 0:09.373 - R 0:00.004
23:17:05        	linking/weakso_nothd                       PASSED     C 0:12.257 - R 0:00.005
23:17:05        	maybe                                      PASSED     C 0:01.381 - R 0:00.004
23:17:05        	nested-types                               PASSED     C 0:00.988 - R 0:00.001
23:17:05        	nested-types-ERR1                          PASSED     C 0:00.100 - R n/a
23:17:05        	nested-types-ERR2                          PASSED     C 0:00.117 - R n/a
23:17:05        	numericConstants                           PASSED     C 0:00.888 - R 0:00.002
23:17:05        	operators                                  PASSED     C 0:00.996 - R 0:00.004
23:17:05        	linking/withthreads                        PASSED     C 0:17.266 - R 0:00.004
23:17:05        	poly-d-cycle                               PASSED     C 0:00.993 - R 0:00.004
23:17:05        	list/dlist-insert-remove                   PASSED     C 0:18.057 - R 0:00.009
23:17:05        	poly-o-cycle                               PASSED     C 0:01.071 - R 0:00.009
23:17:05        	poly-selection                             PASSED     C 0:00.993 - R 0:00.004
23:17:05        	loopctrl                                   PASSED     C 0:13.456 - R 0:00.004
23:17:05        	malloc                                     PASSED     C 0:12.312 - R 0:00.004
23:17:05        	quasiKeyword                               PASSED     C 0:01.045 - R 0:00.001
23:17:05        	raii/ctor-autogen                          PASSED     C 0:01.617 - R 0:00.004
23:17:05        	raii/ctor-autogen-ERR1                     PASSED     C 0:00.595 - R n/a
23:17:05        	polymorphism                               PASSED     C 0:09.251 - R 0:00.004
23:17:05        	minmax                                     PASSED     C 0:16.885 - R 0:00.004
23:17:05        	quotedKeyword                              PASSED     C 0:08.733 - R 0:00.004
23:17:05        	raii/boxed-types                           PASSED     C 0:08.927 - R 0:00.004
23:17:05        	parseconfig                                PASSED     C 0:14.414 - R 0:00.004
23:17:05        	raii/memberCtors                           PASSED     C 0:01.258 - R 0:00.004
23:17:05        	raii/init_once                             PASSED     C 0:01.369 - R 0:00.004
23:17:05        	raii/memberCtors-ERR1                      PASSED     C 0:00.674 - R n/a
23:17:05        	raii/dtor-early-exit                       PASSED     C 0:13.861 - R 0:00.008
23:17:05        	raii/dtor-early-exit-ERR1                  PASSED     C 0:09.123 - R n/a
23:17:05        	raii/dtor-early-exit-ERR2                  PASSED     C 0:09.150 - R n/a
23:17:05        	raii/globals                               PASSED     C 0:09.180 - R 0:00.008
23:17:05        	result                                     PASSED     C 0:01.779 - R 0:00.009
23:17:05        	simpleGenericTriple                        PASSED     C 0:01.506 - R 0:00.004
23:17:05        	smart-pointers                             PASSED     C 0:01.402 - R 0:00.004
23:17:05        	references                                 PASSED     C 0:10.509 - R 0:00.004
23:17:05        	shortCircuit                               PASSED     C 0:08.890 - R 0:00.004
23:17:05        	switch                                     PASSED     C 0:00.932 - R 0:00.002
23:17:05        	strstream                                  PASSED     C 0:09.561 - R 0:00.004
23:17:05        	searchsort                                 PASSED     C 0:16.376 - R 0:00.004
23:17:05        	tuple/tupleCast                            PASSED     C 0:01.031 - R 0:00.004
23:17:05        	sum                                        PASSED     C 0:15.037 - R 0:00.004
23:17:05        	tuple/tupleFunction                        PASSED     C 0:01.128 - R 0:00.004
23:17:05        	tuple/tupleMember                          PASSED     C 0:01.087 - R 0:00.004
23:17:05        	tuple/tuplePolymorphism                    PASSED     C 0:01.540 - R 0:00.004
23:17:05        	typedefRedef                               PASSED     C 0:00.895 - R 0:00.002
23:17:05        	typedefRedef-ERR1                          PASSED     C 0:00.106 - R n/a
23:17:05        	swap                                       PASSED     C 0:16.635 - R 0:00.004
23:17:05        	tuple/tupleVariadic                        PASSED     C 0:02.999 - R 0:00.004
23:17:05        	typeof                                     PASSED     C 0:01.033 - R 0:00.004
23:17:05        	time                                       PASSED     C 0:12.283 - R 0:00.005
23:17:05        	tuple/tupleAssign                          PASSED     C 0:11.674 - R 0:00.004
23:17:05        	rational                                   PASSED     C 0:37.826 - R 0:00.004
23:17:05        	unified_locking/fast                       FAILED with code 1    C 0:17.818 - R 0:00.022
23:17:05 		expected :
23:17:05 		3	Match!
23:17:05 		got :
23:17:05 		3	No Match! 719669070 vs 2472653409
23:17:05 
23:17:05        	unified_locking/timeout_lock               PASSED     C 0:14.623 - R 0:01.067
23:17:05        	unified_locking/lin_backoff                PASSED     C 0:17.843 - R 0:00.013
23:17:05        	variableDeclarator                         PASSED     C 0:01.109 - R 0:00.010
23:17:05        	userLiterals                               PASSED     C 0:10.547 - R 0:00.005
23:17:05        	unified_locking/mcs                        PASSED     C 0:19.472 - R 0:03.631
23:17:05        	unified_locking/locks                      PASSED     C 0:16.423 - R 0:11.046
23:17:05        	vector                                     PASSED     C 0:14.431 - R 0:00.004
23:17:05        	vector_math/vec2_double                    PASSED     C 0:14.498 - R 0:00.004
23:17:05        	vector_math/vec2_uint                      PASSED     C 0:13.835 - R 0:00.007
23:17:05        	vector_math/vec2_float                     PASSED     C 0:29.660 - R 0:00.004
23:17:05        	voidPtr                                    PASSED     C 0:01.006 - R 0:00.004
23:17:05        	warnings/self-assignment                   PASSED     C 0:00.958 - R 0:00.002
23:17:05        	KRfunctions                                PASSED     C 0:00.888 - R 0:00.002
23:17:05        	vector_math/vec2_int                       PASSED     C 0:31.450 - R 0:00.008
23:17:05        	vector_math/vec3_int                       PASSED     C 0:24.880 - R 0:00.004
23:17:05        	vector_math/vec3_float                     PASSED     C 0:30.753 - R 0:00.004
23:17:05        	attributes                                 PASSED     C 0:01.075 - R 0:00.002
23:17:05        	vector_math/vec4_float                     PASSED     C 0:28.762 - R 0:00.004
23:17:05        	array-container/array-md-sbscr-cases       PASSED     C 0:13.213 - R 0:00.004
23:17:05        	vector_math/vec4_int                       PASSED     C 0:27.524 - R 0:00.008
23:17:05        	abs                                        PASSED     C 0:14.174 - R 0:00.004
23:17:05        	errors/completeType                        PASSED     C 0:00.515 - R n/a
23:17:05        	declarationSpecifier                       PASSED     C 0:00.992 - R 0:00.002
23:17:05        	extension                                  PASSED     C 0:00.901 - R 0:00.002
23:17:05        	functions                                  PASSED     C 0:00.847 - R 0:00.002
23:17:05        	gccExtensions                              PASSED     C 0:00.882 - R 0:00.002
23:17:05        	ato                                        PASSED     C 0:13.605 - R 0:00.004
23:17:05        	io/manipulatorsInput                       PASSED     C 0:13.545 - R 0:00.004
23:17:05        	bitmanip1                                  PASSED     C 0:24.091 - R 0:00.016
23:17:05        	bitmanip2                                  PASSED     C 0:26.219 - R 0:00.017
23:17:05        	meta/archVast                              PASSED     C 0:00.500 - R n/a
23:17:05        	io/manipulatorsOutput2                     PASSED     C 0:20.248 - R 0:00.008
23:17:05        	io/manipulatorsOutput1                     PASSED     C 0:32.400 - R 0:00.004
23:17:05        	random                                     PASSED     C 0:12.810 - R 0:00.004
23:17:05        	vector_math/vec2_ldouble                   PASSED     C 0:13.109 - R 0:00.004
23:17:05        	bitmanip3                                  PASSED     C 0:42.504 - R 0:00.016
23:17:05        	math                                       PASSED     C 0:25.176 - R 0:00.010
23:17:05        	mathX                                      PASSED     C 0:37.891 - R 0:00.018
23:17:05 Tests took  6:56.453
23:17:05 Makefile:865: recipe for target 'all-tests' failed
23:17:05 make: *** [all-tests] Error 1
23:17:05 [Pipeline] }
23:17:05 [Pipeline] // dir
23:17:05 [Pipeline] }
23:17:05 [Pipeline] // stage
23:17:05 [Pipeline] echo
23:17:05 Archiving core dumps
23:17:05 [Pipeline] dir
23:17:05 Running in /var/lib/jenkins/workspace/Cforall_master@tmp
23:17:05 [Pipeline] {
23:17:05 [Pipeline] fileExists
23:17:05 [Pipeline] }
23:17:05 [Pipeline] // dir
23:17:05 [Pipeline] }
23:17:05 [Pipeline] // wrap
23:17:05 [Pipeline] }
23:17:05 [Pipeline] // node
23:17:05 [Pipeline] echo
23:17:05 hudson.AbortException: script returned exit code 2
23:17:05 [Pipeline] node
23:17:05 Running on Brokk 3 in /var/lib/jenkins/workspace/Cforall_master
23:17:05 [Pipeline] {
23:17:05 [Pipeline] echo
23:17:05 Notifying users of result
23:17:05 [Pipeline] echo
23:17:05 Reusing previously constructed message
23:17:05 [Pipeline] echo
23:17:05 Would send email to: cforall@lists.uwaterloo.ca
23:17:05 [Pipeline] echo
23:17:05 With title: [cforall git][BUILD# 16458 - FAILURE] - branch master
23:17:05 [Pipeline] echo
23:17:05 Content: 
23:17:05 <p>This is an automated email from the Jenkins build machine. It was
23:17:05 generated because of a git hooks/post-receive script following
23:17:05 a ref change which was pushed to the C∀ repository.</p>
23:17:05 
23:17:05 <p>- Status --------------------------------------------------------------</p>
23:17:05 
23:17:05 <p>BUILD# 16458 - FAILURE</p>
23:17:05 <p>Check console output at https://cforall.uwaterloo.ca/jenkins/job/Cforall/job/master/16458/ to view the results.</p>
23:17:05 
23:17:05 <p>- Changes -------------------------------------------------------------</p>
23:17:05 
23:17:05 <pre>
23:17:05 The branch master has been updated.
23:17:05       from  6cc87c0c8c3470f60ca93a524803cf323c2dbf05 (commit)
23:17:05 </pre>
23:17:05 
23:17:05 <p>- Log -----------------------------------------------------------------</p>
23:17:05 
23:17:05 <pre>
23:17:05 
23:17:05 </pre>
23:17:05 
23:17:05 <p>-----------------------------------------------------------------------</p>
23:17:05 <pre>
23:17:05 Summary of changes:
23:17:05 
23:17:05 </pre>
23:17:05 
23:17:05 [Pipeline] }
23:17:05 [Pipeline] // node
23:17:05 [Pipeline] echo
23:17:05 Build Completed
23:17:05 [Pipeline] End of Pipeline
23:17:05 ERROR: script returned exit code 2
23:17:05 Finished: FAILURE
[Pipeline] error
[Pipeline] }
23:17:05 Failed in branch gcc_07_x86_new
[Pipeline] echo
23:20:00 SUCCESS
[Pipeline] }
[Pipeline] echo
23:22:14 SUCCESS
[Pipeline] }
[Pipeline] // parallel
[Pipeline] }
[Pipeline] // stage
[Pipeline] }
[Pipeline] // wrap
[Pipeline] echo
error caught
[Pipeline] node
Running on Brokk 3 in /var/lib/jenkins/workspace/Cforall_Full_Build
[Pipeline] {
[Pipeline] echo
notifying users
[Pipeline] emailext
Sending email to: cforall@lists.uwaterloo.ca
[Pipeline] }
[Pipeline] // node
[Pipeline] }
[Pipeline] // node
[Pipeline] End of Pipeline
ERROR: FAILURE
Finished: FAILURE