Console Output

Started by timer
Running as Jenkins Build User
Checking out git cforall@plg.uwaterloo.ca:software/cfa/cfa-cc into /var/lib/jenkins/workspace/Cforall_Full_Build@script to read Jenkins/FullBuild
The recommended git tool is: NONE
using credential git_key_aug20
 > git rev-parse --resolve-git-dir /var/lib/jenkins/workspace/Cforall_Full_Build@script/.git # timeout=10
Fetching changes from the remote Git repository
 > git config remote.origin.url cforall@plg.uwaterloo.ca:software/cfa/cfa-cc # timeout=10
Fetching upstream changes from cforall@plg.uwaterloo.ca:software/cfa/cfa-cc
 > git --version # timeout=10
 > git --version # 'git version 2.25.1'
using GIT_SSH to set credentials SSH key used for git, ed25519 generated August 2020
 > git fetch --tags --force --progress -- cforall@plg.uwaterloo.ca:software/cfa/cfa-cc +refs/heads/*:refs/remotes/origin/* # timeout=10
 > git rev-parse refs/remotes/origin/master^{commit} # timeout=10
Checking out Revision b8454c6aa02e82fa4ba491124611cebb978472cf (refs/remotes/origin/master)
 > git config core.sparsecheckout # timeout=10
 > git checkout -f b8454c6aa02e82fa4ba491124611cebb978472cf # timeout=10
Commit message: "Merge branch 'master' of plg.uwaterloo.ca:software/cfa/cfa-cc"
 > git rev-list --no-walk a3769ccdacc632e22086a04e026c059c11f1a1a3 # timeout=10
Resume disabled by user, switching to high-performance, low-durability mode.
[Pipeline] Start of Pipeline
[Pipeline] node
Running on Brokk 3 in /var/lib/jenkins/workspace/Cforall_Full_Build
[Pipeline] {
[Pipeline] checkout
The recommended git tool is: NONE
using credential git_key_aug20
Fetching changes from the remote Git repository
 > git rev-parse --resolve-git-dir /var/lib/jenkins/workspace/Cforall_Full_Build/.git # timeout=10
 > git config remote.origin.url cforall@plg.uwaterloo.ca:software/cfa/cfa-cc # timeout=10
Fetching upstream changes from cforall@plg.uwaterloo.ca:software/cfa/cfa-cc
 > git --version # timeout=10
 > git --version # 'git version 2.25.1'
using GIT_SSH to set credentials SSH key used for git, ed25519 generated August 2020
 > git fetch --tags --force --progress -- cforall@plg.uwaterloo.ca:software/cfa/cfa-cc +refs/heads/*:refs/remotes/origin/* # timeout=10
Checking out Revision b8454c6aa02e82fa4ba491124611cebb978472cf (refs/remotes/origin/master)
Commit message: "Merge branch 'master' of plg.uwaterloo.ca:software/cfa/cfa-cc"
[Pipeline] wrap
[Pipeline] {
[Pipeline] stage
[Pipeline] { (Build)
[Pipeline] parallel
[Pipeline] { (Branch: gcc_08_x86_new)
[Pipeline] { (Branch: gcc_07_x86_new)
[Pipeline] { (Branch: gcc_06_x86_new)
[Pipeline] { (Branch: gcc_10_x64_new)
[Pipeline] { (Branch: gcc_09_x64_new)
[Pipeline] { (Branch: gcc_08_x64_new)
[Pipeline] { (Branch: gcc_07_x64_new)
[Pipeline] { (Branch: gcc_06_x64_new)
[Pipeline] { (Branch: clang_x64_new)
[Pipeline] sleep
22:47:05 Sleeping for 1 min 0 sec
[Pipeline] sleep
22:47:05 No need to sleep any longer
[Pipeline] sleep
22:47:05 Sleeping for 4 min 0 sec
[Pipeline] sleep
22:47:05 Sleeping for 3 min 0 sec
[Pipeline] sleep
22:47:05 Sleeping for 2 min 0 sec
[Pipeline] sleep
22:47:05 Sleeping for 1 min 0 sec
[Pipeline] sleep
22:47:05 Sleeping for 3 min 0 sec
[Pipeline] sleep
22:47:05 Sleeping for 1 min 0 sec
[Pipeline] sleep
22:47:05 Sleeping for 2 min 0 sec
[Pipeline] build
22:47:05 Scheduling project: Cforall » master
 > git rev-parse refs/remotes/origin/master^{commit} # timeout=10
 > git config core.sparsecheckout # timeout=10
 > git checkout -f b8454c6aa02e82fa4ba491124611cebb978472cf # timeout=10
22:47:12 Starting building: Cforall » master #16403
[Pipeline] build
22:48:05 Scheduling project: Cforall » master
[Pipeline] build
22:48:05 Scheduling project: Cforall » master
[Pipeline] build
22:48:05 Scheduling project: Cforall » master
22:48:12 Starting building: Cforall » master #16404
22:48:12 Starting building: Cforall » master #16406
22:48:12 Starting building: Cforall » master #16405
[Pipeline] build
22:49:05 Scheduling project: Cforall » master
[Pipeline] build
22:49:05 Scheduling project: Cforall » master
22:49:12 Starting building: Cforall » master #16408
22:49:12 Starting building: Cforall » master #16407
[Pipeline] build
22:50:05 Scheduling project: Cforall » master
[Pipeline] build
22:50:05 Scheduling project: Cforall » master
22:50:12 Starting building: Cforall » master #16410
22:50:12 Starting building: Cforall » master #16409
[Pipeline] build
22:51:05 Scheduling project: Cforall » master
22:51:12 Starting building: Cforall » master #16411
[Pipeline] echo
23:00:46 SUCCESS
[Pipeline] }
[Pipeline] echo
23:01:35 SUCCESS
[Pipeline] }
[Pipeline] echo
23:02:09 SUCCESS
[Pipeline] }
[Pipeline] echo
23:02:29 SUCCESS
[Pipeline] }
[Pipeline] echo
23:04:04 SUCCESS
[Pipeline] }
[Pipeline] echo
23:04:36 SUCCESS
[Pipeline] }
[Pipeline] echo
23:18:14 SUCCESS
[Pipeline] }
[Pipeline] echo
23:20:49 SUCCESS
[Pipeline] }
[Pipeline] echo
23:22:51 FAILURE
[Pipeline] sh
23:22:51 + wget -q -O - https://cforall.uwaterloo.ca/jenkins/job/Cforall/job/master/16403/consoleText
23:22:51 Started by upstream project "Cforall_Full_Build" build number 1854
23:22:51 originally caused by:
23:22:51  Started by timer
23:22:51 Running as Jenkins Build User
23:22:51  > git rev-parse --resolve-git-dir /var/lib/jenkins/caches/git-914b6fdde163b7e17ee75d99ca23f18a/.git # timeout=10
23:22:51 Setting origin to cforall@plg.uwaterloo.ca:software/cfa/cfa-cc
23:22:51  > git config remote.origin.url cforall@plg.uwaterloo.ca:software/cfa/cfa-cc # timeout=10
23:22:51 Fetching origin...
23:22:51 Fetching upstream changes from origin
23:22:51  > git --version # timeout=10
23:22:51  > git --version # 'git version 2.25.1'
23:22:51  > git config --get remote.origin.url # timeout=10
23:22:51 using GIT_SSH to set credentials SSH key used for git, ed25519 generated August 2020
23:22:51  > git fetch --tags --force --progress -- origin +refs/heads/*:refs/remotes/origin/* # timeout=10
23:22:51 Seen branch in repository origin/aaron-thesis
23:22:51 Seen branch in repository origin/arm-eh
23:22:51 Seen branch in repository origin/cleanup-dtors
23:22:51 Seen branch in repository origin/ctor
23:22:51 Seen branch in repository origin/deferred_resn
23:22:51 Seen branch in repository origin/demangler
23:22:51 Seen branch in repository origin/gc_noraii
23:22:51 Seen branch in repository origin/jacob/cs343-translation
23:22:51 Seen branch in repository origin/jenkins-sandbox
23:22:51 Seen branch in repository origin/master
23:22:51 Seen branch in repository origin/memory
23:22:51 Seen branch in repository origin/new-ast
23:22:51 Seen branch in repository origin/new-ast-unique-expr
23:22:51 Seen branch in repository origin/new-env
23:22:51 Seen branch in repository origin/no_list
23:22:51 Seen branch in repository origin/persistent-indexer
23:22:51 Seen branch in repository origin/resolv-new
23:22:51 Seen branch in repository origin/string
23:22:51 Seen branch in repository origin/with_gc
23:22:51 Seen 19 remote branches
23:22:51 Obtained Jenkinsfile from b8454c6aa02e82fa4ba491124611cebb978472cf
23:22:51 Running in Durability level: PERFORMANCE_OPTIMIZED
23:22:51 [Pipeline] Start of Pipeline
23:22:51 [Pipeline] node
23:22:51 Running on Brokk 5 in /var/lib/jenkins/workspace/Cforall_master
23:22:51 [Pipeline] {
23:22:51 [Pipeline] wrap
23:22:51 [Pipeline] {
23:22:51 [Pipeline] properties
23:22:51 WARNING: Unknown parameter(s) found for class type 'hudson.model.ChoiceParameterDefinition': defaultValue
23:22:51 WARNING: Unknown parameter(s) found for class type 'hudson.model.ChoiceParameterDefinition': defaultValue
23:22:51 [Pipeline] checkout
23:22:51 The recommended git tool is: NONE
23:22:51 using credential git_key_aug20
23:22:51 Fetching changes from the remote Git repository
23:22:51 Cleaning workspace
23:22:51 Fetching without tags
23:22:51  > git rev-parse --resolve-git-dir /var/lib/jenkins/workspace/Cforall_master/.git # timeout=10
23:22:51  > git config remote.origin.url cforall@plg.uwaterloo.ca:software/cfa/cfa-cc # timeout=10
23:22:51  > git rev-parse --verify HEAD # timeout=10
23:22:51 Resetting working tree
23:22:51  > git reset --hard # timeout=10
23:22:51  > git clean -fdx # timeout=10
23:22:51 Fetching upstream changes from cforall@plg.uwaterloo.ca:software/cfa/cfa-cc
23:22:51  > git --version # timeout=10
23:22:51  > git --version # 'git version 2.25.1'
23:22:51 using GIT_SSH to set credentials SSH key used for git, ed25519 generated August 2020
23:22:51  > git fetch --no-tags --force --progress -- cforall@plg.uwaterloo.ca:software/cfa/cfa-cc +refs/heads/*:refs/remotes/origin/* # timeout=10
23:22:51 Checking out Revision b8454c6aa02e82fa4ba491124611cebb978472cf (master)
23:22:51 Commit message: "Merge branch 'master' of plg.uwaterloo.ca:software/cfa/cfa-cc"
23:22:51 [Pipeline] load
23:22:51 [Pipeline] { (Jenkins/tools.groovy)
23:22:51 [Pipeline] }
23:22:51 [Pipeline] // load
23:22:51  > git config core.sparsecheckout # timeout=10
23:22:51  > git checkout -f b8454c6aa02e82fa4ba491124611cebb978472cf # timeout=10
23:22:51  > git rev-list --no-walk b8454c6aa02e82fa4ba491124611cebb978472cf # timeout=10
23:22:51 [Pipeline] echo
23:22:51 Compiler 	         : gcc-7 (g++-7/gcc-7)
23:22:51 AST Version             : New AST
23:22:51 Architecture            : x86
23:22:51 Arc Flags               : --host=i386
23:22:51 Run All Tests           : true
23:22:51 Run Benchmark           : true
23:22:51 Build Documentation     : true
23:22:51 Publish                 : true
23:22:51 Silent                  : true
23:22:51 
23:22:51 [Pipeline] }
23:22:51 [Pipeline] // wrap
23:22:51 [Pipeline] }
23:22:51 [Pipeline] // node
23:22:51 [Pipeline] node
23:22:51 Running on Ada in /var/lib/jenkins/workspace/Cforall_master
23:22:51 [Pipeline] {
23:22:51 [Pipeline] wrap
23:22:51 [Pipeline] {
23:22:51 [Pipeline] pwd
23:22:51 [Pipeline] pwd
23:22:51 [Pipeline] echo
23:22:51  -------- Cleanup -------- 
23:22:51 [Pipeline] stage
23:22:51 [Pipeline] { (Cleanup)
23:22:51 [Pipeline] dir
23:22:51 Running in /var/lib/jenkins/workspace/Cforall_master@tmp
23:22:51 [Pipeline] {
23:22:51 [Pipeline] deleteDir
23:22:51 [Pipeline] }
23:22:51 [Pipeline] // dir
23:22:51 [Pipeline] }
23:22:51 [Pipeline] // stage
23:22:51 [Pipeline] echo
23:22:51  -------- Checkout -------- 
23:22:51 [Pipeline] stage
23:22:51 [Pipeline] { (Checkout)
23:22:51 [Pipeline] checkout
23:22:51 The recommended git tool is: NONE
23:22:51 using credential git_key_aug20
23:22:51 Fetching changes from the remote Git repository
23:22:51 Cleaning workspace
23:22:51 Fetching without tags
23:22:51  > git rev-parse --resolve-git-dir /var/lib/jenkins/workspace/Cforall_master/.git # timeout=10
23:22:51  > git config remote.origin.url cforall@plg.uwaterloo.ca:software/cfa/cfa-cc # timeout=10
23:22:51  > git rev-parse --verify HEAD # timeout=10
23:22:51 Resetting working tree
23:22:51  > git reset --hard # timeout=10
23:22:51  > git clean -fdx # timeout=10
23:22:51 Fetching upstream changes from cforall@plg.uwaterloo.ca:software/cfa/cfa-cc
23:22:51  > git --version # timeout=10
23:22:51  > git --version # 'git version 2.7.4'
23:22:51 using GIT_SSH to set credentials SSH key used for git, ed25519 generated August 2020
23:22:51  > git fetch --no-tags --progress cforall@plg.uwaterloo.ca:software/cfa/cfa-cc +refs/heads/*:refs/remotes/origin/* # timeout=10
23:22:51 Checking out Revision b8454c6aa02e82fa4ba491124611cebb978472cf (master)
23:22:51 Commit message: "Merge branch 'master' of plg.uwaterloo.ca:software/cfa/cfa-cc"
23:22:51 [Pipeline] echo
23:22:51 Constructing new git message
23:22:51 [Pipeline] sh
23:22:51 + git rev-list b8454c6aa02e82fa4ba491124611cebb978472cf..b8454c6aa02e82fa4ba491124611cebb978472cf
23:22:51 [Pipeline] sh
23:22:51  > git config core.sparsecheckout # timeout=10
23:22:51  > git checkout -f b8454c6aa02e82fa4ba491124611cebb978472cf # timeout=10
23:22:51 + git cat-file -t b8454c6aa02e82fa4ba491124611cebb978472cf
23:22:51 [Pipeline] sh
23:22:51 + git rev-list --format=short b8454c6aa02e82fa4ba491124611cebb978472cf...b8454c6aa02e82fa4ba491124611cebb978472cf
23:22:51 [Pipeline] sh
23:22:51 + git diff --stat --color b8454c6aa02e82fa4ba491124611cebb978472cf b8454c6aa02e82fa4ba491124611cebb978472cf
23:22:51 [Pipeline] echo
23:22:51 
23:22:51 <p>- Changes -------------------------------------------------------------</p>
23:22:51 
23:22:51 <pre>
23:22:51 The branch master has been updated.
23:22:51       from  b8454c6aa02e82fa4ba491124611cebb978472cf (commit)
23:22:51 </pre>
23:22:51 
23:22:51 <p>- Log -----------------------------------------------------------------</p>
23:22:51 
23:22:51 <pre>
23:22:51 
23:22:51 </pre>
23:22:51 
23:22:51 <p>-----------------------------------------------------------------------</p>
23:22:51 <pre>
23:22:51 Summary of changes:
23:22:51 
23:22:51 </pre>
23:22:51 
23:22:51 [Pipeline] }
23:22:51 [Pipeline] // stage
23:22:51 [Pipeline] echo
23:22:51  -------- Build : configure -------- 
23:22:51 [Pipeline] stage
23:22:51 [Pipeline] { (Build : configure)
23:22:51 [Pipeline] dir
23:22:51 Running in /var/lib/jenkins/workspace/Cforall_master
23:22:51 [Pipeline] {
23:22:51 [Pipeline] sh
23:22:51 + ./autogen.sh
23:22:51 Running aclocal in root
23:22:51 Running libtoolize in root
23:22:51 libtoolize: putting auxiliary files in AC_CONFIG_AUX_DIR, 'automake'.
23:22:51 libtoolize: linking file 'automake/ltmain.sh'
23:22:51 libtoolize: putting macros in AC_CONFIG_MACRO_DIRS, 'automake'.
23:22:51 libtoolize: linking file 'automake/libtool.m4'
23:22:51 libtoolize: linking file 'automake/ltoptions.m4'
23:22:51 libtoolize: linking file 'automake/ltsugar.m4'
23:22:51 libtoolize: linking file 'automake/ltversion.m4'
23:22:51 libtoolize: linking file 'automake/lt~obsolete.m4'
23:22:51 Running autoconf in root
23:22:51 Running automake in root
23:22:51 configure.ac:241: installing 'automake/compile'
23:22:51 configure.ac:156: installing 'automake/config.guess'
23:22:51 configure.ac:156: installing 'automake/config.sub'
23:22:51 configure.ac:17: installing 'automake/install-sh'
23:22:51 benchmark/Makefile.am: installing 'automake/depcomp'
23:22:51 parallel-tests: installing 'automake/test-driver'
23:22:51 configure.ac: installing 'automake/ylwrap'
23:22:51 Running aclocal in libcfa
23:22:51 Running libtoolize in libcfa
23:22:51 libtoolize: putting auxiliary files in AC_CONFIG_AUX_DIR, 'automake'.
23:22:51 libtoolize: linking file 'automake/ltmain.sh'
23:22:51 libtoolize: putting macros in AC_CONFIG_MACRO_DIRS, 'automake'.
23:22:51 libtoolize: linking file 'automake/libtool.m4'
23:22:51 libtoolize: linking file 'automake/ltoptions.m4'
23:22:51 libtoolize: linking file 'automake/ltsugar.m4'
23:22:51 libtoolize: linking file 'automake/ltversion.m4'
23:22:51 libtoolize: linking file 'automake/lt~obsolete.m4'
23:22:51 Running autoconf in libcfa
23:22:51 Running automake in libcfa
23:22:51 configure.ac:119: installing 'automake/compile'
23:22:51 configure.ac:119: installing 'automake/config.guess'
23:22:51 configure.ac:119: installing 'automake/config.sub'
23:22:51 configure.ac:12: installing 'automake/install-sh'
23:22:51 src/Makefile.am: installing 'automake/depcomp'
23:22:51 [Pipeline] }
23:22:51 [Pipeline] // dir
23:22:51 [Pipeline] dir
23:22:51 Running in /var/lib/jenkins/workspace/Cforall_master@tmp
23:22:51 [Pipeline] {
23:22:51 [Pipeline] sh
23:22:51 + /var/lib/jenkins/workspace/Cforall_master/configure CXX=g++-7 CC=gcc-7 --host=i386 AR=gcc-ar RANLIB=gcc-ranlib --with-target-hosts=host:debug,host:nodebug --enable-new-ast --quiet --prefix=/var/lib/jenkins/workspace/Cforall_master@tmp
23:22:51 [Pipeline] sh
23:22:51 + make -j 8 --no-print-directory configure-libcfa
23:22:51 libcfa/x86-debug/config.data
23:22:51 Configuring libcfa (/var/lib/jenkins/workspace/Cforall_master/libcfa/configure) with ''CXX=g++-7' 'CC=gcc-7' 'AR=gcc-ar' 'RANLIB=gcc-ranlib' '--enable-new-ast' '--prefix=/var/lib/jenkins/workspace/Cforall_master@tmp' DRIVER_DIR=/var/lib/jenkins/workspace/Cforall_master@tmp/driver/ ARCHITECTURE=x86 CONFIGURATION=debug CFA_VERSION=1:0:0' from /var/lib/jenkins/workspace/Cforall_master@tmp / libcfa/x86-debug/
23:22:51 libcfa/x86-nodebug/config.data
23:22:51 Configuring libcfa (/var/lib/jenkins/workspace/Cforall_master/libcfa/configure) with ''CXX=g++-7' 'CC=gcc-7' 'AR=gcc-ar' 'RANLIB=gcc-ranlib' '--enable-new-ast' '--prefix=/var/lib/jenkins/workspace/Cforall_master@tmp' DRIVER_DIR=/var/lib/jenkins/workspace/Cforall_master@tmp/driver/ ARCHITECTURE=x86 CONFIGURATION=nodebug CFA_VERSION=1:0:0' from /var/lib/jenkins/workspace/Cforall_master@tmp / libcfa/x86-nodebug/
23:22:51 configure: WARNING: unrecognized options: --enable-new-ast
23:22:51 configure: WARNING: unrecognized options: --enable-new-ast
23:22:51 checking whether make supports nested variables... yes
23:22:51 checking for a BSD-compatible install... checking whether make supports nested variables... yes
23:22:51 checking for a BSD-compatible install... /usr/bin/install -c
23:22:51 checking whether build environment is sane... /usr/bin/install -c
23:22:51 checking whether build environment is sane... yes
23:22:51 yes
23:22:51 checking for a thread-safe mkdir -p... /bin/mkdir -p
23:22:51 checking for gawk... gawk
23:22:51 checking whether make sets $(MAKE)... checking for a thread-safe mkdir -p... /bin/mkdir -p
23:22:51 checking for gawk... gawk
23:22:51 checking whether make sets $(MAKE)... yes
23:22:51 yes
23:22:51 checking for distributated build... no
23:22:51 checking for distributated build... no
23:22:51 checking build system type... checking build system type... i686-pc-linux-gnu
23:22:51 checking host system type... i686-pc-linux-gnu
23:22:51 checking how to print strings... i686-pc-linux-gnu
23:22:51 checking host system type... i686-pc-linux-gnu
23:22:51 checking how to print strings... printf
23:22:51 checking for style of include used by make... printf
23:22:51 GNU
23:22:51 checking for style of include used by make... checking for gcc... gcc-7
23:22:51 GNU
23:22:51 checking for gcc... gcc-7
23:22:51 checking whether the C compiler works... checking whether the C compiler works... yes
23:22:51 checking for C compiler default output file name... a.out
23:22:51 checking for suffix of executables... yes
23:22:51 checking for C compiler default output file name... a.out
23:22:51 checking for suffix of executables... 
23:22:51 
23:22:51 checking whether we are cross compiling... checking whether we are cross compiling... no
23:22:51 checking for suffix of object files... no
23:22:51 checking for suffix of object files... o
23:22:51 checking whether we are using the GNU C compiler... o
23:22:51 checking whether we are using the GNU C compiler... yes
23:22:51 checking whether gcc-7 accepts -g... yes
23:22:51 checking whether gcc-7 accepts -g... yes
23:22:51 checking for gcc-7 option to accept ISO C89... yes
23:22:51 checking for gcc-7 option to accept ISO C89... none needed
23:22:51 checking whether gcc-7 understands -c and -o together... none needed
23:22:51 checking whether gcc-7 understands -c and -o together... yes
23:22:51 checking dependency style of gcc-7... yes
23:22:51 checking dependency style of gcc-7... gcc3
23:22:51 checking for a sed that does not truncate output... /bin/sed
23:22:51 checking for grep that handles long lines and -e... gcc3
23:22:51 checking for a sed that does not truncate output... /bin/grep
23:22:51 checking for egrep... /bin/grep -E
23:22:51 checking for fgrep... /bin/sed
23:22:51 /bin/grep -F
23:22:51 checking for grep that handles long lines and -e... checking for ld used by gcc-7... /bin/grep
23:22:51 checking for egrep... /bin/grep -E
23:22:51 checking for fgrep... /usr/bin/ld
23:22:51 checking if the linker (/usr/bin/ld) is GNU ld... /bin/grep -F
23:22:51 checking for ld used by gcc-7... yes
23:22:51 checking for BSD- or MS-compatible name lister (nm)... /usr/bin/nm -B
23:22:51 checking the name lister (/usr/bin/nm -B) interface... /usr/bin/ld
23:22:51 checking if the linker (/usr/bin/ld) is GNU ld... yes
23:22:51 checking for BSD- or MS-compatible name lister (nm)... /usr/bin/nm -B
23:22:51 checking the name lister (/usr/bin/nm -B) interface... BSD nm
23:22:51 checking whether ln -s works... yes
23:22:51 checking the maximum length of command line arguments... 1572864
23:22:51 BSD nm
23:22:51 checking whether ln -s works... yes
23:22:51 checking the maximum length of command line arguments... checking how to convert i686-pc-linux-gnu file names to i686-pc-linux-gnu format... func_convert_file_noop
23:22:51 checking how to convert i686-pc-linux-gnu file names to toolchain format... func_convert_file_noop
23:22:51 checking for /usr/bin/ld option to reload object files... -r
23:22:51 checking for objdump... objdump
23:22:51 checking how to recognize dependent libraries... pass_all
23:22:51 1572864
23:22:51 checking for dlltool... no
23:22:51 checking how to associate runtime and link libraries... printf %s\n
23:22:51 checking for archiver @FILE support... checking how to convert i686-pc-linux-gnu file names to i686-pc-linux-gnu format... func_convert_file_noop
23:22:51 checking how to convert i686-pc-linux-gnu file names to toolchain format... func_convert_file_noop
23:22:51 checking for /usr/bin/ld option to reload object files... -r
23:22:51 checking for objdump... objdump
23:22:51 checking how to recognize dependent libraries... pass_all
23:22:51 checking for dlltool... no
23:22:51 checking how to associate runtime and link libraries... printf %s\n
23:22:51 checking for archiver @FILE support... @
23:22:51 checking for strip... strip
23:22:51 @
23:22:51 checking for ranlib... gcc-ranlib
23:22:51 checking for strip... checking command to parse /usr/bin/nm -B output from gcc-7 object... strip
23:22:51 checking for ranlib... gcc-ranlib
23:22:51 checking command to parse /usr/bin/nm -B output from gcc-7 object... ok
23:22:51 ok
23:22:51 checking for sysroot... no
23:22:51 checking for a working dd... checking for sysroot... no
23:22:51 checking for a working dd... /bin/dd
23:22:51 checking how to truncate binary pipes... /bin/dd
23:22:51 checking how to truncate binary pipes... /bin/dd bs=4096 count=1
23:22:51 checking for mt... mt
23:22:51 checking if mt is a manifest tool... /bin/dd bs=4096 count=1
23:22:51 checking for mt... mt
23:22:51 checking if mt is a manifest tool... no
23:22:51 no
23:22:51 checking how to run the C preprocessor... checking how to run the C preprocessor... gcc-7 -E
23:22:51 gcc-7 -E
23:22:51 checking for ANSI C header files... checking for ANSI C header files... yes
23:22:51 checking for sys/types.h... yes
23:22:51 checking for sys/types.h... yes
23:22:51 yes
23:22:51 checking for sys/stat.h... checking for sys/stat.h... yes
23:22:51 yes
23:22:51 checking for stdlib.h... checking for stdlib.h... yes
23:22:51 checking for string.h... yes
23:22:51 checking for string.h... yes
23:22:51 checking for memory.h... yes
23:22:51 checking for memory.h... yes
23:22:51 checking for strings.h... yes
23:22:51 checking for strings.h... yes
23:22:51 checking for inttypes.h... yes
23:22:51 checking for inttypes.h... yes
23:22:51 checking for stdint.h... yes
23:22:51 checking for stdint.h... yes
23:22:51 checking for unistd.h... yes
23:22:51 checking for unistd.h... yes
23:22:51 checking for dlfcn.h... yes
23:22:51 checking for dlfcn.h... yes
23:22:51 checking for objdir... .libs
23:22:51 yes
23:22:51 checking for objdir... .libs
23:22:51 checking if gcc-7 supports -fno-rtti -fno-exceptions... checking if gcc-7 supports -fno-rtti -fno-exceptions... no
23:22:51 checking for gcc-7 option to produce PIC... -fPIC -DPIC
23:22:51 checking if gcc-7 PIC flag -fPIC -DPIC works... no
23:22:51 checking for gcc-7 option to produce PIC... -fPIC -DPIC
23:22:51 checking if gcc-7 PIC flag -fPIC -DPIC works... yes
23:22:51 checking if gcc-7 static flag -static works... yes
23:22:51 checking if gcc-7 static flag -static works... yes
23:22:51 checking if gcc-7 supports -c -o file.o... yes
23:22:51 checking if gcc-7 supports -c -o file.o... yes
23:22:51 checking if gcc-7 supports -c -o file.o... yes
23:22:51 (cached) checking if gcc-7 supports -c -o file.o... yes
23:22:51 (cached) yes
23:22:51 checking whether the gcc-7 linker (/usr/bin/ld) supports shared libraries... checking whether the gcc-7 linker (/usr/bin/ld) supports shared libraries... yes
23:22:51 checking whether -lc should be explicitly linked in... yes
23:22:51 checking whether -lc should be explicitly linked in... no
23:22:51 checking dynamic linker characteristics... no
23:22:51 checking dynamic linker characteristics... GNU/Linux ld.so
23:22:51 checking how to hardcode library paths into programs... GNU/Linux ld.so
23:22:51 immediate
23:22:51 checking whether stripping libraries is possible... checking how to hardcode library paths into programs... immediate
23:22:51 checking whether stripping libraries is possible... yes
23:22:51 checking if libtool supports shared libraries... yes
23:22:51 checking whether to build shared libraries... yes
23:22:51 yes
23:22:51 checking whether to build static libraries... checking if libtool supports shared libraries... no
23:22:51 yes
23:22:51 checking whether to build shared libraries... yes
23:22:51 checking whether to build static libraries... no
23:22:51 checking whether we are using the GNU C++ compiler... checking whether we are using the GNU C++ compiler... yes
23:22:51 checking whether g++-7 accepts -g... yes
23:22:51 checking whether g++-7 accepts -g... yes
23:22:51 checking dependency style of g++-7... yes
23:22:51 checking dependency style of g++-7... gcc3
23:22:51 gcc3
23:22:51 checking how to run the C++ preprocessor... checking how to run the C++ preprocessor... g++-7 -E
23:22:51 g++-7 -E
23:22:51 checking for ld used by g++-7... /usr/bin/ld
23:22:51 checking if the linker (/usr/bin/ld) is GNU ld... checking for ld used by g++-7... yes
23:22:51 /usr/bin/ld
23:22:51 checking if the linker (/usr/bin/ld) is GNU ld... yes
23:22:51 checking whether the g++-7 linker (/usr/bin/ld) supports shared libraries... checking whether the g++-7 linker (/usr/bin/ld) supports shared libraries... yes
23:22:51 yes
23:22:51 checking for g++-7 option to produce PIC... -fPIC -DPIC
23:22:51 checking if g++-7 PIC flag -fPIC -DPIC works... checking for g++-7 option to produce PIC... -fPIC -DPIC
23:22:51 checking if g++-7 PIC flag -fPIC -DPIC works... yes
23:22:51 checking if g++-7 static flag -static works... yes
23:22:51 checking if g++-7 static flag -static works... yes
23:22:51 checking if g++-7 supports -c -o file.o... yes
23:22:51 checking if g++-7 supports -c -o file.o... yes
23:22:51 checking if g++-7 supports -c -o file.o... (cached) yes
23:22:51 checking whether the g++-7 linker (/usr/bin/ld) supports shared libraries... yes
23:22:51 checking dynamic linker characteristics... (cached) yes
23:22:51 checking if g++-7 supports -c -o file.o... (cached) yes
23:22:51 checking whether the g++-7 linker (/usr/bin/ld) supports shared libraries... yes
23:22:51 checking dynamic linker characteristics... (cached) GNU/Linux ld.so
23:22:51 checking how to hardcode library paths into programs... immediate
23:22:51 checking for gcc... (cached) gcc-7
23:22:51 GNU/Linux ld.so
23:22:51 checking how to hardcode library paths into programs... immediate
23:22:51 checking for gcc... (cached) gcc-7
23:22:51 checking whether we are using the GNU C compiler... (cached) yes
23:22:51 checking whether gcc-7 accepts -g... (cached) yes
23:22:51 checking for gcc-7 option to accept ISO C89... (cached) none needed
23:22:51 checking whether gcc-7 understands -c and -o together... (cached) yes
23:22:51 checking dependency style of gcc-7... (cached) gcc3
23:22:51 checking dependency style of gcc-7... checking whether we are using the GNU C compiler... (cached) yes
23:22:51 checking whether gcc-7 accepts -g... (cached) yes
23:22:51 checking for gcc-7 option to accept ISO C89... (cached) none needed
23:22:51 checking whether gcc-7 understands -c and -o together... (cached) yes
23:22:51 checking dependency style of gcc-7... (cached) gcc3
23:22:51 checking dependency style of gcc-7... gcc3
23:22:51 checking whether make sets $(MAKE)... (cached) yes
23:22:51 checking linux/rseq.h usability... gcc3
23:22:51 checking whether make sets $(MAKE)... (cached) yes
23:22:51 checking linux/rseq.h usability... no
23:22:51 checking linux/rseq.h presence... no
23:22:51 checking linux/rseq.h presence... no
23:22:51 checking for linux/rseq.h... no
23:22:51 checking for rseq_available in -lrseq... no
23:22:51 checking for linux/rseq.h... no
23:22:51 checking for rseq_available in -lrseq... no
23:22:51 checking linux/io_uring.h usability... no
23:22:51 checking linux/io_uring.h usability... no
23:22:51 checking linux/io_uring.h presence... no
23:22:51 checking linux/io_uring.h presence... no
23:22:51 checking for linux/io_uring.h... no
23:22:51 checking for preadv2... no
23:22:51 checking for linux/io_uring.h... no
23:22:51 checking for preadv2... no
23:22:51 checking for pwritev2... no
23:22:51 checking for pwritev2... no
23:22:51 no
23:22:51 checking that generated files are newer than configure... done
23:22:51 configure: creating ./config.status
23:22:51 checking that generated files are newer than configure... done
23:22:51 configure: creating ./config.status
23:22:51 config.status: creating Makefile
23:22:51 config.status: creating src/Makefile
23:22:51 config.status: creating Makefile
23:22:51 config.status: creating src/Makefile
23:22:51 config.status: creating prelude/Makefile
23:22:51 config.status: creating prelude/Makefile
23:22:51 config.status: creating src/concurrency/io/call.cfa
23:22:51 config.status: creating src/concurrency/io/call.cfa
23:22:51 config.status: creating prelude/defines.hfa
23:22:51 config.status: creating prelude/defines.hfa
23:22:51 config.status: executing depfiles commands
23:22:51 config.status: executing depfiles commands
23:22:51 config.status: executing libtool commands
23:22:51 config.status: executing libtool commands
23:22:51 configure: WARNING: unrecognized options: --enable-new-ast
23:22:51 Cforall library configuraton completed. Type "make -j 8 install".
23:22:51 configure: WARNING: unrecognized options: --enable-new-ast
23:22:51 Cforall library configuraton completed. Type "make -j 8 install".
23:22:51 [Pipeline] }
23:22:51 [Pipeline] // dir
23:22:51 [Pipeline] }
23:22:51 [Pipeline] // stage
23:22:51 [Pipeline] echo
23:22:51  -------- Build : cfa-cpp -------- 
23:22:51 [Pipeline] stage
23:22:51 [Pipeline] { (Build : cfa-cpp)
23:22:51 [Pipeline] dir
23:22:51 Running in /var/lib/jenkins/workspace/Cforall_master@tmp
23:22:51 [Pipeline] {
23:22:51 [Pipeline] sh
23:22:51 + make -j 8 --no-print-directory -C driver
23:22:51   CXX      as.o
23:22:51   CXX      cc1.o
23:22:51   CXX      cfa.o
23:22:51   CXXLD    as
23:22:51   CXXLD    cc1
23:22:51   CXXLD    cfa
23:22:51 [Pipeline] sh
23:22:51 + make -j 8 --no-print-directory -C src
23:22:51   YACC     Parser/parser.cc
23:22:51 /var/lib/jenkins/workspace/Cforall_master/src/Parser/parser.yy: warning: 2 reduce/reduce conflicts [-Wconflicts-rr]
23:22:51 updating Parser/parser.output
23:22:51 updating Parser/parser.hh
23:22:51 make  all-am
23:22:51   CXX      CompilationState.o
23:22:51   CXX      main.o
23:22:51   CXX      MakeLibCfa.o
23:22:51   CXX      MakeLibCfaNew.o
23:22:51   CXX      CodeGen/Generate.o
23:22:51   CXX      CodeGen/FixNames.o
23:22:51   CXX      Concurrency/Waitfor.o
23:22:51   CXX      ControlStruct/ExceptTranslate.o
23:22:51   CXX      Common/DebugMalloc.o
23:22:51   CXX      GenPoly/Box.o
23:22:51   CXX      GenPoly/FindFunction.o
23:22:51   CXX      GenPoly/InstantiateGeneric.o
23:22:51   CXX      GenPoly/ScrubTyVars.o
23:22:51   CXX      GenPoly/Specialize.o
23:22:51   CXX      InitTweak/FixGlobalInit.o
23:22:51   CXX      InitTweak/FixInit.o
23:22:51   CXX      InitTweak/FixInitNew.o
23:22:51   LEX      Parser/lex.cc
23:22:51   CXX      Parser/ParseNode.o
23:22:51   CXX      Parser/parser.o
23:22:51   CXX      Parser/parserutility.o
23:22:51   CXX      Parser/StatementNode.o
23:22:51   CXX      Parser/TypeData.o
23:22:51   CXX      Parser/TypedefTable.o
23:22:51   CXX      ResolvExpr/AlternativePrinter.o
23:22:51   CXX      Virtual/ExpandCasts.o
23:22:51   CXX      SymTab/demangler.o
23:22:51   CXX      AST/AssertAcyclic.o
23:22:51   CXX      AST/Attribute.o
23:22:51   CXX      AST/Convert.o
23:22:51   CXX      AST/Decl.o
23:22:51   CXX      AST/DeclReplacer.o
23:22:51   CXX      AST/Expr.o
23:22:51   CXX      AST/GenericSubstitution.o
23:22:51   CXX      AST/Init.o
23:22:51   CXX      AST/LinkageSpec.o
23:22:51   CXX      AST/Node.o
23:22:51   CXX      AST/Pass.o
23:22:51   CXX      AST/Print.o
23:22:51   CXX      AST/Stmt.o
23:22:51   CXX      AST/SymbolTable.o
23:22:51   CXX      AST/Type.o
23:22:51   CXX      AST/TypeEnvironment.o
23:22:51   CXX      AST/TypeSubstitution.o
23:22:51   CXX      CodeGen/CodeGenerator.o
23:22:51   CXX      CodeGen/FixMain.o
23:22:51   CXX      CodeGen/GenType.o
23:22:51   CXX      CodeGen/LinkOnce.o
23:22:51   CXX      CodeGen/OperatorTable.o
23:22:51   CXX      Concurrency/Keywords.o
23:22:51   CXX      Common/Assert.o
23:22:51   CXX      Common/CodeLocationTools.o
23:22:51   CXX      Common/Eval.o
23:22:51   CXX      Common/Examine.o
23:22:51   CXX      Common/PassVisitor.o
23:22:51   CXX      Common/SemanticError.o
23:22:51   CXX      Common/Stats/Counter.o
23:22:51   CXX      Common/Stats/Heap.o
23:22:51   CXX      Common/Stats/ResolveTime.o
23:22:51   CXX      Common/Stats/Stats.o
23:22:51   CXX      Common/Stats/Time.o
23:22:51   CXX      Common/UniqueName.o
23:22:51   CXX      ControlStruct/ExceptDecl.o
23:22:51   CXX      ControlStruct/ForExprMutator.o
23:22:51   CXX      ControlStruct/LabelFixer.o
23:22:51   CXX      ControlStruct/LabelGenerator.o
23:22:51   CXX      ControlStruct/MLEMutator.o
23:22:51   CXX      ControlStruct/Mutate.o
23:22:51   CXX      GenPoly/GenPoly.o
23:22:51   CXX      GenPoly/Lvalue.o
23:22:51   CXX      InitTweak/GenInit.o
23:22:51   CXX      InitTweak/InitTweak.o
23:22:51 /var/lib/jenkins/workspace/Cforall_master/src/GenPoly/GenPoly.cc:67:130: warning: ‘ununsed’ attribute directive ignored [-Wattributes]
23:22:51    bool hasPolyParams( const std::vector<ast::ptr<ast::Expr>> & params, const TyVarMap & tyVars, const ast::TypeSubstitution * env) {
23:22:51                                                                                                                                   ^
23:22:51   CXX      ResolvExpr/AdjustExprType.o
23:22:51 /var/lib/jenkins/workspace/Cforall_master/src/GenPoly/GenPoly.cc:67:8: warning: ‘bool GenPoly::{anonymous}::hasPolyParams(const std::vector<ast::ptr_base<ast::Expr, (ast::Node::ref_type)0> >&, const TyVarMap&, const ast::TypeSubstitution*)’ defined but not used [-Wunused-function]
23:22:51    bool hasPolyParams( const std::vector<ast::ptr<ast::Expr>> & params, const TyVarMap & tyVars, const ast::TypeSubstitution * env) {
23:22:51         ^~~~~~~~~~~~~
23:22:51   CXX      ResolvExpr/Alternative.o
23:22:51   CXX      ResolvExpr/AlternativeFinder.o
23:22:51   CXX      ResolvExpr/Candidate.o
23:22:51   CXX      ResolvExpr/CandidateFinder.o
23:22:51   CXX      ResolvExpr/CastCost.o
23:22:51 In file included from /var/lib/jenkins/workspace/Cforall_master/src/ResolvExpr/CastCost.cc:22:0:
23:22:51 /var/lib/jenkins/workspace/Cforall_master/src/ResolvExpr/ConversionCost.h:79:2: warning: #warning when the old ConversionCost is removed, get ride of the _new suffix. [-Wcpp]
23:22:51  #warning when the old ConversionCost is removed, get ride of the _new suffix.
23:22:51   ^~~~~~~
23:22:51 /var/lib/jenkins/workspace/Cforall_master/src/ResolvExpr/CastCost.cc:186:3: warning: #warning For overload resolution between the two versions. [-Wcpp]
23:22:51   #warning For overload resolution between the two versions.
23:22:51    ^~~~~~~
23:22:51 /var/lib/jenkins/workspace/Cforall_master/src/ResolvExpr/CastCost.cc:236:4: warning: #warning cast on ptrsCastable artifact of having two functions, remove when port done [-Wcpp]
23:22:51    #warning cast on ptrsCastable artifact of having two functions, remove when port done
23:22:51     ^~~~~~~
23:22:51 /var/lib/jenkins/workspace/Cforall_master/src/ResolvExpr/CastCost.cc:240:4: warning: #warning cast on castCost artifact of having two functions, remove when port done [-Wcpp]
23:22:51    #warning cast on castCost artifact of having two functions, remove when port done
23:22:51     ^~~~~~~
23:22:51   CXX      ResolvExpr/CommonType.o
23:22:51 /var/lib/jenkins/workspace/Cforall_master/src/ResolvExpr/CommonType.cc:682:6: warning: #warning remove casts when `commonTypes` moved to new AST [-Wcpp]
23:22:51      #warning remove casts when `commonTypes` moved to new AST
23:22:51       ^~~~~~~
23:22:51 /var/lib/jenkins/workspace/Cforall_master/src/ResolvExpr/CommonType.cc:697:6: warning: #warning remove casts when `commonTypes` moved to new AST [-Wcpp]
23:22:51      #warning remove casts when `commonTypes` moved to new AST
23:22:51       ^~~~~~~
23:22:51   CXX      ResolvExpr/ConversionCost.o
23:22:51 In file included from /var/lib/jenkins/workspace/Cforall_master/src/ResolvExpr/ConversionCost.cc:16:0:
23:22:51 /var/lib/jenkins/workspace/Cforall_master/src/ResolvExpr/ConversionCost.h:79:2: warning: #warning when the old ConversionCost is removed, get ride of the _new suffix. [-Wcpp]
23:22:51  #warning when the old ConversionCost is removed, get ride of the _new suffix.
23:22:51   ^~~~~~~
23:22:51 /var/lib/jenkins/workspace/Cforall_master/src/ResolvExpr/ConversionCost.cc:484:4: warning: #warning For overload resolution between the two versions. [-Wcpp]
23:22:51   # warning For overload resolution between the two versions.
23:22:51     ^~~~~~~
23:22:51   CXX      ResolvExpr/CurrentObject.o
23:22:51   CXX      ResolvExpr/ExplodedActual.o
23:22:51   CXX      ResolvExpr/ExplodedArg.o
23:22:51   CXX      ResolvExpr/FindOpenVars.o
23:22:51   CXX      ResolvExpr/Occurs.o
23:22:51   CXX      ResolvExpr/PolyCost.o
23:22:51   CXX      ResolvExpr/PtrsAssignable.o
23:22:51   CXX      ResolvExpr/PtrsCastable.o
23:22:51   CXX      ResolvExpr/RenameVars.o
23:22:51   CXX      ResolvExpr/ResolveAssertions.o
23:22:51   CXX      ResolvExpr/Resolver.o
23:22:51   CXX      ResolvExpr/ResolveTypeof.o
23:22:51   CXX      ResolvExpr/SatisfyAssertions.o
23:22:51   CXX      ResolvExpr/SpecCost.o
23:22:51 /var/lib/jenkins/workspace/Cforall_master/src/ResolvExpr/SpecCost.cc:133:4: warning: #warning Should use a standard maybe_accept [-Wcpp]
23:22:51    #warning Should use a standard maybe_accept
23:22:51     ^~~~~~~
23:22:51   CXX      ResolvExpr/TypeEnvironment.o
23:22:51   CXX      ResolvExpr/Unify.o
23:22:51   CXX      SymTab/Autogen.o
23:22:51   CXX      SymTab/FixFunction.o
23:22:51   CXX      SymTab/Indexer.o
23:22:51   CXX      SymTab/Mangler.o
23:22:51   CXX      SymTab/ManglerCommon.o
23:22:51   CXX      SymTab/Validate.o
23:22:51   CXX      SymTab/Demangle.o
23:22:51   CXX      SynTree/AddressExpr.o
23:22:51   CXX      SynTree/AggregateDecl.o
23:22:51   CXX      SynTree/ApplicationExpr.o
23:22:51   CXX      SynTree/ArrayType.o
23:22:51   CXX      SynTree/Attribute.o
23:22:51   CXX      SynTree/AttrType.o
23:22:51   CXX      SynTree/BasicType.o
23:22:51   CXX      SynTree/CommaExpr.o
23:22:51   CXX      SynTree/CompoundStmt.o
23:22:51   CXX      SynTree/Constant.o
23:22:51   CXX      SynTree/Declaration.o
23:22:51   CXX      SynTree/DeclarationWithType.o
23:22:51   CXX      SynTree/DeclReplacer.o
23:22:51   CXX      SynTree/DeclStmt.o
23:22:51   CXX      SynTree/Expression.o
23:22:51   CXX      SynTree/FunctionDecl.o
23:22:51   CXX      SynTree/FunctionType.o
23:22:51   CXX      SynTree/Initializer.o
23:22:51   CXX      SynTree/LinkageSpec.o
23:22:51   CXX      SynTree/NamedTypeDecl.o
23:22:51   CXX      SynTree/ObjectDecl.o
23:22:51   CXX      SynTree/PointerType.o
23:22:51   CXX      SynTree/ReferenceToType.o
23:22:51   CXX      SynTree/ReferenceType.o
23:22:51   CXX      SynTree/Statement.o
23:22:51   CXX      SynTree/TupleExpr.o
23:22:51   CXX      SynTree/TupleType.o
23:22:51   CXX      SynTree/Type.o
23:22:51   CXX      SynTree/TypeDecl.o
23:22:51   CXX      SynTree/TypeExpr.o
23:22:51   CXX      SynTree/TypeofType.o
23:22:51   CXX      SynTree/TypeSubstitution.o
23:22:51   CXX      SynTree/VarArgsType.o
23:22:51   CXX      SynTree/VoidType.o
23:22:51   CXX      SynTree/ZeroOneType.o
23:22:51   CXX      Tuples/Explode.o
23:22:51   CXX      Tuples/TupleAssignment.o
23:22:51   CXX      Tuples/TupleExpansion.o
23:22:51   CXX      Tuples/TupleExpansionNew.o
23:22:51   CXX      Tuples/Tuples.o
23:22:51   CXX      Validate/HandleAttributes.o
23:22:51   CXX      Validate/FindSpecialDecls.o
23:22:51   CXX      Virtual/Tables.o
23:22:51   CXX      CodeTools/DeclStats.o
23:22:51   CXX      CodeTools/ResolvProtoDump.o
23:22:51   CXX      CodeTools/TrackLoc.o
23:22:51   CXX      Parser/DeclarationNode.o
23:22:51   CXX      Parser/ExpressionNode.o
23:22:51   CXX      Parser/InitializerNode.o
23:22:51   CXX      Parser/lex.o
23:22:51   AR       libdemangle.a
23:22:51   CXXLD    ../driver/cfa-cpp
23:22:51   CXXLD    demangler
23:22:51 [Pipeline] }
23:22:51 [Pipeline] // dir
23:22:51 [Pipeline] }
23:22:51 [Pipeline] // stage
23:22:51 [Pipeline] echo
23:22:51  -------- Build : libcfa(debug) -------- 
23:22:51 [Pipeline] stage
23:22:51 [Pipeline] { (Build : libcfa(debug))
23:22:51 [Pipeline] dir
23:22:51 Running in /var/lib/jenkins/workspace/Cforall_master@tmp
23:22:51 [Pipeline] {
23:22:51 [Pipeline] sh
23:22:51 + make -j 8 --no-print-directory -C libcfa/x86-debug
23:22:51 Making all in prelude
23:22:51 (CDPATH="${ZSH_VERSION+.}:" && cd /var/lib/jenkins/workspace/Cforall_master/libcfa && /bin/bash /var/lib/jenkins/workspace/Cforall_master/libcfa/automake/missing autoheader)
23:22:51 rm -f stamp-h1
23:22:51 touch /var/lib/jenkins/workspace/Cforall_master/libcfa/prelude/defines.hfa.in
23:22:51 cd .. && /bin/bash ./config.status prelude/defines.hfa
23:22:51 config.status: creating prelude/defines.hfa
23:22:51 config.status: prelude/defines.hfa is unchanged
23:22:51 make  all-am
23:22:51   GEN      gcc-builtins.c
23:22:51   GEN      builtins.cf
23:22:51   GEN      extras.cf
23:22:51   GEN      prelude.cfa
23:22:51   GEN      extras.cf
23:22:51   GEN      gcc-builtins.cf
23:22:51   GEN      bootloader.c
23:22:51 Making all in src
23:22:51   CFA      common.lo
23:22:51   CFA      fstream.lo
23:22:51   CFA      memory.lo
23:22:51   CFA      heap.lo
23:22:51   CFA      iterator.lo
23:22:51   CFA      limits.lo
23:22:51   CFA      parseargs.lo
23:22:51   CFA      iostream.lo
23:22:51   CFA      parseconfig.lo
23:22:51   CFA      rational.lo
23:22:51   CFA      stdlib.lo
23:22:51   CFA      strstream.lo
23:22:51   CFA      time.lo
23:22:51   CFA      assert.lo
23:22:51   CFA      bits/debug.lo
23:22:51   CC       exception.lo
23:22:51   CFA      interpose.lo
23:22:51   CFA      startup.lo
23:22:51   CC       virtual.lo
23:22:51   GEN      prelude.lo
23:22:51   CPPAS    concurrency/CtxSwitch-x86.lo
23:22:51   CC       concurrency/invoke.lo
23:22:51   CFA      concurrency/io.lo
23:22:51   CFA      concurrency/preemption.lo
23:22:51   CFA      concurrency/ready_queue.lo
23:22:51   CFA      concurrency/stats.lo
23:22:51   CFA      bits/weakso_locks.lo
23:22:51   CFA      containers/maybe.lo
23:22:51   CFA      containers/pair.lo
23:22:51   CFA      containers/result.lo
23:22:51   CFA      containers/string.lo
23:22:51   CFA      containers/string_res.lo
23:22:51   CFA      containers/vector.lo
23:22:51   CFA      device/cpu.lo
23:22:51   CFA      concurrency/alarm.lo
23:22:51   CFA      concurrency/coroutine.lo
23:22:51   CFA      concurrency/exception.lo
23:22:51   CFA      concurrency/kernel.lo
23:22:51   CFA      concurrency/locks.lo
23:22:51   CFA      concurrency/monitor.lo
23:22:51   CFA      concurrency/mutex.lo
23:22:51   CFA      concurrency/thread.lo
23:22:51   CFA      concurrency/clib/cfathread.lo
23:22:51   CFA      concurrency/io/setup.lo
23:22:51   CFA      concurrency/io/call.lo
23:22:51   CFA      concurrency/kernel/startup.lo
23:22:51   CCLD     libcfa.la
23:22:51   CCLD     libcfathread.la
23:22:51 make[1]: Nothing to be done for 'all-am'.
23:22:51 [Pipeline] }
23:22:51 [Pipeline] // dir
23:22:51 [Pipeline] }
23:22:51 [Pipeline] // stage
23:22:51 [Pipeline] echo
23:22:51  -------- Build : libcfa(nodebug) -------- 
23:22:51 [Pipeline] stage
23:22:51 [Pipeline] { (Build : libcfa(nodebug))
23:22:51 [Pipeline] dir
23:22:51 Running in /var/lib/jenkins/workspace/Cforall_master@tmp
23:22:51 [Pipeline] {
23:22:51 [Pipeline] sh
23:22:51 + make -j 8 --no-print-directory -C libcfa/x86-nodebug
23:22:51 Making all in prelude
23:22:51 cd .. && /bin/bash ./config.status prelude/defines.hfa
23:22:51 config.status: creating prelude/defines.hfa
23:22:51 config.status: prelude/defines.hfa is unchanged
23:22:51 make  all-am
23:22:51   GEN      gcc-builtins.c
23:22:51   GEN      builtins.cf
23:22:51   GEN      extras.cf
23:22:51   GEN      prelude.cfa
23:22:51   GEN      extras.cf
23:22:51   GEN      gcc-builtins.cf
23:22:51   GEN      bootloader.c
23:22:51 Making all in src
23:22:51   CFA      common.lo
23:22:51   CFA      fstream.lo
23:22:51   CFA      heap.lo
23:22:51   CFA      iostream.lo
23:22:51   CFA      parseargs.lo
23:22:51   CFA      memory.lo
23:22:51   CFA      limits.lo
23:22:51   CFA      iterator.lo
23:22:51   CFA      parseconfig.lo
23:22:51   CFA      rational.lo
23:22:51   CFA      stdlib.lo
23:22:51   CFA      strstream.lo
23:22:51 /var/lib/jenkins/workspace/Cforall_master/libcfa/src/stdlib.cfa: In function ‘_X4anewQ1_0_1_1__X12_constructorFv_BD0BT0__FPBD0_jBT0__1’:
23:22:51 /var/lib/jenkins/workspace/Cforall_master/libcfa/src/stdlib.hfa:154:97: warning: ‘_X4_srcS6S_fill_Y12__T_generic___1._X1cc_1’ is used uninitialized in this function [-Wuninitialized]
23:22:51   struct S_fill   { char tag; char c; size_t size; T * at; char t[50]; };
23:22:51                                                                ~~~~~~~~~~                        ^       
23:22:51 /var/lib/jenkins/workspace/Cforall_master/libcfa/src/stdlib.hfa:154:100: warning: ‘_X4_srcS6S_fill_Y12__T_generic___1._X4sizej_1’ is used uninitialized in this function [-Wuninitialized]
23:22:51   struct S_fill   { char tag; char c; size_t size; T * at; char t[50]; };
23:22:51                                                                   ~~~~~~~                           ^          
23:22:51 /var/lib/jenkins/workspace/Cforall_master/libcfa/src/stdlib.hfa:154:130: warning: ‘_X4_srcS6S_fill_Y12__T_generic___1._X2atPY12__T_generic__1’ is used uninitialized in this function [-Wuninitialized]
23:22:51   struct S_fill   { char tag; char c; size_t size; T * at; char t[50]; };
23:22:51                                                                                                                                   ^                       
23:22:51   CFA      time.lo
23:22:51   CFA      assert.lo
23:22:51   CFA      bits/debug.lo
23:22:51   CC       exception.lo
23:22:51   CFA      interpose.lo
23:22:51   CFA      startup.lo
23:22:51   CC       virtual.lo
23:22:51   GEN      prelude.lo
23:22:51 /var/lib/jenkins/workspace/Cforall_master/libcfa/src/parseconfig.cfa: In function ‘_X12_constructorFv_S13Parse_FailurePcPc__1’:
23:22:51 /var/lib/jenkins/workspace/Cforall_master/libcfa/src/stdlib.hfa:154:97: warning: ‘_X4_srcS6S_fill_Y12__T_generic___1._X1cc_1’ is used uninitialized in this function [-Wuninitialized]
23:22:51   struct S_fill   { char tag; char c; size_t size; T * at; char t[50]; };
23:22:51                                                                ~~~~~~~~~~                        ^       
23:22:51 /var/lib/jenkins/workspace/Cforall_master/libcfa/src/stdlib.hfa:154:100: warning: ‘_X4_srcS6S_fill_Y12__T_generic___1._X4sizej_1’ is used uninitialized in this function [-Wuninitialized]
23:22:51   struct S_fill   { char tag; char c; size_t size; T * at; char t[50]; };
23:22:51                                                                   ~~~~~~~                           ^          
23:22:51 /var/lib/jenkins/workspace/Cforall_master/libcfa/src/stdlib.hfa:154:130: warning: ‘_X4_srcS6S_fill_Y12__T_generic___1._X2atPY12__T_generic__1’ is used uninitialized in this function [-Wuninitialized]
23:22:51   struct S_fill   { char tag; char c; size_t size; T * at; char t[50]; };
23:22:51                                                                                                                                   ^                       
23:22:51 /var/lib/jenkins/workspace/Cforall_master/libcfa/src/parseconfig.cfa: In function ‘_X12_constructorFv_S18Validation_FailurePcPc__1’:
23:22:51 /var/lib/jenkins/workspace/Cforall_master/libcfa/src/stdlib.hfa:154:97: warning: ‘_X4_srcS6S_fill_Y12__T_generic___1._X1cc_1’ is used uninitialized in this function [-Wuninitialized]
23:22:51   struct S_fill   { char tag; char c; size_t size; T * at; char t[50]; };
23:22:51                                                                ~~~~~~~~~~                        ^       
23:22:51 /var/lib/jenkins/workspace/Cforall_master/libcfa/src/stdlib.hfa:154:100: warning: ‘_X4_srcS6S_fill_Y12__T_generic___1._X4sizej_1’ is used uninitialized in this function [-Wuninitialized]
23:22:51   struct S_fill   { char tag; char c; size_t size; T * at; char t[50]; };
23:22:51                                                                   ~~~~~~~                           ^          
23:22:51 /var/lib/jenkins/workspace/Cforall_master/libcfa/src/stdlib.hfa:154:130: warning: ‘_X4_srcS6S_fill_Y12__T_generic___1._X2atPY12__T_generic__1’ is used uninitialized in this function [-Wuninitialized]
23:22:51   struct S_fill   { char tag; char c; size_t size; T * at; char t[50]; };
23:22:51                                                                                                                                   ^                       
23:22:51 /var/lib/jenkins/workspace/Cforall_master/libcfa/src/parseconfig.cfa: In function ‘_X12_constructorFv_S7KVPairsj__1’:
23:22:51 /var/lib/jenkins/workspace/Cforall_master/libcfa/src/stdlib.hfa:154:97: warning: ‘_X4_srcS6S_fill_Y12__T_generic___1._X1cc_1’ is used uninitialized in this function [-Wuninitialized]
23:22:51   struct S_fill   { char tag; char c; size_t size; T * at; char t[50]; };
23:22:51                                                                ~~~~~~~~~~                        ^       
23:22:51 /var/lib/jenkins/workspace/Cforall_master/libcfa/src/stdlib.hfa:154:100: warning: ‘_X4_srcS6S_fill_Y12__T_generic___1._X4sizej_1’ is used uninitialized in this function [-Wuninitialized]
23:22:51   struct S_fill   { char tag; char c; size_t size; T * at; char t[50]; };
23:22:51                                                                   ~~~~~~~                           ^          
23:22:51 /var/lib/jenkins/workspace/Cforall_master/libcfa/src/stdlib.hfa:154:130: warning: ‘_X4_srcS6S_fill_Y12__T_generic___1._X2atPY12__T_generic__1’ is used uninitialized in this function [-Wuninitialized]
23:22:51   struct S_fill   { char tag; char c; size_t size; T * at; char t[50]; };
23:22:51                                                                                                                                   ^                       
23:22:51 /var/lib/jenkins/workspace/Cforall_master/libcfa/src/parseconfig.cfa: In function ‘_X11add_kv_pairFv_S7KVPairsPcPc__1’:
23:22:51 /var/lib/jenkins/workspace/Cforall_master/libcfa/src/stdlib.hfa:154:97: warning: ‘_X4_srcS6S_fill_Y12__T_generic___1._X1cc_1’ may be used uninitialized in this function [-Wmaybe-uninitialized]
23:22:51   struct S_fill   { char tag; char c; size_t size; T * at; char t[50]; };
23:22:51                                                                ~~~~~~~~~~                        ^       
23:22:51 /var/lib/jenkins/workspace/Cforall_master/libcfa/src/stdlib.hfa:154:100: warning: ‘_X4_srcS6S_fill_Y12__T_generic___1._X4sizej_1’ may be used uninitialized in this function [-Wmaybe-uninitialized]
23:22:51   struct S_fill   { char tag; char c; size_t size; T * at; char t[50]; };
23:22:51                                                                   ~~~~~~~                           ^          
23:22:51 /var/lib/jenkins/workspace/Cforall_master/libcfa/src/stdlib.hfa:154:130: warning: ‘_X4_srcS6S_fill_Y12__T_generic___1._X2atPY12__T_generic__1’ may be used uninitialized in this function [-Wmaybe-uninitialized]
23:22:51   struct S_fill   { char tag; char c; size_t size; T * at; char t[50]; };
23:22:51                                                                                                                                   ^                       
23:22:51 /var/lib/jenkins/workspace/Cforall_master/libcfa/src/stdlib.hfa:154:97: warning: ‘_X4_srcS6S_fill_Y12__T_generic___1._X1cc_1’ may be used uninitialized in this function [-Wmaybe-uninitialized]
23:22:51   struct S_fill   { char tag; char c; size_t size; T * at; char t[50]; };
23:22:51                                                                ~~~~~~~~~~                        ^       
23:22:51 /var/lib/jenkins/workspace/Cforall_master/libcfa/src/stdlib.hfa:154:100: warning: ‘_X4_srcS6S_fill_Y12__T_generic___1._X4sizej_1’ may be used uninitialized in this function [-Wmaybe-uninitialized]
23:22:51   struct S_fill   { char tag; char c; size_t size; T * at; char t[50]; };
23:22:51                                                                   ~~~~~~~                           ^          
23:22:51 /var/lib/jenkins/workspace/Cforall_master/libcfa/src/stdlib.hfa:154:130: warning: ‘_X4_srcS6S_fill_Y12__T_generic___1._X2atPY12__T_generic__1’ may be used uninitialized in this function [-Wmaybe-uninitialized]
23:22:51   struct S_fill   { char tag; char c; size_t size; T * at; char t[50]; };
23:22:51                                                                                                                                   ^                       
23:22:51   CPPAS    concurrency/CtxSwitch-x86.lo
23:22:51   CC       concurrency/invoke.lo
23:22:51   CFA      concurrency/io.lo
23:22:51   CFA      concurrency/preemption.lo
23:22:51   CFA      concurrency/ready_queue.lo
23:22:51   CFA      concurrency/stats.lo
23:22:51   CFA      bits/weakso_locks.lo
23:22:51   CFA      containers/maybe.lo
23:22:51   CFA      containers/pair.lo
23:22:51   CFA      containers/result.lo
23:22:51   CFA      containers/string.lo
23:22:51   CFA      containers/string_res.lo
23:22:51   CFA      containers/vector.lo
23:22:51   CFA      device/cpu.lo
23:22:51   CFA      concurrency/alarm.lo
23:22:51   CFA      concurrency/coroutine.lo
23:22:51   CFA      concurrency/exception.lo
23:22:51 /var/lib/jenkins/workspace/Cforall_master/libcfa/src/stdlib.hfa: In function ‘_X5allocQ1_0_1_1__X15alloc_internal$FPBD0_PvPBD0jjS6S_fill_BD0_BT0__FPBD0_jBT0__1.isra.14.constprop’:
23:22:51 /var/lib/jenkins/workspace/Cforall_master/libcfa/src/stdlib.hfa:154:97: warning: ‘_X4_srcS6S_fill_Y12__T_generic___1._X1cc_1’ is used uninitialized in this function [-Wuninitialized]
23:22:51   struct S_fill   { char tag; char c; size_t size; T * at; char t[50]; };
23:22:51                                                                ~~~~~~~~~~                        ^       
23:22:51 /var/lib/jenkins/workspace/Cforall_master/libcfa/src/stdlib.hfa:154:100: warning: ‘_X4_srcS6S_fill_Y12__T_generic___1._X4sizej_1’ is used uninitialized in this function [-Wuninitialized]
23:22:51   struct S_fill   { char tag; char c; size_t size; T * at; char t[50]; };
23:22:51                                                                   ~~~~~~~                           ^          
23:22:51 /var/lib/jenkins/workspace/Cforall_master/libcfa/src/stdlib.hfa:154:130: warning: ‘_X4_srcS6S_fill_Y12__T_generic___1._X2atPY12__T_generic__1’ is used uninitialized in this function [-Wuninitialized]
23:22:51   struct S_fill   { char tag; char c; size_t size; T * at; char t[50]; };
23:22:51                                                                                                                                   ^                       
23:22:51 /var/lib/jenkins/workspace/Cforall_master/libcfa/src/stdlib.hfa: In function ‘_X5allocQ1_0_1_1__X15alloc_internal$FPBD0_PvPBD0jjS6S_fill_BD0_BT0__FPBD0_jBT0__1.isra.14.constprop’:
23:22:51 /var/lib/jenkins/workspace/Cforall_master/libcfa/src/stdlib.hfa:154:97: warning: ‘_X4_srcS6S_fill_Y12__T_generic___1._X1cc_1’ is used uninitialized in this function [-Wuninitialized]
23:22:51   struct S_fill   { char tag; char c; size_t size; T * at; char t[50]; };
23:22:51                                                                ~~~~~~~~~~                        ^       
23:22:51 /var/lib/jenkins/workspace/Cforall_master/libcfa/src/stdlib.hfa:154:100: warning: ‘_X4_srcS6S_fill_Y12__T_generic___1._X4sizej_1’ is used uninitialized in this function [-Wuninitialized]
23:22:51   struct S_fill   { char tag; char c; size_t size; T * at; char t[50]; };
23:22:51                                                                   ~~~~~~~                           ^          
23:22:51 /var/lib/jenkins/workspace/Cforall_master/libcfa/src/stdlib.hfa:154:130: warning: ‘_X4_srcS6S_fill_Y12__T_generic___1._X2atPY12__T_generic__1’ is used uninitialized in this function [-Wuninitialized]
23:22:51   struct S_fill   { char tag; char c; size_t size; T * at; char t[50]; };
23:22:51                                                                                                                                   ^                       
23:22:51   CFA      concurrency/kernel.lo
23:22:51   CFA      concurrency/locks.lo
23:22:51   CFA      concurrency/monitor.lo
23:22:51   CFA      concurrency/mutex.lo
23:22:51   CFA      concurrency/thread.lo
23:22:51   CFA      concurrency/clib/cfathread.lo
23:22:51   CFA      concurrency/io/setup.lo
23:22:51   CFA      concurrency/io/call.lo
23:22:51   CFA      concurrency/kernel/startup.lo
23:22:51   CCLD     libcfa.la
23:22:51 /var/lib/jenkins/workspace/Cforall_master/libcfa/src/concurrency/clib/cfathread.cfa: In function ‘cfathread_cluster_add_worker’:
23:22:51 /var/lib/jenkins/workspace/Cforall_master/libcfa/src/stdlib.hfa:154:97: warning: ‘_X4_srcS6S_fill_Y12__T_generic___1._X1cc_1’ may be used uninitialized in this function [-Wmaybe-uninitialized]
23:22:51   struct S_fill   { char tag; char c; size_t size; T * at; char t[50]; };
23:22:51                                                                ~~~~~~~~~~                        ^       
23:22:51 /var/lib/jenkins/workspace/Cforall_master/libcfa/src/stdlib.hfa:154:100: warning: ‘_X4_srcS6S_fill_Y12__T_generic___1._X4sizej_1’ may be used uninitialized in this function [-Wmaybe-uninitialized]
23:22:51   struct S_fill   { char tag; char c; size_t size; T * at; char t[50]; };
23:22:51                                                                   ~~~~~~~                           ^          
23:22:51 /var/lib/jenkins/workspace/Cforall_master/libcfa/src/stdlib.hfa:154:130: warning: ‘_X4_srcS6S_fill_Y12__T_generic___1._X2atPY12__T_generic__1’ may be used uninitialized in this function [-Wmaybe-uninitialized]
23:22:51   struct S_fill   { char tag; char c; size_t size; T * at; char t[50]; };
23:22:51                                                                                                                                   ^                       
23:22:51   CCLD     libcfathread.la
23:22:51 make[1]: Nothing to be done for 'all-am'.
23:22:51 [Pipeline] }
23:22:51 [Pipeline] // dir
23:22:51 [Pipeline] }
23:22:51 [Pipeline] // stage
23:22:51 [Pipeline] echo
23:22:51  -------- Build : install -------- 
23:22:51 [Pipeline] stage
23:22:51 [Pipeline] { (Build : install)
23:22:51 [Pipeline] dir
23:22:51 Running in /var/lib/jenkins/workspace/Cforall_master@tmp
23:22:51 [Pipeline] {
23:22:51 [Pipeline] sh
23:22:51 + make -j 8 --no-print-directory install
23:22:51 Making install in driver
23:22:51 make  install-exec-hook
23:22:51  /bin/mkdir -p '/var/lib/jenkins/workspace/Cforall_master@tmp/lib/cfa/'
23:22:51   /bin/bash ../libtool   --mode=install /usr/bin/install -c as cc1 '/var/lib/jenkins/workspace/Cforall_master@tmp/lib/cfa/'
23:22:51   /usr/bin/install -c cfa '/var/lib/jenkins/workspace/Cforall_master@tmp/bin//cfa'
23:22:51 libtool: install: /usr/bin/install -c as /var/lib/jenkins/workspace/Cforall_master@tmp/lib/cfa/as
23:22:51 libtool: install: /usr/bin/install -c cc1 /var/lib/jenkins/workspace/Cforall_master@tmp/lib/cfa/cc1
23:22:51 Making install in src
23:22:51 make  install-am
23:22:51 make[3]: Nothing to be done for 'install-exec-am'.
23:22:51  /bin/mkdir -p '/var/lib/jenkins/workspace/Cforall_master@tmp/lib/cfa/'
23:22:51   /bin/bash ../libtool   --mode=install /usr/bin/install -c ../driver/cfa-cpp demangler '/var/lib/jenkins/workspace/Cforall_master@tmp/lib/cfa/'
23:22:51 libtool: install: /usr/bin/install -c ../driver/cfa-cpp /var/lib/jenkins/workspace/Cforall_master@tmp/lib/cfa/cfa-cpp
23:22:51 libtool: install: /usr/bin/install -c demangler /var/lib/jenkins/workspace/Cforall_master@tmp/lib/cfa/demangler
23:22:51 Making install in .
23:22:51 (CDPATH="${ZSH_VERSION+.}:" && cd /var/lib/jenkins/workspace/Cforall_master && /bin/bash /var/lib/jenkins/workspace/Cforall_master/automake/missing autoheader)
23:22:51 rm -f stamp-h1
23:22:51 touch /var/lib/jenkins/workspace/Cforall_master/src/config.h.in
23:22:51 cd . && /bin/bash ./config.status config.h
23:22:51 config.status: creating config.h
23:22:51 config.status: config.h is unchanged
23:22:51 make[2]: Nothing to be done for 'install-exec-am'.
23:22:51  /bin/mkdir -p '/var/lib/jenkins/workspace/Cforall_master@tmp/share/man/man1'
23:22:51  /usr/bin/install -c -m 644 /var/lib/jenkins/workspace/Cforall_master/doc/man/cfa.1 '/var/lib/jenkins/workspace/Cforall_master@tmp/share/man/man1'
23:22:51 Making install in libcfa/x86-debug
23:22:51 Making install in prelude
23:22:51 make[3]: Nothing to be done for 'install-exec-am'.
23:22:51  /bin/mkdir -p '/var/lib/jenkins/workspace/Cforall_master@tmp/lib/cfa/x86-debug/'
23:22:51  /usr/bin/install -c -m 644 gcc-builtins.cf builtins.cf extras.cf prelude.cfa bootloader.c defines.hfa '/var/lib/jenkins/workspace/Cforall_master@tmp/lib/cfa/x86-debug/'
23:22:51 Making install in src
23:22:51  /bin/mkdir -p '/var/lib/jenkins/workspace/Cforall_master@tmp/lib/cfa/x86-debug/'
23:22:51  /bin/bash ../libtool   --mode=install /usr/bin/install -c   libcfa.la libcfathread.la '/var/lib/jenkins/workspace/Cforall_master@tmp/lib/cfa/x86-debug/'
23:22:51  /bin/mkdir -p '/var/lib/jenkins/workspace/Cforall_master@tmp/include/cfa/'
23:22:51  /bin/mkdir -p '/var/lib/jenkins/workspace/Cforall_master@tmp/include/cfa//stdhdr/sys'
23:22:51  /usr/bin/install -c -m 644  /var/lib/jenkins/workspace/Cforall_master/libcfa/src/stdhdr/sys/mman.h /var/lib/jenkins/workspace/Cforall_master/libcfa/src/stdhdr/sys/time.h /var/lib/jenkins/workspace/Cforall_master/libcfa/src/stdhdr/sys/socket.h '/var/lib/jenkins/workspace/Cforall_master@tmp/include/cfa//stdhdr/sys'
23:22:51  /bin/mkdir -p '/var/lib/jenkins/workspace/Cforall_master@tmp/include/cfa//containers'
23:22:51  /usr/bin/install -c -m 644  /var/lib/jenkins/workspace/Cforall_master/libcfa/src/containers/maybe.hfa /var/lib/jenkins/workspace/Cforall_master/libcfa/src/containers/pair.hfa /var/lib/jenkins/workspace/Cforall_master/libcfa/src/containers/result.hfa /var/lib/jenkins/workspace/Cforall_master/libcfa/src/containers/string.hfa /var/lib/jenkins/workspace/Cforall_master/libcfa/src/containers/string_res.hfa /var/lib/jenkins/workspace/Cforall_master/libcfa/src/containers/vector.hfa /var/lib/jenkins/workspace/Cforall_master/libcfa/src/containers/array.hfa /var/lib/jenkins/workspace/Cforall_master/libcfa/src/containers/list.hfa /var/lib/jenkins/workspace/Cforall_master/libcfa/src/containers/queueLockFree.hfa /var/lib/jenkins/workspace/Cforall_master/libcfa/src/containers/stackLockFree.hfa /var/lib/jenkins/workspace/Cforall_master/libcfa/src/containers/vector2.hfa '/var/lib/jenkins/workspace/Cforall_master@tmp/include/cfa//containers'
23:22:51  /bin/mkdir -p '/var/lib/jenkins/workspace/Cforall_master@tmp/include/cfa//concurrency/kernel'
23:22:51  /usr/bin/install -c -m 644  /var/lib/jenkins/workspace/Cforall_master/libcfa/src/concurrency/kernel/fwd.hfa '/var/lib/jenkins/workspace/Cforall_master@tmp/include/cfa//concurrency/kernel'
23:22:51  /usr/bin/install -c -m 644  /var/lib/jenkins/workspace/Cforall_master/libcfa/src/common.hfa /var/lib/jenkins/workspace/Cforall_master/libcfa/src/fstream.hfa /var/lib/jenkins/workspace/Cforall_master/libcfa/src/heap.hfa /var/lib/jenkins/workspace/Cforall_master/libcfa/src/iostream.hfa /var/lib/jenkins/workspace/Cforall_master/libcfa/src/iterator.hfa /var/lib/jenkins/workspace/Cforall_master/libcfa/src/limits.hfa /var/lib/jenkins/workspace/Cforall_master/libcfa/src/memory.hfa /var/lib/jenkins/workspace/Cforall_master/libcfa/src/parseargs.hfa /var/lib/jenkins/workspace/Cforall_master/libcfa/src/parseconfig.hfa /var/lib/jenkins/workspace/Cforall_master/libcfa/src/rational.hfa /var/lib/jenkins/workspace/Cforall_master/libcfa/src/stdlib.hfa /var/lib/jenkins/workspace/Cforall_master/libcfa/src/strstream.hfa /var/lib/jenkins/workspace/Cforall_master/libcfa/src/time.hfa /var/lib/jenkins/workspace/Cforall_master/libcfa/src/bitmanip.hfa /var/lib/jenkins/workspace/Cforall_master/libcfa/src/clock.hfa /var/lib/jenkins/workspace/Cforall_master/libcfa/src/exception.hfa /var/lib/jenkins/workspace/Cforall_master/libcfa/src/exception.h /var/lib/jenkins/workspace/Cforall_master/libcfa/src/gmp.hfa /var/lib/jenkins/workspace/Cforall_master/libcfa/src/math.trait.hfa /var/lib/jenkins/workspace/Cforall_master/libcfa/src/math.hfa /var/lib/jenkins/workspace/Cforall_master/libcfa/src/time_t.hfa '/var/lib/jenkins/workspace/Cforall_master@tmp/include/cfa//.'
23:22:51  /bin/mkdir -p '/var/lib/jenkins/workspace/Cforall_master@tmp/include/cfa//concurrency'
23:22:51  /usr/bin/install -c -m 644  /var/lib/jenkins/workspace/Cforall_master/libcfa/src/concurrency/iofwd.hfa /var/lib/jenkins/workspace/Cforall_master/libcfa/src/concurrency/alarm.hfa /var/lib/jenkins/workspace/Cforall_master/libcfa/src/concurrency/coroutine.hfa /var/lib/jenkins/workspace/Cforall_master/libcfa/src/concurrency/exception.hfa /var/lib/jenkins/workspace/Cforall_master/libcfa/src/concurrency/kernel.hfa /var/lib/jenkins/workspace/Cforall_master/libcfa/src/concurrency/locks.hfa /var/lib/jenkins/workspace/Cforall_master/libcfa/src/concurrency/monitor.hfa /var/lib/jenkins/workspace/Cforall_master/libcfa/src/concurrency/mutex.hfa /var/lib/jenkins/workspace/Cforall_master/libcfa/src/concurrency/thread.hfa /var/lib/jenkins/workspace/Cforall_master/libcfa/src/concurrency/invoke.h /var/lib/jenkins/workspace/Cforall_master/libcfa/src/concurrency/future.hfa /var/lib/jenkins/workspace/Cforall_master/libcfa/src/concurrency/mutex_stmt.hfa '/var/lib/jenkins/workspace/Cforall_master@tmp/include/cfa//concurrency'
23:22:51  /bin/mkdir -p '/var/lib/jenkins/workspace/Cforall_master@tmp/include/cfa//concurrency/clib'
23:22:51  /usr/bin/install -c -m 644  /var/lib/jenkins/workspace/Cforall_master/libcfa/src/concurrency/clib/cfathread.h '/var/lib/jenkins/workspace/Cforall_master@tmp/include/cfa//concurrency/clib'
23:22:51  /bin/mkdir -p '/var/lib/jenkins/workspace/Cforall_master@tmp/include/cfa//device'
23:22:51  /usr/bin/install -c -m 644  /var/lib/jenkins/workspace/Cforall_master/libcfa/src/device/cpu.hfa '/var/lib/jenkins/workspace/Cforall_master@tmp/include/cfa//device'
23:22:51  /bin/mkdir -p '/var/lib/jenkins/workspace/Cforall_master@tmp/include/cfa//stdhdr/libltdl'
23:22:51 libtool: install: /usr/bin/install -c .libs/libcfa.so.1.0.0 /var/lib/jenkins/workspace/Cforall_master@tmp/lib/cfa/x86-debug/libcfa.so.1.0.0
23:22:51  /usr/bin/install -c -m 644  /var/lib/jenkins/workspace/Cforall_master/libcfa/src/stdhdr/libltdl/lt_dlloader.h '/var/lib/jenkins/workspace/Cforall_master@tmp/include/cfa//stdhdr/libltdl'
23:22:51  /bin/mkdir -p '/var/lib/jenkins/workspace/Cforall_master@tmp/include/cfa//vec'
23:22:51 libtool: install: (cd /var/lib/jenkins/workspace/Cforall_master@tmp/lib/cfa/x86-debug && { ln -s -f libcfa.so.1.0.0 libcfa.so.1 || { rm -f libcfa.so.1 && ln -s libcfa.so.1.0.0 libcfa.so.1; }; })
23:22:51  /usr/bin/install -c -m 644  /var/lib/jenkins/workspace/Cforall_master/libcfa/src/vec/vec.hfa /var/lib/jenkins/workspace/Cforall_master/libcfa/src/vec/vec2.hfa /var/lib/jenkins/workspace/Cforall_master/libcfa/src/vec/vec3.hfa /var/lib/jenkins/workspace/Cforall_master/libcfa/src/vec/vec4.hfa '/var/lib/jenkins/workspace/Cforall_master@tmp/include/cfa//vec'
23:22:51  /bin/mkdir -p '/var/lib/jenkins/workspace/Cforall_master@tmp/include/cfa//bits'
23:22:51 libtool: install: (cd /var/lib/jenkins/workspace/Cforall_master@tmp/lib/cfa/x86-debug && { ln -s -f libcfa.so.1.0.0 libcfa.so || { rm -f libcfa.so && ln -s libcfa.so.1.0.0 libcfa.so; }; })
23:22:51  /usr/bin/install -c -m 644  /var/lib/jenkins/workspace/Cforall_master/libcfa/src/bits/weakso_locks.hfa /var/lib/jenkins/workspace/Cforall_master/libcfa/src/bits/algorithm.hfa /var/lib/jenkins/workspace/Cforall_master/libcfa/src/bits/align.hfa /var/lib/jenkins/workspace/Cforall_master/libcfa/src/bits/containers.hfa /var/lib/jenkins/workspace/Cforall_master/libcfa/src/bits/debug.hfa /var/lib/jenkins/workspace/Cforall_master/libcfa/src/bits/defs.hfa /var/lib/jenkins/workspace/Cforall_master/libcfa/src/bits/locks.hfa /var/lib/jenkins/workspace/Cforall_master/libcfa/src/bits/collection.hfa /var/lib/jenkins/workspace/Cforall_master/libcfa/src/bits/stack.hfa /var/lib/jenkins/workspace/Cforall_master/libcfa/src/bits/queue.hfa /var/lib/jenkins/workspace/Cforall_master/libcfa/src/bits/sequence.hfa /var/lib/jenkins/workspace/Cforall_master/libcfa/src/bits/random.hfa '/var/lib/jenkins/workspace/Cforall_master@tmp/include/cfa//bits'
23:22:51 libtool: install: /usr/bin/install -c .libs/libcfa.lai /var/lib/jenkins/workspace/Cforall_master@tmp/lib/cfa/x86-debug/libcfa.la
23:22:51 libtool: install: /usr/bin/install -c .libs/libcfathread.so.1.0.0 /var/lib/jenkins/workspace/Cforall_master@tmp/lib/cfa/x86-debug/libcfathread.so.1.0.0
23:22:51  /bin/mkdir -p '/var/lib/jenkins/workspace/Cforall_master@tmp/include/cfa//stdhdr'
23:22:51  /usr/bin/install -c -m 644  /var/lib/jenkins/workspace/Cforall_master/libcfa/src/stdhdr/limits.h /var/lib/jenkins/workspace/Cforall_master/libcfa/src/stdhdr/iso646.h /var/lib/jenkins/workspace/Cforall_master/libcfa/src/stdhdr/float.h /var/lib/jenkins/workspace/Cforall_master/libcfa/src/stdhdr/malloc.h /var/lib/jenkins/workspace/Cforall_master/libcfa/src/stdhdr/stdlib.h /var/lib/jenkins/workspace/Cforall_master/libcfa/src/stdhdr/tgmath.h /var/lib/jenkins/workspace/Cforall_master/libcfa/src/stdhdr/errno.h /var/lib/jenkins/workspace/Cforall_master/libcfa/src/stdhdr/stdnoreturn.h /var/lib/jenkins/workspace/Cforall_master/libcfa/src/stdhdr/stdarg.h /var/lib/jenkins/workspace/Cforall_master/libcfa/src/stdhdr/stddef.h /var/lib/jenkins/workspace/Cforall_master/libcfa/src/stdhdr/assert.h /var/lib/jenkins/workspace/Cforall_master/libcfa/src/stdhdr/gmp.h /var/lib/jenkins/workspace/Cforall_master/libcfa/src/stdhdr/ctype.h /var/lib/jenkins/workspace/Cforall_master/libcfa/src/stdhdr/math.h /var/lib/jenkins/workspace/Cforall_master/libcfa/src/stdhdr/stdbool.h /var/lib/jenkins/workspace/Cforall_master/libcfa/src/stdhdr/signal.h /var/lib/jenkins/workspace/Cforall_master/libcfa/src/stdhdr/setjmp.h /var/lib/jenkins/workspace/Cforall_master/libcfa/src/stdhdr/fenv.h /var/lib/jenkins/workspace/Cforall_master/libcfa/src/stdhdr/stdio.h /var/lib/jenkins/workspace/Cforall_master/libcfa/src/stdhdr/unistd.h /var/lib/jenkins/workspace/Cforall_master/libcfa/src/stdhdr/string.h /var/lib/jenkins/workspace/Cforall_master/libcfa/src/stdhdr/locale.h /var/lib/jenkins/workspace/Cforall_master/libcfa/src/stdhdr/wchar.h /var/lib/jenkins/workspace/Cforall_master/libcfa/src/stdhdr/pthread.h /var/lib/jenkins/workspace/Cforall_master/libcfa/src/stdhdr/unwind.h /var/lib/jenkins/workspace/Cforall_master/libcfa/src/stdhdr/wctype.h /var/lib/jenkins/workspace/Cforall_master/libcfa/src/stdhdr/inttypes.h /var/lib/jenkins/workspace/Cforall_master/libcfa/src/stdhdr/stdatomic.h /var/lib/jenkins/workspace/Cforall_master/libcfa/src/stdhdr/complex.h /var/lib/jenkins/workspace/Cforall_master/libcfa/src/stdhdr/threads.h /var/lib/jenkins/workspace/Cforall_master/libcfa/src/stdhdr/stdalign.h /var/lib/jenkins/workspace/Cforall_master/libcfa/src/stdhdr/time.h /var/lib/jenkins/workspace/Cforall_master/libcfa/src/stdhdr/stdint.h /var/lib/jenkins/workspace/Cforall_master/libcfa/src/stdhdr/uchar.h '/var/lib/jenkins/workspace/Cforall_master@tmp/include/cfa//stdhdr'
23:22:51 libtool: install: (cd /var/lib/jenkins/workspace/Cforall_master@tmp/lib/cfa/x86-debug && { ln -s -f libcfathread.so.1.0.0 libcfathread.so.1 || { rm -f libcfathread.so.1 && ln -s libcfathread.so.1.0.0 libcfathread.so.1; }; })
23:22:51 libtool: install: (cd /var/lib/jenkins/workspace/Cforall_master@tmp/lib/cfa/x86-debug && { ln -s -f libcfathread.so.1.0.0 libcfathread.so || { rm -f libcfathread.so && ln -s libcfathread.so.1.0.0 libcfathread.so; }; })
23:22:51 libtool: install: /usr/bin/install -c .libs/libcfathread.lai /var/lib/jenkins/workspace/Cforall_master@tmp/lib/cfa/x86-debug/libcfathread.la
23:22:51 libtool: warning: remember to run 'libtool --finish /var/lib/jenkins/workspace/Cforall_master@tmp/lib/cfa/x86-debug/'
23:22:51 make[3]: Nothing to be done for 'install-exec-am'.
23:22:51 make[3]: Nothing to be done for 'install-data-am'.
23:22:51 Making install in libcfa/x86-nodebug
23:22:51 Making install in prelude
23:22:51 make[3]: Nothing to be done for 'install-exec-am'.
23:22:51  /bin/mkdir -p '/var/lib/jenkins/workspace/Cforall_master@tmp/lib/cfa/x86-nodebug/'
23:22:51  /usr/bin/install -c -m 644 gcc-builtins.cf builtins.cf extras.cf prelude.cfa bootloader.c defines.hfa '/var/lib/jenkins/workspace/Cforall_master@tmp/lib/cfa/x86-nodebug/'
23:22:51 Making install in src
23:22:51  /bin/mkdir -p '/var/lib/jenkins/workspace/Cforall_master@tmp/lib/cfa/x86-nodebug/'
23:22:51  /bin/bash ../libtool   --mode=install /usr/bin/install -c   libcfa.la libcfathread.la '/var/lib/jenkins/workspace/Cforall_master@tmp/lib/cfa/x86-nodebug/'
23:22:51  /bin/mkdir -p '/var/lib/jenkins/workspace/Cforall_master@tmp/include/cfa/'
23:22:51  /bin/mkdir -p '/var/lib/jenkins/workspace/Cforall_master@tmp/include/cfa//stdhdr/sys'
23:22:51  /usr/bin/install -c -m 644  /var/lib/jenkins/workspace/Cforall_master/libcfa/src/stdhdr/sys/mman.h /var/lib/jenkins/workspace/Cforall_master/libcfa/src/stdhdr/sys/time.h /var/lib/jenkins/workspace/Cforall_master/libcfa/src/stdhdr/sys/socket.h '/var/lib/jenkins/workspace/Cforall_master@tmp/include/cfa//stdhdr/sys'
23:22:51  /bin/mkdir -p '/var/lib/jenkins/workspace/Cforall_master@tmp/include/cfa//containers'
23:22:51  /usr/bin/install -c -m 644  /var/lib/jenkins/workspace/Cforall_master/libcfa/src/containers/maybe.hfa /var/lib/jenkins/workspace/Cforall_master/libcfa/src/containers/pair.hfa /var/lib/jenkins/workspace/Cforall_master/libcfa/src/containers/result.hfa /var/lib/jenkins/workspace/Cforall_master/libcfa/src/containers/string.hfa /var/lib/jenkins/workspace/Cforall_master/libcfa/src/containers/string_res.hfa /var/lib/jenkins/workspace/Cforall_master/libcfa/src/containers/vector.hfa /var/lib/jenkins/workspace/Cforall_master/libcfa/src/containers/array.hfa /var/lib/jenkins/workspace/Cforall_master/libcfa/src/containers/list.hfa /var/lib/jenkins/workspace/Cforall_master/libcfa/src/containers/queueLockFree.hfa /var/lib/jenkins/workspace/Cforall_master/libcfa/src/containers/stackLockFree.hfa /var/lib/jenkins/workspace/Cforall_master/libcfa/src/containers/vector2.hfa '/var/lib/jenkins/workspace/Cforall_master@tmp/include/cfa//containers'
23:22:51  /bin/mkdir -p '/var/lib/jenkins/workspace/Cforall_master@tmp/include/cfa//concurrency/kernel'
23:22:51  /usr/bin/install -c -m 644  /var/lib/jenkins/workspace/Cforall_master/libcfa/src/concurrency/kernel/fwd.hfa '/var/lib/jenkins/workspace/Cforall_master@tmp/include/cfa//concurrency/kernel'
23:22:51  /usr/bin/install -c -m 644  /var/lib/jenkins/workspace/Cforall_master/libcfa/src/common.hfa /var/lib/jenkins/workspace/Cforall_master/libcfa/src/fstream.hfa /var/lib/jenkins/workspace/Cforall_master/libcfa/src/heap.hfa /var/lib/jenkins/workspace/Cforall_master/libcfa/src/iostream.hfa /var/lib/jenkins/workspace/Cforall_master/libcfa/src/iterator.hfa /var/lib/jenkins/workspace/Cforall_master/libcfa/src/limits.hfa /var/lib/jenkins/workspace/Cforall_master/libcfa/src/memory.hfa /var/lib/jenkins/workspace/Cforall_master/libcfa/src/parseargs.hfa /var/lib/jenkins/workspace/Cforall_master/libcfa/src/parseconfig.hfa /var/lib/jenkins/workspace/Cforall_master/libcfa/src/rational.hfa /var/lib/jenkins/workspace/Cforall_master/libcfa/src/stdlib.hfa /var/lib/jenkins/workspace/Cforall_master/libcfa/src/strstream.hfa /var/lib/jenkins/workspace/Cforall_master/libcfa/src/time.hfa /var/lib/jenkins/workspace/Cforall_master/libcfa/src/bitmanip.hfa /var/lib/jenkins/workspace/Cforall_master/libcfa/src/clock.hfa /var/lib/jenkins/workspace/Cforall_master/libcfa/src/exception.hfa /var/lib/jenkins/workspace/Cforall_master/libcfa/src/exception.h /var/lib/jenkins/workspace/Cforall_master/libcfa/src/gmp.hfa /var/lib/jenkins/workspace/Cforall_master/libcfa/src/math.trait.hfa /var/lib/jenkins/workspace/Cforall_master/libcfa/src/math.hfa /var/lib/jenkins/workspace/Cforall_master/libcfa/src/time_t.hfa '/var/lib/jenkins/workspace/Cforall_master@tmp/include/cfa//.'
23:22:51  /bin/mkdir -p '/var/lib/jenkins/workspace/Cforall_master@tmp/include/cfa//concurrency'
23:22:51  /usr/bin/install -c -m 644  /var/lib/jenkins/workspace/Cforall_master/libcfa/src/concurrency/iofwd.hfa /var/lib/jenkins/workspace/Cforall_master/libcfa/src/concurrency/alarm.hfa /var/lib/jenkins/workspace/Cforall_master/libcfa/src/concurrency/coroutine.hfa /var/lib/jenkins/workspace/Cforall_master/libcfa/src/concurrency/exception.hfa /var/lib/jenkins/workspace/Cforall_master/libcfa/src/concurrency/kernel.hfa /var/lib/jenkins/workspace/Cforall_master/libcfa/src/concurrency/locks.hfa /var/lib/jenkins/workspace/Cforall_master/libcfa/src/concurrency/monitor.hfa /var/lib/jenkins/workspace/Cforall_master/libcfa/src/concurrency/mutex.hfa /var/lib/jenkins/workspace/Cforall_master/libcfa/src/concurrency/thread.hfa /var/lib/jenkins/workspace/Cforall_master/libcfa/src/concurrency/invoke.h /var/lib/jenkins/workspace/Cforall_master/libcfa/src/concurrency/future.hfa /var/lib/jenkins/workspace/Cforall_master/libcfa/src/concurrency/mutex_stmt.hfa '/var/lib/jenkins/workspace/Cforall_master@tmp/include/cfa//concurrency'
23:22:51  /bin/mkdir -p '/var/lib/jenkins/workspace/Cforall_master@tmp/include/cfa//concurrency/clib'
23:22:51  /usr/bin/install -c -m 644  /var/lib/jenkins/workspace/Cforall_master/libcfa/src/concurrency/clib/cfathread.h '/var/lib/jenkins/workspace/Cforall_master@tmp/include/cfa//concurrency/clib'
23:22:51  /bin/mkdir -p '/var/lib/jenkins/workspace/Cforall_master@tmp/include/cfa//device'
23:22:51  /usr/bin/install -c -m 644  /var/lib/jenkins/workspace/Cforall_master/libcfa/src/device/cpu.hfa '/var/lib/jenkins/workspace/Cforall_master@tmp/include/cfa//device'
23:22:51  /bin/mkdir -p '/var/lib/jenkins/workspace/Cforall_master@tmp/include/cfa//stdhdr/libltdl'
23:22:51  /usr/bin/install -c -m 644  /var/lib/jenkins/workspace/Cforall_master/libcfa/src/stdhdr/libltdl/lt_dlloader.h '/var/lib/jenkins/workspace/Cforall_master@tmp/include/cfa//stdhdr/libltdl'
23:22:51  /bin/mkdir -p '/var/lib/jenkins/workspace/Cforall_master@tmp/include/cfa//vec'
23:22:51  /usr/bin/install -c -m 644  /var/lib/jenkins/workspace/Cforall_master/libcfa/src/vec/vec.hfa /var/lib/jenkins/workspace/Cforall_master/libcfa/src/vec/vec2.hfa /var/lib/jenkins/workspace/Cforall_master/libcfa/src/vec/vec3.hfa /var/lib/jenkins/workspace/Cforall_master/libcfa/src/vec/vec4.hfa '/var/lib/jenkins/workspace/Cforall_master@tmp/include/cfa//vec'
23:22:51  /bin/mkdir -p '/var/lib/jenkins/workspace/Cforall_master@tmp/include/cfa//bits'
23:22:51 libtool: install: /usr/bin/install -c .libs/libcfa.so.1.0.0 /var/lib/jenkins/workspace/Cforall_master@tmp/lib/cfa/x86-nodebug/libcfa.so.1.0.0
23:22:51  /usr/bin/install -c -m 644  /var/lib/jenkins/workspace/Cforall_master/libcfa/src/bits/weakso_locks.hfa /var/lib/jenkins/workspace/Cforall_master/libcfa/src/bits/algorithm.hfa /var/lib/jenkins/workspace/Cforall_master/libcfa/src/bits/align.hfa /var/lib/jenkins/workspace/Cforall_master/libcfa/src/bits/containers.hfa /var/lib/jenkins/workspace/Cforall_master/libcfa/src/bits/debug.hfa /var/lib/jenkins/workspace/Cforall_master/libcfa/src/bits/defs.hfa /var/lib/jenkins/workspace/Cforall_master/libcfa/src/bits/locks.hfa /var/lib/jenkins/workspace/Cforall_master/libcfa/src/bits/collection.hfa /var/lib/jenkins/workspace/Cforall_master/libcfa/src/bits/stack.hfa /var/lib/jenkins/workspace/Cforall_master/libcfa/src/bits/queue.hfa /var/lib/jenkins/workspace/Cforall_master/libcfa/src/bits/sequence.hfa /var/lib/jenkins/workspace/Cforall_master/libcfa/src/bits/random.hfa '/var/lib/jenkins/workspace/Cforall_master@tmp/include/cfa//bits'
23:22:51 libtool: install: (cd /var/lib/jenkins/workspace/Cforall_master@tmp/lib/cfa/x86-nodebug && { ln -s -f libcfa.so.1.0.0 libcfa.so.1 || { rm -f libcfa.so.1 && ln -s libcfa.so.1.0.0 libcfa.so.1; }; })
23:22:51 libtool: install: (cd /var/lib/jenkins/workspace/Cforall_master@tmp/lib/cfa/x86-nodebug && { ln -s -f libcfa.so.1.0.0 libcfa.so || { rm -f libcfa.so && ln -s libcfa.so.1.0.0 libcfa.so; }; })
23:22:51  /bin/mkdir -p '/var/lib/jenkins/workspace/Cforall_master@tmp/include/cfa//stdhdr'
23:22:51  /usr/bin/install -c -m 644  /var/lib/jenkins/workspace/Cforall_master/libcfa/src/stdhdr/limits.h /var/lib/jenkins/workspace/Cforall_master/libcfa/src/stdhdr/iso646.h /var/lib/jenkins/workspace/Cforall_master/libcfa/src/stdhdr/float.h /var/lib/jenkins/workspace/Cforall_master/libcfa/src/stdhdr/malloc.h /var/lib/jenkins/workspace/Cforall_master/libcfa/src/stdhdr/stdlib.h /var/lib/jenkins/workspace/Cforall_master/libcfa/src/stdhdr/tgmath.h /var/lib/jenkins/workspace/Cforall_master/libcfa/src/stdhdr/errno.h /var/lib/jenkins/workspace/Cforall_master/libcfa/src/stdhdr/stdnoreturn.h /var/lib/jenkins/workspace/Cforall_master/libcfa/src/stdhdr/stdarg.h /var/lib/jenkins/workspace/Cforall_master/libcfa/src/stdhdr/stddef.h /var/lib/jenkins/workspace/Cforall_master/libcfa/src/stdhdr/assert.h /var/lib/jenkins/workspace/Cforall_master/libcfa/src/stdhdr/gmp.h /var/lib/jenkins/workspace/Cforall_master/libcfa/src/stdhdr/ctype.h /var/lib/jenkins/workspace/Cforall_master/libcfa/src/stdhdr/math.h /var/lib/jenkins/workspace/Cforall_master/libcfa/src/stdhdr/stdbool.h /var/lib/jenkins/workspace/Cforall_master/libcfa/src/stdhdr/signal.h /var/lib/jenkins/workspace/Cforall_master/libcfa/src/stdhdr/setjmp.h /var/lib/jenkins/workspace/Cforall_master/libcfa/src/stdhdr/fenv.h /var/lib/jenkins/workspace/Cforall_master/libcfa/src/stdhdr/stdio.h /var/lib/jenkins/workspace/Cforall_master/libcfa/src/stdhdr/unistd.h /var/lib/jenkins/workspace/Cforall_master/libcfa/src/stdhdr/string.h /var/lib/jenkins/workspace/Cforall_master/libcfa/src/stdhdr/locale.h /var/lib/jenkins/workspace/Cforall_master/libcfa/src/stdhdr/wchar.h /var/lib/jenkins/workspace/Cforall_master/libcfa/src/stdhdr/pthread.h /var/lib/jenkins/workspace/Cforall_master/libcfa/src/stdhdr/unwind.h /var/lib/jenkins/workspace/Cforall_master/libcfa/src/stdhdr/wctype.h /var/lib/jenkins/workspace/Cforall_master/libcfa/src/stdhdr/inttypes.h /var/lib/jenkins/workspace/Cforall_master/libcfa/src/stdhdr/stdatomic.h /var/lib/jenkins/workspace/Cforall_master/libcfa/src/stdhdr/complex.h /var/lib/jenkins/workspace/Cforall_master/libcfa/src/stdhdr/threads.h /var/lib/jenkins/workspace/Cforall_master/libcfa/src/stdhdr/stdalign.h /var/lib/jenkins/workspace/Cforall_master/libcfa/src/stdhdr/time.h /var/lib/jenkins/workspace/Cforall_master/libcfa/src/stdhdr/stdint.h /var/lib/jenkins/workspace/Cforall_master/libcfa/src/stdhdr/uchar.h '/var/lib/jenkins/workspace/Cforall_master@tmp/include/cfa//stdhdr'
23:22:51 libtool: install: /usr/bin/install -c .libs/libcfa.lai /var/lib/jenkins/workspace/Cforall_master@tmp/lib/cfa/x86-nodebug/libcfa.la
23:22:51 libtool: install: /usr/bin/install -c .libs/libcfathread.so.1.0.0 /var/lib/jenkins/workspace/Cforall_master@tmp/lib/cfa/x86-nodebug/libcfathread.so.1.0.0
23:22:51 libtool: install: (cd /var/lib/jenkins/workspace/Cforall_master@tmp/lib/cfa/x86-nodebug && { ln -s -f libcfathread.so.1.0.0 libcfathread.so.1 || { rm -f libcfathread.so.1 && ln -s libcfathread.so.1.0.0 libcfathread.so.1; }; })
23:22:51 libtool: install: (cd /var/lib/jenkins/workspace/Cforall_master@tmp/lib/cfa/x86-nodebug && { ln -s -f libcfathread.so.1.0.0 libcfathread.so || { rm -f libcfathread.so && ln -s libcfathread.so.1.0.0 libcfathread.so; }; })
23:22:51 libtool: install: /usr/bin/install -c .libs/libcfathread.lai /var/lib/jenkins/workspace/Cforall_master@tmp/lib/cfa/x86-nodebug/libcfathread.la
23:22:51 libtool: warning: remember to run 'libtool --finish /var/lib/jenkins/workspace/Cforall_master@tmp/lib/cfa/x86-nodebug/'
23:22:51 make[3]: Nothing to be done for 'install-exec-am'.
23:22:51 make[3]: Nothing to be done for 'install-data-am'.
23:22:51 [Pipeline] }
23:22:51 [Pipeline] // dir
23:22:51 [Pipeline] }
23:22:51 [Pipeline] // stage
23:22:51 [Pipeline] sh
23:22:51 + free -h
23:22:51               total        used        free      shared  buff/cache   available
23:22:51 Mem:            15G        145M         12G        9.0M        2.6G         14G
23:22:51 Swap:          975M          0B        975M
23:22:51 [Pipeline] sh
23:22:51 + ulimit -a
23:22:51 time(seconds)        unlimited
23:22:51 file(blocks)         unlimited
23:22:51 data(kbytes)         unlimited
23:22:51 stack(kbytes)        8192
23:22:51 coredump(blocks)     0
23:22:51 memory(kbytes)       unlimited
23:22:51 locked memory(kbytes) 64
23:22:51 process              128880
23:22:51 nofiles              1048576
23:22:51 vmemory(kbytes)      unlimited
23:22:51 locks                unlimited
23:22:51 rtprio               0
23:22:51 [Pipeline] echo
23:22:51  -------- Test: short -------- 
23:22:51 [Pipeline] stage
23:22:51 [Pipeline] { (Test: short)
23:22:51 [Pipeline] }
23:22:51 [Pipeline] // stage
23:22:51 [Pipeline] echo
23:22:51  -------- Test: full -------- 
23:22:51 [Pipeline] stage
23:22:51 [Pipeline] { (Test: full)
23:22:51 [Pipeline] dir
23:22:51 Running in /var/lib/jenkins/workspace/Cforall_master@tmp
23:22:51 [Pipeline] {
23:22:51 [Pipeline] sh
23:22:51 + make --no-print-directory -C tests timeouts=--timeout=600 --global-timeout=14400 all-tests debug=yes archiveerrors=/var/lib/jenkins/workspace/Cforall_master@tmp/tests/crashes/full-debug
23:22:51 Running 220 tests on 6 cores (Default AST (new):x86 - debug)
23:22:51        	array-container/language-dim-mismatch      PASSED     C 0:00.134 - R n/a
23:22:51        	array                                      PASSED     C 0:01.767 - R 0:00.017
23:22:51        	builtins/sync                              PASSED     C 0:02.117 - R 0:00.029
23:22:51        	array-container/array-basic                PASSED     C 0:04.530 - R 0:00.033
23:22:51        	castError                                  PASSED     C 0:00.947 - R n/a
23:22:51        	avl_test                                   PASSED     C 0:05.683 - R 0:00.017
23:22:51        	cast                                       PASSED     C 0:01.713 - R 0:00.002
23:22:51        	alloc-ERROR                                PASSED     C 0:09.746 - R n/a
23:22:51        	alloc                                      PASSED     C 0:15.560 - R 0:00.017
23:22:51        	collections/multi_list                     PASSED     C 0:12.831 - R 0:00.016
23:22:51        	alloc2                                     PASSED     C 0:18.985 - R 0:00.033
23:22:51        	collections/vector-demo                    PASSED     C 0:05.069 - R 0:00.016
23:22:51        	collections/queue                          PASSED     C 0:21.664 - R 0:00.038
23:22:51        	collections/vector-err-pass-perm-it-byval  PASSED     C 0:03.463 - R n/a
23:22:51        	collections/vector-err-retn-perm-it-byval  PASSED     C 0:02.557 - R n/a
23:22:51        	collections/stack                          PASSED     C 0:15.364 - R 0:00.042
23:22:51        	collections/sequence                       PASSED     C 0:22.937 - R 0:00.075
23:22:51        	collections/string-api-coverage            PASSED     C 0:16.588 - R 0:00.034
23:22:51        	collections/atomic_mpsc                    PASSED     C 0:17.666 - R 0:14.143
23:22:51        	concurrent/clib                            PASSED     C 0:07.062 - R 0:00.421
23:22:51        	concurrent/clib_tls                        PASSED     C 0:07.039 - R 0:00.115
23:22:51        	complex                                    PASSED     C 0:11.062 - R 0:00.017
23:22:51        	concurrent/cluster                         PASSED     C 0:14.187 - R 0:00.115
23:22:51        	concurrent/coroutineYield                  PASSED     C 0:18.404 - R 0:00.065
23:22:51        	concurrent/examples/datingService          PASSED     C 0:17.660 - R 0:00.073
23:22:51        	concurrent/examples/gortn                  PASSED     C 0:18.849 - R 0:00.073
23:22:51        	concurrent/examples/matrixSum              PASSED     C 0:18.961 - R 0:00.133
23:22:51        	concurrent/futures/abandon                 PASSED     C 0:15.741 - R 0:00.315
23:22:51        	concurrent/examples/boundedBufferEXT       PASSED     C 0:19.049 - R 0:17.152
23:22:51        	concurrent/examples/boundedBufferINT       PASSED     C 0:17.858 - R 0:18.353
23:22:51        	concurrent/futures/basic                   PASSED     C 0:16.240 - R 0:00.165
23:22:51        	concurrent/keywordErrors                   PASSED     C 0:00.298 - R n/a
23:22:51        	concurrent/examples/quickSort              PASSED     C 0:21.071 - R 0:00.033
23:22:51        	concurrent/futures/multi                   PASSED     C 0:18.314 - R 0:00.065
23:22:51        	concurrent/futures/typed                   PASSED     C 0:14.080 - R 0:00.265
23:22:51        	concurrent/join                            PASSED     C 0:17.897 - R 0:00.074
23:22:51        	concurrent/park/contention                 PASSED     C 0:22.757 - R 0:01.077
23:22:51        	concurrent/mutexstmt/monitors              PASSED     C 0:20.863 - R 0:13.425
23:22:51        	concurrent/mutexstmt/locks                 PASSED     C 0:16.669 - R 0:32.982
23:22:51        	concurrent/park/force_preempt              PASSED     C 0:36.819 - R 0:00.325
23:22:51        	concurrent/park/start_parked               PASSED     C 0:22.532 - R 0:00.122
23:22:51        	concurrent/semaphore                       PASSED     C 0:24.541 - R 0:00.085
23:22:51        	concurrent/preempt                         PASSED     C 0:17.868 - R 0:16.853
23:22:51        	concurrent/monitor                         PASSED     C 0:17.108 - R 1:04.528
23:22:51        	concurrent/signal/block                    PASSED     C 0:23.490 - R 0:04.173
23:22:51        	concurrent/multi-monitor                   PASSED     C 0:17.278 - R 1:08.020
23:22:51        	concurrent/signal/disjoint                 PASSED     C 0:24.286 - R 0:05.690
23:22:51        	concurrent/signal/wait                     PASSED     C 0:20.131 - R 0:00.616
23:22:51        	concurrent/sleep                           PASSED     C 0:18.697 - R 0:01.168
23:22:51        	concurrent/suspend_then                    PASSED     C 0:18.605 - R 0:00.115
23:22:51        	concurrent/spinaphore                      PASSED     C 0:20.436 - R 0:01.017
23:22:51        	concurrent/thread                          PASSED     C 0:20.017 - R 0:00.065
23:22:51        	concurrent/waitfor/barge                   PASSED     C 0:17.674 - R 0:00.566
23:22:51        	const-init                                 PASSED     C 0:01.077 - R 0:00.033
23:22:51        	concurrent/waitfor/else                    PASSED     C 0:14.974 - R 0:00.076
23:22:51        	concurrent/waitfor/dtor                    PASSED     C 0:17.057 - R 0:03.178
23:22:51        	copyfile                                   PASSED     C 0:10.322 - R 0:00.038
23:22:51        	concurrent/waitfor/recurse                 PASSED     C 0:18.888 - R 0:02.470
23:22:51        	concurrent/waitfor/statment                PASSED     C 0:20.436 - R 0:00.115
23:22:51        	concurrent/waitfor/when                    PASSED     C 0:19.193 - R 0:00.315
23:22:51        	coroutine/devicedriver                     PASSED     C 0:12.437 - R 0:00.032
23:22:51        	coroutine/fibonacci                        PASSED     C 0:11.803 - R 0:00.033
23:22:51        	coroutine/fmtLines                         PASSED     C 0:11.815 - R 0:00.033
23:22:51        	designations                               PASSED     C 0:01.333 - R 0:00.033
23:22:51        	coroutine/pingpong                         PASSED     C 0:11.775 - R 0:00.041
23:22:51        	coroutine/raii                             PASSED     C 0:11.823 - R 0:00.033
23:22:51        	counter                                    PASSED     C 0:09.552 - R 0:00.017
23:22:51        	errors/declaration                         PASSED     C 0:00.109 - R n/a
23:22:51        	enum                                       PASSED     C 0:01.124 - R 0:00.016
23:22:51        	errors/scope                               PASSED     C 0:00.197 - R n/a
23:22:51        	coroutine/prodcons                         PASSED     C 0:14.407 - R 0:00.034
23:22:51        	errors/signature                           PASSED     C 0:00.104 - R n/a
23:22:51        	coroutine/runningTotal                     PASSED     C 0:11.809 - R 0:00.033
23:22:51        	exceptions/conditional                     PASSED     C 0:01.225 - R 0:00.033
23:22:51        	exceptions/data-except                     PASSED     C 0:01.231 - R 0:00.033
23:22:51        	exceptions/defaults                        PASSED     C 0:01.928 - R 0:00.017
23:22:51        	device/cpu                                 PASSED     C 0:14.013 - R 0:00.033
23:22:51        	exceptions/cancel/coroutine                PASSED     C 0:08.028 - R 0:00.033
23:22:51        	exceptions/finally-error                   PASSED     C 0:00.282 - R n/a
23:22:51        	div                                        PASSED     C 0:12.080 - R 0:00.016
23:22:51        	exceptions/conditional-threads             PASSED     C 0:07.954 - R 0:00.034
23:22:51        	exceptions/finally                         PASSED     C 0:01.265 - R 0:00.017
23:22:51        	exceptions/interact                        PASSED     C 0:01.501 - R 0:00.017
23:22:51        	exceptions/polymorphic                     PASSED     C 0:01.661 - R 0:00.033
23:22:51        	exceptions/resume                          PASSED     C 0:01.611 - R 0:00.016
23:22:51        	exceptions/terminate                       PASSED     C 0:01.635 - R 0:00.033
23:22:51        	exceptions/cancel/thread                   PASSED     C 0:12.848 - R 0:00.033
23:22:51        	exceptions/type-check                      PASSED     C 0:00.293 - R n/a
23:22:51        	exceptions/defaults-threads                PASSED     C 0:08.839 - R 0:00.033
23:22:51        	exceptions/trash                           PASSED     C 0:01.354 - R 0:00.016
23:22:51        	expression                                 PASSED     C 0:01.061 - R 0:00.007
23:22:51        	exceptions/virtual-poly                    PASSED     C 0:01.400 - R 0:00.033
23:22:51        	exceptions/virtual-cast                    PASSED     C 0:02.853 - R 0:00.017
23:22:51        	exceptions/finally-threads                 PASSED     C 0:08.094 - R 0:00.042
23:22:51        	forall                                     PASSED     C 0:01.935 - R 0:00.002
23:22:51        	exceptions/resume-threads                  PASSED     C 0:08.425 - R 0:00.037
23:22:51        	exceptions/terminate-threads               PASSED     C 0:08.485 - R 0:00.033
23:22:51        	fallthrough                                PASSED     C 0:09.783 - R 0:00.022
23:22:51        	genericUnion                               PASSED     C 0:01.216 - R 0:00.033
23:22:51        	fstream_test                               PASSED     C 0:09.989 - R 0:00.017
23:22:51        	generator/fibonacci                        PASSED     C 0:09.476 - R 0:00.033
23:22:51        	global-monomorph                           PASSED     C 0:01.121 - R 0:00.033
23:22:51        	identFuncDeclarator                        PASSED     C 0:01.020 - R 0:00.002
23:22:51        	generator/fmtLines                         PASSED     C 0:09.659 - R 0:00.033
23:22:51        	generator/suspend_then                     PASSED     C 0:09.543 - R 0:00.033
23:22:51        	function-operator                          PASSED     C 0:12.601 - R 0:00.033
23:22:51        	identParamDeclarator                       PASSED     C 0:01.130 - R 0:00.016
23:22:51        	hello                                      PASSED     C 0:09.596 - R 0:00.016
23:22:51        	identity                                   PASSED     C 0:10.158 - R 0:00.033
23:22:51        	ifwhileCtl                                 PASSED     C 0:09.753 - R 0:00.017
23:22:51        	include/stdincludes                        PASSED     C 0:11.596 - R 0:00.010
23:22:51        	include/vector-sequence                    PASSED     C 0:02.262 - R 0:00.070
23:22:51        	include/vector-containers                  PASSED     C 0:05.827 - R 0:00.037
23:22:51        	init1-ERROR                                PASSED     C 0:01.041 - R n/a
23:22:51        	init1                                      PASSED     C 0:01.901 - R 0:00.019
23:22:51        	include/vector-fstream                     PASSED     C 0:13.218 - R 0:00.038
23:22:51        	io/manipulatorsOutput4                     PASSED     C 0:21.735 - R 0:00.032
23:22:51        	labelledExit                               PASSED     C 0:01.098 - R 0:00.002
23:22:51        	limits                                     PASSED     C 0:01.188 - R 0:00.002
23:22:51        	io/io-acquire                              PASSED     C 0:27.256 - R 0:00.120
23:22:51        	linking/exception-nothreads                PASSED     C 0:03.450 - R 0:00.033
23:22:51        	include/includes                           PASSED     C 0:43.543 - R 0:00.002
23:22:51        	linking/nostdlib                           PASSED     C 0:01.947 - R 0:00.049
23:22:51        	io/many_read                               PASSED     C 0:28.149 - R 0:00.135
23:22:51        	io/io                                      PASSED     C 0:38.425 - R 0:00.081
23:22:51        	linking/exception-withthreads              PASSED     C 0:12.626 - R 0:00.120
23:22:51        	linkonce                                   PASSED     C 0:02.628 - R 0:00.038
23:22:51        	linking/io-acquire                         PASSED     C 0:18.183 - R 0:00.069
23:22:51        	linking/nothreads                          PASSED     C 0:15.888 - R 0:00.017
23:22:51        	heap                                       PASSED     C 0:14.355 - R 0:51.280
23:22:51        	linking/weakso_nothd                       PASSED     C 0:13.785 - R 0:00.017
23:22:51        	maybe                                      PASSED     C 0:01.409 - R 0:00.017
23:22:51        	literals                                   PASSED     C 0:10.730 - R 0:00.016
23:22:51        	linking/withthreads                        PASSED     C 0:20.176 - R 0:00.033
23:22:51        	nested-types-ERR1                          PASSED     C 0:00.114 - R n/a
23:22:51        	nested-types                               PASSED     C 0:01.096 - R 0:00.002
23:22:51        	nested-types-ERR2                          PASSED     C 0:00.133 - R n/a
23:22:51        	numericConstants                           PASSED     C 0:01.017 - R 0:00.006
23:22:51        	operators                                  PASSED     C 0:01.106 - R 0:00.017
23:22:51        	poly-d-cycle                               PASSED     C 0:01.115 - R 0:00.016
23:22:51        	malloc                                     PASSED     C 0:12.550 - R 0:00.033
23:22:51        	poly-o-cycle                               PASSED     C 0:01.179 - R 0:00.017
23:22:51        	loopctrl                                   PASSED     C 0:14.153 - R 0:00.016
23:22:51        	poly-selection                             PASSED     C 0:01.089 - R 0:00.033
23:22:51        	quasiKeyword                               PASSED     C 0:01.126 - R 0:00.002
23:22:51        	list/dlist-insert-remove                   PASSED     C 0:21.649 - R 0:00.033
23:22:51        	raii/ctor-autogen                          PASSED     C 0:01.897 - R 0:00.033
23:22:51        	raii/ctor-autogen-ERR1                     PASSED     C 0:00.661 - R n/a
23:22:51        	minmax                                     PASSED     C 0:15.805 - R 0:00.033
23:22:51        	polymorphism                               PASSED     C 0:09.973 - R 0:00.017
23:22:51        	quotedKeyword                              PASSED     C 0:09.508 - R 0:00.017
23:22:51        	parseconfig                                PASSED     C 0:13.362 - R 0:00.033
23:22:51        	raii/boxed-types                           PASSED     C 0:09.767 - R 0:00.017
23:22:51        	raii/init_once                             PASSED     C 0:01.337 - R 0:00.016
23:22:51        	raii/memberCtors                           PASSED     C 0:01.240 - R 0:00.017
23:22:51        	raii/memberCtors-ERR1                      PASSED     C 0:00.733 - R n/a
23:22:51        	raii/dtor-early-exit-ERR1                  PASSED     C 0:08.058 - R n/a
23:22:51        	result                                     PASSED     C 0:01.722 - R 0:00.016
23:22:51        	raii/dtor-early-exit-ERR2                  PASSED     C 0:07.962 - R n/a
23:22:51        	raii/dtor-early-exit                       PASSED     C 0:12.667 - R 0:00.033
23:22:51        	simpleGenericTriple                        PASSED     C 0:01.353 - R 0:00.033
23:22:51        	raii/globals                               PASSED     C 0:09.921 - R 0:00.033
23:22:51        	smart-pointers                             PASSED     C 0:01.390 - R 0:00.033
23:22:51        	references                                 PASSED     C 0:11.186 - R 0:00.020
23:22:51        	shortCircuit                               PASSED     C 0:09.534 - R 0:00.017
23:22:51        	switch                                     PASSED     C 0:01.002 - R 0:00.005
23:22:51        	strstream                                  PASSED     C 0:10.217 - R 0:00.016
23:22:51        	searchsort                                 PASSED     C 0:15.464 - R 0:00.033
23:22:51        	tuple/tupleCast                            PASSED     C 0:01.058 - R 0:00.033
23:22:51        	tuple/tupleFunction                        PASSED     C 0:01.213 - R 0:00.017
23:22:51        	sum                                        PASSED     C 0:14.001 - R 0:00.017
23:22:51        	tuple/tupleMember                          PASSED     C 0:01.210 - R 0:00.017
23:22:51        	tuple/tuplePolymorphism                    PASSED     C 0:01.463 - R 0:00.017
23:22:51        	typedefRedef                               PASSED     C 0:01.011 - R 0:00.003
23:22:51        	typedefRedef-ERR1                          PASSED     C 0:00.116 - R n/a
23:22:51        	tuple/tupleVariadic                        PASSED     C 0:02.945 - R 0:00.016
23:22:51        	typeof                                     PASSED     C 0:01.079 - R 0:00.032
23:22:51        	swap                                       PASSED     C 0:15.157 - R 0:00.033
23:22:51        	time                                       PASSED     C 0:13.237 - R 0:00.017
23:22:51        	tuple/tupleAssign                          PASSED     C 0:12.358 - R 0:00.033
23:22:51        	rational                                   PASSED     C 0:31.739 - R 0:00.033
23:22:51        	userLiterals                               PASSED     C 0:10.737 - R 0:00.033
23:22:51        	variableDeclarator                         PASSED     C 0:01.049 - R 0:00.004
23:22:51        	unified_locking/fast                       PASSED     C 0:19.750 - R 0:00.115
23:22:51        	unified_locking/lin_backoff                PASSED     C 0:19.723 - R 0:00.185
23:22:51        	unified_locking/timeout_lock               PASSED     C 0:16.264 - R 0:01.272
23:22:51        	vector                                     PASSED     C 0:17.691 - R 0:00.075
23:22:51        	vector_math/vec2_double                    PASSED     C 0:16.824 - R 0:00.033
23:22:51        	unified_locking/mcs                        PASSED     C 0:19.694 - R 0:23.847
23:22:51        	vector_math/vec2_float                     PASSED     C 0:28.795 - R 0:00.033
23:22:51        	vector_math/vec2_uint                      PASSED     C 0:16.265 - R 0:00.053
23:22:51        	vector_math/vec2_int                       PASSED     C 0:29.997 - R 0:00.071
23:22:51        	voidPtr                                    PASSED     C 0:01.247 - R 0:00.016
23:22:51        	warnings/self-assignment                   PASSED     C 0:01.245 - R 0:00.014
23:22:51        	KRfunctions                                PASSED     C 0:01.133 - R 0:00.012
23:22:51        	vector_math/vec3_float                     PASSED     C 0:27.849 - R 0:00.033
23:22:51        	vector_math/vec3_int                       PASSED     C 0:22.373 - R 0:00.033
23:22:51        	abs                                        PASSED     C 0:14.887 - R 0:00.037
23:22:51        	attributes                                 PASSED     C 0:01.417 - R 0:00.016
23:22:51        	vector_math/vec4_float                     PASSED     C 0:25.003 - R 0:00.033
23:22:51        	vector_math/vec4_int                       PASSED     C 0:22.435 - R 0:00.033
23:22:51        	array-container/array-md-sbscr-cases       PASSED     C 0:13.088 - R 0:00.033
23:22:51        	declarationSpecifier                       PASSED     C 0:01.230 - R 0:00.017
23:22:51        	errors/completeType                        PASSED     C 0:00.584 - R n/a
23:22:51        	extension                                  PASSED     C 0:01.000 - R 0:00.021
23:22:51        	functions                                  PASSED     C 0:01.017 - R 0:00.026
23:22:51        	ato                                        PASSED     C 0:13.709 - R 0:00.033
23:22:51        	gccExtensions                              PASSED     C 0:01.305 - R 0:00.002
23:22:51        	bitmanip1                                  PASSED     C 0:22.740 - R 0:00.041
23:22:51        	io/manipulatorsInput                       PASSED     C 0:15.228 - R 0:00.086
23:22:51        	bitmanip2                                  PASSED     C 0:25.328 - R 0:00.082
23:22:51        	unified_locking/locks                      PASSED     C 0:17.412 - R 1:21.796
23:22:51        	meta/archVast                              PASSED     C 0:00.559 - R n/a
23:22:51        	io/manipulatorsOutput1                     PASSED     C 0:24.607 - R 0:00.033
23:22:51        	random                                     PASSED     C 0:11.745 - R 0:00.033
23:22:51        	io/manipulatorsOutput2                     PASSED     C 0:17.746 - R 0:00.032
23:22:51        	bitmanip3                                  PASSED     C 0:40.753 - R 0:00.033
23:22:51        	vector_math/vec2_ldouble                   PASSED     C 0:11.179 - R 0:00.032
23:22:51        	math                                       PASSED     C 0:24.208 - R 0:00.034
23:22:51        	mathX                                      PASSED     C 0:37.391 - R 0:00.034
23:22:51 Tests took  8:12.773
23:22:51 [Pipeline] sh
23:22:51 + make --no-print-directory -C tests timeouts=--timeout=600 --global-timeout=14400 all-tests debug=no archiveerrors=/var/lib/jenkins/workspace/Cforall_master@tmp/tests/crashes/full-nodebug
23:22:51 Running 220 tests on 6 cores (Default AST (new):x86 - no debug)
23:22:51        	array-container/language-dim-mismatch      PASSED     C 0:00.135 - R n/a
23:22:51        	array                                      PASSED     C 0:01.588 - R 0:00.020
23:22:51        	builtins/sync                              PASSED     C 0:02.221 - R 0:00.002
23:22:51        	array-container/array-basic                PASSED     C 0:05.259 - R 0:00.023
23:22:51        	cast                                       PASSED     C 0:01.520 - R 0:00.002
23:22:51        	castError                                  PASSED     C 0:00.798 - R n/a
23:22:51        	avl_test                                   PASSED     C 0:06.612 - R 0:00.004
23:22:51        	alloc-ERROR                                PASSED     C 0:10.011 - R n/a
23:22:51        	collections/multi_list                     PASSED     C 0:14.856 - R 0:00.004
23:22:51        	alloc                                      PASSED     C 0:26.179 - R 0:00.032
23:22:51        	collections/atomic_mpsc                    PASSED     C 0:19.617 - R 0:02.219
23:22:51        	collections/queue                          PASSED     C 0:24.159 - R 0:00.004
23:22:51        	collections/vector-demo                    PASSED     C 0:05.697 - R 0:00.004
23:22:51        	collections/vector-err-pass-perm-it-byval  PASSED     C 0:02.685 - R n/a
23:22:51        	collections/sequence                       PASSED     C 0:25.070 - R 0:00.005
23:22:51        	collections/vector-err-retn-perm-it-byval  PASSED     C 0:02.164 - R n/a
23:22:51        	collections/stack                          PASSED     C 0:16.757 - R 0:00.010
23:22:51        	concurrent/clib                            PASSED     C 0:06.650 - R 0:00.065
23:22:51        	concurrent/clib_tls                        PASSED     C 0:06.618 - R 0:00.009
23:22:51        	collections/string-api-coverage            PASSED     C 0:16.957 - R 0:00.004
23:22:51        	complex                                    PASSED     C 0:09.752 - R 0:00.004
23:22:51        	alloc2                                     PASSED     C 0:44.196 - R 0:00.004
23:22:51        	concurrent/cluster                         PASSED     C 0:12.777 - R 0:00.009
23:22:51        	concurrent/examples/datingService          PASSED     C 0:17.859 - R 0:00.008
23:22:51        	concurrent/coroutineYield                  PASSED     C 0:20.237 - R 0:00.072
23:22:51        	concurrent/examples/boundedBufferEXT       PASSED     C 0:19.128 - R 0:02.470
23:22:51        	concurrent/examples/boundedBufferINT       PASSED     C 0:18.130 - R 0:02.531
23:22:51        	concurrent/examples/gortn                  PASSED     C 0:20.245 - R 0:00.004
23:22:51        	concurrent/examples/matrixSum              PASSED     C 0:19.346 - R 0:00.008
23:22:51        	concurrent/futures/abandon                 PASSED     C 0:13.872 - R 0:00.065
23:22:51        	concurrent/keywordErrors                   PASSED     C 0:00.289 - R n/a
23:22:51        	concurrent/futures/basic                   PASSED     C 0:13.561 - R 0:00.033
23:22:51        	concurrent/futures/typed                   PASSED     C 0:14.081 - R 0:00.065
23:22:51        	concurrent/futures/multi                   PASSED     C 0:17.454 - R 0:00.017
23:22:51        	concurrent/examples/quickSort              PASSED     C 0:21.252 - R 0:00.004
23:22:51        	concurrent/join                            PASSED     C 0:19.421 - R 0:00.008
23:22:51        	concurrent/park/contention                 PASSED     C 0:13.833 - R 0:00.129
23:22:51        	concurrent/mutexstmt/monitors              PASSED     C 0:14.253 - R 0:01.230
23:22:51        	concurrent/mutexstmt/locks                 PASSED     C 0:16.695 - R 0:01.832
23:22:51        	concurrent/monitor                         PASSED     C 0:19.003 - R 0:05.104
23:22:51        	concurrent/multi-monitor                   PASSED     C 0:19.910 - R 0:05.692
23:22:51        	concurrent/park/force_preempt              PASSED     C 0:19.719 - R 0:00.265
23:22:51        	concurrent/park/start_parked               PASSED     C 0:13.834 - R 0:00.008
23:22:51        	concurrent/semaphore                       PASSED     C 0:22.750 - R 0:00.008
23:22:51        	concurrent/signal/block                    PASSED     C 0:23.320 - R 0:00.772
23:22:51        	concurrent/preempt                         PASSED     C 0:14.329 - R 0:14.144
23:22:51        	concurrent/signal/disjoint                 PASSED     C 0:23.668 - R 0:00.766
23:22:51        	concurrent/signal/wait                     PASSED     C 0:22.157 - R 0:00.115
23:22:51        	concurrent/sleep                           PASSED     C 0:22.405 - R 0:01.117
23:22:51        	concurrent/spinaphore                      PASSED     C 0:22.808 - R 0:00.165
23:22:51        	concurrent/suspend_then                    PASSED     C 0:20.758 - R 0:00.068
23:22:51        	concurrent/thread                          PASSED     C 0:21.264 - R 0:00.004
23:22:51        	concurrent/waitfor/barge                   PASSED     C 0:19.260 - R 0:00.115
23:22:51        	const-init                                 PASSED     C 0:01.086 - R 0:00.005
23:22:51        	concurrent/waitfor/else                    PASSED     C 0:17.065 - R 0:00.004
23:22:51        	concurrent/waitfor/dtor                    PASSED     C 0:19.345 - R 0:00.365
23:22:51        	copyfile                                   PASSED     C 0:10.111 - R 0:00.005
23:22:51        	coroutine/devicedriver                     PASSED     C 0:11.961 - R 0:00.004
23:22:51        	coroutine/fibonacci                        PASSED     C 0:11.685 - R 0:00.004
23:22:51        	concurrent/waitfor/recurse                 PASSED     C 0:20.707 - R 0:00.369
23:22:51        	concurrent/waitfor/when                    PASSED     C 0:21.186 - R 0:00.065
23:22:51        	concurrent/waitfor/statment                PASSED     C 0:22.627 - R 0:00.016
23:22:51        	coroutine/fmtLines                         PASSED     C 0:11.829 - R 0:00.009
23:22:51        	designations                               PASSED     C 0:01.343 - R 0:00.004
23:22:51        	coroutine/pingpong                         PASSED     C 0:11.601 - R 0:00.004
23:22:51        	coroutine/raii                             PASSED     C 0:11.726 - R 0:00.004
23:22:51        	enum                                       PASSED     C 0:01.101 - R 0:00.004
23:22:51        	errors/declaration                         PASSED     C 0:00.100 - R n/a
23:22:51        	errors/scope                               PASSED     C 0:00.197 - R n/a
23:22:51        	errors/signature                           PASSED     C 0:00.120 - R n/a
23:22:51        	counter                                    PASSED     C 0:09.549 - R 0:00.004
23:22:51        	coroutine/runningTotal                     PASSED     C 0:11.588 - R 0:00.008
23:22:51        	coroutine/prodcons                         PASSED     C 0:16.751 - R 0:00.004
23:22:51        	exceptions/conditional                     PASSED     C 0:01.219 - R 0:00.004
23:22:51        	exceptions/data-except                     PASSED     C 0:01.256 - R 0:00.004
23:22:51        	exceptions/defaults                        PASSED     C 0:02.315 - R 0:00.004
23:22:51        	exceptions/cancel/coroutine                PASSED     C 0:07.820 - R 0:00.012
23:22:51        	exceptions/finally                         PASSED     C 0:01.333 - R 0:00.005
23:22:51        	exceptions/finally-error                   PASSED     C 0:00.292 - R n/a
23:22:51        	exceptions/conditional-threads             PASSED     C 0:07.975 - R 0:00.008
23:22:51        	device/cpu                                 PASSED     C 0:17.456 - R 0:00.004
23:22:51        	div                                        PASSED     C 0:14.296 - R 0:00.004
23:22:51        	exceptions/interact                        PASSED     C 0:01.637 - R 0:00.004
23:22:51        	exceptions/polymorphic                     PASSED     C 0:01.796 - R 0:00.004
23:22:51        	exceptions/resume                          PASSED     C 0:01.719 - R 0:00.004
23:22:51        	exceptions/cancel/thread                   PASSED     C 0:13.046 - R 0:00.004
23:22:51        	exceptions/terminate                       PASSED     C 0:01.835 - R 0:00.004
23:22:51        	exceptions/trash                           PASSED     C 0:01.365 - R 0:00.004
23:22:51        	exceptions/type-check                      PASSED     C 0:00.288 - R n/a
23:22:51        	exceptions/defaults-threads                PASSED     C 0:09.165 - R 0:00.005
23:22:51        	exceptions/virtual-poly                    PASSED     C 0:01.405 - R 0:00.004
23:22:51        	expression                                 PASSED     C 0:01.093 - R 0:00.002
23:22:51        	exceptions/finally-threads                 PASSED     C 0:08.027 - R 0:00.004
23:22:51        	exceptions/virtual-cast                    PASSED     C 0:03.060 - R 0:00.005
23:22:51        	forall                                     PASSED     C 0:01.926 - R 0:00.002
23:22:51        	exceptions/resume-threads                  PASSED     C 0:08.373 - R 0:00.008
23:22:51        	exceptions/terminate-threads               PASSED     C 0:08.490 - R 0:00.004
23:22:51        	fallthrough                                PASSED     C 0:09.888 - R 0:00.004
23:22:51        	fstream_test                               PASSED     C 0:10.001 - R 0:00.004
23:22:51        	genericUnion                               PASSED     C 0:01.240 - R 0:00.007
23:22:51        	generator/fibonacci                        PASSED     C 0:09.411 - R 0:00.004
23:22:51        	global-monomorph                           PASSED     C 0:01.107 - R 0:00.004
23:22:51        	identFuncDeclarator                        PASSED     C 0:01.040 - R 0:00.002
23:22:51        	generator/fmtLines                         PASSED     C 0:09.725 - R 0:00.004
23:22:51        	identParamDeclarator                       PASSED     C 0:01.086 - R 0:00.007
23:22:51        	generator/suspend_then                     PASSED     C 0:09.692 - R 0:00.004
23:22:51        	function-operator                          PASSED     C 0:15.405 - R 0:00.004
23:22:51        	hello                                      PASSED     C 0:09.739 - R 0:00.004
23:22:51        	ifwhileCtl                                 PASSED     C 0:09.671 - R 0:00.004
23:22:51        	identity                                   PASSED     C 0:10.381 - R 0:00.005
23:22:51        	include/vector-sequence                    PASSED     C 0:01.879 - R 0:00.022
23:22:51        	init1                                      PASSED     C 0:01.437 - R 0:00.010
23:22:51        	include/vector-containers                  PASSED     C 0:06.665 - R 0:00.017
23:22:51        	init1-ERROR                                PASSED     C 0:00.974 - R n/a
23:22:51        	include/stdincludes                        PASSED     C 0:14.791 - R 0:00.002
23:22:51        	include/vector-fstream                     PASSED     C 0:12.365 - R 0:00.017
23:22:51        	heap                                       PASSED     C 0:14.898 - R 0:20.908
23:22:51        	labelledExit                               PASSED     C 0:01.037 - R 0:00.002
23:22:51        	limits                                     PASSED     C 0:01.112 - R 0:00.002
23:22:51        	linking/exception-nothreads                PASSED     C 0:03.017 - R 0:00.004
23:22:51        	include/includes                           PASSED     C 0:41.885 - R 0:00.001
23:22:51        	io/many_read                               PASSED     C 0:22.326 - R 0:00.004
23:22:51        	linking/nostdlib                           PASSED     C 0:01.019 - R 0:00.004
23:22:51        	io/io                                      PASSED     C 0:32.541 - R 0:00.004
23:22:51        	linking/exception-withthreads              PASSED     C 0:09.180 - R 0:00.004
23:22:51        	io/manipulatorsOutput4                     PASSED     C 0:30.974 - R 0:00.016
23:22:51        	linkonce                                   PASSED     C 0:01.197 - R 0:00.004
23:22:51        	linking/io-acquire                         PASSED     C 0:13.700 - R 0:00.004
23:22:51        	linking/weakso_nothd                       PASSED     C 0:11.208 - R 0:00.004
23:22:51        	linking/nothreads                          PASSED     C 0:12.616 - R 0:00.004
23:22:51        	literals                                   PASSED     C 0:09.162 - R 0:00.004
23:22:51        	linking/withthreads                        PASSED     C 0:18.419 - R 0:00.004
23:22:51        	maybe                                      PASSED     C 0:01.509 - R 0:00.004
23:22:51        	nested-types                               PASSED     C 0:00.987 - R 0:00.001
23:22:51        	list/dlist-insert-remove                   PASSED     C 0:18.300 - R 0:00.008
23:22:51        	nested-types-ERR1                          PASSED     C 0:00.109 - R n/a
23:22:51        	nested-types-ERR2                          PASSED     C 0:00.127 - R n/a
23:22:51        	numericConstants                           PASSED     C 0:00.983 - R 0:00.002
23:22:51        	operators                                  PASSED     C 0:01.088 - R 0:00.004
23:22:51        	poly-d-cycle                               PASSED     C 0:01.081 - R 0:00.004
23:22:51        	malloc                                     PASSED     C 0:12.909 - R 0:00.004
23:22:51        	poly-o-cycle                               PASSED     C 0:01.086 - R 0:00.004
23:22:51        	loopctrl                                   PASSED     C 0:13.978 - R 0:00.004
23:22:51        	poly-selection                             PASSED     C 0:01.026 - R 0:00.004
23:22:51        	quasiKeyword                               PASSED     C 0:01.082 - R 0:00.001
23:22:51        	quotedKeyword                              PASSED     C 0:08.661 - R 0:00.005
23:22:51        	polymorphism                               PASSED     C 0:09.331 - R 0:00.004
23:22:51        	raii/ctor-autogen-ERR1                     PASSED     C 0:00.649 - R n/a
23:22:51        	raii/boxed-types                           PASSED     C 0:09.123 - R 0:00.004
23:22:51        	minmax                                     PASSED     C 0:16.995 - R 0:00.004
23:22:51        	raii/ctor-autogen                          PASSED     C 0:01.769 - R 0:00.004
23:22:51        	parseconfig                                PASSED     C 0:14.821 - R 0:00.004
23:22:51        	raii/init_once                             PASSED     C 0:01.480 - R 0:00.005
23:22:51        	raii/memberCtors                           PASSED     C 0:01.341 - R 0:00.004
23:22:51        	raii/memberCtors-ERR1                      PASSED     C 0:00.715 - R n/a
23:22:51        	raii/dtor-early-exit-ERR1                  PASSED     C 0:08.359 - R n/a
23:22:51        	raii/globals                               PASSED     C 0:09.506 - R 0:00.004
23:22:51        	raii/dtor-early-exit-ERR2                  PASSED     C 0:09.685 - R n/a
23:22:51        	result                                     PASSED     C 0:01.611 - R 0:00.004
23:22:51        	raii/dtor-early-exit                       PASSED     C 0:14.463 - R 0:00.004
23:22:51        	simpleGenericTriple                        PASSED     C 0:01.585 - R 0:00.004
23:22:51        	smart-pointers                             PASSED     C 0:01.538 - R 0:00.004
23:22:51        	references                                 PASSED     C 0:10.659 - R 0:00.004
23:22:51        	shortCircuit                               PASSED     C 0:08.546 - R 0:00.004
23:22:51        	searchsort                                 PASSED     C 0:16.276 - R 0:00.004
23:22:51        	strstream                                  PASSED     C 0:09.499 - R 0:00.004
23:22:51        	switch                                     PASSED     C 0:00.993 - R 0:00.002
23:22:51        	sum                                        PASSED     C 0:15.672 - R 0:00.004
23:22:51        	tuple/tupleCast                            PASSED     C 0:01.064 - R 0:00.004
23:22:51        	swap                                       PASSED     C 0:16.236 - R 0:00.004
23:22:51        	tuple/tupleFunction                        PASSED     C 0:01.181 - R 0:00.004
23:22:51        	tuple/tupleMember                          PASSED     C 0:01.172 - R 0:00.004
23:22:51        	tuple/tuplePolymorphism                    PASSED     C 0:01.680 - R 0:00.004
23:22:51        	tuple/tupleAssign                          PASSED     C 0:12.132 - R 0:00.004
23:22:51        	time                                       PASSED     C 0:13.034 - R 0:00.004
23:22:51        	typedefRedef-ERR1                          PASSED     C 0:00.107 - R n/a
23:22:51        	typedefRedef                               PASSED     C 0:00.969 - R 0:00.002
23:22:51        	typeof                                     PASSED     C 0:01.040 - R 0:00.004
23:22:51        	tuple/tupleVariadic                        PASSED     C 0:03.118 - R 0:00.004
23:22:51        	rational                                   PASSED     C 0:39.368 - R 0:00.004
23:22:51        	unified_locking/fast                       PASSED     C 0:15.655 - R 0:00.008
23:22:51        	unified_locking/lin_backoff                PASSED     C 0:19.084 - R 0:00.015
23:22:51        	variableDeclarator                         PASSED     C 0:01.150 - R 0:00.013
23:22:51        	unified_locking/timeout_lock               PASSED     C 0:15.576 - R 0:01.069
23:22:51        	unified_locking/mcs                        PASSED     C 0:20.477 - R 0:03.388
23:22:51        	unified_locking/locks                      PASSED     C 0:17.709 - R 0:07.390
23:22:51        	userLiterals                               PASSED     C 0:11.017 - R 0:00.004
23:22:51        	vector                                     PASSED     C 0:14.290 - R 0:00.004
23:22:51        	vector_math/vec2_double                    PASSED     C 0:15.085 - R 0:00.004
23:22:51        	vector_math/vec2_uint                      PASSED     C 0:14.488 - R 0:00.004
23:22:51        	vector_math/vec2_float                     PASSED     C 0:27.856 - R 0:00.005
23:22:51        	vector_math/vec2_int                       PASSED     C 0:31.929 - R 0:00.004
23:22:51        	voidPtr                                    PASSED     C 0:01.057 - R 0:00.004
23:22:51        	warnings/self-assignment                   PASSED     C 0:00.990 - R 0:00.001
23:22:51        	KRfunctions                                PASSED     C 0:00.708 - R 0:00.001
23:22:51        	vector_math/vec3_int                       PASSED     C 0:25.645 - R 0:00.004
23:22:51        	vector_math/vec3_float                     PASSED     C 0:32.293 - R 0:00.008
23:22:51        	vector_math/vec4_float                     PASSED     C 0:29.032 - R 0:00.004
23:22:51        	attributes                                 PASSED     C 0:01.077 - R 0:00.002
23:22:51        	abs                                        PASSED     C 0:13.676 - R 0:00.004
23:22:51        	array-container/array-md-sbscr-cases       PASSED     C 0:14.283 - R 0:00.004
23:22:51        	vector_math/vec4_int                       PASSED     C 0:28.337 - R 0:00.010
23:22:51        	ato                                        PASSED     C 0:14.454 - R 0:00.004
23:22:51        	errors/completeType                        PASSED     C 0:00.550 - R n/a
23:22:51        	declarationSpecifier                       PASSED     C 0:00.910 - R 0:00.002
23:22:51        	functions                                  PASSED     C 0:00.797 - R 0:00.002
23:22:51        	extension                                  PASSED     C 0:00.890 - R 0:00.002
23:22:51        	gccExtensions                              PASSED     C 0:00.948 - R 0:00.002
23:22:51        	bitmanip1                                  PASSED     C 0:24.679 - R 0:00.016
23:22:51        	io/manipulatorsInput                       PASSED     C 0:13.824 - R 0:00.004
23:22:51        	bitmanip2                                  PASSED     C 0:28.076 - R 0:00.016
23:22:51        	io/manipulatorsOutput1                     PASSED     C 0:32.539 - R 0:00.004
23:22:51        	meta/archVast                              PASSED     C 0:00.420 - R n/a
23:22:51        	io/manipulatorsOutput2                     PASSED     C 0:21.499 - R 0:00.004
23:22:51        	bitmanip3                                  PASSED     C 0:47.100 - R 0:00.017
23:22:51        	math                                       PASSED     C 0:27.104 - R 0:00.005
23:22:51        	vector_math/vec2_ldouble                   PASSED     C 0:12.221 - R 0:00.004
23:22:51        	random                                     PASSED     C 0:13.308 - R 0:00.010
23:22:51        	mathX                                      PASSED     C 0:42.514 - R 0:00.018
23:22:51        	io/io-acquire                              TIMEOUT    C 0:27.564 - R10:00.323
23:22:51 1 2 3 4 5 6 7 8 9
23:22:51 1 2 3 4 5 6 7 8 9
23:22:51 1 2 3 4 5 6 7 8 9
23:22:51 1 2 3 4 5 6 7 8 9
23:22:51 1 2 3 4 5 6 7 8 9
23:22:51 1 2 3 4 5 6 7 8 9
23:22:51 1 2 3 4 5 6 7 8 9
23:22:51 1 2 3 4 5 6 7 8 9
23:22:51 1 2 3 4 5 6 7 8 9
23:22:51 1 2 3 4 5 6 7 8 9
23:22:51 1 2 3 4 5 6 7 8 9
23:22:51 1 2 3 4 5 6 7 8 9
23:22:51 1 2 3 4 5 6 7 8 9
23:22:51 1 2 3 4 5 6 7 8 9
23:22:51 1 2 3 4 5 6 7 8 9
23:22:51 1 2 3 4 5 6 7 8 9
23:22:51 1 2 3 4 5 6 7 8 9
23:22:51 1 2 3 4 5 6 7 8 9
23:22:51 1 2 3 4 5 6 7 8 9
23:22:51 1 2 3 4 5 6 7 8 9
23:22:51 1 2 3 4 5 6 7 8 9
23:22:51 1 2 3 4 5 6 7 8 9
23:22:51 1 2 3 4 5 6 7 8 9
23:22:51 1 2 3 4 5 6 7 8 9
23:22:51 1 2 3 4 5 6 7 8 9
23:22:51 1 2 3 4 5 6 7 8 9
23:22:51 1 2 3 4 5 6 7 8 9
23:22:51 1 2 3 4 5 6 7 8 9
23:22:51 1 2 3 4 5 6 7 8 9
23:22:51 1 2 3 4 5 6 7 8 9
23:22:51 1 2 3 4 5 6 7 8 9
23:22:51 1 2 3 4 5 6 7 8 9
23:22:51 1 2 3 4 5 6 7 8 9
23:22:51 1 2 3 4 5 6 7 8 9
23:22:51 1 2 3 4 5 6 7 8 9
23:22:51 1 2 3 4 5 6 7 8 9
23:22:51 1 2 3 4 5 6 7 8 9
23:22:51 1 2 3 4 5 6 7 8 9
23:22:51 1 2 3 4 5 6 7 8 9
23:22:51 1 2 3 4 5 6 7 8 9
23:22:51 1 2 3 4 5 6 7 8 9
23:22:51 1 2 3 4 5 6 7 8 9
23:22:51 1 2 3 4 5 6 7 8 9
23:22:51 1 2 3 4 5 6 7 8 9
23:22:51 1 2 3 4 5 6 7 8 9
23:22:51 1 2 3 4 5 6 7 8 9
23:22:51 1 2 3 4 5 6 7 8 9
23:22:51 1 2 3 4 5 6 7 8 9
23:22:51 1 2 3 4 5 6 7 8 9
23:22:51 1 2 3 4 5 6 7 8 9
23:22:51 1 2 3 4 5 6 7 8 9
23:22:51 1 2 3 4 5 6 7 8 9
23:22:51 1 2 3 4 5 6 7 8 9
23:22:51 1 2 3 4 5 6 7 8 9
23:22:51 1 2 3 4 5 6 7 8 9
23:22:51 1 2 3 4 5 6 7 8 9
23:22:51 1 2 3 4 5 6 7 8 9
23:22:51 1 2 3 4 5 6 7 8 9
23:22:51 1 2 3 4 5 6 7 8 9
23:22:51 1 2 3 4 5 6 7 8 9
23:22:51 1 2 3 4 5 6 7 8 9
23:22:51 1 2 3 4 5 6 7 8 9
23:22:51 1 2 3 4 5 6 7 8 9
23:22:51 1 2 3 4 5 6 7 8 9
23:22:51 1 2 3 4 5 6 7 8 9
23:22:51 1 2 3 4 5 6 7 8 9
23:22:51 1 2 3 4 5 6 7 8 9
23:22:51 1 2 3 4 5 6 7 8 9
23:22:51 1 2 3 4 5 6 7 8 9
23:22:51 1 2 3 4 5 6 7 8 9
23:22:51 1 2 3 4 5 6 7 8 9
23:22:51 1 2 3 4 5 6 7 8 9
23:22:51 1 2 3 4 5 6 7 8 9
23:22:51 1 2 3 4 5 6 7 8 9
23:22:51 1 2 3 4 5 6 7 8 9
23:22:51 1 2 3 4 5 6 7 8 9
23:22:51 1 2 3 4 5 6 7 8 9
23:22:51 1 2 3 4 5 6 7 8 9
23:22:51 1 2 3 4 5 6 7 8 9
23:22:51 1 2 3 4 5 6 7 8 9
23:22:51 1 2 3 4 5 6 7 8 9
23:22:51 1 2 3 4 5 6 7 8 9
23:22:51 1 2 3 4 5 6 7 8 9
23:22:51 1 2 3 4 5 6 7 8 9
23:22:51 1 2 3 4 5 6 7 8 9
23:22:51 1 2 3 4 5 6 7 8 9
23:22:51 1 2 3 4 5 6 7 8 9
23:22:51 1 2 3 4 5 6 7 8 9
23:22:51 1 2 3 4 5 6 7 8 9
23:22:51 1 2 3 4 5 6 7 8 9
23:22:51 1 2 3 4 5 6 7 8 9
23:22:51 1 2 3 4 5 6 7 8 9
23:22:51 1 2 3 4 5 6 7 8 9
23:22:51 1 2 3 4 5 6 7 8 9
23:22:51 1 2 3 4 5 6 7 8 9
23:22:51 1 2 3 4 5 6 7 8 9
23:22:51 1 2 3 4 5 6 7 8 9
23:22:51 1 2 3 4 5 6 7 8 9
23:22:51 1 2 3 4 5 6 7 8 9
23:22:51 1 2 3 4 5 6 7 8 9
23:22:51 1 2 3 4 5 6 7 8 9
23:22:51 1 2 3 4 5 6 7 8 9
23:22:51 1 2 3 4 5 6 7 8 9
23:22:51 1 2 3 4 5 6 7 8 9
23:22:51 1 2 3 4 5 6 7 8 9
23:22:51 1 2 3 4 5 6 7 8 9
23:22:51 1 2 3 4 5 6 7 8 9
23:22:51 1 2 3 4 5 6 7 8 9
23:22:51 1 2 3 4 5 6 7 8 9
23:22:51 1 2 3 4 5 6 7 8 9
23:22:51 1 2 3 4 5 6 7 8 9
23:22:51 1 2 3 4 5 6 7 8 9
23:22:51 1 2 3 4 5 6 7 8 9
23:22:51 1 2 3 4 5 6 7 8 9
23:22:51 1 2 3 4 5 6 7 8 9
23:22:51 1 2 3 4 5 6 7 8 9
23:22:51 1 2 3 4 5 6 7 8 9
23:22:51 1 2 3 4 5 6 7 8 9
23:22:51 1 2 3 4 5 6 7 8 9
23:22:51 1 2 3 4 5 6 7 8 9
23:22:51 1 2 3 4 5 6 7 8 9
23:22:51 1 2 3 4 5 6 7 8 9
23:22:51 1 2 3 4 5 6 7 8 9
23:22:51 1 2 3 4 5 6 7 8 9
23:22:51 1 2 3 4 5 6 7 8 9
23:22:51 1 2 3 4 5 6 7 8 9
23:22:51 1 2 3 4 5 6 7 8 9
23:22:51 1 2 3 4 5 6 7 8 9
23:22:51 1 2 3 4 5 6 7 8 9
23:22:51 1 2 3 4 5 6 7 8 9
23:22:51 1 2 3 4 5 6 7 8 9
23:22:51 1 2 3 4 5 6 7 8 9
23:22:51 1 2 3 4 5 6 7 8 9
23:22:51 1 2 3 4 5 6 7 8 9
23:22:51 1 2 3 4 5 6 7 8 9
23:22:51 1 2 3 4 5 6 7 8 9
23:22:51 1 2 3 4 5 6 7 8 9
23:22:51 1 2 3 4 5 6 7 8 9
23:22:51 1 2 3 4 5 6 7 8 9
23:22:51 1 2 3 4 5 6 7 8 9
23:22:51 1 2 3 4 5 6 7 8 9
23:22:51 1 2 3 4 5 6 7 8 9
23:22:51 1 2 3 4 5 6 7 8 9
23:22:51 1 2 3 4 5 6 7 8 9
23:22:51 1 2 3 4 5 6 7 8 9
23:22:51 1 2 3 4 5 6 7 8 9
23:22:51 1 2 3 4 5 6 7 8 9
23:22:51 1 2 3 4 5 6 7 8 9
23:22:51 1 2 3 4 5 6 7 8 9
23:22:51 1 2 3 4 5 6 7 8 9
23:22:51 1 2 3 4 5 6 7 8 9
23:22:51 1 2 3 4 5 6 7 8 9
23:22:51 1 2 3 4 5 6 7 8 9
23:22:51 1 2 3 4 5 6 7 8 9
23:22:51 1 2 3 4 5 6 7 8 9
23:22:51 1 2 3 4 5 6 7 8 9
23:22:51 1 2 3 4 5 6 7 8 9
23:22:51 1 2 3 4 5 6 7 8 9
23:22:51 1 2 3 4 5 6 7 8 9
23:22:51 1 2 3 4 5 6 7 8 9
23:22:51 1 2 3 4 5 6 7 8 9
23:22:51 1 2 3 4 5 6 7 8 9
23:22:51 1 2 3 4 5 6 7 8 9
23:22:51 1 2 3 4 5 6 7 8 9
23:22:51 1 2 3 4 5 6 7 8 9
23:22:51 1 2 3 4 5 6 7 8 9
23:22:51 1 2 3 4 5 6 7 8 9
23:22:51 1 2 3 4 5 6 7 8 9
23:22:51 1 2 3 4 5 6 7 8 9
23:22:51 1 2 3 4 5 6 7 8 9
23:22:51 1 2 3 4 5 6 7 8 9
23:22:51 1 2 3 4 5 6 7 8 9
23:22:51 1 2 3 4 5 6 7 8 9
23:22:51 1 2 3 4 5 6 7 8 9
23:22:51 1 2 3 4 5 6 7 8 9
23:22:51 1 2 3 4 5 6 7 8 9
23:22:51 1 2 3 4 5 6 7 8 9
23:22:51 1 2 3 4 5 6 7 8 9
23:22:51 1 2 3 4 5 6 7 8 9
23:22:51 1 2 3 4 5 6 7 8 9
23:22:51 1 2 3 4 5 6 7 8 9
23:22:51 1 2 3 4 5 6 7 8 9
23:22:51 1 2 3 4 5 6 7 8 9
23:22:51 1 2 3 4 5 6 7 8 9
23:22:51 1 2 3 4 5 6 7 8 9
23:22:51 1 2 3 4 5 6 7 8 9
23:22:51 1 2 3 4 5 6 7 8 9
23:22:51 1 2 3 4 5 6 7 8 9
23:22:51 1 2 3 4 5 6 7 8 9
23:22:51 1 2 3 4 5 6 7 8 9
23:22:51 1 2 3 4 5 6 7 8 9
23:22:51 1 2 3 4 5 6 7 8 9
23:22:51 1 2 3 4 5 6 7 8 9
23:22:51 1 2 3 4 5 6 7 8 9
23:22:51 1 2 3 4 5 6 7 8 9
23:22:51 1 2 3 4 5 6 7 8 9
23:22:51 1 2 3 4 5 6 7 8 9
23:22:51 1 2 3 4 5 6 7 8 9
23:22:51 1 2 3 4 5 6 7 8 9
23:22:51 1 2 3 4 5 6 7 8 9
23:22:51 1 2 3 4 5 6 7 8 9
23:22:51 1 2 3 4 5 6 7 8 9
23:22:51 1 2 3 4 5 6 7 8 9
23:22:51 1 2 3 4 5 6 7 8 9
23:22:51 1 2 3 4 5 6 7 8 9
23:22:51 1 2 3 4 5 6 7 8 9
23:22:51 1 2 3 4 5 6 7 8 9
23:22:51 1 2 3 4 5 6 7 8 9
23:22:51 1 2 3 4 5 6 7 8 9
23:22:51 1 2 3 4 5 6 7 8 9
23:22:51 1 2 3 4 5 6 7 8 9
23:22:51 1 2 3 4 5 6 7 8 9
23:22:51 1 2 3 4 5 6 7 8 9
23:22:51 1 2 3 4 5 6 7 8 9
23:22:51 1 2 3 4 5 6 7 8 9
23:22:51 1 2 3 4 5 6 7 8 9
23:22:51 1 2 3 4 5 6 7 8 9
23:22:51 1 2 3 4 5 6 7 8 9
23:22:51 1 2 3 4 5 6 7 8 9
23:22:51 1 2 3 4 5 6 7 8 9
23:22:51 1 2 3 4 5 6 7 8 9
23:22:51 1 2 3 4 5 6 7 8 9
23:22:51 1 2 3 4 5 6 7 8 9
23:22:51 1 2 3 4 5 6 7 8 9
23:22:51 1 2 3 4 5 6 7 8 9
23:22:51 1 2 3 4 5 6 7 8 9
23:22:51 1 2 3 4 5 6 7 8 9
23:22:51 1 2 3 4 5 6 7 8 9
23:22:51 1 2 3 4 5 6 7 8 9
23:22:51 1 2 3 4 5 6 7 8 9
23:22:51 1 2 3 4 5 6 7 8 9
23:22:51 1 2 3 4 5 6 7 8 9
23:22:51 1 2 3 4 5 6 7 8 9
23:22:51 1 2 3 4 5 6 7 8 9
23:22:51 1 2 3 4 5 6 7 8 9
23:22:51 1 2 3 4 5 6 7 8 9
23:22:51 1 2 3 4 5 6 7 8 9
23:22:51 1 2 3 4 5 6 7 8 9
23:22:51 1 2 3 4 5 6 7 8 9
23:22:51 1 2 3 4 5 6 7 8 9
23:22:51 1 2 3 4 5 6 7 8 9
23:22:51 1 2 3 4 5 6 7 8 9
23:22:51 1 2 3 4 5 6 7 8 9
23:22:51 1 2 3 4 5 6 7 8 9
23:22:51 1 2 3 4 5 6 7 8 9
23:22:51 1 2 3 4 5 6 7 8 9
23:22:51 1 2 3 4 5 6 7 8 9
23:22:51 1 2 3 4 5 6 7 8 9
23:22:51 1 2 3 4 5 6 7 8 9
23:22:51 1 2 3 4 5 6 7 8 9
23:22:51 1 2 3 4 5 6 7 8 9
23:22:51 1 2 3 4 5 6 7 8 9
23:22:51 1 2 3 4 5 6 7 8 9
23:22:51 1 2 3 4 5 6 7 8 9
23:22:51 1 2 3 4 5 6 7 8 9
23:22:51 1 2 3 4 5 6 7 8 9
23:22:51 1 2 3 4 5 6 7 8 9
23:22:51 1 2 3 4 5 6 7 8 9
23:22:51 1 2 3 4 5 6 7 8 9
23:22:51 1 2 3 4 5 6 7 8 9
23:22:51 1 2 3 4 5 6 7 8 9
23:22:51 1 2 3 4 5 6 7 8 9
23:22:51 1 2 3 4 5 6 7 8 9
23:22:51 1 2 3 4 5 6 7 8 9
23:22:51 1 2 3 4 5 6 7 8 9
23:22:51 1 2 3 4 5 6 7 8 9
23:22:51 1 2 3 4 5 6 7 8 9
23:22:51 1 2 3 4 5 6 7 8 9
23:22:51 1 2 3 4 5 6 7 8 9
23:22:51 1 2 3 4 5 6 7 8 9
23:22:51 1 2 3 4 5 6 7 8 9
23:22:51 1 2 3 4 5 6 7 8 9
23:22:51 1 2 3 4 5 6 7 8 9
23:22:51 1 2 3 4 5 6 7 8 9
23:22:51 1 2 3 4 5 6 7 8 9
23:22:51 1 2 3 4 5 6 7 8 9
23:22:51 1 2 3 4 5 6 7 8 9
23:22:51 1 2 3 4 5 6 7 8 9
23:22:51 1 2 3 4 5 6 7 8 9
23:22:51 1 2 3 4 5 6 7 8 9
23:22:51 1 2 3 4 5 6 7 8 9
23:22:51 1 2 3 4 5 6 7 8 9
23:22:51 1 2 3 4 5 6 7 8 9
23:22:51 1 2 3 4 5 6 7 8 9
23:22:51 1 2 3 4 5 6 7 8 9
23:22:51 1 2 3 4 5 6 7 8 9
23:22:51 1 2 3 4 5 6 7 8 9
23:22:51 1 2 3 4 5 6 7 8 9
23:22:51 1 2 3 4 5 6 7 8 9
23:22:51 1 2 3 4 5 6 7 8 9
23:22:51 1 2 3 4 5 6 7 8 9
23:22:51 1 2 3 4 5 6 7 8 9
23:22:51 1 2 3 4 5 6 7 8 9
23:22:51 1 2 3 4 5 6 7 8 9
23:22:51 1 2 3 4 5 6 7 8 9
23:22:51 1 2 3 4 5 6 7 8 9
23:22:51 1 2 3 4 5 6 7 8 9
23:22:51 1 2 3 4 5 6 7 8 9
23:22:51 1 2 3 4 5 6 7 8 9
23:22:51 1 2 3 4 5 6 7 8 9
23:22:51 1 2 3 4 5 6 7 8 9
23:22:51 1 2 3 4 5 6 7 8 9
23:22:51 1 2 3 4 5 6 7 8 9
23:22:51 1 2 3 4 5 6 7 8 9
23:22:51 1 2 3 4 5 6 7 8 9
23:22:51 1 2 3 4 5 6 7 8 9
23:22:51 1 2 3 4 5 6 7 8 9
23:22:51 1 2 3 4 5 6 7 8 9
23:22:51 1 2 3 4 5 6 7 8 9
23:22:51 1 2 3 4 5 6 7 8 9
23:22:51 1 2 3 4 5 6 7 8 9
23:22:51 1 2 3 4 5 6 7 8 9
23:22:51 1 2 3 4 5 6 7 8 9
23:22:51 1 2 3 4 5 6 7 8 9
23:22:51 1 2 3 4 5 6 7 8 9
23:22:51 1 2 3 4 5 6 7 8 9
23:22:51 1 2 3 4 5 6 7 8 9
23:22:51 1 2 3 4 5 6 7 8 9
23:22:51 1 2 3 4 5 6 7 8 9
23:22:51 1 2 3 4 5 6 7 8 9
23:22:51 1 2 3 4 5 6 7 8 9
23:22:51 1 2 3 4 5 6 7 8 9
23:22:51 1 2 3 4 5 6 7 8 9
23:22:51 1 2 3 4 5 6 7 8 9
23:22:51 1 2 3 4 5 6 7 8 9
23:22:51 1 2 3 4 5 6 7 8 9
23:22:51 1 2 3 4 5 6 7 8 9
23:22:51 1 2 3 4 5 6 7 8 9
23:22:51 1 2 3 4 5 6 7 8 9
23:22:51 1 2 3 4 5 6 7 8 9
23:22:51 1 2 3 4 5 6 7 8 9
23:22:51 1 2 3 4 5 6 7 8 9
23:22:51 1 2 3 4 5 6 7 8 9
23:22:51 1 2 3 4 5 6 7 8 9
23:22:51 1 2 3 4 5 6 7 8 9
23:22:51 1 2 3 4 5 6 7 8 9
23:22:51 1 2 3 4 5 6 7 8 9
23:22:51 1 2 3 4 5 6 7 8 9
23:22:51 1 2 3 4 5 6 7 8 9
23:22:51 1 2 3 4 5 6 7 8 9
23:22:51 1 2 3 4 5 6 7 8 9
23:22:51 1 2 3 4 5 6 7 8 9
23:22:51 1 2 3 4 5 6 7 8 9
23:22:51 1 2 3 4 5 6 7 8 9
23:22:51 1 2 3 4 5 6 7 8 9
23:22:51 1 2 3 4 5 6 7 8 9
23:22:51 1 2 3 4 5 6 7 8 9
23:22:51 1 2 3 4 5 6 7 8 9
23:22:51 1 2 3 4 5 6 7 8 9
23:22:51 1 2 3 4 5 6 7 8 9
23:22:51 1 2 3 4 5 6 7 8 9
23:22:51 1 2 3 4 5 6 7 8 9
23:22:51 1 2 3 4 5 6 7 8 9
23:22:51 1 2 3 4 5 6 7 8 9
23:22:51 1 2 3 4 5 6 7 8 9
23:22:51 1 2 3 4 5 6 7 8 9
23:22:51 1 2 3 4 5 6 7 8 9
23:22:51 1 2 3 4 5 6 7 8 9
23:22:51 1 2 3 4 5 6 7 8 9
23:22:51 1 2 3 4 5 6 7 8 9
23:22:51 1 2 3 4 5 6 7 8 9
23:22:51 1 2 3 4 5 6 7 8 9
23:22:51 1 2 3 4 5 6 7 8 9
23:22:51 1 2 3 4 5 6 7 8 9
23:22:51 1 2 3 4 5 6 7 8 9
23:22:51 1 2 3 4 5 6 7 8 9
23:22:51 1 2 3 4 5 6 7 8 9
23:22:51 1 2 3 4 5 6 7 8 9
23:22:51 1 2 3 4 5 6 7 8 9
23:22:51 1 2 3 4 5 6 7 8 9
23:22:51 1 2 3 4 5 6 7 8 9
23:22:51 1 2 3 4 5 6 7 8 9
23:22:51 1 2 3 4 5 6 7 8 9
23:22:51 1 2 3 4 5 6 7 8 9
23:22:51 1 2 3 4 5 6 7 8 9
23:22:51 1 2 3 4 5 6 7 8 9
23:22:51 1 2 3 4 5 6 7 8 9
23:22:51 1 2 3 4 5 6 7 8 9
23:22:51 1 2 3 4 5 6 7 8 9
23:22:51 1 2 3 4 5 6 7 8 9
23:22:51 1 2 3 4 5 6 7 8 9
23:22:51 1 2 3 4 5 6 7 8 9
23:22:51 1 2 3 4 5 6 7 8 9
23:22:51 1 2 3 4 5 6 7 8 9
23:22:51 1 2 3 4 5 6 7 8 9
23:22:51 1 2 3 4 5 6 7 8 9
23:22:51 1 2 3 4 5 6 7 8 9
23:22:51 1 2 3 4 5 6 7 8 9
23:22:51 1 2 3 4 5 6 7 8 9
23:22:51 1 2 3 4 5 6 7 8 9
23:22:51 1 2 3 4 5 6 7 8 9
23:22:51 1 2 3 4 5 6 7 8 9
23:22:51 1 2 3 4 5 6 7 8 9
23:22:51 1 2 3 4 5 6 7 8 9
23:22:51 1 2 3 4 5 6 7 8 9
23:22:51 1 2 3 4 5 6 7 8 9
23:22:51 1 2 3 4 5 6 7 8 9
23:22:51 1 2 3 4 5 6 7 8 9
23:22:51 1 2 3 4 5 6 7 8 9
23:22:51 1 2 3 4 5 6 7 8 9
23:22:51 1 2 3 4 5 6 7 8 9
23:22:51 1 2 3 4 5 6 7 8 9
23:22:51 1 2 3 4 5 6 7 8 9
23:22:51 1 2 3 4 5 6 7 8 9
23:22:51 1 2 3 4 5 6 7 8 9
23:22:51 1 2 3 4 5 6 7 8 9
23:22:51 1 2 3 4 5 6 7 8 9
23:22:51 1 2 3 4 5 6 7 8 9
23:22:51 1 2 3 4 5 6 7 8 9
23:22:51 1 2 3 4 5 6 7 8 9
23:22:51 1 2 3 4 5 6 7 8 9
23:22:51 1 2 3 4 5 6 7 8 9
23:22:51 1 2 3 4 5 6 7 8 9
23:22:51 1 2 3 4 5 6 7 8 9
23:22:51 1 2 3 4 5 6 7 8 9
23:22:51 1 2 3 4 5 6 7 8 9
23:22:51 1 2 3 4 5 6 7 8 9
23:22:51 1 2 3 4 5 6 7 8 9
23:22:51 1 2 3 4 5 6 7 8 9
23:22:51 1 2 3 4 5 6 7 8 9
23:22:51 1 2 3 4 5 6 7 8 9
23:22:51 1 2 3 4 5 6 7 8 9
23:22:51 1 2 3 4 5 6 7 8 9
23:22:51 1 2 3 4 5 6 7 8 9
23:22:51 1 2 3 4 5 6 7 8 9
23:22:51 1 2 3 4 5 6 7 8 9
23:22:51 1 2 3 4 5 6 7 8 9
23:22:51 1 2 3 4 5 6 7 8 9
23:22:51 1 2 3 4 5 6 7 8 9
23:22:51 1 2 3 4 5 6 7 8 9
23:22:51 1 2 3 4 5 6 7 8 9
23:22:51 1 2 3 4 5 6 7 8 9
23:22:51 1 2 3 4 5 6 7 8 9
23:22:51 1 2 3 4 5 6 7 8 9
23:22:51 1 2 3 4 5 6 7 8 9
23:22:51 1 2 3 4 5 6 7 8 9
23:22:51 1 2 3 4 5 6 7 8 9
23:22:51 1 2 3 4 5 6 7 8 9
23:22:51 1 2 3 4 5 6 7 8 9
23:22:51 1 2 3 4 5 6 7 8 9
23:22:51 1 2 3 4 5 6 7 8 9
23:22:51 1 2 3 4 5 6 7 8 9
23:22:51 1 2 3 4 5 6 7 8 9
23:22:51 1 2 3 4 5 6 7 8 9
23:22:51 1 2 3 4 5 6 7 8 9
23:22:51 1 2 3 4 5 6 7 8 9
23:22:51 1 2 3 4 5 6 7 8 9
23:22:51 1 2 3 4 5 6 7 8 9
23:22:51 1 2 3 4 5 6 7 8 9
23:22:51 1 2 3 4 5 6 7 8 9
23:22:51 1 2 3 4 5 6 7 8 9
23:22:51 1 2 3 4 5 6 7 8 9
23:22:51 1 2 3 4 5 6 7 8 9
23:22:51 1 2 3 4 5 6 7 8 9
23:22:51 1 2 3 4 5 6 7 8 9
23:22:51 1 2 3 4 5 6 7 8 9
23:22:51 1 2 3 4 5 6 7 8 9
23:22:51 1 2 3 4 5 6 7 8 9
23:22:51 1 2 3 4 5 6 7 8 9
23:22:51 1 2 3 4 5 6 7 8 9
23:22:51 1 2 3 4 5 6 7 8 9
23:22:51 1 2 3 4 5 6 7 8 9
23:22:51 1 2 3 4 5 6 7 8 9
23:22:51 1 2 3 4 5 6 7 8 9
23:22:51 1 2 3 4 5 6 7 8 9
23:22:51 1 2 3 4 5 6 7 8 9
23:22:51 1 2 3 4 5 6 7 8 9
23:22:51 1 2 3 4 5 6 7 8 9
23:22:51 1 2 3 4 5 6 7 8 9
23:22:51 1 2 3 4 5 6 7 8 9
23:22:51 1 2 3 4 5 6 7 8 9
23:22:51 1 2 3 4 5 6 7 8 9
23:22:51 1 2 3 4 5 6 7 8 9
23:22:51 1 2 3 4 5 6 7 8 9
23:22:51 1 2 3 4 5 6 7 8 9
23:22:51 1 2 3 4 5 6 7 8 9
23:22:51 1 2 3 4 5 6 7 8 9
23:22:51 1 2 3 4 5 6 7 8 9
23:22:51 1 2 3 4 5 6 7 8 9
23:22:51 1 2 3 4 5 6 7 8 9
23:22:51 1 2 3 4 5 6 7 8 9
23:22:51 1 2 3 4 5 6 7 8 9
23:22:51 1 2 3 4 5 6 7 8 9
23:22:51 1 2 3 4 5 6 7 8 9
23:22:51 1 2 3 4 5 6 7 8 9
23:22:51 1 2 3 4 5 6 7 8 9
23:22:51 1 2 3 4 5 6 7 8 9
23:22:51 1 2 3 4 5 6 7 8 9
23:22:51 1 2 3 4 5 6 7 8 9
23:22:51 1 2 3 4 5 6 7 8 9
23:22:51 1 2 3 4 5 6 7 8 9
23:22:51 1 2 3 4 5 6 7 8 9
23:22:51 1 2 3 4 5 6 7 8 9
23:22:51 1 2 3 4 5 6 7 8 9
23:22:51 1 2 3 4 5 6 7 8 9
23:22:51 1 2 3 4 5 6 7 8 9
23:22:51 1 2 3 4 5 6 7 8 9
23:22:51 1 2 3 4 5 6 7 8 9
23:22:51 1 2 3 4 5 6 7 8 9
23:22:51 1 2 3 4 5 6 7 8 9
23:22:51 1 2 3 4 5 6 7 8 9
23:22:51 1 2 3 4 5 6 7 8 9
23:22:51 1 2 3 4 5 6 7 8 9
23:22:51 1 2 3 4 5 6 7 8 9
23:22:51 1 2 3 4 5 6 7 8 9
23:22:51 1 2 3 4 5 6 7 8 9
23:22:51 1 2 3 4 5 6 7 8 9
23:22:51 1 2 3 4 5 6 7 8 9
23:22:51 1 2 3 4 5 6 7 8 9
23:22:51 1 2 3 4 5 6 7 8 9
23:22:51 1 2 3 4 5 6 7 8 9
23:22:51 1 2 3 4 5 6 7 8 9
23:22:51 1 2 3 4 5 6 7 8 9
23:22:51 1 2 3 4 5 6 7 8 9
23:22:51 1 2 3 4 5 6 7 8 9
23:22:51 1 2 3 4 5 6 7 8 9
23:22:51 1 2 3 4 5 6 7 8 9
23:22:51 1 2 3 4 5 6 7 8 9
23:22:51 1 2 3 4 5 6 7 8 9
23:22:51 1 2 3 4 5 6 7 8 9
23:22:51 1 2 3 4 5 6 7 8 9
23:22:51 1 2 3 4 5 6 7 8 9
23:22:51 1 2 3 4 5 6 7 8 9
23:22:51 1 2 3 4 5 6 7 8 9
23:22:51 1 2 3 4 5 6 7 8 9
23:22:51 1 2 3 4 5 6 7 8 9
23:22:51 1 2 3 4 5 6 7 8 9
23:22:51 1 2 3 4 5 6 7 8 9
23:22:51 1 2 3 4 5 6 7 8 9
23:22:51 1 2 3 4 5 6 7 8 9
23:22:51 1 2 3 4 5 6 7 8 9
23:22:51 1 2 3 4 5 6 7 8 9
23:22:51 1 2 3 4 5 6 7 8 9
23:22:51 1 2 3 4 5 6 7 8 9
23:22:51 1 2 3 4 5 6 7 8 9
23:22:51 1 2 3 4 5 6 7 8 9
23:22:51 1 2 3 4 5 6 7 8 9
23:22:51 1 2 3 4 5 6 7 8 9
23:22:51 1 2 3 4 5 6 7 8 9
23:22:51 1 2 3 4 5 6 7 8 9
23:22:51 1 2 3 4 5 6 7 8 9
23:22:51 1 2 3 4 5 6 7 8 9
23:22:51 1 2 3 4 5 6 7 8 9
23:22:51 1 2 3 4 5 6 7 8 9
23:22:51 1 2 3 4 5 6 7 8 9
23:22:51 1 2 3 4 5 6 7 8 9
23:22:51 1 2 3 4 5 6 7 8 9
23:22:51 1 2 3 4 5 6 7 8 9
23:22:51 1 2 3 4 5 6 7 8 9
23:22:51 1 2 3 4 5 6 7 8 9
23:22:51 1 2 3 4 5 6 7 8 9
23:22:51 1 2 3 4 5 6 7 8 9
23:22:51 1 2 3 4 5 6 7 8 9
23:22:51 1 2 3 4 5 6 7 8 9
23:22:51 1 2 3 4 5 6 7 8 9
23:22:51 1 2 3 4 5 6 7 8 9
23:22:51 1 2 3 4 5 6 7 8 9
23:22:51 1 2 3 4 5 6 7 8 9
23:22:51 1 2 3 4 5 6 7 8 9
23:22:51 1 2 3 4 5 6 7 8 9
23:22:51 1 2 3 4 5 6 7 8 9
23:22:51 1 2 3 4 5 6 7 8 9
23:22:51 1 2 3 4 5 6 7 8 9
23:22:51 1 2 3 4 5 6 7 8 9
23:22:51 1 2 3 4 5 6 7 8 9
23:22:51 1 2 3 4 5 6 7 8 9
23:22:51 1 2 3 4 5 6 7 8 9
23:22:51 1 2 3 4 5 6 7 8 9
23:22:51 1 2 3 4 5 6 7 8 9
23:22:51 1 2 3 4 5 6 7 8 9
23:22:51 1 2 3 4 5 6 7 8 9
23:22:51 1 2 3 4 5 6 7 8 9
23:22:51 1 2 3 4 5 6 7 8 9
23:22:51 1 2 3 4 5 6 7 8 9
23:22:51 1 2 3 4 5 6 7 8 9
23:22:51 1 2 3 4 5 6 7 8 9
23:22:51 1 2 3 4 5 6 7 8 9
23:22:51 1 2 3 4 5 6 7 8 9
23:22:51 1 2 3 4 5 6 7 8 9
23:22:51 1 2 3 4 5 6 7 8 9
23:22:51 1 2 3 4 5 6 7 8 9
23:22:51 1 2 3 4 5 6 7 8 9
23:22:51 1 2 3 4 5 6 7 8 9
23:22:51 1 2 3 4 5 6 7 8 9
23:22:51 1 2 3 4 5 6 7 8 9
23:22:51 1 2 3 4 5 6 7 8 9
23:22:51 1 2 3 4 5 6 7 8 9
23:22:51 1 2 3 4 5 6 7 8 9
23:22:51 1 2 3 4 5 6 7 8 9
23:22:51 1 2 3 4 5 6 7 8 9
23:22:51 1 2 3 4 5 6 7 8 9
23:22:51 1 2 3 4 5 6 7 8 9
23:22:51 1 2 3 4 5 6 7 8 9
23:22:51 1 2 3 4 5 6 7 8 9
23:22:51 1 2 3 4 5 6 7 8 9
23:22:51 1 2 3 4 5 6 7 8 9
23:22:51 1 2 3 4 5 6 7 8 9
23:22:51 1 2 3 4 5 6 7 8 9
23:22:51 1 2 3 4 5 6 7 8 9
23:22:51 1 2 3 4 5 6 7 8 9
23:22:51 1 2 3 4 5 6 7 8 9
23:22:51 1 2 3 4 5 6 7 8 9
23:22:51 1 2 3 4 5 6 7 8 9
23:22:51 1 2 3 4 5 6 7 8 9
23:22:51 1 2 3 4 5 6 7 8 9
23:22:51 1 2 3 4 5 6 7 8 9
23:22:51 1 2 3 4 5 6 7 8 9
23:22:51 1 2 3 4 5 6 7 8 9
23:22:51 1 2 3 4 5 6 7 8 9
23:22:51 1 2 3 4 5 6 7 8 9
23:22:51 1 2 3 4 5 6 7 8 9
23:22:51 1 2 3 4 5 6 7 8 9
23:22:51 1 2 3 4 5 6 7 8 9
23:22:51 1 2 3 4 5 6 7 8 9
23:22:51 1 2 3 4 5 6 7 8 9
23:22:51 1 2 3 4 5 6 7 8 9
23:22:51 1 2 3 4 5 6 7 8 9
23:22:51 1 2 3 4 5 6 7 8 9
23:22:51 1 2 3 4 5 6 7 8 9
23:22:51 1 2 3 4 5 6 7 8 9
23:22:51 1 2 3 4 5 6 7 8 9
23:22:51 1 2 3 4 5 6 7 8 9
23:22:51 1 2 3 4 5 6 7 8 9
23:22:51 1 2 3 4 5 6 7 8 9
23:22:51 1 2 3 4 5 6 7 8 9
23:22:51 1 2 3 4 5 6 7 8 9
23:22:51 1 2 3 4 5 6 7 8 9
23:22:51 1 2 3 4 5 6 7 8 9
23:22:51 1 2 3 4 5 6 7 8 9
23:22:51 1 2 3 4 5 6 7 8 9
23:22:51 1 2 3 4 5 6 7 8 9
23:22:51 1 2 3 4 5 6 7 8 9
23:22:51 1 2 3 4 5 6 7 8 9
23:22:51 1 2 3 4 5 6 7 8 9
23:22:51 1 2 3 4 5 6 7 8 9
23:22:51 1 2 3 4 5 6 7 8 9
23:22:51 1 2 3 4 5 6 7 8 9
23:22:51 1 2 3 4 5 6 7 8 9
23:22:51 1 2 3 4 5 6 7 8 9
23:22:51 1 2 3 4 5 6 7 8 9
23:22:51 1 2 3 4 5 6 7 8 9
23:22:51 1 2 3 4 5 6 7 8 9
23:22:51 1 2 3 4 5 6 7 8 9
23:22:51 1 2 3 4 5 6 7 8 9
23:22:51 1 2 3 4 5 6 7 8 9
23:22:51 1 2 3 4 5 6 7 8 9
23:22:51 1 2 3 4 5 6 7 8 9
23:22:51 1 2 3 4 5 6 7 8 9
23:22:51 1 2 3 4 5 6 7 8 9
23:22:51 1 2 3 4 5 6 7 8 9
23:22:51 1 2 3 4 5 6 7 8 9
23:22:51 1 2 3 4 5 6 7 8 9
23:22:51 1 2 3 4 5 6 7 8 9
23:22:51 1 2 3 4 5 6 7 8 9
23:22:51 1 2 3 4 5 6 7 8 9
23:22:51 1 2 3 4 5 6 7 8 9
23:22:51 1 2 3 4 5 6 7 8 9
23:22:51 1 2 3 4 5 6 7 8 9
23:22:51 1 2 3 4 5 6 7 8 9
23:22:51 1 2 3 4 5 6 7 8 9
23:22:51 1 2 3 4 5 6 7 8 9
23:22:51 1 2 3 4 5 6 7 8 9
23:22:51 1 2 3 4 5 6 7 8 9
23:22:51 1 2 3 4 5 6 7 8 9
23:22:51 1 2 3 4 5 6 7 8 9
23:22:51 1 2 3 4 5 6 7 8 9
23:22:51 1 2 3 4 5 6 7 8 9
23:22:51 1 2 3 4 5 6 7 8 9
23:22:51 1 2 3 4 5 6 7 8 9
23:22:51 1 2 3 4 5 6 7 8 9
23:22:51 1 2 3 4 5 6 7 8 9
23:22:51 1 2 3 4 5 6 7 8 9
23:22:51 1 2 3 4 5 6 7 8 9
23:22:51 1 2 3 4 5 6 7 8 9
23:22:51 1 2 3 4 5 6 7 8 9
23:22:51 1 2 3 4 5 6 7 8 9
23:22:51 1 2 3 4 5 6 7 8 9
23:22:51 1 2 3 4 5 6 7 8 9
23:22:51 1 2 3 4 5 6 7 8 9
23:22:51 1 2 3 4 5 6 7 8 9
23:22:51 1 2 3 4 5 6 7 8 9
23:22:51 1 2 3 4 5 6 7 8 9
23:22:51 1 2 3 4 5 6 7 8 9
23:22:51 1 2 3 4 5 6 7 8 9
23:22:51 1 2 3 4 5 6 7 8 9
23:22:51 1 2 3 4 5 6 7 8 9
23:22:51 1 2 3 4 5 6 7 8 9
23:22:51 1 2 3 4 5 6 7 8 9
23:22:51 1 2 3 4 5 6 7 8 9
23:22:51 1 2 3 4 5 6 7 8 9
23:22:51 1 2 3 4 5 6 7 8 9
23:22:51 1 2 3 4 5 6 7 8 9
23:22:51 1 2 3 4 5 6 7 8 9
23:22:51 1 2 3 4 5 6 7 8 9
23:22:51 1 2 3 4 5 6 7 8 9
23:22:51 1 2 3 4 5 6 7 8 9
23:22:51 1 2 3 4 5 6 7 8 9
23:22:51 1 2 3 4 5 6 7 8 9
23:22:51 1 2 3 4 5 6 7 8 9
23:22:51 1 2 3 4 5 6 7 8 9
23:22:51 1 2 3 4 5 6 7 8 9
23:22:51 1 2 3 4 5 6 7 8 9
23:22:51 1 2 3 4 5 6 7 8 9
23:22:51 1 2 3 4 5 6 7 8 9
23:22:51 1 2 3 4 5 6 7 8 9
23:22:51 1 2 3 4 5 6 7 8 9
23:22:51 1 2 3 4 5 6 7 8 9
23:22:51 1 2 3 4 5 6 7 8 9
23:22:51 1 2 3 4 5 6 7 8 9
23:22:51 1 2 3 4 5 6 7 8 9
23:22:51 1 2 3 4 5 6 7 8 9
23:22:51 1 2 3 4 5 6 7 8 9
23:22:51 1 2 3 4 5 6 7 8 9
23:22:51 1 2 3 4 5 6 7 8 9
23:22:51 1 2 3 4 5 6 7 8 9
23:22:51 1 2 3 4 5 6 7 8 9
23:22:51 1 2 3 4 5 6 7 8 9
23:22:51 1 2 3 4 5 6 7 8 9
23:22:51 1 2 3 4 5 6 7 8 9
23:22:51 1 2 3 4 5 6 7 8 9
23:22:51 1 2 3 4 5 6 7 8 9
23:22:51 1 2 3 4 5 6 7 8 9
23:22:51 1 2 3 4 5 6 7 8 9
23:22:51 1 2 3 4 5 6 7 8 9
23:22:51 1 2 3 4 5 6 7 8 9
23:22:51 1 2 3 4 5 6 7 8 9
23:22:51 1 2 3 4 5 6 7 8 9
23:22:51 1 2 3 4 5 6 7 8 9
23:22:51 1 2 3 4 5 6 7 8 9
23:22:51 1 2 3 4 5 6 7 8 9
23:22:51 1 2 3 4 5 6 7 8 9
23:22:51 1 2 3 4 5 6 7 8 9
23:22:51 1 2 3 4 5 6 7 8 9
23:22:51 1 2 3 4 5 6 7 8 9
23:22:51 1 2 3 4 5 6 7 8 9
23:22:51 1 2 3 4 5 6 7 8 9
23:22:51 1 2 3 4 5 6 7 8 9
23:22:51 1 2 3 4 5 6 7 8 9
23:22:51 1 2 3 4 5 6 7 8 9
23:22:51 1 2 3 4 5 6 7 8 9
23:22:51 1 2 3 4 5 6 7 8 9
23:22:51 1 2 3 4 5 6 7 8 9
23:22:51 1 2 3 4 5 6 7 8 9
23:22:51 1 2 3 4 5 6 7 8 9
23:22:51 1 2 3 4 5 6 7 8 9
23:22:51 1 2 3 4 5 6 7 8 9
23:22:51 1 2 3 4 5 6 7 8 9
23:22:51 1 2 3 4 5 6 7 8 9
23:22:51 1 2 3 4 5 6 7 8 9
23:22:51 1 2 3 4 5 6 7 8 9
23:22:51 1 2 3 4 5 6 7 8 9
23:22:51 1 2 3 4 5 6 7 8 9
23:22:51 1 2 3 4 5 6 7 8 9
23:22:51 1 2 3 4 5 6 7 8 9
23:22:51 1 2 3 4 5 6 7 8 9
23:22:51 1 2 3 4 5 6 7 8 9
23:22:51 1 2 3 4 5 6 7 8 9
23:22:51 1 2 3 4 5 6 7 8 9
23:22:51 1 2 3 4 5 6 7 8 9
23:22:51 1 2 3 4 5 6 7 8 9
23:22:51 1 2 3 4 5 6 7 8 9
23:22:51 1 2 3 4 5 6 7 8 9
23:22:51 1 2 3 4 5 6 7 8 9
23:22:51 1 2 3 4 5 6 7 8 9
23:22:51 1 2 3 4 5 6 7 8 9
23:22:51 1 2 3 4 5 6 7 8 9
23:22:51 1 2 3 4 5 6 7 8 9
23:22:51 1 2 3 4 5 6 7 8 9
23:22:51 1 2 3 4 5 6 7 8 9
23:22:51 1 2 3 4 5 6 7 8 9
23:22:51 1 2 3 4 5 6 7 8 9
23:22:51 1 2 3 4 5 6 7 8 9
23:22:51 1 2 3 4 5 6 7 8 9
23:22:51 1 2 3 4 5 6 7 8 9
23:22:51 1 2 3 4 5 6 7 8 9
23:22:51 1 2 3 4 5 6 7 8 9
23:22:51 1 2 3 4 5 6 7 8 9
23:22:51 1 2 3 4 5 6 7 8 9
23:22:51 1 2 3 4 5 6 7 8 9
23:22:51 1 2 3 4 5 6 7 8 9
23:22:51 1 2 3 4 5 6 7 8 9
23:22:51 1 2 3 4 5 6 7 8 9
23:22:51 1 2 3 4 5 6 7 8 9
23:22:51 1 2 3 4 5 6 7 8 9
23:22:51 1 2 3 4 5 6 7 8 9
23:22:51 1 2 3 4 5 6 7 8 9
23:22:51 1 2 3 4 5 6 7 8 9
23:22:51 1 2 3 4 5 6 7 8 9
23:22:51 1 2 3 4 5 6 7 8 9
23:22:51 1 2 3 4 5 6 7 8 9
23:22:51 1 2 3 4 5 6 7 8 9
23:22:51 1 2 3 4 5 6 7 8 9
23:22:51 1 2 3 4 5 6 7 8 9
23:22:51 1 2 3 4 5 6 7 8 9
23:22:51 1 2 3 4 5 6 7 8 9
23:22:51 1 2 3 4 5 6 7 8 9
23:22:51 1 2 3 4 5 6 7 8 9
23:22:51 1 2 3 4 5 6 7 8 9
23:22:51 1 2 3 4 5 6 7 8 9
23:22:51 1 2 3 4 5 6 7 8 9
23:22:51 1 2 3 4 5 6 7 8 9
23:22:51 1 2 3 4 5 6 7 8 9
23:22:51 1 2 3 4 5 6 7 8 9
23:22:51 1 2 3 4 5 6 7 8 9
23:22:51 1 2 3 4 5 6 7 8 9
23:22:51 1 2 3 4 5 6 7 8 9
23:22:51 1 2 3 4 5 6 7 8 9
23:22:51 1 2 3 4 5 6 7 8 9
23:22:51 1 2 3 4 5 6 7 8 9
23:22:51 1 2 3 4 5 6 7 8 9
23:22:51 1 2 3 4 5 6 7 8 9
23:22:51 1 2 3 4 5 6 7 8 9
23:22:51 1 2 3 4 5 6 7 8 9
23:22:51 1 2 3 4 5 6 7 8 9
23:22:51 1 2 3 4 5 6 7 8 9
23:22:51 1 2 3 4 5 6 7 8 9
23:22:51 1 2 3 4 5 6 7 8 9
23:22:51 1 2 3 4 5 6 7 8 9
23:22:51 1 2 3 4 5 6 7 8 9
23:22:51 1 2 3 4 5 6 7 8 9
23:22:51 1 2 3 4 5 6 7 8 9
23:22:51 1 2 3 4 5 6 7 8 9
23:22:51 1 2 3 4 5 6 7 8 9
23:22:51 1 2 3 4 5 6 7 8 9
23:22:51 1 2 3 4 5 6 7 8 9
23:22:51 1 2 3 4 5 6 7 8 9
23:22:51 1 2 3 4 5 6 7 8 9
23:22:51 1 2 3 4 5 6 7 8 9
23:22:51 1 2 3 4 5 6 7 8 9
23:22:51 1 2 3 4 5 6 7 8 9
23:22:51 1 2 3 4 5 6 7 8 9
23:22:51 1 2 3 4 5 6 7 8 9
23:22:51 1 2 3 4 5 6 7 8 9
23:22:51 1 2 3 4 5 6 7 8 9
23:22:51 1 2 3 4 5 6 7 8 9
23:22:51 1 2 3 4 5 6 7 8 9
23:22:51 1 2 3 4 5 6 7 8 9
23:22:51 1 2 3 4 5 6 7 8 9
23:22:51 1 2 3 4 5 6 7 8 9
23:22:51 1 2 3 4 5 6 7 8 9
23:22:51 1 2 3 4 5 6 7 8 9
23:22:51 1 2 3 4 5 6 7 8 9
23:22:51 1 2 3 4 5 6 7 8 9
23:22:51 1 2 3 4 5 6 7 8 9
23:22:51 1 2 3 4 5 6 7 8 9
23:22:51 1 2 3 4 5 6 7 8 9
23:22:51 1 2 3 4 5 6 7 8 9
23:22:51 1 2 3 4 5 6 7 8 9
23:22:51 1 2 3 4 5 6 7 8 9
23:22:51 1 2 3 4 5 6 7 8 9
23:22:51 1 2 3 4 5 6 7 8 9
23:22:51 1 2 3 4 5 6 7 8 9
23:22:51 1 2 3 4 5 6 7 8 9
23:22:51 1 2 3 4 5 6 7 8 9
23:22:51 1 2 3 4 5 6 7 8 9
23:22:51 1 2 3 4 5 6 7 8 9
23:22:51 1 2 3 4 5 6 7 8 9
23:22:51 1 2 3 4 5 6 7 8 9
23:22:51 1 2 3 4 5 6 7 8 9
23:22:51 1 2 3 4 5 6 7 8 9
23:22:51 1 2 3 4 5 6 7 8 9
23:22:51 1 2 3 4 5 6 7 8 9
23:22:51 1 2 3 4 5 6 7 8 9
23:22:51 1 2 3 4 5 6 7 8 9
23:22:51 1 2 3 4 5 6 7 8 9
23:22:51 1 2 3 4 5 6 7 8 9
23:22:51 1 2 3 4 5 6 7 8 9
23:22:51 1 2 3 4 5 6 7 8 9
23:22:51 1 2 3 4 5 6 7 8 9
23:22:51 1 2 3 4 5 6 7 8 9
23:22:51 1 2 3 4 5 6 7 8 9
23:22:51 1 2 3 4 5 6 7 8 9
23:22:51 1 2 3 4 5 6 7 8 9
23:22:51 1 2 3 4 5 6 7 8 9
23:22:51 1 2 3 4 5 6 7 8 9
23:22:51 1 2 3 4 5 6 7 8 9
23:22:51 1 2 3 4 5 6 7 8 9
23:22:51 1 2 3 4 5 6 7 8 9
23:22:51 1 2 3 4 5 6 7 8 9
23:22:51 1 2 3 4 5 6 7 8 9
23:22:51 1 2 3 4 5 6 7 8 9
23:22:51 1 2 3 4 5 6 7 8 9
23:22:51 1 2 3 4 5 6 7 8 9
23:22:51 1 2 3 4 5 6 7 8 9
23:22:51 1 2 3 4 5 6 7 8 9
23:22:51 1 2 3 4 5 6 7 8 9
23:22:51 1 2 3 4 5 6 7 8 9
23:22:51 1 2 3 4 5 6 7 8 9
23:22:51 1 2 3 4 5 6 7 8 9
23:22:51 1 2 3 4 5 6 7 8 9
23:22:51 1 2 3 4 5 6 7 8 9
23:22:51 1 2 3 4 5 6 7 8 9
23:22:51 1 2 3 4 5 6 7 8 9
23:22:51 1 2 3 4 5 6 7 8 9
23:22:51 1 2 3 4 5 6 7 8 9
23:22:51 1 2 3 4 5 6 7 8 9
23:22:51 1 2 3 4 5 6 7 8 9
23:22:51 1 2 3 4 5 6 7 8 9
23:22:51 1 2 3 4 5 6 7 8 9
23:22:51 1 2 3 4 5 6 7 8 9
23:22:51 1 2 3 4 5 6 7 8 9
23:22:51 1 2 3 4 5 6 7 8 9
23:22:51 1 2 3 4 5 6 7 8 9
23:22:51 1 2 3 4 5 6 7 8 9
23:22:51 1 2 3 4 5 6 7 8 9
23:22:51 1 2 3 4 5 6 7 8 9
23:22:51 1 2 3 4 5 6 7 8 9
23:22:51 1 2 3 4 5 6 7 8 9
23:22:51 1 2 3 4 5 6 7 8 9
23:22:51 1 2 3 4 5 6 7 8 9
23:22:51 1 2 3 4 5 6 7 8 9
23:22:51 1 2 3 4 5 6 7 8 9
23:22:51 1 2 3 4 5 6 7 8 9
23:22:51 1 2 3 4 5 6 7 8 9
23:22:51 1 2 3 4 5 6 7 8 9
23:22:51 1 2 3 4 5 6 7 8 9
23:22:51 1 2 3 4 5 6 7 8 9
23:22:51 1 2 3 4 5 6 7 8 9
23:22:51 1 2 3 4 5 6 7 8 9
23:22:51 1 2 3 4 5 6 7 8 9
23:22:51 1 2 3 4 5 6 7 8 9
23:22:51 1 2 3 4 5 6 7 8 9
23:22:51 1 2 3 4 5 6 7 8 9
23:22:51 1 2 3 4 5 6 7 8 9
23:22:51 1 2 3 4 5 6 7 8 9
23:22:51 1 2 3 4 5 6 7 8 9
23:22:51 1 2 3 4 5 6 7 8 9
23:22:51 1 2 3 4 5 6 7 8 9
23:22:51 Cforall Runtime error (UNIX pid:2813) Application interrupted by signal: Aborted.
23:22:51 Error occurred outside of any thread.
23:22:51 Stack back trace for: /var/lib/jenkins/workspace/Cforall_master@tmp/libcfa/x86-nodebug/src/.libs/libcfa.so.1
23:22:51 (0) [0xb7fdabd1]
23:22:51 (1) /lib/i386-linux-gnu/libc.so.6 : __read + 0x4f  [0xb7d75c6f]
23:22:51 1 2 3 4 5 6 7 [New LWP 2813]
23:22:51 [New LWP 2815]
23:22:51 [New LWP 2814]
23:22:51 [Thread debugging using libthread_db enabled]
23:22:51 Using host libthread_db library "/lib/i386-linux-gnu/libthread_db.so.1".
23:22:51 Core was generated by `/var/lib/jenkins/workspace/Cforall_master@tmp/tests/io/io-acquire'.
23:22:51 Program terminated with signal SIGABRT, Aborted.
23:22:51 #0  0xb7fdabd1 in __kernel_vsyscall ()
23:22:51 [Current thread is 1 (Thread 0xb7c81700 (LWP 2813))]
23:22:51 -----
23:22:51 #0  0xb7fdabd1 in __kernel_vsyscall ()
23:22:51 #1  0xb7ccbeb9 in __GI_raise (sig=6) at ../sysdeps/unix/sysv/linux/raise.c:54
23:22:51 #2  0xb7ccd417 in __GI_abort () at abort.c:89
23:22:51 #3  0xb7f5155c in _X7__abortFv_bPKcY17__builtin_va_list__1 (_X11signalAbortb_1=<optimized out>, _X3fmtPKc_1=<optimized out>, _X4argsY17__builtin_va_list_1=<optimized out>) at /var/lib/jenkins/workspace/Cforall_master/libcfa/src/interpose.cfa:264
23:22:51 #4  0xb7f51db6 in _X5abortFv_bPKc__1 (_X11signalAbortb_1=true, _X3fmtPKc_1=0xb7f646a0 "Application interrupted by signal: %s.\n") at /var/lib/jenkins/workspace/Cforall_master/libcfa/src/interpose.cfa:279
23:22:51 #5  0xb7f51f4a in _X15sigHandler_termFv_iPS13__anonymous18PS8ucontext__1 (_X3sigi_1=6, _X3sfpPS13__anonymous18_1=0xb7fa6d4c <stack+64300>, _X3cxtPS8ucontext_1=0xb7fa6dcc <stack+64428>) at /var/lib/jenkins/workspace/Cforall_master/libcfa/src/interpose.cfa:315
23:22:51 #6  <signal handler called>
23:22:51 #7  0xb7fdabd1 in __kernel_vsyscall ()
23:22:51 #8  0xb7d75c6f in read () at ../sysdeps/unix/syscall-template.S:84
23:22:51 #9  0xb7fb3d6c in read (__nbytes=8, __buf=0x806bca0, __fd=<optimized out>) at /usr/include/i386-linux-gnu/bits/unistd.h:44
23:22:51 #10 _X4mainFv_S14processorCtx_t__1 (_X6runnerS14processorCtx_t_1=<optimized out>) at /var/lib/jenkins/workspace/Cforall_master/libcfa/src/concurrency/kernel.cfa:238
23:22:51 #11 0xb7fbc1c2 in __cfactx_invoke_coroutine (main=0xb7fb38f0 <_X4mainFv_S14processorCtx_t__1>, this=0xb7fd6624 <_X21storage_mainProcessorA0c_1+36>) at /var/lib/jenkins/workspace/Cforall_master/libcfa/src/concurrency/invoke.c:46
23:22:51 #12 0x00000000 in ?? ()
23:22:51 -----
23:22:51   Id   Target Id                    Frame 
23:22:51 * 1    Thread 0xb7c81700 (LWP 2813) 0xb7fdabd1 in __kernel_vsyscall ()
23:22:51   2    Thread 0xb714cb00 (LWP 2815) 0xb7fdabd1 in __kernel_vsyscall ()
23:22:51   3    Thread 0xb794db00 (LWP 2814) 0xb7fdabd1 in __kernel_vsyscall ()
23:22:51 
23:22:51 Archiving io/io-acquire (executable and core) to crashes/full-nodebug/io/io-acquire
23:22:51 Tests took 14:12.306
23:22:51 Makefile:865: recipe for target 'all-tests' failed
23:22:51 make: *** [all-tests] Error 1
23:22:51 [Pipeline] }
23:22:51 [Pipeline] // dir
23:22:51 [Pipeline] }
23:22:51 [Pipeline] // stage
23:22:51 [Pipeline] echo
23:22:51 Archiving core dumps
23:22:51 [Pipeline] dir
23:22:51 Running in /var/lib/jenkins/workspace/Cforall_master@tmp
23:22:51 [Pipeline] {
23:22:51 [Pipeline] fileExists
23:22:51 [Pipeline] sh
23:22:51 + /var/lib/jenkins/workspace/Cforall_master/tools/jenkins/archive-gen.sh
23:22:51 [Pipeline] archiveArtifacts
23:22:51 Archiving artifacts
23:22:51 Recording fingerprints
23:22:51 [Pipeline] }
23:22:51 [Pipeline] // dir
23:22:51 [Pipeline] }
23:22:51 [Pipeline] // wrap
23:22:51 [Pipeline] }
23:22:51 [Pipeline] // node
23:22:51 [Pipeline] echo
23:22:51 hudson.AbortException: script returned exit code 2
23:22:51 [Pipeline] node
23:22:51 Running on Brokk 5 in /var/lib/jenkins/workspace/Cforall_master
23:22:51 [Pipeline] {
23:22:51 [Pipeline] echo
23:22:51 Notifying users of result
23:22:51 [Pipeline] echo
23:22:51 Reusing previously constructed message
23:22:51 [Pipeline] echo
23:22:51 Would send email to: cforall@lists.uwaterloo.ca
23:22:51 [Pipeline] echo
23:22:51 With title: [cforall git][BUILD# 16403 - FAILURE] - branch master
23:22:51 [Pipeline] echo
23:22:51 Content: 
23:22:51 <p>This is an automated email from the Jenkins build machine. It was
23:22:51 generated because of a git hooks/post-receive script following
23:22:51 a ref change which was pushed to the C∀ repository.</p>
23:22:51 
23:22:51 <p>- Status --------------------------------------------------------------</p>
23:22:51 
23:22:51 <p>BUILD# 16403 - FAILURE</p>
23:22:51 <p>Check console output at https://cforall.uwaterloo.ca/jenkins/job/Cforall/job/master/16403/ to view the results.</p>
23:22:51 
23:22:51 <p>- Changes -------------------------------------------------------------</p>
23:22:51 
23:22:51 <pre>
23:22:51 The branch master has been updated.
23:22:51       from  b8454c6aa02e82fa4ba491124611cebb978472cf (commit)
23:22:51 </pre>
23:22:51 
23:22:51 <p>- Log -----------------------------------------------------------------</p>
23:22:51 
23:22:51 <pre>
23:22:51 
23:22:51 </pre>
23:22:51 
23:22:51 <p>-----------------------------------------------------------------------</p>
23:22:51 <pre>
23:22:51 Summary of changes:
23:22:51 
23:22:51 </pre>
23:22:51 
23:22:51 [Pipeline] }
23:22:51 [Pipeline] // node
23:22:51 [Pipeline] echo
23:22:51 Build Completed
23:22:51 [Pipeline] End of Pipeline
23:22:51 ERROR: script returned exit code 2
23:22:51 Finished: FAILURE
[Pipeline] error
[Pipeline] }
23:22:51 Failed in branch gcc_07_x86_new
[Pipeline] // parallel
[Pipeline] }
[Pipeline] // stage
[Pipeline] }
[Pipeline] // wrap
[Pipeline] echo
error caught
[Pipeline] node
Running on Brokk 4 in /var/lib/jenkins/workspace/Cforall_Full_Build
[Pipeline] {
[Pipeline] echo
notifying users
[Pipeline] emailext
Sending email to: cforall@lists.uwaterloo.ca
[Pipeline] }
[Pipeline] // node
[Pipeline] }
[Pipeline] // node
[Pipeline] End of Pipeline
ERROR: FAILURE
Finished: FAILURE