Console Output

Skipping 6,334 KB.. Full Log
23:37:53        	collections/atomic_mpsc                    PASSED     C 0:18.731 - R 0:01.117
23:37:53        	alloc                                      PASSED     C 0:28.185 - R 0:00.005
23:37:53        	collections/queue                          PASSED     C 0:21.632 - R 0:00.005
23:37:53        	collections/vector-err-pass-perm-it-byval  PASSED     C 0:01.878 - R n/a
23:37:53        	collections/vector-err-retn-perm-it-byval  PASSED     C 0:01.524 - R n/a
23:37:53        	collections/vector-demo                    PASSED     C 0:07.429 - R 0:00.005
23:37:53        	collections/sequence                       PASSED     C 0:23.143 - R 0:00.004
23:37:53        	collections/stack                          PASSED     C 0:18.429 - R 0:00.005
23:37:53        	concurrent/clib_tls                        PASSED     C 0:07.220 - R 0:00.009
23:37:53        	concurrent/clib                            PASSED     C 0:07.388 - R 0:00.033
23:37:53        	collections/string-api-coverage            PASSED     C 0:19.391 - R 0:00.010
23:37:53        	complex                                    PASSED     C 0:13.682 - R 0:00.034
23:37:53        	alloc2                                     PASSED     C 0:59.681 - R 0:00.009
23:37:53        	concurrent/cluster                         PASSED     C 0:21.946 - R 0:00.010
23:37:53        	concurrent/coroutineYield                  PASSED     C 0:25.736 - R 0:00.017
23:37:53        	concurrent/examples/boundedBufferEXT       PASSED     C 0:25.725 - R 0:01.429
23:37:53        	concurrent/examples/datingService          PASSED     C 0:24.078 - R 0:00.004
23:37:53        	concurrent/examples/boundedBufferINT       PASSED     C 0:24.174 - R 0:01.518
23:37:53        	concurrent/futures/abandon                 PASSED     C 0:13.716 - R 0:00.017
23:37:53        	concurrent/examples/gortn                  PASSED     C 0:24.346 - R 0:00.004
23:37:53        	concurrent/futures/basic                   PASSED     C 0:13.860 - R 0:00.017
23:37:53        	concurrent/keywordErrors                   PASSED     C 0:00.316 - R n/a
23:37:53        	concurrent/examples/matrixSum              PASSED     C 0:20.885 - R 0:00.005
23:37:53        	concurrent/futures/multi                   PASSED     C 0:14.986 - R 0:00.004
23:37:53        	concurrent/examples/quickSort              PASSED     C 0:22.383 - R 0:00.004
23:37:53        	concurrent/futures/typed                   PASSED     C 0:18.074 - R 0:00.025
23:37:53        	concurrent/mutexstmt/monitors              PASSED     C 0:15.118 - R 0:00.667
23:37:53        	concurrent/mutexstmt/locks                 PASSED     C 0:21.262 - R 0:01.135
23:37:53        	concurrent/join                            PASSED     C 0:25.760 - R 0:00.004
23:37:53        	concurrent/monitor                         PASSED     C 0:24.793 - R 0:02.618
23:37:53        	concurrent/multi-monitor                   PASSED     C 0:24.467 - R 0:04.673
23:37:53        	concurrent/park/contention                 PASSED     C 0:12.574 - R 0:00.033
23:37:53        	concurrent/park/start_parked               PASSED     C 0:12.968 - R 0:00.009
23:37:53        	concurrent/park/force_preempt              PASSED     C 0:21.742 - R 0:00.266
23:37:53        	concurrent/signal/disjoint                 PASSED     C 0:21.967 - R 0:00.467
23:37:53        	concurrent/signal/block                    PASSED     C 0:25.165 - R 0:00.316
23:37:53        	concurrent/preempt                         PASSED     C 0:16.605 - R 0:15.638
23:37:53        	concurrent/semaphore                       PASSED     C 0:33.004 - R 0:00.005
23:37:53        	concurrent/signal/wait                     PASSED     C 0:32.067 - R 0:00.065
23:37:53        	concurrent/sleep                           PASSED     C 0:26.718 - R 0:01.121
23:37:53        	concurrent/spinaphore                      PASSED     C 0:20.085 - R 0:00.065
23:37:53        	concurrent/suspend_then                    PASSED     C 0:20.231 - R 0:00.034
23:37:53        	concurrent/thread                          PASSED     C 0:34.385 - R 0:00.006
23:37:53        	concurrent/waitfor/barge                   PASSED     C 0:31.552 - R 0:00.065
23:37:53        	concurrent/waitfor/else                    PASSED     C 0:20.824 - R 0:00.004
23:37:53        	concurrent/waitfor/dtor                    PASSED     C 0:23.134 - R 0:00.215
23:37:53        	const-init                                 PASSED     C 0:01.005 - R 0:00.004
23:37:53        	concurrent/waitfor/statment                PASSED     C 0:18.748 - R 0:00.008
23:37:53        	concurrent/waitfor/recurse                 PASSED     C 0:21.563 - R 0:00.970
23:37:53        	copyfile                                   PASSED     C 0:12.042 - R 0:00.006
23:37:53        	coroutine/devicedriver                     PASSED     C 0:12.523 - R 0:00.004
23:37:53        	coroutine/fibonacci                        PASSED     C 0:12.525 - R 0:00.004
23:37:53        	coroutine/fmtLines                         PASSED     C 0:12.170 - R 0:00.004
23:37:53        	coroutine/pingpong                         PASSED     C 0:11.315 - R 0:00.004
23:37:53        	designations                               PASSED     C 0:01.053 - R 0:00.004
23:37:53        	concurrent/waitfor/when                    PASSED     C 0:16.289 - R 0:00.033
23:37:53        	counter                                    PASSED     C 0:11.073 - R 0:00.010
23:37:53        	enum                                       PASSED     C 0:01.194 - R 0:00.004
23:37:53        	coroutine/runningTotal                     PASSED     C 0:12.854 - R 0:00.004
23:37:53        	errors/declaration                         PASSED     C 0:00.074 - R n/a
23:37:53        	errors/scope                               PASSED     C 0:00.144 - R n/a
23:37:53        	errors/signature                           PASSED     C 0:00.100 - R n/a
23:37:53        	coroutine/raii                             PASSED     C 0:13.796 - R 0:00.004
23:37:53        	exceptions/conditional                     PASSED     C 0:01.620 - R 0:00.006
23:37:53        	div                                        PASSED     C 0:13.840 - R 0:00.004
23:37:53        	coroutine/prodcons                         PASSED     C 0:17.380 - R 0:00.004
23:37:53        	device/cpu                                 PASSED     C 0:14.869 - R 0:00.004
23:37:53        	exceptions/data-except                     PASSED     C 0:00.921 - R 0:00.004
23:37:53        	exceptions/finally                         PASSED     C 0:01.325 - R 0:00.004
23:37:53        	exceptions/finally-error                   PASSED     C 0:00.209 - R n/a
23:37:53        	exceptions/defaults                        PASSED     C 0:02.740 - R 0:00.005
23:37:53        	exceptions/cancel/coroutine                PASSED     C 0:06.302 - R 0:00.004
23:37:53        	exceptions/interact                        PASSED     C 0:04.837 - R 0:00.006
23:37:53        	exceptions/polymorphic                     PASSED     C 0:04.932 - R 0:00.005
23:37:53        	exceptions/defaults-threads                PASSED     C 0:10.992 - R 0:00.011
23:37:53        	exceptions/conditional-threads             PASSED     C 0:12.321 - R 0:00.011
23:37:53        	exceptions/resume                          PASSED     C 0:04.424 - R 0:00.011
23:37:53        	exceptions/finally-threads                 PASSED     C 0:11.038 - R 0:00.005
23:37:53        	exceptions/type-check                      PASSED     C 0:00.195 - R n/a
23:37:53        	exceptions/cancel/thread                   PASSED     C 0:16.931 - R 0:00.004
23:37:53        	exceptions/terminate                       PASSED     C 0:02.498 - R 0:00.005
23:37:53        	exceptions/trash                           PASSED     C 0:01.735 - R 0:00.004
23:37:53        	exceptions/resume-threads                  PASSED     C 0:06.931 - R 0:00.007
23:37:53        	expression                                 PASSED     C 0:01.225 - R 0:00.002
23:37:53        	exceptions/virtual-poly                    PASSED     C 0:01.520 - R 0:00.004
23:37:53        	exceptions/virtual-cast                    PASSED     C 0:02.361 - R 0:00.004
23:37:53        	forall                                     PASSED     C 0:02.437 - R 0:00.001
23:37:53        	exceptions/terminate-threads               PASSED     C 0:06.747 - R 0:00.004
23:37:53        	fallthrough                                PASSED     C 0:13.348 - R 0:00.006
23:37:53        	generator/fibonacci                        PASSED     C 0:11.476 - R 0:00.004
23:37:53        	fstream_test                               PASSED     C 0:12.437 - R 0:00.005
23:37:53        	generator/fmtLines                         PASSED     C 0:10.411 - R 0:00.004
23:37:53        	generator/suspend_then                     PASSED     C 0:09.584 - R 0:00.004
23:37:53        	global-monomorph                           PASSED     C 0:00.895 - R 0:00.004
23:37:53        	genericUnion                               PASSED     C 0:00.962 - R 0:00.004
23:37:53        	identFuncDeclarator                        PASSED     C 0:00.786 - R 0:00.001
23:37:53        	function-operator                          PASSED     C 0:14.925 - R 0:00.004
23:37:53        	identParamDeclarator                       PASSED     C 0:01.852 - R 0:00.004
23:37:53        	hello                                      PASSED     C 0:09.405 - R 0:00.005
23:37:53        	identity                                   PASSED     C 0:09.117 - R 0:00.004
23:37:53        	ifwhileCtl                                 PASSED     C 0:08.967 - R 0:00.005
23:37:53        	include/vector-sequence                    PASSED     C 0:02.262 - R 0:00.006
23:37:53        	init1                                      PASSED     C 0:01.108 - R 0:00.001
23:37:53        	init1-ERROR                                PASSED     C 0:00.355 - R n/a
23:37:53        	include/vector-containers                  PASSED     C 0:04.887 - R 0:00.002
23:37:53        	include/stdincludes                        PASSED     C 0:12.489 - R 0:00.002
23:37:53        	include/vector-fstream                     PASSED     C 0:11.815 - R 0:00.013
23:37:53        	heap                                       PASSED     C 0:15.520 - R 0:12.096
23:37:53        	labelledExit                               PASSED     C 0:01.998 - R 0:00.002
23:37:53        	limits                                     PASSED     C 0:02.176 - R 0:00.002
23:37:53        	linking/exception-nothreads                PASSED     C 0:03.476 - R 0:00.005
23:37:53        	linking/exception-withthreads              PASSED     C 0:10.152 - R 0:00.008
23:37:53        	io/manipulatorsOutput4                     PASSED     C 0:31.278 - R 0:00.066
23:37:53        	io/io-acquire                              PASSED     C 0:31.917 - R 0:00.033
23:37:53        	linking/nostdlib                           PASSED     C 0:01.089 - R 0:00.004
23:37:53        	io/many_read                               PASSED     C 0:26.258 - R 0:00.004
23:37:53        	include/includes                           PASSED     C 0:46.090 - R 0:00.001
23:37:53        	io/io                                      PASSED     C 0:36.393 - R 0:00.004
23:37:53        	linkonce                                   PASSED     C 0:02.303 - R 0:00.006
23:37:53        	linking/weakso_nothd                       PASSED     C 0:13.767 - R 0:00.004
23:37:53        	linking/io-acquire                         PASSED     C 0:16.410 - R 0:00.005
23:37:53        	linking/nothreads                          PASSED     C 0:15.616 - R 0:00.004
23:37:53        	literals                                   PASSED     C 0:11.284 - R 0:00.005
23:37:53        	maybe                                      PASSED     C 0:01.650 - R 0:00.004
23:37:53        	nested-types                               PASSED     C 0:01.576 - R 0:00.001
23:37:53        	linking/withthreads                        PASSED     C 0:17.236 - R 0:00.004
23:37:53        	nested-types-ERR1                          PASSED     C 0:00.074 - R n/a
23:37:53        	nested-types-ERR2                          PASSED     C 0:00.092 - R n/a
23:37:53        	numericConstants                           PASSED     C 0:01.451 - R 0:00.002
23:37:53        	operators                                  PASSED     C 0:01.493 - R 0:00.002
23:37:53        	poly-d-cycle                               PASSED     C 0:01.534 - R 0:00.004
23:37:53        	list/dlist-insert-remove                   PASSED     C 0:21.877 - R 0:00.008
23:37:53        	poly-o-cycle                               PASSED     C 0:03.533 - R 0:00.004
23:37:53        	poly-selection                             PASSED     C 0:01.568 - R 0:00.004
23:37:53        	quasiKeyword                               PASSED     C 0:01.016 - R 0:00.001
23:37:53        	malloc                                     PASSED     C 0:13.083 - R 0:00.004
23:37:53        	loopctrl                                   PASSED     C 0:13.810 - R 0:00.004
23:37:53        	minmax                                     PASSED     C 0:13.478 - R 0:00.004
23:37:53        	raii/ctor-autogen-ERR1                     PASSED     C 0:00.520 - R n/a
23:37:53        	raii/ctor-autogen                          PASSED     C 0:03.737 - R 0:00.004
23:37:53        	polymorphism                               PASSED     C 0:09.901 - R 0:00.005
23:37:53        	raii/dtor-early-exit-ERR1                  PASSED     C 0:06.535 - R n/a
23:37:53        	quotedKeyword                              PASSED     C 0:13.400 - R 0:00.011
23:37:53        	raii/dtor-early-exit-ERR2                  PASSED     C 0:06.294 - R n/a
23:37:53        	raii/memberCtors                           PASSED     C 0:01.588 - R 0:00.005
23:37:53        	raii/boxed-types                           PASSED     C 0:15.086 - R 0:00.009
23:37:53        	parseconfig                                FAILED with code -6    C 0:16.360 - R 0:06.396
23:37:53 Different types of destination addresses
23:37:53 Stop cost: 1
23:37:53 Number of students: 2
23:37:53 Number of stops: 2
23:37:53 Maximum number of students: 5
23:37:53 Timer delay: 2
23:37:53 Groupoff delay: 10
23:37:53 Conductor delay: 5
23:37:53 Parental delay: 5
23:37:53 Number of couriers: 1
23:37:53 Maximum student delay: 10
23:37:53 Maximum student trips: 3
23:37:53 
23:37:53 Open_Failure thrown when config file does not exist
23:37:53 Cforall Runtime error (UNIX pid:10307) Null pointer (0p) dereference.
23:37:53 Stack back trace for: /var/lib/jenkins/workspace/Cforall_master@tmp/libcfa/x86-nodebug/src/.libs/libcfa.so.1
23:37:53 (0) /lib/i386-linux-gnu/libc.so.6 : __isoc99_vfscanf + 0x17  [0xb7d1b3f7]
23:37:53 (1) /var/lib/jenkins/workspace/Cforall_master@tmp/libcfa/x86-nodebug/src/.libs/libcfa.so.1 : _X3fmtFi_S8ifstreamPKc__1 + 0x25  [0xb7f41d35]
23:37:53 (2) /var/lib/jenkins/workspace/Cforall_master@tmp/libcfa/x86-nodebug/src/.libs/libcfa.so.1 : _X15_operator_bitorQ1_0_0_7__X6getANLFb_BD0__X4nlOnFv_BD0__X5nlOffFv_BD0__X4endsFv_BD0__X3fmtFi_BD0PKc__X6ungetcFBD0_BD0c__X3eofFb_BD0__FBD0_BD0Pc__1 + 0x22  [0xb7f51082]
23:37:53 (3) /var/lib/jenkins/workspace/Cforall_master@tmp/libcfa/x86-nodebug/src/.libs/libcfa.so.1 : _X15_operator_bitorQ1_0_0_7__X6getANLFb_BD0__X4nlOnFv_BD0__X5nlOffFv_BD0__X4endsFv_BD0__X3fmtFi_BD0PKc__X6ungetcFBD0_BD0c__X3eofFb_BD0__Fv_BD0Pc__1 + 0x3c  [0xb7f510cc]
23:37:53 (4) /var/lib/jenkins/workspace/Cforall_master@tmp/libcfa/x86-nodebug/src/.libs/libcfa.so.1 : _X8commentsFb_S8ifstreamPc__1 + 0xb2  [0xb7f578f2]
23:37:53 (5) /var/lib/jenkins/workspace/Cforall_master@tmp/libcfa/x86-nodebug/src/.libs/libcfa.so.1 :  + 0x50a17  [0xb7f57a17]
23:37:53 (6) /var/lib/jenkins/workspace/Cforall_master@tmp/libcfa/x86-nodebug/src/.libs/libcfa.so.1 : __cfaehm_try_terminate + 0x16  [0xb7f7e196]
23:37:53 (7) /var/lib/jenkins/workspace/Cforall_master@tmp/libcfa/x86-nodebug/src/.libs/libcfa.so.1 : _X27parse_tabular_config_formatFPS7KVPairs_PKcj__1 + 0xc0  [0xb7f57b10]
23:37:53 (8) /var/lib/jenkins/workspace/Cforall_master@tmp/libcfa/x86-nodebug/src/.libs/libcfa.so.1 : _X12parse_configFv_PKcPS12config_entryjFPS7KVPairs_PKcj___1 + 0x32  [0xb7f57bb2]
23:37:53 (9) /var/lib/jenkins/workspace/Cforall_master@tmp/tests/parseconfig() [0x804a588]
23:37:53 (10) /var/lib/jenkins/workspace/Cforall_master@tmp/libcfa/x86-nodebug/src/.libs/libcfa.so.1 : __cfaehm_try_terminate + 0x16  [0xb7f7e196]
23:37:53 [New LWP 10307]
23:37:53 [Thread debugging using libthread_db enabled]
23:37:53 Using host libthread_db library "/lib/i386-linux-gnu/libthread_db.so.1".
23:37:53 Core was generated by `/var/lib/jenkins/workspace/Cforall_master@tmp/tests/parseconfig'.
23:37:53 Program terminated with signal SIGABRT, Aborted.
23:37:53 #0  0xb7fd9cf5 in __kernel_vsyscall ()
23:37:53 -----
23:37:53 #0  0xb7fd9cf5 in __kernel_vsyscall ()
23:37:53 #1  0xb7ceaeb9 in __GI_raise (sig=6) at ../sysdeps/unix/sysv/linux/raise.c:54
23:37:53 #2  0xb7cec417 in __GI_abort () at abort.c:89
23:37:53 #3  0xb7f7e2cf in _X7__abortFv_bPKcY17__builtin_va_list__1 (_X11signalAbortb_1=<optimized out>, _X3fmtPKc_1=<optimized out>, _X4argsY17__builtin_va_list_1=<optimized out>) at /var/lib/jenkins/workspace/Cforall_master/libcfa/src/interpose.cfa:241
23:37:53 #4  0xb7f7ecb6 in _X5abortFv_bPKc__1 (_X11signalAbortb_1=true, _X3fmtPKc_1=0xb7f915a0 "Application interrupted by signal: %s.\n") at /var/lib/jenkins/workspace/Cforall_master/libcfa/src/interpose.cfa:279
23:37:53 #5  0xb7f7ee4a in _X15sigHandler_termFv_iPS13__anonymous18PS8ucontext__1 (_X3sigi_1=6, _X3sfpPS13__anonymous18_1=0xb7fd384c <stack+63020>, _X3cxtPS8ucontext_1=0xb7fd38cc <stack+63148>) at /var/lib/jenkins/workspace/Cforall_master/libcfa/src/interpose.cfa:315
23:37:53 #6  <signal handler called>
23:37:53 #7  0xb7fd9cf5 in __kernel_vsyscall ()
23:37:53 #8  0xb7ceaeb9 in __GI_raise (sig=6) at ../sysdeps/unix/sysv/linux/raise.c:54
23:37:53 #9  0xb7cec417 in __GI_abort () at abort.c:89
23:37:53 #10 0xb7f7e45c in _X7__abortFv_bPKcY17__builtin_va_list__1 (_X11signalAbortb_1=<optimized out>, _X3fmtPKc_1=<optimized out>, _X4argsY17__builtin_va_list_1=<optimized out>) at /var/lib/jenkins/workspace/Cforall_master/libcfa/src/interpose.cfa:264
23:37:53 #11 0xb7f7ecb6 in _X5abortFv_bPKc__1 (_X11signalAbortb_1=true, _X3fmtPKc_1=0xb7f91454 "Null pointer (0p) dereference.\n") at /var/lib/jenkins/workspace/Cforall_master/libcfa/src/interpose.cfa:279
23:37:53 #12 0xb7f7ed41 in _X15sigHandler_segvFv_iPS13__anonymous18PS8ucontext__1 (_X3sigi_1=11, _X3sfpPS13__anonymous18_1=0xb7fd3e8c <stack+64620>, _X3cxtPS8ucontext_1=0xb7fd3f0c <stack+64748>) at /var/lib/jenkins/workspace/Cforall_master/libcfa/src/interpose.cfa:286
23:37:53 #13 <signal handler called>
23:37:53 #14 __GI___isoc99_vfscanf (stream=0x0, format=0xb7f8fdc1 "%s", args=0xbfffee58 "\\\357\377\277`\245\005\b\260\225Ò·f", <incomplete sequence \365\267>) at isoc99_vfscanf.c:28
23:37:53 #15 0xb7f41d35 in _X3fmtFi_S8ifstreamPKc__1 (_X2isS8ifstream_1=0xbffff100, _X6formatPKc_1=0xb7f8fdc1 "%s") at /var/lib/jenkins/workspace/Cforall_master/libcfa/src/fstream.cfa:316
23:37:53 #16 0xb7f51082 in _X15_operator_bitorQ1_0_0_7__X6getANLFb_BD0__X4nlOnFv_BD0__X5nlOffFv_BD0__X4endsFv_BD0__X3fmtFi_BD0PKc__X6ungetcFBD0_BD0c__X3eofFb_BD0__FBD0_BD0Pc__1 (_X6getANLFb_Y6istype__1=0xb7f41820 <_X6getANLFb_S8ifstream__1>, _X4nlOnFv_Y6istype__1=0xb7f41800 <_X4nlOnFv_S8ifstream__1>, _X5nlOffFv_Y6istype__1=0xb7f41810 <_X5nlOffFv_S8ifstream__1>, _X4endsFv_Y6istype__1=0xb7f41890 <_X4endsFv_S8ifstream__1>, _X3fmtFi_Y6istypePKc__1=0xb7f41d10 <_X3fmtFi_S8ifstreamPKc__1>, _X6ungetcFY6istype_Y6istypec__1=0xb7f419e0 <_X6ungetcFS8ifstream_S8ifstreamc__1>, _X3eofFb_Y6istype__1=0xb7f418d0 <_X3eofFb_S8ifstream__1>, _X2isY6istype_1=0xbffff100, _X1sPc_1=0xbfffef5c "") from /var/lib/jenkins/workspace/Cforall_master@tmp/libcfa/x86-nodebug/src/.libs/libcfa.so.1
23:37:53 #17 0xb7f510cc in _X15_operator_bitorQ1_0_0_7__X6getANLFb_BD0__X4nlOnFv_BD0__X5nlOffFv_BD0__X4endsFv_BD0__X3fmtFi_BD0PKc__X6ungetcFBD0_BD0c__X3eofFb_BD0__Fv_BD0Pc__1 (_X6getANLFb_Y6istype__1=0xb7f41820 <_X6getANLFb_S8ifstream__1>, _X4nlOnFv_Y6istype__1=0xb7f41800 <_X4nlOnFv_S8ifstream__1>, _X5nlOffFv_Y6istype__1=0xb7f41810 <_X5nlOffFv_S8ifstream__1>, _X4endsFv_Y6istype__1=0xb7f41890 <_X4endsFv_S8ifstream__1>, _X3fmtFi_Y6istypePKc__1=0xb7f41d10 <_X3fmtFi_S8ifstreamPKc__1>, _X6ungetcFY6istype_Y6istypec__1=0xb7f419e0 <_X6ungetcFS8ifstream_S8ifstreamc__1>, _X3eofFb_Y6istype__1=0xb7f418d0 <_X3eofFb_S8ifstream__1>, _X2isY6istype_1=0xbffff100, _X1sPc_1=0xbfffef5c "") from /var/lib/jenkins/workspace/Cforall_master@tmp/libcfa/x86-nodebug/src/.libs/libcfa.so.1
23:37:53 #18 0xb7f578f2 in _X8commentsFb_S8ifstreamPc__1 (_X2inS8ifstream_1=0xbffff100, _X4namePc_1=0xbfffef5c "") at /var/lib/jenkins/workspace/Cforall_master/libcfa/src/parseconfig.cfa:113
23:37:53 #19 0xb7f57a17 in try () at /var/lib/jenkins/workspace/Cforall_master/libcfa/src/parseconfig.cfa:135
23:37:53 #20 0xb7f7e196 in __cfaehm_try_terminate (try_block=0xbffff13c, catch_block=0xbffff132, match_block=0xbffff128) at /var/lib/jenkins/workspace/Cforall_master/libcfa/src/exception.c:502
23:37:53 #21 0xb7f57b10 in _X27parse_tabular_config_formatFPS7KVPairs_PKcj__1 (_X11config_filePKc_1=0x804c478 "/var/lib/jenkins/workspace/Cforall_master/tests/.in/doesnt-exist.txt", _X11num_entriesj_1=11) at /var/lib/jenkins/workspace/Cforall_master/libcfa/src/parseconfig.cfa:121
23:37:53 #22 0xb7f57bb2 in _X12parse_configFv_PKcPS12config_entryjFPS7KVPairs_PKcj___1 (_X11config_filePKc_1=0x804c478 "/var/lib/jenkins/workspace/Cforall_master/tests/.in/doesnt-exist.txt", _X7entriesPS12config_entry_1=0xbffff29c, _X11num_entriesj_1=11, _X6parserFPS7KVPairs_PKcj__1=0x8049fa0 <_X27parse_tabular_config_formatFPS7KVPairs_PKcj__1@plt>) at /var/lib/jenkins/workspace/Cforall_master/libcfa/src/parseconfig.cfa:159
23:37:53 #23 0x0804a588 in try () at parseconfig.cfa:70
23:37:53 #24 0xb7f7e196 in __cfaehm_try_terminate (try_block=0xbffff28e, catch_block=0x804a770 <catch>, match_block=0x804a6d0 <match>) at /var/lib/jenkins/workspace/Cforall_master/libcfa/src/exception.c:502
23:37:53 #25 0x0804b916 in _X4mainFi___1 () at parseconfig.cfa:21
23:37:53 #26 0x0804a2fe in invoke_main (argc=1, argv=0xbffff424, envp=0xbffff42c) at parseconfig.cfa:23
23:37:53 #27 main (_X4argci_1=1, _X4argvPPc_1=0xbffff424, _X4envpPPc_1=0xbffff42c) at parseconfig.cfa:44
23:37:53 -----
23:37:53   Id   Target Id                     Frame 
23:37:53 * 1    Thread 0xb7ca1940 (LWP 10307) 0xb7fd9cf5 in __kernel_vsyscall ()
23:37:53 
23:37:53 Archiving parseconfig (executable and core) to crashes/full-nodebug/parseconfig
23:37:53        	raii/init_once                             PASSED     C 0:02.005 - R 0:00.004
23:37:53        	raii/memberCtors-ERR1                      PASSED     C 0:00.504 - R n/a
23:37:53        	raii/dtor-early-exit                       PASSED     C 0:15.449 - R 0:00.004
23:37:53        	result                                     PASSED     C 0:02.557 - R 0:00.005
23:37:53        	simpleGenericTriple                        PASSED     C 0:02.972 - R 0:00.004
23:37:53        	raii/globals                               PASSED     C 0:10.363 - R 0:00.004
23:37:53        	smart-pointers                             PASSED     C 0:02.902 - R 0:00.005
23:37:53        	references                                 PASSED     C 0:11.884 - R 0:00.004
23:37:53        	shortCircuit                               PASSED     C 0:10.697 - R 0:00.005
23:37:53        	switch                                     PASSED     C 0:01.612 - R 0:00.001
23:37:53        	strstream                                  PASSED     C 0:19.057 - R 0:00.009
23:37:53        	searchsort                                 PASSED     C 0:24.484 - R 0:00.005
23:37:53        	sum                                        PASSED     C 0:18.858 - R 0:00.004
23:37:53        	tuple/tupleCast                            PASSED     C 0:02.968 - R 0:00.005
23:37:53        	time                                       PASSED     C 0:14.739 - R 0:00.004
23:37:53        	tuple/tupleFunction                        PASSED     C 0:01.363 - R 0:00.004
23:37:53        	tuple/tupleMember                          PASSED     C 0:01.038 - R 0:00.004
23:37:53        	typedefRedef                               PASSED     C 0:01.805 - R 0:00.003
23:37:53        	typedefRedef-ERR1                          PASSED     C 0:00.085 - R n/a
23:37:53        	swap                                       PASSED     C 0:19.819 - R 0:00.004
23:37:53        	tuple/tuplePolymorphism                    PASSED     C 0:03.639 - R 0:00.003
23:37:53        	typeof                                     PASSED     C 0:02.043 - R 0:00.002
23:37:53        	tuple/tupleVariadic                        PASSED     C 0:04.839 - R 0:00.009
23:37:53        	tuple/tupleAssign                          PASSED     C 0:18.010 - R 0:00.005
23:37:53        	rational                                   PASSED     C 1:05.261 - R 0:00.004
23:37:53        	unified_locking/fast                       PASSED     C 0:35.889 - R 0:00.009
23:37:53        	unified_locking/lin_backoff                PASSED     C 0:35.492 - R 0:00.009
23:37:53        	unified_locking/timeout_lock               PASSED     C 0:24.800 - R 0:01.074
23:37:53        	unified_locking/mcs                        PASSED     C 0:34.864 - R 0:01.520
23:37:53        	variableDeclarator                         PASSED     C 0:03.156 - R 0:00.001
23:37:53        	unified_locking/locks                      PASSED     C 0:37.876 - R 0:05.881
23:37:53        	userLiterals                               PASSED     C 0:15.927 - R 0:00.010
23:37:53        	vector                                     PASSED     C 0:15.585 - R 0:00.005
23:37:53        	vector_math/vec2_double                    PASSED     C 0:17.206 - R 0:00.004
23:37:53        	vector_math/vec2_uint                      PASSED     C 0:15.885 - R 0:00.004
23:37:53        	vector_math/vec2_float                     PASSED     C 0:44.802 - R 0:00.004
23:37:53        	voidPtr                                    PASSED     C 0:01.570 - R 0:00.010
23:37:53        	vector_math/vec2_int                       PASSED     C 0:48.040 - R 0:00.006
23:37:53        	warnings/self-assignment                   PASSED     C 0:02.519 - R 0:00.003
23:37:53        	KRfunctions                                PASSED     C 0:00.609 - R 0:00.003
23:37:53        	vector_math/vec3_int                       PASSED     C 0:52.277 - R 0:00.005
23:37:53        	vector_math/vec3_float                     PASSED     C 0:56.387 - R 0:00.006
23:37:53        	attributes                                 PASSED     C 0:01.554 - R 0:00.048
23:37:53        	array-container/array-md-sbscr-cases       PASSED     C 0:26.349 - R 0:00.011
23:37:53        	abs                                        PASSED     C 0:35.930 - R 0:00.010
23:37:53        	vector_math/vec4_float                     PASSED     C 1:16.000 - R 0:00.011
23:37:53        	declarationSpecifier                       PASSED     C 0:00.706 - R 0:00.049
23:37:53        	errors/completeType                        PASSED     C 0:00.342 - R n/a
23:37:53        	vector_math/vec4_int                       PASSED     C 1:10.931 - R 0:00.005
23:37:53        	extension                                  PASSED     C 0:00.685 - R 0:00.001
23:37:53        	functions                                  PASSED     C 0:00.682 - R 0:00.003
23:37:53        	ato                                        PASSED     C 0:28.678 - R 0:00.005
23:37:53        	gccExtensions                              PASSED     C 0:00.768 - R 0:00.001
23:37:53        	bitmanip2                                  PASSED     C 0:30.474 - R 0:00.067
23:37:53        	bitmanip1                                  PASSED     C 0:37.590 - R 0:00.008
23:37:53        	io/manipulatorsInput                       PASSED     C 0:21.868 - R 0:00.011
23:37:53        	meta/archVast                              PASSED     C 0:00.396 - R n/a
23:37:53        	bitmanip3                                  PASSED     C 0:53.293 - R 0:00.017
23:37:53        	io/manipulatorsOutput2                     PASSED     C 0:57.065 - R 0:00.004
23:37:53        	random                                     PASSED     C 0:35.207 - R 0:00.005
23:37:53        	math                                       PASSED     C 0:49.198 - R 0:00.005
23:37:53        	mathX                                      PASSED     C 0:55.446 - R 0:00.018
23:37:53        	vector_math/vec2_ldouble                   PASSED     C 0:32.641 - R 0:00.010
23:37:53        	io/manipulatorsOutput1                     PASSED     C 1:40.719 - R 0:00.006
23:37:53 Tests took  9:51.269
23:37:53 Makefile:862: recipe for target 'all-tests' failed
23:37:53 make: *** [all-tests] Error 1
23:37:53 [Pipeline] }
23:37:53 [Pipeline] // dir
23:37:53 [Pipeline] }
23:37:53 [Pipeline] // stage
23:37:53 [Pipeline] echo
23:37:53 Archiving core dumps
23:37:53 [Pipeline] dir
23:37:53 Running in /var/lib/jenkins/workspace/Cforall_master@tmp
23:37:53 [Pipeline] {
23:37:53 [Pipeline] fileExists
23:37:53 [Pipeline] sh
23:37:53 + /var/lib/jenkins/workspace/Cforall_master/tools/jenkins/archive-gen.sh
23:37:53 [Pipeline] archiveArtifacts
23:37:53 Archiving artifacts
23:37:53 Recording fingerprints
23:37:53 [Pipeline] }
23:37:53 [Pipeline] // dir
23:37:53 [Pipeline] }
23:37:53 [Pipeline] // wrap
23:37:53 [Pipeline] }
23:37:53 [Pipeline] // node
23:37:53 [Pipeline] echo
23:37:53 hudson.AbortException: script returned exit code 2
23:37:53 [Pipeline] node
23:37:53 Running on Brokk 5 in /var/lib/jenkins/workspace/Cforall_master
23:37:53 [Pipeline] {
23:37:53 [Pipeline] echo
23:37:53 Notifying users of result
23:37:53 [Pipeline] echo
23:37:53 Reusing previously constructed message
23:37:53 [Pipeline] echo
23:37:53 Would send email to: cforall@lists.uwaterloo.ca
23:37:53 [Pipeline] echo
23:37:53 With title: [cforall git][BUILD# 16309 - FAILURE] - branch master
23:37:53 [Pipeline] echo
23:37:53 Content: 
23:37:53 <p>This is an automated email from the Jenkins build machine. It was
23:37:53 generated because of a git hooks/post-receive script following
23:37:53 a ref change which was pushed to the C∀ repository.</p>
23:37:53 
23:37:53 <p>- Status --------------------------------------------------------------</p>
23:37:53 
23:37:53 <p>BUILD# 16309 - FAILURE</p>
23:37:53 <p>Check console output at https://cforall.uwaterloo.ca/jenkins/job/Cforall/job/master/16309/ to view the results.</p>
23:37:53 
23:37:53 <p>- Changes -------------------------------------------------------------</p>
23:37:53 
23:37:53 <pre>
23:37:53 The branch master has been updated.
23:37:53       from  49b3389e6e21dcaa864c8562aed949bc43f23925 (commit)
23:37:53 </pre>
23:37:53 
23:37:53 <p>- Log -----------------------------------------------------------------</p>
23:37:53 
23:37:53 <pre>
23:37:53 
23:37:53 </pre>
23:37:53 
23:37:53 <p>-----------------------------------------------------------------------</p>
23:37:53 <pre>
23:37:53 Summary of changes:
23:37:53 
23:37:53 </pre>
23:37:53 
23:37:53 [Pipeline] }
23:37:53 [Pipeline] // node
23:37:53 [Pipeline] echo
23:37:53 Build Completed
23:37:53 [Pipeline] End of Pipeline
23:37:53 ERROR: script returned exit code 2
23:37:53 Finished: FAILURE
[Pipeline] error
[Pipeline] }
23:37:53 Failed in branch gcc_07_x86_new
[Pipeline] // parallel
[Pipeline] }
[Pipeline] // stage
[Pipeline] }
[Pipeline] // wrap
[Pipeline] echo
error caught
[Pipeline] node
Running on Brokk 4 in /var/lib/jenkins/workspace/Cforall_Full_Build
[Pipeline] {
[Pipeline] echo
notifying users
[Pipeline] emailext
Sending email to: cforall@lists.uwaterloo.ca
[Pipeline] }
[Pipeline] // node
[Pipeline] }
[Pipeline] // node
[Pipeline] End of Pipeline
ERROR: FAILURE
Finished: FAILURE