Console Output

Skipping 6,334 KB.. Full Log
23:37:50        	collections/atomic_mpsc                    PASSED     C 0:24.245 - R 0:00.916
23:37:50        	collections/queue                          PASSED     C 0:24.617 - R 0:00.005
23:37:50        	collections/sequence                       PASSED     C 0:24.969 - R 0:00.005
23:37:50        	collections/vector-err-pass-perm-it-byval  PASSED     C 0:01.888 - R n/a
23:37:50        	alloc                                      PASSED     C 0:35.072 - R 0:00.004
23:37:50        	collections/vector-err-retn-perm-it-byval  PASSED     C 0:01.571 - R n/a
23:37:50        	collections/vector-demo                    PASSED     C 0:05.890 - R 0:00.004
23:37:50        	collections/stack                          PASSED     C 0:14.579 - R 0:00.004
23:37:50        	concurrent/clib                            PASSED     C 0:08.009 - R 0:00.033
23:37:50        	concurrent/clib_tls                        PASSED     C 0:07.222 - R 0:00.011
23:37:50        	complex                                    PASSED     C 0:13.907 - R 0:00.004
23:37:50        	collections/string-api-coverage            PASSED     C 0:23.745 - R 0:00.006
23:37:50        	alloc2                                     PASSED     C 0:59.469 - R 0:00.005
23:37:50        	concurrent/cluster                         PASSED     C 0:19.579 - R 0:00.005
23:37:50        	concurrent/coroutineYield                  PASSED     C 0:27.016 - R 0:00.318
23:37:50        	concurrent/examples/boundedBufferEXT       PASSED     C 0:27.887 - R 0:01.471
23:37:50        	concurrent/examples/datingService          PASSED     C 0:20.054 - R 0:00.016
23:37:50        	concurrent/examples/boundedBufferINT       PASSED     C 0:24.981 - R 0:01.422
23:37:50        	concurrent/examples/gortn                  PASSED     C 0:20.453 - R 0:00.004
23:37:50        	concurrent/examples/matrixSum              PASSED     C 0:20.354 - R 0:00.004
23:37:50        	concurrent/futures/abandon                 PASSED     C 0:16.430 - R 0:00.017
23:37:50        	concurrent/keywordErrors                   PASSED     C 0:00.293 - R n/a
23:37:50        	concurrent/futures/basic                   PASSED     C 0:16.215 - R 0:00.034
23:37:50        	concurrent/futures/multi                   PASSED     C 0:18.210 - R 0:00.004
23:37:50        	concurrent/futures/typed                   PASSED     C 0:14.997 - R 0:00.032
23:37:50        	concurrent/examples/quickSort              PASSED     C 0:24.910 - R 0:00.004
23:37:50        	concurrent/join                            PASSED     C 0:16.458 - R 0:00.004
23:37:50        	concurrent/park/contention                 PASSED     C 0:14.203 - R 0:00.017
23:37:50        	concurrent/mutexstmt/monitors              PASSED     C 0:15.661 - R 0:00.685
23:37:50        	concurrent/mutexstmt/locks                 PASSED     C 0:17.593 - R 0:01.330
23:37:50        	concurrent/park/force_preempt              PASSED     C 0:16.461 - R 0:00.332
23:37:50        	concurrent/monitor                         PASSED     C 0:20.718 - R 0:02.842
23:37:50        	concurrent/multi-monitor                   PASSED     C 0:20.595 - R 0:04.882
23:37:50        	concurrent/park/start_parked               PASSED     C 0:20.357 - R 0:00.009
23:37:50        	concurrent/semaphore                       PASSED     C 0:26.996 - R 0:00.033
23:37:50        	concurrent/signal/disjoint                 PASSED     C 0:25.243 - R 0:00.465
23:37:50        	concurrent/signal/block                    PASSED     C 0:25.666 - R 0:00.315
23:37:50        	concurrent/signal/wait                     PASSED     C 0:23.810 - R 0:00.065
23:37:50        	concurrent/preempt                         PASSED     C 0:18.509 - R 0:16.624
23:37:50        	concurrent/sleep                           PASSED     C 0:29.565 - R 0:01.121
23:37:50        	concurrent/thread                          PASSED     C 0:22.686 - R 0:00.004
23:37:50        	concurrent/suspend_then                    PASSED     C 0:22.710 - R 0:00.018
23:37:50        	concurrent/waitfor/barge                   PASSED     C 0:22.539 - R 0:00.316
23:37:50        	concurrent/spinaphore                      PASSED     C 0:23.834 - R 0:00.064
23:37:50        	concurrent/waitfor/dtor                    PASSED     C 0:17.530 - R 0:00.215
23:37:50        	const-init                                 PASSED     C 0:03.479 - R 0:00.004
23:37:50        	copyfile                                   PASSED     C 0:12.226 - R 0:00.004
23:37:50        	concurrent/waitfor/else                    PASSED     C 0:16.662 - R 0:00.005
23:37:50        	coroutine/devicedriver                     PASSED     C 0:12.324 - R 0:00.005
23:37:50        	concurrent/waitfor/when                    PASSED     C 0:25.114 - R 0:00.033
23:37:50        	concurrent/waitfor/statment                PASSED     C 0:26.460 - R 0:00.017
23:37:50        	concurrent/waitfor/recurse                 PASSED     C 0:27.019 - R 0:00.568
23:37:50        	coroutine/fmtLines                         PASSED     C 0:12.111 - R 0:00.004
23:37:50        	coroutine/fibonacci                        PASSED     C 0:13.704 - R 0:00.004
23:37:50        	coroutine/pingpong                         PASSED     C 0:12.071 - R 0:00.005
23:37:50        	designations                               PASSED     C 0:06.459 - R 0:00.002
23:37:50        	counter                                    PASSED     C 0:07.576 - R 0:00.004
23:37:50        	coroutine/raii                             PASSED     C 0:10.053 - R 0:00.004
23:37:50        	errors/declaration                         PASSED     C 0:00.083 - R n/a
23:37:50        	enum                                       PASSED     C 0:01.615 - R 0:00.004
23:37:50        	errors/scope                               PASSED     C 0:00.131 - R n/a
23:37:50        	errors/signature                           PASSED     C 0:00.080 - R n/a
23:37:50        	coroutine/runningTotal                     PASSED     C 0:10.957 - R 0:00.004
23:37:50        	exceptions/conditional                     PASSED     C 0:01.059 - R 0:00.004
23:37:50        	coroutine/prodcons                         PASSED     C 0:15.233 - R 0:00.004
23:37:50        	exceptions/data-except                     PASSED     C 0:01.066 - R 0:00.004
23:37:50        	device/cpu                                 PASSED     C 0:13.288 - R 0:00.004
23:37:50        	exceptions/cancel/coroutine                PASSED     C 0:06.068 - R 0:00.004
23:37:50        	exceptions/defaults                        PASSED     C 0:01.751 - R 0:00.004
23:37:50        	exceptions/finally-error                   PASSED     C 0:00.246 - R n/a
23:37:50        	exceptions/finally                         PASSED     C 0:01.065 - R 0:00.004
23:37:50        	div                                        PASSED     C 0:11.196 - R 0:00.004
23:37:50        	exceptions/interact                        PASSED     C 0:01.564 - R 0:00.004
23:37:50        	exceptions/conditional-threads             PASSED     C 0:06.674 - R 0:00.017
23:37:50        	exceptions/polymorphic                     PASSED     C 0:02.175 - R 0:00.005
23:37:50        	exceptions/resume                          PASSED     C 0:02.598 - R 0:00.004
23:37:50        	exceptions/terminate                       PASSED     C 0:02.373 - R 0:00.005
23:37:50        	exceptions/cancel/thread                   PASSED     C 0:13.107 - R 0:00.007
23:37:50        	exceptions/type-check                      PASSED     C 0:00.216 - R n/a
23:37:50        	exceptions/defaults-threads                PASSED     C 0:08.122 - R 0:00.004
23:37:50        	exceptions/finally-threads                 PASSED     C 0:06.606 - R 0:00.004
23:37:50        	expression                                 PASSED     C 0:01.922 - R 0:00.003
23:37:50        	exceptions/trash                           PASSED     C 0:02.534 - R 0:00.004
23:37:50        	exceptions/virtual-poly                    PASSED     C 0:02.171 - R 0:00.018
23:37:50        	exceptions/virtual-cast                    PASSED     C 0:04.709 - R 0:00.005
23:37:50        	forall                                     PASSED     C 0:03.533 - R 0:00.001
23:37:50        	exceptions/resume-threads                  PASSED     C 0:09.913 - R 0:00.004
23:37:50        	exceptions/terminate-threads               PASSED     C 0:08.334 - R 0:00.004
23:37:50        	fallthrough                                PASSED     C 0:13.759 - R 0:00.003
23:37:50        	fstream_test                               PASSED     C 0:13.603 - R 0:00.004
23:37:50        	generator/fibonacci                        PASSED     C 0:10.393 - R 0:00.004
23:37:50        	generator/fmtLines                         PASSED     C 0:10.261 - R 0:00.005
23:37:50        	generator/suspend_then                     PASSED     C 0:10.032 - R 0:00.004
23:37:50        	genericUnion                               PASSED     C 0:02.118 - R 0:00.005
23:37:50        	global-monomorph                           PASSED     C 0:02.008 - R 0:00.005
23:37:50        	identFuncDeclarator                        PASSED     C 0:01.772 - R 0:00.001
23:37:50        	function-operator                          PASSED     C 0:14.082 - R 0:00.004
23:37:50        	identParamDeclarator                       PASSED     C 0:01.141 - R 0:00.002
23:37:50        	ifwhileCtl                                 PASSED     C 0:09.348 - R 0:00.007
23:37:50        	hello                                      PASSED     C 0:11.489 - R 0:00.004
23:37:50        	identity                                   PASSED     C 0:09.969 - R 0:00.004
23:37:50        	include/vector-sequence                    PASSED     C 0:05.048 - R 0:00.029
23:37:50        	include/vector-containers                  PASSED     C 0:05.822 - R 0:00.015
23:37:50        	include/stdincludes                        PASSED     C 0:14.364 - R 0:00.022
23:37:50        	init1-ERROR                                PASSED     C 0:00.627 - R n/a
23:37:50        	init1                                      PASSED     C 0:01.284 - R 0:00.026
23:37:50        	heap                                       PASSED     C 0:13.076 - R 0:11.492
23:37:50        	include/vector-fstream                     PASSED     C 0:19.946 - R 0:00.002
23:37:50        	labelledExit                               PASSED     C 0:02.066 - R 0:00.002
23:37:50        	limits                                     PASSED     C 0:03.764 - R 0:00.001
23:37:50        	linking/exception-nothreads                PASSED     C 0:03.326 - R 0:00.009
23:37:50        	io/many_read                               PASSED     C 0:18.070 - R 0:00.009
23:37:50        	io/io-acquire                              PASSED     C 0:24.955 - R 0:00.117
23:37:50        	linking/nostdlib                           PASSED     C 0:01.313 - R 0:00.004
23:37:50        	io/io                                      PASSED     C 0:27.155 - R 0:00.004
23:37:50        	include/includes                           PASSED     C 0:42.530 - R 0:00.001
23:37:50        	linking/exception-withthreads              PASSED     C 0:11.787 - R 0:00.006
23:37:50        	linkonce                                   PASSED     C 0:05.095 - R 0:00.010
23:37:50        	io/manipulatorsOutput4                     PASSED     C 0:40.997 - R 0:00.065
23:37:50        	linking/nothreads                          PASSED     C 0:20.621 - R 0:00.004
23:37:50        	linking/weakso_nothd                       PASSED     C 0:20.420 - R 0:00.005
23:37:50        	linking/io-acquire                         PASSED     C 0:22.541 - R 0:00.005
23:37:50        	maybe                                      PASSED     C 0:03.576 - R 0:00.033
23:37:50        	linking/withthreads                        PASSED     C 0:24.265 - R 0:00.004
23:37:50        	nested-types                               PASSED     C 0:00.922 - R 0:00.002
23:37:50        	nested-types-ERR1                          PASSED     C 0:00.083 - R n/a
23:37:50        	nested-types-ERR2                          PASSED     C 0:00.103 - R n/a
23:37:50        	literals                                   PASSED     C 0:11.181 - R 0:00.004
23:37:50        	numericConstants                           PASSED     C 0:00.866 - R 0:00.001
23:37:50        	operators                                  PASSED     C 0:00.823 - R 0:00.004
23:37:50        	poly-d-cycle                               PASSED     C 0:01.194 - R 0:00.004
23:37:50        	poly-o-cycle                               PASSED     C 0:00.888 - R 0:00.004
23:37:50        	poly-selection                             PASSED     C 0:01.085 - R 0:00.005
23:37:50        	list/dlist-insert-remove                   PASSED     C 0:21.616 - R 0:00.008
23:37:50        	quasiKeyword                               PASSED     C 0:01.618 - R 0:00.001
23:37:50        	malloc                                     PASSED     C 0:16.005 - R 0:00.004
23:37:50        	loopctrl                                   PASSED     C 0:17.598 - R 0:00.004
23:37:50        	polymorphism                               PASSED     C 0:09.202 - R 0:00.005
23:37:50        	minmax                                     PASSED     C 0:15.405 - R 0:00.004
23:37:50        	raii/ctor-autogen-ERR1                     PASSED     C 0:00.468 - R n/a
23:37:50        	raii/ctor-autogen                          PASSED     C 0:02.015 - R 0:00.004
23:37:50        	raii/dtor-early-exit-ERR1                  PASSED     C 0:06.484 - R n/a
23:37:50        	raii/dtor-early-exit-ERR2                  PASSED     C 0:06.441 - R n/a
23:37:50        	parseconfig                                FAILED with code -6    C 0:13.244 - R 0:10.720
23:37:50 Different types of destination addresses
23:37:50 Stop cost: 1
23:37:50 Number of students: 2
23:37:50 Number of stops: 2
23:37:50 Maximum number of students: 5
23:37:50 Timer delay: 2
23:37:50 Groupoff delay: 10
23:37:50 Conductor delay: 5
23:37:50 Parental delay: 5
23:37:50 Number of couriers: 1
23:37:50 Maximum student delay: 10
23:37:50 Maximum student trips: 3
23:37:50 
23:37:50 Open_Failure thrown when config file does not exist
23:37:50 Cforall Runtime error (UNIX pid:30714) Null pointer (0p) dereference.
23:37:50 Stack back trace for: /var/lib/jenkins/workspace/Cforall_master@tmp/libcfa/x86-nodebug/src/.libs/libcfa.so.1
23:37:50 (0) /lib/i386-linux-gnu/libc.so.6 : __isoc99_vfscanf + 0x17  [0xb7d1b3f7]
23:37:50 (1) /var/lib/jenkins/workspace/Cforall_master@tmp/libcfa/x86-nodebug/src/.libs/libcfa.so.1 : _X3fmtFi_S8ifstreamPKc__1 + 0x25  [0xb7f41d35]
23:37:50 (2) /var/lib/jenkins/workspace/Cforall_master@tmp/libcfa/x86-nodebug/src/.libs/libcfa.so.1 : _X15_operator_bitorQ1_0_0_7__X6getANLFb_BD0__X4nlOnFv_BD0__X5nlOffFv_BD0__X4endsFv_BD0__X3fmtFi_BD0PKc__X6ungetcFBD0_BD0c__X3eofFb_BD0__FBD0_BD0Pc__1 + 0x22  [0xb7f51082]
23:37:50 (3) /var/lib/jenkins/workspace/Cforall_master@tmp/libcfa/x86-nodebug/src/.libs/libcfa.so.1 : _X15_operator_bitorQ1_0_0_7__X6getANLFb_BD0__X4nlOnFv_BD0__X5nlOffFv_BD0__X4endsFv_BD0__X3fmtFi_BD0PKc__X6ungetcFBD0_BD0c__X3eofFb_BD0__Fv_BD0Pc__1 + 0x3c  [0xb7f510cc]
23:37:50 (4) /var/lib/jenkins/workspace/Cforall_master@tmp/libcfa/x86-nodebug/src/.libs/libcfa.so.1 : _X8commentsFb_S8ifstreamPc__1 + 0xb2  [0xb7f578f2]
23:37:50 (5) /var/lib/jenkins/workspace/Cforall_master@tmp/libcfa/x86-nodebug/src/.libs/libcfa.so.1 :  + 0x50a17  [0xb7f57a17]
23:37:50 (6) /var/lib/jenkins/workspace/Cforall_master@tmp/libcfa/x86-nodebug/src/.libs/libcfa.so.1 : __cfaehm_try_terminate + 0x16  [0xb7f7e196]
23:37:50 (7) /var/lib/jenkins/workspace/Cforall_master@tmp/libcfa/x86-nodebug/src/.libs/libcfa.so.1 : _X27parse_tabular_config_formatFPS7KVPairs_PKcj__1 + 0xc0  [0xb7f57b10]
23:37:50 (8) /var/lib/jenkins/workspace/Cforall_master@tmp/libcfa/x86-nodebug/src/.libs/libcfa.so.1 : _X12parse_configFv_PKcPS12config_entryjFPS7KVPairs_PKcj___1 + 0x32  [0xb7f57bb2]
23:37:50 (9) /var/lib/jenkins/workspace/Cforall_master@tmp/tests/parseconfig() [0x804a588]
23:37:50 (10) /var/lib/jenkins/workspace/Cforall_master@tmp/libcfa/x86-nodebug/src/.libs/libcfa.so.1 : __cfaehm_try_terminate + 0x16  [0xb7f7e196]
23:37:50 [New LWP 30714]
23:37:50 [Thread debugging using libthread_db enabled]
23:37:50 Using host libthread_db library "/lib/i386-linux-gnu/libthread_db.so.1".
23:37:50 Core was generated by `/var/lib/jenkins/workspace/Cforall_master@tmp/tests/parseconfig'.
23:37:50 Program terminated with signal SIGABRT, Aborted.
23:37:50 #0  0xb7fd9cf5 in __kernel_vsyscall ()
23:37:50 -----
23:37:50 #0  0xb7fd9cf5 in __kernel_vsyscall ()
23:37:50 #1  0xb7ceaeb9 in __GI_raise (sig=6) at ../sysdeps/unix/sysv/linux/raise.c:54
23:37:50 #2  0xb7cec417 in __GI_abort () at abort.c:89
23:37:50 #3  0xb7f7e2cf in _X7__abortFv_bPKcY17__builtin_va_list__1 (_X11signalAbortb_1=<optimized out>, _X3fmtPKc_1=<optimized out>, _X4argsY17__builtin_va_list_1=<optimized out>) at /var/lib/jenkins/workspace/Cforall_master/libcfa/src/interpose.cfa:241
23:37:50 #4  0xb7f7ecb6 in _X5abortFv_bPKc__1 (_X11signalAbortb_1=true, _X3fmtPKc_1=0xb7f915a0 "Application interrupted by signal: %s.\n") at /var/lib/jenkins/workspace/Cforall_master/libcfa/src/interpose.cfa:279
23:37:50 #5  0xb7f7ee4a in _X15sigHandler_termFv_iPS13__anonymous18PS8ucontext__1 (_X3sigi_1=6, _X3sfpPS13__anonymous18_1=0xb7fd384c <stack+63020>, _X3cxtPS8ucontext_1=0xb7fd38cc <stack+63148>) at /var/lib/jenkins/workspace/Cforall_master/libcfa/src/interpose.cfa:315
23:37:50 #6  <signal handler called>
23:37:50 #7  0xb7fd9cf5 in __kernel_vsyscall ()
23:37:50 #8  0xb7ceaeb9 in __GI_raise (sig=6) at ../sysdeps/unix/sysv/linux/raise.c:54
23:37:50 #9  0xb7cec417 in __GI_abort () at abort.c:89
23:37:50 #10 0xb7f7e45c in _X7__abortFv_bPKcY17__builtin_va_list__1 (_X11signalAbortb_1=<optimized out>, _X3fmtPKc_1=<optimized out>, _X4argsY17__builtin_va_list_1=<optimized out>) at /var/lib/jenkins/workspace/Cforall_master/libcfa/src/interpose.cfa:264
23:37:50 #11 0xb7f7ecb6 in _X5abortFv_bPKc__1 (_X11signalAbortb_1=true, _X3fmtPKc_1=0xb7f91454 "Null pointer (0p) dereference.\n") at /var/lib/jenkins/workspace/Cforall_master/libcfa/src/interpose.cfa:279
23:37:50 #12 0xb7f7ed41 in _X15sigHandler_segvFv_iPS13__anonymous18PS8ucontext__1 (_X3sigi_1=11, _X3sfpPS13__anonymous18_1=0xb7fd3e8c <stack+64620>, _X3cxtPS8ucontext_1=0xb7fd3f0c <stack+64748>) at /var/lib/jenkins/workspace/Cforall_master/libcfa/src/interpose.cfa:286
23:37:50 #13 <signal handler called>
23:37:50 #14 __GI___isoc99_vfscanf (stream=0x0, format=0xb7f8fdc1 "%s", args=0xbfffee58 "\\\357\377\277`\245\005\b\260\225Ò·f", <incomplete sequence \365\267>) at isoc99_vfscanf.c:28
23:37:50 #15 0xb7f41d35 in _X3fmtFi_S8ifstreamPKc__1 (_X2isS8ifstream_1=0xbffff100, _X6formatPKc_1=0xb7f8fdc1 "%s") at /var/lib/jenkins/workspace/Cforall_master/libcfa/src/fstream.cfa:316
23:37:50 #16 0xb7f51082 in _X15_operator_bitorQ1_0_0_7__X6getANLFb_BD0__X4nlOnFv_BD0__X5nlOffFv_BD0__X4endsFv_BD0__X3fmtFi_BD0PKc__X6ungetcFBD0_BD0c__X3eofFb_BD0__FBD0_BD0Pc__1 (_X6getANLFb_Y6istype__1=0xb7f41820 <_X6getANLFb_S8ifstream__1>, _X4nlOnFv_Y6istype__1=0xb7f41800 <_X4nlOnFv_S8ifstream__1>, _X5nlOffFv_Y6istype__1=0xb7f41810 <_X5nlOffFv_S8ifstream__1>, _X4endsFv_Y6istype__1=0xb7f41890 <_X4endsFv_S8ifstream__1>, _X3fmtFi_Y6istypePKc__1=0xb7f41d10 <_X3fmtFi_S8ifstreamPKc__1>, _X6ungetcFY6istype_Y6istypec__1=0xb7f419e0 <_X6ungetcFS8ifstream_S8ifstreamc__1>, _X3eofFb_Y6istype__1=0xb7f418d0 <_X3eofFb_S8ifstream__1>, _X2isY6istype_1=0xbffff100, _X1sPc_1=0xbfffef5c "") from /var/lib/jenkins/workspace/Cforall_master@tmp/libcfa/x86-nodebug/src/.libs/libcfa.so.1
23:37:50 #17 0xb7f510cc in _X15_operator_bitorQ1_0_0_7__X6getANLFb_BD0__X4nlOnFv_BD0__X5nlOffFv_BD0__X4endsFv_BD0__X3fmtFi_BD0PKc__X6ungetcFBD0_BD0c__X3eofFb_BD0__Fv_BD0Pc__1 (_X6getANLFb_Y6istype__1=0xb7f41820 <_X6getANLFb_S8ifstream__1>, _X4nlOnFv_Y6istype__1=0xb7f41800 <_X4nlOnFv_S8ifstream__1>, _X5nlOffFv_Y6istype__1=0xb7f41810 <_X5nlOffFv_S8ifstream__1>, _X4endsFv_Y6istype__1=0xb7f41890 <_X4endsFv_S8ifstream__1>, _X3fmtFi_Y6istypePKc__1=0xb7f41d10 <_X3fmtFi_S8ifstreamPKc__1>, _X6ungetcFY6istype_Y6istypec__1=0xb7f419e0 <_X6ungetcFS8ifstream_S8ifstreamc__1>, _X3eofFb_Y6istype__1=0xb7f418d0 <_X3eofFb_S8ifstream__1>, _X2isY6istype_1=0xbffff100, _X1sPc_1=0xbfffef5c "") from /var/lib/jenkins/workspace/Cforall_master@tmp/libcfa/x86-nodebug/src/.libs/libcfa.so.1
23:37:50 #18 0xb7f578f2 in _X8commentsFb_S8ifstreamPc__1 (_X2inS8ifstream_1=0xbffff100, _X4namePc_1=0xbfffef5c "") at /var/lib/jenkins/workspace/Cforall_master/libcfa/src/parseconfig.cfa:113
23:37:50 #19 0xb7f57a17 in try () at /var/lib/jenkins/workspace/Cforall_master/libcfa/src/parseconfig.cfa:135
23:37:50 #20 0xb7f7e196 in __cfaehm_try_terminate (try_block=0xbffff13c, catch_block=0xbffff132, match_block=0xbffff128) at /var/lib/jenkins/workspace/Cforall_master/libcfa/src/exception.c:502
23:37:50 #21 0xb7f57b10 in _X27parse_tabular_config_formatFPS7KVPairs_PKcj__1 (_X11config_filePKc_1=0x804c478 "/var/lib/jenkins/workspace/Cforall_master/tests/.in/doesnt-exist.txt", _X11num_entriesj_1=11) at /var/lib/jenkins/workspace/Cforall_master/libcfa/src/parseconfig.cfa:121
23:37:50 #22 0xb7f57bb2 in _X12parse_configFv_PKcPS12config_entryjFPS7KVPairs_PKcj___1 (_X11config_filePKc_1=0x804c478 "/var/lib/jenkins/workspace/Cforall_master/tests/.in/doesnt-exist.txt", _X7entriesPS12config_entry_1=0xbffff29c, _X11num_entriesj_1=11, _X6parserFPS7KVPairs_PKcj__1=0x8049fa0 <_X27parse_tabular_config_formatFPS7KVPairs_PKcj__1@plt>) at /var/lib/jenkins/workspace/Cforall_master/libcfa/src/parseconfig.cfa:159
23:37:50 #23 0x0804a588 in try () at parseconfig.cfa:70
23:37:50 #24 0xb7f7e196 in __cfaehm_try_terminate (try_block=0xbffff28e, catch_block=0x804a770 <catch>, match_block=0x804a6d0 <match>) at /var/lib/jenkins/workspace/Cforall_master/libcfa/src/exception.c:502
23:37:50 #25 0x0804b916 in _X4mainFi___1 () at parseconfig.cfa:21
23:37:50 #26 0x0804a2fe in invoke_main (argc=1, argv=0xbffff424, envp=0xbffff42c) at parseconfig.cfa:23
23:37:50 #27 main (_X4argci_1=1, _X4argvPPc_1=0xbffff424, _X4envpPPc_1=0xbffff42c) at parseconfig.cfa:44
23:37:50 -----
23:37:50   Id   Target Id                     Frame 
23:37:50 * 1    Thread 0xb7ca1940 (LWP 30714) 0xb7fd9cf5 in __kernel_vsyscall ()
23:37:50 
23:37:50 Archiving parseconfig (executable and core) to crashes/full-nodebug/parseconfig
23:37:50        	raii/init_once                             PASSED     C 0:04.898 - R 0:00.005
23:37:50        	raii/memberCtors-ERR1                      PASSED     C 0:00.469 - R n/a
23:37:50        	raii/memberCtors                           PASSED     C 0:01.209 - R 0:00.004
23:37:50        	raii/boxed-types                           PASSED     C 0:16.107 - R 0:00.004
23:37:50        	quotedKeyword                              PASSED     C 0:16.212 - R 0:00.004
23:37:50        	raii/dtor-early-exit                       PASSED     C 0:13.810 - R 0:00.004
23:37:50        	raii/globals                               PASSED     C 0:07.383 - R 0:00.004
23:37:50        	result                                     PASSED     C 0:01.630 - R 0:00.004
23:37:50        	simpleGenericTriple                        PASSED     C 0:01.389 - R 0:00.004
23:37:50        	smart-pointers                             PASSED     C 0:04.053 - R 0:00.004
23:37:50        	shortCircuit                               PASSED     C 0:12.825 - R 0:00.004
23:37:50        	references                                 PASSED     C 0:13.805 - R 0:00.004
23:37:50        	strstream                                  PASSED     C 0:11.109 - R 0:00.004
23:37:50        	switch                                     PASSED     C 0:01.125 - R 0:00.003
23:37:50        	searchsort                                 PASSED     C 0:14.892 - R 0:00.004
23:37:50        	tuple/tupleCast                            PASSED     C 0:00.848 - R 0:00.004
23:37:50        	tuple/tupleFunction                        PASSED     C 0:03.807 - R 0:00.010
23:37:50        	tuple/tupleMember                          PASSED     C 0:01.910 - R 0:00.006
23:37:50        	sum                                        PASSED     C 0:18.490 - R 0:00.005
23:37:50        	tuple/tuplePolymorphism                    PASSED     C 0:02.652 - R 0:00.005
23:37:50        	typedefRedef                               PASSED     C 0:01.905 - R 0:00.003
23:37:50        	typedefRedef-ERR1                          PASSED     C 0:00.106 - R n/a
23:37:50        	typeof                                     PASSED     C 0:01.795 - R 0:00.006
23:37:50        	tuple/tupleAssign                          PASSED     C 0:13.841 - R 0:00.004
23:37:50        	tuple/tupleVariadic                        PASSED     C 0:04.392 - R 0:00.004
23:37:50        	time                                       PASSED     C 0:14.929 - R 0:00.033
23:37:50        	swap                                       PASSED     C 0:24.747 - R 0:00.004
23:37:50        	rational                                   PASSED     C 0:55.938 - R 0:00.004
23:37:50        	unified_locking/fast                       PASSED     C 0:29.263 - R 0:00.009
23:37:50        	unified_locking/lin_backoff                PASSED     C 0:28.757 - R 0:00.008
23:37:50        	unified_locking/timeout_lock               PASSED     C 0:18.447 - R 0:01.069
23:37:50        	unified_locking/mcs                        PASSED     C 0:28.185 - R 0:01.522
23:37:50        	variableDeclarator                         PASSED     C 0:01.102 - R 0:00.001
23:37:50        	unified_locking/locks                      PASSED     C 0:29.847 - R 0:07.258
23:37:50        	userLiterals                               PASSED     C 0:11.351 - R 0:00.004
23:37:50        	vector                                     PASSED     C 0:21.043 - R 0:00.005
23:37:50        	vector_math/vec2_double                    PASSED     C 0:24.082 - R 0:00.004
23:37:50        	vector_math/vec2_uint                      PASSED     C 0:18.643 - R 0:00.004
23:37:50        	vector_math/vec2_float                     PASSED     C 0:49.069 - R 0:00.010
23:37:50        	voidPtr                                    PASSED     C 0:02.550 - R 0:00.005
23:37:50        	warnings/self-assignment                   PASSED     C 0:04.190 - R 0:00.003
23:37:50        	vector_math/vec3_float                     PASSED     C 0:47.921 - R 0:00.005
23:37:50        	KRfunctions                                PASSED     C 0:00.613 - R 0:00.001
23:37:50        	vector_math/vec2_int                       PASSED     C 1:01.418 - R 0:00.011
23:37:50        	abs                                        PASSED     C 0:17.850 - R 0:00.006
23:37:50        	vector_math/vec3_int                       PASSED     C 0:54.728 - R 0:00.005
23:37:50        	attributes                                 PASSED     C 0:00.912 - R 0:00.048
23:37:50        	array-container/array-md-sbscr-cases       PASSED     C 0:23.313 - R 0:00.005
23:37:50        	ato                                        PASSED     C 0:24.709 - R 0:00.005
23:37:50        	declarationSpecifier                       PASSED     C 0:02.133 - R 0:00.049
23:37:50        	errors/completeType                        PASSED     C 0:00.365 - R n/a
23:37:50        	extension                                  PASSED     C 0:00.640 - R 0:00.016
23:37:50        	functions                                  PASSED     C 0:00.603 - R 0:00.004
23:37:50        	gccExtensions                              PASSED     C 0:00.582 - R 0:00.003
23:37:50        	vector_math/vec4_float                     PASSED     C 1:22.342 - R 0:00.004
23:37:50        	vector_math/vec4_int                       PASSED     C 1:20.415 - R 0:00.009
23:37:50        	io/manipulatorsInput                       PASSED     C 0:24.786 - R 0:00.004
23:37:50        	bitmanip2                                  PASSED     C 0:46.533 - R 0:00.820
23:37:50        	bitmanip1                                  PASSED     C 0:48.633 - R 0:00.770
23:37:50        	meta/archVast                              PASSED     C 0:00.373 - R n/a
23:37:50        	bitmanip3                                  PASSED     C 0:49.263 - R 0:00.618
23:37:50        	random                                     PASSED     C 0:21.971 - R 0:00.004
23:37:50        	math                                       PASSED     C 0:35.721 - R 0:00.005
23:37:50        	io/manipulatorsOutput2                     PASSED     C 0:52.508 - R 0:00.006
23:37:50        	vector_math/vec2_ldouble                   PASSED     C 0:29.165 - R 0:00.012
23:37:50        	mathX                                      PASSED     C 0:50.341 - R 0:00.117
23:37:50        	io/manipulatorsOutput1                     PASSED     C 1:34.844 - R 0:00.010
23:37:50 Tests took  9:47.866
23:37:50 Makefile:862: recipe for target 'all-tests' failed
23:37:50 make: *** [all-tests] Error 1
23:37:50 [Pipeline] }
23:37:50 [Pipeline] // dir
23:37:50 [Pipeline] }
23:37:50 [Pipeline] // stage
23:37:50 [Pipeline] echo
23:37:50 Archiving core dumps
23:37:50 [Pipeline] dir
23:37:50 Running in /var/lib/jenkins/workspace/Cforall_master@tmp
23:37:50 [Pipeline] {
23:37:50 [Pipeline] fileExists
23:37:50 [Pipeline] sh
23:37:50 + /var/lib/jenkins/workspace/Cforall_master/tools/jenkins/archive-gen.sh
23:37:50 [Pipeline] archiveArtifacts
23:37:50 Archiving artifacts
23:37:50 Recording fingerprints
23:37:50 [Pipeline] }
23:37:50 [Pipeline] // dir
23:37:50 [Pipeline] }
23:37:50 [Pipeline] // wrap
23:37:50 [Pipeline] }
23:37:50 [Pipeline] // node
23:37:50 [Pipeline] echo
23:37:50 hudson.AbortException: script returned exit code 2
23:37:50 [Pipeline] node
23:37:50 Running on Brokk 5 in /var/lib/jenkins/workspace/Cforall_master
23:37:50 [Pipeline] {
23:37:50 [Pipeline] echo
23:37:50 Notifying users of result
23:37:50 [Pipeline] echo
23:37:50 Reusing previously constructed message
23:37:50 [Pipeline] echo
23:37:50 Would send email to: cforall@lists.uwaterloo.ca
23:37:50 [Pipeline] echo
23:37:50 With title: [cforall git][BUILD# 16291 - FAILURE] - branch master
23:37:50 [Pipeline] echo
23:37:50 Content: 
23:37:50 <p>This is an automated email from the Jenkins build machine. It was
23:37:50 generated because of a git hooks/post-receive script following
23:37:50 a ref change which was pushed to the C∀ repository.</p>
23:37:50 
23:37:50 <p>- Status --------------------------------------------------------------</p>
23:37:50 
23:37:50 <p>BUILD# 16291 - FAILURE</p>
23:37:50 <p>Check console output at https://cforall.uwaterloo.ca/jenkins/job/Cforall/job/master/16291/ to view the results.</p>
23:37:50 
23:37:50 <p>- Changes -------------------------------------------------------------</p>
23:37:50 
23:37:50 <pre>
23:37:50 The branch master has been updated.
23:37:50       from  18783b45169d4a33a235b14266f919d65d7b5046 (commit)
23:37:50 </pre>
23:37:50 
23:37:50 <p>- Log -----------------------------------------------------------------</p>
23:37:50 
23:37:50 <pre>
23:37:50 
23:37:50 </pre>
23:37:50 
23:37:50 <p>-----------------------------------------------------------------------</p>
23:37:50 <pre>
23:37:50 Summary of changes:
23:37:50 
23:37:50 </pre>
23:37:50 
23:37:50 [Pipeline] }
23:37:50 [Pipeline] // node
23:37:50 [Pipeline] echo
23:37:50 Build Completed
23:37:50 [Pipeline] End of Pipeline
23:37:50 ERROR: script returned exit code 2
23:37:50 Finished: FAILURE
[Pipeline] error
[Pipeline] }
23:37:50 Failed in branch gcc_07_x86_new
[Pipeline] // parallel
[Pipeline] }
[Pipeline] // stage
[Pipeline] }
[Pipeline] // wrap
[Pipeline] echo
error caught
[Pipeline] node
Running on Brokk 4 in /var/lib/jenkins/workspace/Cforall_Full_Build
[Pipeline] {
[Pipeline] echo
notifying users
[Pipeline] emailext
Sending email to: cforall@lists.uwaterloo.ca
[Pipeline] }
[Pipeline] // node
[Pipeline] }
[Pipeline] // node
[Pipeline] End of Pipeline
ERROR: FAILURE
Finished: FAILURE