Console Output

Skipping 6,334 KB.. Full Log
23:26:18        	alloc                                      PASSED     C 0:22.068 - R 0:00.004
23:26:18        	collections/atomic_mpsc                    PASSED     C 0:18.145 - R 0:01.067
23:26:18        	collections/vector-demo                    PASSED     C 0:09.455 - R 0:00.004
23:26:18        	collections/queue                          PASSED     C 0:25.924 - R 0:00.004
23:26:18        	collections/vector-err-retn-perm-it-byval  PASSED     C 0:01.408 - R n/a
23:26:18        	collections/vector-err-pass-perm-it-byval  PASSED     C 0:01.795 - R n/a
23:26:18        	collections/sequence                       PASSED     C 0:26.784 - R 0:00.005
23:26:18        	collections/stack                          PASSED     C 0:16.645 - R 0:00.002
23:26:18        	collections/string-api-coverage            PASSED     C 0:18.613 - R 0:00.004
23:26:18        	alloc2                                     PASSED     C 0:41.366 - R 0:00.006
23:26:18        	concurrent/clib                            PASSED     C 0:05.445 - R 0:00.033
23:26:18        	concurrent/clib_tls                        PASSED     C 0:05.002 - R 0:00.017
23:26:18        	complex                                    PASSED     C 0:17.319 - R 0:00.018
23:26:18        	concurrent/cluster                         PASSED     C 0:17.030 - R 0:00.011
23:26:18        	concurrent/examples/datingService          PASSED     C 0:18.146 - R 0:00.004
23:26:18        	concurrent/coroutineYield                  PASSED     C 0:19.718 - R 0:00.065
23:26:18        	concurrent/examples/boundedBufferINT       PASSED     C 0:19.625 - R 0:01.628
23:26:18        	concurrent/examples/boundedBufferEXT       PASSED     C 0:20.124 - R 0:01.840
23:26:18        	concurrent/examples/gortn                  PASSED     C 0:15.006 - R 0:00.006
23:26:18        	concurrent/examples/matrixSum              PASSED     C 0:14.279 - R 0:00.004
23:26:18        	concurrent/futures/abandon                 PASSED     C 0:11.049 - R 0:00.065
23:26:18        	concurrent/keywordErrors                   PASSED     C 0:00.215 - R n/a
23:26:18        	concurrent/futures/basic                   PASSED     C 0:12.809 - R 0:00.034
23:26:18        	concurrent/futures/multi                   PASSED     C 0:18.167 - R 0:00.005
23:26:18        	concurrent/futures/typed                   PASSED     C 0:14.550 - R 0:00.016
23:26:18        	concurrent/examples/quickSort              PASSED     C 0:23.382 - R 0:00.004
23:26:18        	concurrent/join                            PASSED     C 0:14.813 - R 0:00.004
23:26:18        	concurrent/monitor                         PASSED     C 0:14.780 - R 0:02.568
23:26:18        	concurrent/park/contention                 PASSED     C 0:15.548 - R 0:00.016
23:26:18        	concurrent/mutexstmt/monitors              PASSED     C 0:16.396 - R 0:00.769
23:26:18        	concurrent/park/start_parked               PASSED     C 0:12.323 - R 0:00.008
23:26:18        	concurrent/mutexstmt/locks                 PASSED     C 0:20.548 - R 0:01.084
23:26:18        	concurrent/park/force_preempt              PASSED     C 0:19.362 - R 0:00.288
23:26:18        	concurrent/multi-monitor                   PASSED     C 0:22.143 - R 0:05.752
23:26:18        	concurrent/preempt                         PASSED     C 0:12.561 - R 0:15.620
23:26:18        	concurrent/semaphore                       PASSED     C 0:28.246 - R 0:00.004
23:26:18        	concurrent/signal/disjoint                 PASSED     C 0:25.738 - R 0:00.516
23:26:18        	concurrent/signal/wait                     PASSED     C 0:25.587 - R 0:00.064
23:26:18        	concurrent/signal/block                    PASSED     C 0:27.793 - R 0:00.316
23:26:18        	concurrent/sleep                           PASSED     C 0:25.024 - R 0:01.120
23:26:18        	concurrent/waitfor/else                    PASSED     C 0:15.727 - R 0:00.005
23:26:18        	concurrent/suspend_then                    PASSED     C 0:18.973 - R 0:00.066
23:26:18        	concurrent/spinaphore                      PASSED     C 0:20.137 - R 0:00.067
23:26:18        	concurrent/waitfor/dtor                    PASSED     C 0:17.645 - R 0:00.220
23:26:18        	concurrent/thread                          PASSED     C 0:19.054 - R 0:00.005
23:26:18        	concurrent/waitfor/barge                   PASSED     C 0:19.256 - R 0:00.066
23:26:18        	const-init                                 PASSED     C 0:01.223 - R 0:00.004
23:26:18        	copyfile                                   PASSED     C 0:08.458 - R 0:00.005
23:26:18        	coroutine/fibonacci                        PASSED     C 0:14.673 - R 0:00.004
23:26:18        	coroutine/devicedriver                     PASSED     C 0:14.848 - R 0:00.004
23:26:18        	coroutine/fmtLines                         PASSED     C 0:08.566 - R 0:00.004
23:26:18        	concurrent/waitfor/when                    PASSED     C 0:18.144 - R 0:00.032
23:26:18        	concurrent/waitfor/statment                PASSED     C 0:18.568 - R 0:00.009
23:26:18        	concurrent/waitfor/recurse                 PASSED     C 0:19.633 - R 0:00.618
23:26:18        	designations                               PASSED     C 0:02.895 - R 0:00.004
23:26:18        	coroutine/pingpong                         PASSED     C 0:08.975 - R 0:00.005
23:26:18        	counter                                    PASSED     C 0:07.282 - R 0:00.004
23:26:18        	enum                                       PASSED     C 0:01.218 - R 0:00.002
23:26:18        	errors/declaration                         PASSED     C 0:00.088 - R n/a
23:26:18        	errors/scope                               PASSED     C 0:00.147 - R n/a
23:26:18        	errors/signature                           PASSED     C 0:00.091 - R n/a
23:26:18        	coroutine/runningTotal                     PASSED     C 0:14.067 - R 0:00.004
23:26:18        	coroutine/raii                             PASSED     C 0:14.082 - R 0:00.004
23:26:18        	coroutine/prodcons                         PASSED     C 0:16.325 - R 0:00.005
23:26:18        	exceptions/conditional                     PASSED     C 0:01.813 - R 0:00.003
23:26:18        	exceptions/cancel/coroutine                PASSED     C 0:06.905 - R 0:00.005
23:26:18        	exceptions/data-except                     PASSED     C 0:01.545 - R 0:00.007
23:26:18        	device/cpu                                 PASSED     C 0:15.807 - R 0:00.005
23:26:18        	exceptions/defaults                        PASSED     C 0:03.169 - R 0:00.017
23:26:18        	exceptions/finally-error                   PASSED     C 0:00.226 - R n/a
23:26:18        	div                                        PASSED     C 0:13.217 - R 0:00.004
23:26:18        	exceptions/finally                         PASSED     C 0:00.983 - R 0:00.004
23:26:18        	exceptions/conditional-threads             PASSED     C 0:05.877 - R 0:00.004
23:26:18        	exceptions/resume                          PASSED     C 0:02.019 - R 0:00.004
23:26:18        	exceptions/interact                        PASSED     C 0:02.178 - R 0:00.004
23:26:18        	exceptions/polymorphic                     PASSED     C 0:02.172 - R 0:00.004
23:26:18        	exceptions/terminate                       PASSED     C 0:03.451 - R 0:00.006
23:26:18        	exceptions/trash                           PASSED     C 0:01.823 - R 0:00.004
23:26:18        	exceptions/type-check                      PASSED     C 0:00.196 - R n/a
23:26:18        	exceptions/finally-threads                 PASSED     C 0:08.428 - R 0:00.004
23:26:18        	exceptions/cancel/thread                   PASSED     C 0:14.109 - R 0:00.005
23:26:18        	exceptions/defaults-threads                PASSED     C 0:10.744 - R 0:00.004
23:26:18        	exceptions/resume-threads                  PASSED     C 0:06.350 - R 0:00.004
23:26:18        	exceptions/terminate-threads               PASSED     C 0:06.764 - R 0:00.004
23:26:18        	expression                                 PASSED     C 0:00.957 - R 0:00.001
23:26:18        	exceptions/virtual-poly                    PASSED     C 0:01.101 - R 0:00.004
23:26:18        	forall                                     PASSED     C 0:02.561 - R 0:00.001
23:26:18        	exceptions/virtual-cast                    PASSED     C 0:03.560 - R 0:00.004
23:26:18        	fallthrough                                PASSED     C 0:12.788 - R 0:00.068
23:26:18        	generator/fibonacci                        PASSED     C 0:12.000 - R 0:00.010
23:26:18        	fstream_test                               PASSED     C 0:12.756 - R 0:00.006
23:26:18        	generator/fmtLines                         PASSED     C 0:10.792 - R 0:00.004
23:26:18        	global-monomorph                           PASSED     C 0:00.841 - R 0:00.005
23:26:18        	genericUnion                               PASSED     C 0:01.414 - R 0:00.006
23:26:18        	generator/suspend_then                     PASSED     C 0:10.907 - R 0:00.166
23:26:18        	identFuncDeclarator                        PASSED     C 0:00.823 - R 0:00.001
23:26:18        	identParamDeclarator                       PASSED     C 0:00.897 - R 0:00.004
23:26:18        	function-operator                          PASSED     C 0:18.227 - R 0:00.004
23:26:18        	hello                                      PASSED     C 0:13.404 - R 0:00.005
23:26:18        	identity                                   PASSED     C 0:13.401 - R 0:00.004
23:26:18        	ifwhileCtl                                 PASSED     C 0:13.278 - R 0:00.004
23:26:18        	include/vector-sequence                    PASSED     C 0:04.175 - R 0:00.021
23:26:18        	include/vector-containers                  PASSED     C 0:05.143 - R 0:00.017
23:26:18        	include/stdincludes                        PASSED     C 0:13.499 - R 0:00.016
23:26:18        	init1-ERROR                                PASSED     C 0:01.005 - R n/a
23:26:18        	init1                                      PASSED     C 0:01.592 - R 0:00.018
23:26:18        	heap                                       PASSED     C 0:15.453 - R 0:11.397
23:26:18        	include/vector-fstream                     PASSED     C 0:17.232 - R 0:00.005
23:26:18        	labelledExit                               PASSED     C 0:02.486 - R 0:00.003
23:26:18        	limits                                     PASSED     C 0:02.115 - R 0:00.001
23:26:18        	linking/exception-nothreads                PASSED     C 0:04.298 - R 0:00.018
23:26:18        	io/io-acquire                              PASSED     C 0:23.162 - R 0:00.034
23:26:18        	io/many_read                               PASSED     C 0:17.151 - R 0:00.004
23:26:18        	include/includes                           PASSED     C 0:42.608 - R 0:00.001
23:26:18        	linking/nostdlib                           PASSED     C 0:02.466 - R 0:00.004
23:26:18        	io/io                                      PASSED     C 0:27.607 - R 0:00.004
23:26:18        	linking/exception-withthreads              PASSED     C 0:11.471 - R 0:00.004
23:26:18        	linkonce                                   PASSED     C 0:02.326 - R 0:00.006
23:26:18        	io/manipulatorsOutput4                     PASSED     C 0:34.321 - R 0:00.166
23:26:18        	linking/nothreads                          PASSED     C 0:13.207 - R 0:00.005
23:26:18        	linking/io-acquire                         PASSED     C 0:14.101 - R 0:00.004
23:26:18        	linking/weakso_nothd                       PASSED     C 0:11.094 - R 0:00.004
23:26:18        	maybe                                      PASSED     C 0:02.129 - R 0:00.005
23:26:18        	literals                                   PASSED     C 0:19.065 - R 0:00.005
23:26:18        	linking/withthreads                        PASSED     C 0:27.456 - R 0:00.005
23:26:18        	nested-types-ERR1                          PASSED     C 0:00.104 - R n/a
23:26:18        	nested-types-ERR2                          PASSED     C 0:00.109 - R n/a
23:26:18        	nested-types                               PASSED     C 0:00.936 - R 0:00.002
23:26:18        	malloc                                     PASSED     C 0:18.822 - R 0:00.005
23:26:18        	minmax                                     PASSED     C 0:16.572 - R 0:00.004
23:26:18        	numericConstants                           PASSED     C 0:01.918 - R 0:00.002
23:26:18        	loopctrl                                   PASSED     C 0:19.007 - R 0:00.004
23:26:18        	operators                                  PASSED     C 0:01.372 - R 0:00.004
23:26:18        	poly-selection                             PASSED     C 0:01.013 - R 0:00.005
23:26:18        	poly-d-cycle                               PASSED     C 0:01.041 - R 0:00.004
23:26:18        	poly-o-cycle                               PASSED     C 0:01.064 - R 0:00.004
23:26:18        	quasiKeyword                               PASSED     C 0:04.342 - R 0:00.001
23:26:18        	list/dlist-insert-remove                   PASSED     C 0:28.073 - R 0:00.008
23:26:18        	raii/ctor-autogen-ERR1                     PASSED     C 0:00.472 - R n/a
23:26:18        	raii/ctor-autogen                          PASSED     C 0:02.612 - R 0:00.004
23:26:18        	raii/boxed-types                           PASSED     C 0:09.850 - R 0:00.006
23:26:18        	polymorphism                               PASSED     C 0:11.519 - R 0:00.004
23:26:18        	quotedKeyword                              PASSED     C 0:10.669 - R 0:00.004
23:26:18        	raii/dtor-early-exit-ERR1                  PASSED     C 0:06.652 - R n/a
23:26:18        	raii/init_once                             PASSED     C 0:02.962 - R 0:00.004
23:26:18        	raii/memberCtors-ERR1                      PASSED     C 0:00.504 - R n/a
23:26:18        	raii/dtor-early-exit-ERR2                  PASSED     C 0:06.857 - R n/a
23:26:18        	raii/memberCtors                           PASSED     C 0:04.631 - R 0:00.006
23:26:18        	parseconfig                                FAILED with code -6    C 0:15.408 - R 0:07.325
23:26:18 Different types of destination addresses
23:26:18 Stop cost: 1
23:26:18 Number of students: 2
23:26:18 Number of stops: 2
23:26:18 Maximum number of students: 5
23:26:18 Timer delay: 2
23:26:18 Groupoff delay: 10
23:26:18 Conductor delay: 5
23:26:18 Parental delay: 5
23:26:18 Number of couriers: 1
23:26:18 Maximum student delay: 10
23:26:18 Maximum student trips: 3
23:26:18 
23:26:18 Open_Failure thrown when config file does not exist
23:26:18 Cforall Runtime error (UNIX pid:24740) Null pointer (0p) dereference.
23:26:18 Stack back trace for: /var/lib/jenkins/workspace/Cforall_master@tmp/libcfa/x86-nodebug/src/.libs/libcfa.so.1
23:26:18 (0) /lib/i386-linux-gnu/libc.so.6 : __isoc99_vfscanf + 0x17  [0xb7d1b3f7]
23:26:18 (1) /var/lib/jenkins/workspace/Cforall_master@tmp/libcfa/x86-nodebug/src/.libs/libcfa.so.1 : _X3fmtFi_S8ifstreamPKc__1 + 0x25  [0xb7f41d35]
23:26:18 (2) /var/lib/jenkins/workspace/Cforall_master@tmp/libcfa/x86-nodebug/src/.libs/libcfa.so.1 : _X15_operator_bitorQ1_0_0_7__X6getANLFb_BD0__X4nlOnFv_BD0__X5nlOffFv_BD0__X4endsFv_BD0__X3fmtFi_BD0PKc__X6ungetcFBD0_BD0c__X3eofFb_BD0__FBD0_BD0Pc__1 + 0x22  [0xb7f51082]
23:26:18 (3) /var/lib/jenkins/workspace/Cforall_master@tmp/libcfa/x86-nodebug/src/.libs/libcfa.so.1 : _X15_operator_bitorQ1_0_0_7__X6getANLFb_BD0__X4nlOnFv_BD0__X5nlOffFv_BD0__X4endsFv_BD0__X3fmtFi_BD0PKc__X6ungetcFBD0_BD0c__X3eofFb_BD0__Fv_BD0Pc__1 + 0x3c  [0xb7f510cc]
23:26:18 (4) /var/lib/jenkins/workspace/Cforall_master@tmp/libcfa/x86-nodebug/src/.libs/libcfa.so.1 : _X8commentsFb_S8ifstreamPc__1 + 0xb2  [0xb7f578f2]
23:26:18 (5) /var/lib/jenkins/workspace/Cforall_master@tmp/libcfa/x86-nodebug/src/.libs/libcfa.so.1 :  + 0x50a17  [0xb7f57a17]
23:26:18 (6) /var/lib/jenkins/workspace/Cforall_master@tmp/libcfa/x86-nodebug/src/.libs/libcfa.so.1 : __cfaehm_try_terminate + 0x16  [0xb7f7e196]
23:26:18 (7) /var/lib/jenkins/workspace/Cforall_master@tmp/libcfa/x86-nodebug/src/.libs/libcfa.so.1 : _X27parse_tabular_config_formatFPS7KVPairs_PKcj__1 + 0xc0  [0xb7f57b10]
23:26:18 (8) /var/lib/jenkins/workspace/Cforall_master@tmp/libcfa/x86-nodebug/src/.libs/libcfa.so.1 : _X12parse_configFv_PKcPS12config_entryjFPS7KVPairs_PKcj___1 + 0x32  [0xb7f57bb2]
23:26:18 (9) /var/lib/jenkins/workspace/Cforall_master@tmp/tests/parseconfig() [0x804a588]
23:26:18 (10) /var/lib/jenkins/workspace/Cforall_master@tmp/libcfa/x86-nodebug/src/.libs/libcfa.so.1 : __cfaehm_try_terminate + 0x16  [0xb7f7e196]
23:26:18 [New LWP 24740]
23:26:18 [Thread debugging using libthread_db enabled]
23:26:18 Using host libthread_db library "/lib/i386-linux-gnu/libthread_db.so.1".
23:26:18 Core was generated by `/var/lib/jenkins/workspace/Cforall_master@tmp/tests/parseconfig'.
23:26:18 Program terminated with signal SIGABRT, Aborted.
23:26:18 #0  0xb7fd9cf5 in __kernel_vsyscall ()
23:26:18 -----
23:26:18 #0  0xb7fd9cf5 in __kernel_vsyscall ()
23:26:18 #1  0xb7ceaeb9 in __GI_raise (sig=6) at ../sysdeps/unix/sysv/linux/raise.c:54
23:26:18 #2  0xb7cec417 in __GI_abort () at abort.c:89
23:26:18 #3  0xb7f7e2cf in _X7__abortFv_bPKcY17__builtin_va_list__1 (_X11signalAbortb_1=<optimized out>, _X3fmtPKc_1=<optimized out>, _X4argsY17__builtin_va_list_1=<optimized out>) at /var/lib/jenkins/workspace/Cforall_master/libcfa/src/interpose.cfa:241
23:26:18 #4  0xb7f7ecb6 in _X5abortFv_bPKc__1 (_X11signalAbortb_1=true, _X3fmtPKc_1=0xb7f915a0 "Application interrupted by signal: %s.\n") at /var/lib/jenkins/workspace/Cforall_master/libcfa/src/interpose.cfa:279
23:26:18 #5  0xb7f7ee4a in _X15sigHandler_termFv_iPS13__anonymous18PS8ucontext__1 (_X3sigi_1=6, _X3sfpPS13__anonymous18_1=0xb7fd384c <stack+63020>, _X3cxtPS8ucontext_1=0xb7fd38cc <stack+63148>) at /var/lib/jenkins/workspace/Cforall_master/libcfa/src/interpose.cfa:315
23:26:18 #6  <signal handler called>
23:26:18 #7  0xb7fd9cf5 in __kernel_vsyscall ()
23:26:18 #8  0xb7ceaeb9 in __GI_raise (sig=6) at ../sysdeps/unix/sysv/linux/raise.c:54
23:26:18 #9  0xb7cec417 in __GI_abort () at abort.c:89
23:26:18 #10 0xb7f7e45c in _X7__abortFv_bPKcY17__builtin_va_list__1 (_X11signalAbortb_1=<optimized out>, _X3fmtPKc_1=<optimized out>, _X4argsY17__builtin_va_list_1=<optimized out>) at /var/lib/jenkins/workspace/Cforall_master/libcfa/src/interpose.cfa:264
23:26:18 #11 0xb7f7ecb6 in _X5abortFv_bPKc__1 (_X11signalAbortb_1=true, _X3fmtPKc_1=0xb7f91454 "Null pointer (0p) dereference.\n") at /var/lib/jenkins/workspace/Cforall_master/libcfa/src/interpose.cfa:279
23:26:18 #12 0xb7f7ed41 in _X15sigHandler_segvFv_iPS13__anonymous18PS8ucontext__1 (_X3sigi_1=11, _X3sfpPS13__anonymous18_1=0xb7fd3e8c <stack+64620>, _X3cxtPS8ucontext_1=0xb7fd3f0c <stack+64748>) at /var/lib/jenkins/workspace/Cforall_master/libcfa/src/interpose.cfa:286
23:26:18 #13 <signal handler called>
23:26:18 #14 __GI___isoc99_vfscanf (stream=0x0, format=0xb7f8fdc1 "%s", args=0xbfffee58 "\\\357\377\277`\245\005\b\260\225Ò·f", <incomplete sequence \365\267>) at isoc99_vfscanf.c:28
23:26:18 #15 0xb7f41d35 in _X3fmtFi_S8ifstreamPKc__1 (_X2isS8ifstream_1=0xbffff100, _X6formatPKc_1=0xb7f8fdc1 "%s") at /var/lib/jenkins/workspace/Cforall_master/libcfa/src/fstream.cfa:316
23:26:18 #16 0xb7f51082 in _X15_operator_bitorQ1_0_0_7__X6getANLFb_BD0__X4nlOnFv_BD0__X5nlOffFv_BD0__X4endsFv_BD0__X3fmtFi_BD0PKc__X6ungetcFBD0_BD0c__X3eofFb_BD0__FBD0_BD0Pc__1 (_X6getANLFb_Y6istype__1=0xb7f41820 <_X6getANLFb_S8ifstream__1>, _X4nlOnFv_Y6istype__1=0xb7f41800 <_X4nlOnFv_S8ifstream__1>, _X5nlOffFv_Y6istype__1=0xb7f41810 <_X5nlOffFv_S8ifstream__1>, _X4endsFv_Y6istype__1=0xb7f41890 <_X4endsFv_S8ifstream__1>, _X3fmtFi_Y6istypePKc__1=0xb7f41d10 <_X3fmtFi_S8ifstreamPKc__1>, _X6ungetcFY6istype_Y6istypec__1=0xb7f419e0 <_X6ungetcFS8ifstream_S8ifstreamc__1>, _X3eofFb_Y6istype__1=0xb7f418d0 <_X3eofFb_S8ifstream__1>, _X2isY6istype_1=0xbffff100, _X1sPc_1=0xbfffef5c "") from /var/lib/jenkins/workspace/Cforall_master@tmp/libcfa/x86-nodebug/src/.libs/libcfa.so.1
23:26:18 #17 0xb7f510cc in _X15_operator_bitorQ1_0_0_7__X6getANLFb_BD0__X4nlOnFv_BD0__X5nlOffFv_BD0__X4endsFv_BD0__X3fmtFi_BD0PKc__X6ungetcFBD0_BD0c__X3eofFb_BD0__Fv_BD0Pc__1 (_X6getANLFb_Y6istype__1=0xb7f41820 <_X6getANLFb_S8ifstream__1>, _X4nlOnFv_Y6istype__1=0xb7f41800 <_X4nlOnFv_S8ifstream__1>, _X5nlOffFv_Y6istype__1=0xb7f41810 <_X5nlOffFv_S8ifstream__1>, _X4endsFv_Y6istype__1=0xb7f41890 <_X4endsFv_S8ifstream__1>, _X3fmtFi_Y6istypePKc__1=0xb7f41d10 <_X3fmtFi_S8ifstreamPKc__1>, _X6ungetcFY6istype_Y6istypec__1=0xb7f419e0 <_X6ungetcFS8ifstream_S8ifstreamc__1>, _X3eofFb_Y6istype__1=0xb7f418d0 <_X3eofFb_S8ifstream__1>, _X2isY6istype_1=0xbffff100, _X1sPc_1=0xbfffef5c "") from /var/lib/jenkins/workspace/Cforall_master@tmp/libcfa/x86-nodebug/src/.libs/libcfa.so.1
23:26:18 #18 0xb7f578f2 in _X8commentsFb_S8ifstreamPc__1 (_X2inS8ifstream_1=0xbffff100, _X4namePc_1=0xbfffef5c "") at /var/lib/jenkins/workspace/Cforall_master/libcfa/src/parseconfig.cfa:113
23:26:18 #19 0xb7f57a17 in try () at /var/lib/jenkins/workspace/Cforall_master/libcfa/src/parseconfig.cfa:135
23:26:18 #20 0xb7f7e196 in __cfaehm_try_terminate (try_block=0xbffff13c, catch_block=0xbffff132, match_block=0xbffff128) at /var/lib/jenkins/workspace/Cforall_master/libcfa/src/exception.c:502
23:26:18 #21 0xb7f57b10 in _X27parse_tabular_config_formatFPS7KVPairs_PKcj__1 (_X11config_filePKc_1=0x804c478 "/var/lib/jenkins/workspace/Cforall_master/tests/.in/doesnt-exist.txt", _X11num_entriesj_1=11) at /var/lib/jenkins/workspace/Cforall_master/libcfa/src/parseconfig.cfa:121
23:26:18 #22 0xb7f57bb2 in _X12parse_configFv_PKcPS12config_entryjFPS7KVPairs_PKcj___1 (_X11config_filePKc_1=0x804c478 "/var/lib/jenkins/workspace/Cforall_master/tests/.in/doesnt-exist.txt", _X7entriesPS12config_entry_1=0xbffff29c, _X11num_entriesj_1=11, _X6parserFPS7KVPairs_PKcj__1=0x8049fa0 <_X27parse_tabular_config_formatFPS7KVPairs_PKcj__1@plt>) at /var/lib/jenkins/workspace/Cforall_master/libcfa/src/parseconfig.cfa:159
23:26:18 #23 0x0804a588 in try () at parseconfig.cfa:70
23:26:18 #24 0xb7f7e196 in __cfaehm_try_terminate (try_block=0xbffff28e, catch_block=0x804a770 <catch>, match_block=0x804a6d0 <match>) at /var/lib/jenkins/workspace/Cforall_master/libcfa/src/exception.c:502
23:26:18 #25 0x0804b916 in _X4mainFi___1 () at parseconfig.cfa:21
23:26:18 #26 0x0804a2fe in invoke_main (argc=1, argv=0xbffff424, envp=0xbffff42c) at parseconfig.cfa:23
23:26:18 #27 main (_X4argci_1=1, _X4argvPPc_1=0xbffff424, _X4envpPPc_1=0xbffff42c) at parseconfig.cfa:44
23:26:18 -----
23:26:18   Id   Target Id                     Frame 
23:26:18 * 1    Thread 0xb7ca1940 (LWP 24740) 0xb7fd9cf5 in __kernel_vsyscall ()
23:26:18 
23:26:18 Archiving parseconfig (executable and core) to crashes/full-nodebug/parseconfig
23:26:18        	result                                     PASSED     C 0:04.500 - R 0:00.005
23:26:18        	raii/globals                               PASSED     C 0:15.035 - R 0:00.005
23:26:18        	raii/dtor-early-exit                       PASSED     C 0:21.131 - R 0:00.005
23:26:18        	references                                 PASSED     C 0:09.973 - R 0:00.004
23:26:18        	simpleGenericTriple                        PASSED     C 0:01.594 - R 0:00.004
23:26:18        	smart-pointers                             PASSED     C 0:02.171 - R 0:00.004
23:26:18        	shortCircuit                               PASSED     C 0:07.266 - R 0:00.004
23:26:18        	switch                                     PASSED     C 0:02.289 - R 0:00.001
23:26:18        	strstream                                  PASSED     C 0:13.830 - R 0:00.005
23:26:18        	searchsort                                 PASSED     C 0:19.372 - R 0:00.004
23:26:18        	sum                                        PASSED     C 0:15.767 - R 0:00.005
23:26:18        	tuple/tupleCast                            PASSED     C 0:01.512 - R 0:00.005
23:26:18        	time                                       PASSED     C 0:12.051 - R 0:00.004
23:26:18        	tuple/tupleMember                          PASSED     C 0:01.725 - R 0:00.005
23:26:18        	swap                                       PASSED     C 0:16.300 - R 0:00.004
23:26:18        	tuple/tupleFunction                        PASSED     C 0:01.889 - R 0:00.004
23:26:18        	typedefRedef-ERR1                          PASSED     C 0:00.074 - R n/a
23:26:18        	typedefRedef                               PASSED     C 0:01.037 - R 0:00.002
23:26:18        	typeof                                     PASSED     C 0:00.984 - R 0:00.007
23:26:18        	tuple/tuplePolymorphism                    PASSED     C 0:02.593 - R 0:00.004
23:26:18        	tuple/tupleVariadic                        PASSED     C 0:05.144 - R 0:00.005
23:26:18        	tuple/tupleAssign                          PASSED     C 0:17.369 - R 0:00.005
23:26:18        	rational                                   PASSED     C 1:00.735 - R 0:00.005
23:26:18        	unified_locking/fast                       PASSED     C 0:35.761 - R 0:00.026
23:26:18        	unified_locking/lin_backoff                PASSED     C 0:35.694 - R 0:00.036
23:26:18        	variableDeclarator                         PASSED     C 0:00.898 - R 0:00.001
23:26:18        	userLiterals                               PASSED     C 0:07.745 - R 0:00.006
23:26:18        	unified_locking/timeout_lock               PASSED     C 0:23.696 - R 0:01.069
23:26:18        	unified_locking/locks                      PASSED     C 0:32.195 - R 0:05.691
23:26:18        	unified_locking/mcs                        PASSED     C 0:32.680 - R 0:02.370
23:26:18        	vector                                     PASSED     C 0:20.190 - R 0:00.002
23:26:18        	vector_math/vec2_double                    PASSED     C 0:20.517 - R 0:00.010
23:26:18        	vector_math/vec2_uint                      PASSED     C 0:22.795 - R 0:00.004
23:26:18        	vector_math/vec2_float                     PASSED     C 0:57.246 - R 0:00.005
23:26:18        	vector_math/vec3_float                     PASSED     C 0:56.298 - R 0:00.005
23:26:18        	voidPtr                                    PASSED     C 0:01.529 - R 0:00.005
23:26:18        	KRfunctions                                PASSED     C 0:00.618 - R 0:00.004
23:26:18        	warnings/self-assignment                   PASSED     C 0:02.696 - R 0:00.003
23:26:18        	vector_math/vec2_int                       PASSED     C 1:02.186 - R 0:00.004
23:26:18        	vector_math/vec3_int                       PASSED     C 1:00.402 - R 0:00.010
23:26:18        	attributes                                 PASSED     C 0:01.134 - R 0:00.002
23:26:18        	array-container/array-md-sbscr-cases       PASSED     C 0:22.826 - R 0:00.004
23:26:18        	vector_math/vec4_int                       PASSED     C 1:03.809 - R 0:00.005
23:26:18        	ato                                        PASSED     C 0:27.920 - R 0:00.005
23:26:18        	declarationSpecifier                       PASSED     C 0:00.900 - R 0:00.001
23:26:18        	abs                                        PASSED     C 0:31.762 - R 0:00.005
23:26:18        	errors/completeType                        PASSED     C 0:00.385 - R n/a
23:26:18        	extension                                  PASSED     C 0:00.933 - R 0:00.003
23:26:18        	functions                                  PASSED     C 0:00.963 - R 0:00.032
23:26:18        	gccExtensions                              PASSED     C 0:00.714 - R 0:00.003
23:26:18        	vector_math/vec4_float                     PASSED     C 1:12.760 - R 0:00.004
23:26:18        	io/manipulatorsInput                       PASSED     C 0:18.878 - R 0:00.005
23:26:18        	bitmanip1                                  PASSED     C 0:32.311 - R 0:00.719
23:26:18        	bitmanip2                                  PASSED     C 0:35.244 - R 0:00.017
23:26:18        	meta/archVast                              PASSED     C 0:00.403 - R n/a
23:26:18        	io/manipulatorsOutput2                     PASSED     C 0:49.828 - R 0:00.005
23:26:18        	bitmanip3                                  PASSED     C 0:55.299 - R 0:00.067
23:26:18        	random                                     PASSED     C 0:29.533 - R 0:00.010
23:26:18        	math                                       PASSED     C 0:40.430 - R 0:00.011
23:26:18        	mathX                                      PASSED     C 0:48.923 - R 0:00.971
23:26:18        	vector_math/vec2_ldouble                   PASSED     C 0:35.808 - R 0:00.010
23:26:18        	io/manipulatorsOutput1                     PASSED     C 1:47.478 - R 0:00.010
23:26:18 Tests took  9:31.380
23:26:18 Makefile:862: recipe for target 'all-tests' failed
23:26:18 make: *** [all-tests] Error 1
23:26:18 [Pipeline] }
23:26:18 [Pipeline] // dir
23:26:18 [Pipeline] }
23:26:18 [Pipeline] // stage
23:26:18 [Pipeline] echo
23:26:18 Archiving core dumps
23:26:18 [Pipeline] dir
23:26:18 Running in /var/lib/jenkins/workspace/Cforall_master@tmp
23:26:18 [Pipeline] {
23:26:18 [Pipeline] fileExists
23:26:18 [Pipeline] sh
23:26:18 + /var/lib/jenkins/workspace/Cforall_master/tools/jenkins/archive-gen.sh
23:26:18 [Pipeline] archiveArtifacts
23:26:18 Archiving artifacts
23:26:18 Recording fingerprints
23:26:18 [Pipeline] }
23:26:18 [Pipeline] // dir
23:26:18 [Pipeline] }
23:26:18 [Pipeline] // wrap
23:26:18 [Pipeline] }
23:26:18 [Pipeline] // node
23:26:18 [Pipeline] echo
23:26:18 hudson.AbortException: script returned exit code 2
23:26:18 [Pipeline] node
23:26:18 Running on Brokk 5 in /var/lib/jenkins/workspace/Cforall_master
23:26:18 [Pipeline] {
23:26:18 [Pipeline] echo
23:26:18 Notifying users of result
23:26:18 [Pipeline] echo
23:26:18 Reusing previously constructed message
23:26:18 [Pipeline] echo
23:26:18 Would send email to: cforall@lists.uwaterloo.ca
23:26:18 [Pipeline] echo
23:26:18 With title: [cforall git][BUILD# 16281 - FAILURE] - branch master
23:26:18 [Pipeline] echo
23:26:18 Content: 
23:26:18 <p>This is an automated email from the Jenkins build machine. It was
23:26:18 generated because of a git hooks/post-receive script following
23:26:18 a ref change which was pushed to the C∀ repository.</p>
23:26:18 
23:26:18 <p>- Status --------------------------------------------------------------</p>
23:26:18 
23:26:18 <p>BUILD# 16281 - FAILURE</p>
23:26:18 <p>Check console output at https://cforall.uwaterloo.ca/jenkins/job/Cforall/job/master/16281/ to view the results.</p>
23:26:18 
23:26:18 <p>- Changes -------------------------------------------------------------</p>
23:26:18 
23:26:18 <pre>
23:26:18 The branch master has been updated.
23:26:18       from  f450f2f3d268f91ca50a97d15db72c48d26ad4b6 (commit)
23:26:18 </pre>
23:26:18 
23:26:18 <p>- Log -----------------------------------------------------------------</p>
23:26:18 
23:26:18 <pre>
23:26:18 
23:26:18 </pre>
23:26:18 
23:26:18 <p>-----------------------------------------------------------------------</p>
23:26:18 <pre>
23:26:18 Summary of changes:
23:26:18 
23:26:18 </pre>
23:26:18 
23:26:18 [Pipeline] }
23:26:18 [Pipeline] // node
23:26:18 [Pipeline] echo
23:26:18 Build Completed
23:26:18 [Pipeline] End of Pipeline
23:26:18 ERROR: script returned exit code 2
23:26:18 Finished: FAILURE
[Pipeline] error
[Pipeline] }
23:26:18 Failed in branch gcc_07_x86_new
[Pipeline] // parallel
[Pipeline] }
[Pipeline] // stage
[Pipeline] }
[Pipeline] // wrap
[Pipeline] echo
error caught
[Pipeline] node
Running on Brokk 4 in /var/lib/jenkins/workspace/Cforall_Full_Build
[Pipeline] {
[Pipeline] echo
notifying users
[Pipeline] emailext
Sending email to: cforall@lists.uwaterloo.ca
[Pipeline] }
[Pipeline] // node
[Pipeline] }
[Pipeline] // node
[Pipeline] End of Pipeline
ERROR: FAILURE
Finished: FAILURE