Console Output

Skipping 6,285 KB.. Full Log
23:28:18        	vector_math/vec4_float                     PASSED     C 0:27.798 - R 0:00.017
23:28:18        	vector_math/vec4_int                       PASSED     C 0:23.660 - R 0:00.018
23:28:18        	declarationSpecifier                       PASSED     C 0:01.198 - R 0:00.088
23:28:18        	errors/completeType                        PASSED     C 0:00.376 - R n/a
23:28:18        	extension                                  PASSED     C 0:00.964 - R 0:00.001
23:28:18        	functions                                  PASSED     C 0:00.657 - R 0:00.001
23:28:18        	array-container/array-md-sbscr-cases       PASSED     C 0:16.912 - R 0:00.017
23:28:18        	gccExtensions                              PASSED     C 0:00.644 - R 0:00.002
23:28:18        	ato                                        PASSED     C 0:17.368 - R 0:00.018
23:28:18        	bitmanip1                                  PASSED     C 0:18.501 - R 0:00.065
23:28:18        	bitmanip2                                  PASSED     C 0:19.229 - R 0:00.033
23:28:18        	io/manipulatorsInput                       PASSED     C 0:11.755 - R 0:00.017
23:28:18        	meta/archVast                              PASSED     C 0:00.366 - R n/a
23:28:18        	io/manipulatorsOutput2                     PASSED     C 0:25.042 - R 0:00.017
23:28:18        	random                                     PASSED     C 0:17.206 - R 0:00.017
23:28:18        	bitmanip3                                  PASSED     C 0:39.532 - R 0:00.216
23:28:18        	math                                       PASSED     C 0:21.328 - R 0:00.035
23:28:18        	io/manipulatorsOutput1                     PASSED     C 0:38.370 - R 0:00.018
23:28:18        	vector_math/vec2_ldouble                   PASSED     C 0:21.777 - R 0:00.034
23:28:18        	mathX                                      PASSED     C 0:43.375 - R 0:00.117
23:28:18 Tests took  7:44.600
23:28:18 [Pipeline] sh
23:28:18 + make --no-print-directory -C tests timeouts=--timeout=600 --global-timeout=14400 all-tests debug=no archiveerrors=/var/lib/jenkins/workspace/Cforall_master@tmp/tests/crashes/full-nodebug
23:28:18 Running 219 tests on 6 cores (Default AST (new):x86 - no debug)
23:28:18        	array-container/language-dim-mismatch      PASSED     C 0:00.108 - R n/a
23:28:18        	array                                      PASSED     C 0:02.045 - R 0:00.012
23:28:18        	builtins/sync                              PASSED     C 0:02.978 - R 0:00.001
23:28:18        	alloc-ERROR                                PASSED     C 0:06.144 - R n/a
23:28:18        	array-container/array-basic                PASSED     C 0:06.273 - R 0:00.004
23:28:18        	castError                                  PASSED     C 0:00.359 - R n/a
23:28:18        	cast                                       PASSED     C 0:03.947 - R 0:00.001
23:28:18        	avl_test                                   PASSED     C 0:09.845 - R 0:00.004
23:28:18        	alloc                                      PASSED     C 0:24.074 - R 0:00.005
23:28:18        	collections/multi_list                     PASSED     C 0:18.555 - R 0:00.005
23:28:18        	collections/atomic_mpsc                    PASSED     C 0:22.274 - R 0:01.167
23:28:18        	collections/vector-err-pass-perm-it-byval  PASSED     C 0:01.849 - R n/a
23:28:18        	collections/queue                          PASSED     C 0:23.175 - R 0:00.011
23:28:18        	collections/vector-err-retn-perm-it-byval  PASSED     C 0:01.501 - R n/a
23:28:18        	collections/vector-demo                    PASSED     C 0:08.595 - R 0:00.002
23:28:18        	collections/sequence                       PASSED     C 0:23.744 - R 0:00.004
23:28:18        	collections/stack                          PASSED     C 0:11.473 - R 0:00.004
23:28:18        	concurrent/clib                            PASSED     C 0:12.797 - R 0:00.016
23:28:18        	concurrent/clib_tls                        PASSED     C 0:13.971 - R 0:00.006
23:28:18        	alloc2                                     PASSED     C 0:48.856 - R 0:00.004
23:28:18        	complex                                    PASSED     C 0:17.879 - R 0:00.005
23:28:18        	concurrent/cluster                         PASSED     C 0:17.104 - R 0:00.004
23:28:18        	concurrent/coroutineYield                  PASSED     C 0:16.003 - R 0:00.017
23:28:18        	concurrent/examples/matrixSum              PASSED     C 0:18.094 - R 0:00.017
23:28:18        	concurrent/examples/datingService          PASSED     C 0:20.247 - R 0:00.008
23:28:18        	concurrent/examples/gortn                  PASSED     C 0:19.584 - R 0:00.041
23:28:18        	concurrent/examples/boundedBufferEXT       PASSED     C 0:23.019 - R 0:01.470
23:28:18        	concurrent/examples/quickSort              PASSED     C 0:19.232 - R 0:00.032
23:28:18        	concurrent/examples/boundedBufferINT       PASSED     C 0:22.572 - R 0:01.543
23:28:18        	concurrent/keywordErrors                   PASSED     C 0:00.309 - R n/a
23:28:18        	concurrent/futures/abandon                 PASSED     C 0:16.424 - R 0:00.034
23:28:18        	concurrent/futures/basic                   PASSED     C 0:16.707 - R 0:00.016
23:28:18        	concurrent/futures/typed                   PASSED     C 0:15.918 - R 0:00.017
23:28:18        	concurrent/futures/multi                   PASSED     C 0:16.823 - R 0:00.004
23:28:18        	concurrent/join                            PASSED     C 0:16.230 - R 0:00.004
23:28:18        	concurrent/monitor                         PASSED     C 0:15.033 - R 0:02.620
23:28:18        	concurrent/park/contention                 PASSED     C 0:14.782 - R 0:00.032
23:28:18        	concurrent/park/start_parked               PASSED     C 0:12.365 - R 0:00.006
23:28:18        	concurrent/mutexstmt/monitors              PASSED     C 0:15.025 - R 0:00.775
23:28:18        	concurrent/mutexstmt/locks                 PASSED     C 0:16.880 - R 0:00.616
23:28:18        	concurrent/park/force_preempt              PASSED     C 0:16.598 - R 0:00.271
23:28:18        	concurrent/multi-monitor                   PASSED     C 0:18.862 - R 0:04.374
23:28:18        	concurrent/signal/block                    PASSED     C 0:23.226 - R 0:00.316
23:28:18        	concurrent/signal/disjoint                 PASSED     C 0:23.286 - R 0:00.467
23:28:18        	concurrent/semaphore                       PASSED     C 0:25.313 - R 0:00.016
23:28:18        	concurrent/signal/wait                     PASSED     C 0:23.733 - R 0:00.079
23:28:18        	concurrent/sleep                           PASSED     C 0:20.430 - R 0:01.124
23:28:18        	concurrent/preempt                         PASSED     C 0:15.036 - R 0:15.125
23:28:18        	concurrent/waitfor/else                    PASSED     C 0:16.753 - R 0:00.004
23:28:18        	concurrent/suspend_then                    PASSED     C 0:21.403 - R 0:00.033
23:28:18        	concurrent/thread                          PASSED     C 0:21.742 - R 0:00.004
23:28:18        	concurrent/waitfor/dtor                    PASSED     C 0:18.808 - R 0:00.215
23:28:18        	concurrent/spinaphore                      PASSED     C 0:24.036 - R 0:00.065
23:28:18        	concurrent/waitfor/barge                   PASSED     C 0:21.868 - R 0:00.416
23:28:18        	const-init                                 PASSED     C 0:03.674 - R 0:00.004
23:28:18        	copyfile                                   PASSED     C 0:08.596 - R 0:00.004
23:28:18        	coroutine/devicedriver                     PASSED     C 0:09.090 - R 0:00.004
23:28:18        	coroutine/fibonacci                        PASSED     C 0:13.066 - R 0:00.005
23:28:18        	coroutine/fmtLines                         PASSED     C 0:12.324 - R 0:00.004
23:28:18        	concurrent/waitfor/recurse                 PASSED     C 0:22.449 - R 0:00.374
23:28:18        	coroutine/pingpong                         PASSED     C 0:11.894 - R 0:00.004
23:28:18        	concurrent/waitfor/when                    PASSED     C 0:22.526 - R 0:00.032
23:28:18        	concurrent/waitfor/statment                PASSED     C 0:23.367 - R 0:00.008
23:28:18        	designations                               PASSED     C 0:02.243 - R 0:00.004
23:28:18        	coroutine/prodcons                         PASSED     C 0:12.089 - R 0:00.005
23:28:18        	enum                                       PASSED     C 0:00.902 - R 0:00.005
23:28:18        	errors/declaration                         PASSED     C 0:00.080 - R n/a
23:28:18        	errors/scope                               PASSED     C 0:00.150 - R n/a
23:28:18        	errors/signature                           PASSED     C 0:00.103 - R n/a
23:28:18        	counter                                    PASSED     C 0:08.900 - R 0:00.005
23:28:18        	coroutine/raii                             PASSED     C 0:11.006 - R 0:00.004
23:28:18        	coroutine/runningTotal                     PASSED     C 0:11.547 - R 0:00.005
23:28:18        	exceptions/conditional                     PASSED     C 0:01.145 - R 0:00.004
23:28:18        	exceptions/data-except                     PASSED     C 0:02.162 - R 0:00.004
23:28:18        	div                                        PASSED     C 0:13.610 - R 0:00.005
23:28:18        	exceptions/cancel/coroutine                PASSED     C 0:08.557 - R 0:00.004
23:28:18        	exceptions/defaults                        PASSED     C 0:03.008 - R 0:00.005
23:28:18        	exceptions/finally-error                   PASSED     C 0:00.237 - R n/a
23:28:18        	device/cpu                                 PASSED     C 0:17.494 - R 0:00.004
23:28:18        	exceptions/conditional-threads             PASSED     C 0:06.840 - R 0:00.004
23:28:18        	exceptions/finally                         PASSED     C 0:01.501 - R 0:00.004
23:28:18        	exceptions/interact                        PASSED     C 0:01.899 - R 0:00.004
23:28:18        	exceptions/resume                          PASSED     C 0:01.854 - R 0:00.005
23:28:18        	exceptions/polymorphic                     PASSED     C 0:02.207 - R 0:00.005
23:28:18        	exceptions/cancel/thread                   PASSED     C 0:11.623 - R 0:00.004
23:28:18        	exceptions/trash                           PASSED     C 0:01.073 - R 0:00.004
23:28:18        	exceptions/terminate                       PASSED     C 0:01.552 - R 0:00.004
23:28:18        	exceptions/type-check                      PASSED     C 0:00.207 - R n/a
23:28:18        	exceptions/defaults-threads                PASSED     C 0:06.934 - R 0:00.005
23:28:18        	exceptions/virtual-poly                    PASSED     C 0:01.564 - R 0:00.004
23:28:18        	exceptions/finally-threads                 PASSED     C 0:06.967 - R 0:00.004
23:28:18        	expression                                 PASSED     C 0:00.893 - R 0:00.001
23:28:18        	exceptions/virtual-cast                    PASSED     C 0:02.641 - R 0:00.004
23:28:18        	forall                                     PASSED     C 0:07.789 - R 0:00.004
23:28:18        	exceptions/resume-threads                  PASSED     C 0:13.864 - R 0:00.065
23:28:18        	exceptions/terminate-threads               PASSED     C 0:13.442 - R 0:00.009
23:28:18        	fallthrough                                PASSED     C 0:10.888 - R 0:00.004
23:28:18        	fstream_test                               PASSED     C 0:10.192 - R 0:00.004
23:28:18        	global-monomorph                           PASSED     C 0:00.805 - R 0:00.004
23:28:18        	genericUnion                               PASSED     C 0:00.968 - R 0:00.004
23:28:18        	function-operator                          PASSED     C 0:15.033 - R 0:00.004
23:28:18        	identFuncDeclarator                        PASSED     C 0:01.495 - R 0:00.003
23:28:18        	identParamDeclarator                       PASSED     C 0:02.557 - R 0:00.005
23:28:18        	generator/fibonacci                        PASSED     C 0:12.739 - R 0:00.008
23:28:18        	generator/fmtLines                         PASSED     C 0:12.450 - R 0:00.005
23:28:18        	generator/suspend_then                     PASSED     C 0:12.849 - R 0:00.066
23:28:18        	hello                                      PASSED     C 0:11.573 - R 0:00.004
23:28:18        	include/vector-containers                  PASSED     C 0:08.112 - R 0:00.058
23:28:18        	ifwhileCtl                                 PASSED     C 0:11.467 - R 0:00.021
23:28:18        	identity                                   PASSED     C 0:12.616 - R 0:00.021
23:28:18        	init1                                      PASSED     C 0:01.617 - R 0:00.026
23:28:18        	init1-ERROR                                PASSED     C 0:00.640 - R n/a
23:28:18        	include/vector-sequence                    PASSED     C 0:02.515 - R 0:00.011
23:28:18        	include/stdincludes                        PASSED     C 0:12.505 - R 0:00.001
23:28:18        	heap                                       PASSED     C 0:13.337 - R 0:11.996
23:28:18        	include/vector-fstream                     PASSED     C 0:08.117 - R 0:00.004
23:28:18        	labelledExit                               PASSED     C 0:04.146 - R 0:00.001
23:28:18        	limits                                     PASSED     C 0:01.532 - R 0:00.002
23:28:18        	linking/exception-nothreads                PASSED     C 0:03.300 - R 0:00.004
23:28:18        	linking/exception-withthreads              PASSED     C 0:11.629 - R 0:00.018
23:28:18        	io/many_read                               PASSED     C 0:26.175 - R 0:00.005
23:28:18        	io/io-acquire                              PASSED     C 0:28.739 - R 0:00.317
23:28:18        	linking/nostdlib                           PASSED     C 0:02.883 - R 0:00.004
23:28:18        	io/io                                      PASSED     C 0:31.589 - R 0:00.005
23:28:18        	io/manipulatorsOutput4                     PASSED     C 0:44.803 - R 0:00.065
23:28:18        	linking/io-acquire                         PASSED     C 0:21.018 - R 0:00.004
23:28:18        	linking/nothreads                          PASSED     C 0:17.019 - R 0:00.008
23:28:18        	include/includes                           PASSED     C 0:59.190 - R 0:00.003
23:28:18        	linking/weakso_nothd                       PASSED     C 0:15.972 - R 0:00.006
23:28:18        	linking/withthreads                        PASSED     C 0:15.594 - R 0:00.004
23:28:18        	linkonce                                   PASSED     C 0:01.772 - R 0:00.004
23:28:18        	maybe                                      PASSED     C 0:01.157 - R 0:00.004
23:28:18        	nested-types                               PASSED     C 0:00.765 - R 0:00.001
23:28:18        	nested-types-ERR1                          PASSED     C 0:00.068 - R n/a
23:28:18        	nested-types-ERR2                          PASSED     C 0:00.083 - R n/a
23:28:18        	numericConstants                           PASSED     C 0:00.714 - R 0:00.001
23:28:18        	operators                                  PASSED     C 0:00.784 - R 0:00.004
23:28:18        	literals                                   PASSED     C 0:14.986 - R 0:00.004
23:28:18        	malloc                                     PASSED     C 0:15.318 - R 0:00.004
23:28:18        	poly-d-cycle                               PASSED     C 0:00.903 - R 0:00.004
23:28:18        	loopctrl                                   PASSED     C 0:16.390 - R 0:00.005
23:28:18        	minmax                                     PASSED     C 0:15.667 - R 0:00.004
23:28:18        	poly-selection                             PASSED     C 0:00.944 - R 0:00.004
23:28:18        	poly-o-cycle                               PASSED     C 0:01.463 - R 0:00.003
23:28:18        	quasiKeyword                               PASSED     C 0:02.981 - R 0:00.001
23:28:18        	parseconfig                                FAILED with code -6    C 0:12.147 - R 0:08.558
23:28:18 Different types of destination addresses
23:28:18 Stop cost: 1
23:28:18 Number of students: 2
23:28:18 Number of stops: 2
23:28:18 Maximum number of students: 5
23:28:18 Timer delay: 2
23:28:18 Groupoff delay: 10
23:28:18 Conductor delay: 5
23:28:18 Parental delay: 5
23:28:18 Number of couriers: 1
23:28:18 Maximum student delay: 10
23:28:18 Maximum student trips: 3
23:28:18 
23:28:18 Open_Failure thrown when config file does not exist
23:28:18 Cforall Runtime error (UNIX pid:6518) Null pointer (0p) dereference.
23:28:18 Stack back trace for: /var/lib/jenkins/workspace/Cforall_master@tmp/libcfa/x86-nodebug/src/.libs/libcfa.so.1
23:28:18 (0) /lib/i386-linux-gnu/libc.so.6 : __isoc99_vfscanf + 0x17  [0xb7d223f7]
23:28:18 (1) /var/lib/jenkins/workspace/Cforall_master@tmp/libcfa/x86-nodebug/src/.libs/libcfa.so.1 : _X3fmtFi_S8ifstreamPKc__1 + 0x25  [0xb7f4d905]
23:28:18 (2) /var/lib/jenkins/workspace/Cforall_master@tmp/libcfa/x86-nodebug/src/.libs/libcfa.so.1 : _X15_operator_bitorQ1_0_0_7__X6getANLFb_BD0__X4nlOnFv_BD0__X5nlOffFv_BD0__X4endsFv_BD0__X3fmtFi_BD0PKc__X6ungetcFBD0_BD0c__X3eofFb_BD0__FBD0_BD0Pc__1 + 0x22  [0xb7f5bdf2]
23:28:18 (3) /var/lib/jenkins/workspace/Cforall_master@tmp/libcfa/x86-nodebug/src/.libs/libcfa.so.1 : _X15_operator_bitorQ1_0_0_7__X6getANLFb_BD0__X4nlOnFv_BD0__X5nlOffFv_BD0__X4endsFv_BD0__X3fmtFi_BD0PKc__X6ungetcFBD0_BD0c__X3eofFb_BD0__Fv_BD0Pc__1 + 0x3c  [0xb7f5be3c]
23:28:18 (4) /var/lib/jenkins/workspace/Cforall_master@tmp/libcfa/x86-nodebug/src/.libs/libcfa.so.1 : _X8commentsFb_S8ifstreamPc__1 + 0xb2  [0xb7f61a92]
23:28:18 (5) /var/lib/jenkins/workspace/Cforall_master@tmp/libcfa/x86-nodebug/src/.libs/libcfa.so.1 :  + 0x53bb7  [0xb7f61bb7]
23:28:18 (6) /var/lib/jenkins/workspace/Cforall_master@tmp/libcfa/x86-nodebug/src/.libs/libcfa.so.1 : __cfaehm_try_terminate + 0x15  [0xb7f7e987]
23:28:18 (7) /var/lib/jenkins/workspace/Cforall_master@tmp/libcfa/x86-nodebug/src/.libs/libcfa.so.1 : _X27parse_tabular_config_formatFPS7KVPairs_PKcj__1 + 0xba  [0xb7f61caa]
23:28:18 (8) /var/lib/jenkins/workspace/Cforall_master@tmp/libcfa/x86-nodebug/src/.libs/libcfa.so.1 : _X12parse_configFv_PKcPS12config_entryjFPS7KVPairs_PKcj___1 + 0x32  [0xb7f61d32]
23:28:18 (9) /var/lib/jenkins/workspace/Cforall_master@tmp/tests/parseconfig() [0x804a5d7]
23:28:18 (10) /var/lib/jenkins/workspace/Cforall_master@tmp/libcfa/x86-nodebug/src/.libs/libcfa.so.1 : __cfaehm_try_terminate + 0x15  [0xb7f7e987]
23:28:18 BFD: warning: /tmp/tmpf4efj_no/core is truncated: expected core file size >= 10924032, found: 10616832
23:28:18 [New LWP 6518]
23:28:18 Cannot access memory at address 0xb7fff908
23:28:18 Cannot access memory at address 0xb7fff904
23:28:18 Failed to read a valid object file image from memory.
23:28:18 Core was generated by `/var/lib/jenkins/workspace/Cforall_master@tmp/tests/parseconfig'.
23:28:18 Program terminated with signal SIGABRT, Aborted.
23:28:18 #0  0xb7fd9cf5 in ?? ()
23:28:18 -----
23:28:18 #0  0xb7fd9cf5 in ?? ()
23:28:18 Backtrace stopped: Cannot access memory at address 0xb7fd3498
23:28:18 -----
23:28:18   Id   Target Id         Frame 
23:28:18 * 1    LWP 6518          0xb7fd9cf5 in ?? ()
23:28:18 
23:28:18 Archiving parseconfig (executable and core) to crashes/full-nodebug/parseconfig
23:28:18        	raii/ctor-autogen                          PASSED     C 0:06.551 - R 0:00.010
23:28:18        	raii/ctor-autogen-ERR1                     PASSED     C 0:00.393 - R n/a
23:28:18        	list/dlist-insert-remove                   PASSED     C 0:26.764 - R 0:00.004
23:28:18        	raii/dtor-early-exit-ERR1                  PASSED     C 0:06.274 - R n/a
23:28:18        	raii/dtor-early-exit-ERR2                  PASSED     C 0:06.311 - R n/a
23:28:18        	quotedKeyword                              PASSED     C 0:16.551 - R 0:00.005
23:28:18        	raii/boxed-types                           PASSED     C 0:16.127 - R 0:00.004
23:28:18        	raii/memberCtors-ERR1                      PASSED     C 0:00.514 - R n/a
23:28:18        	polymorphism                               PASSED     C 0:17.452 - R 0:00.004
23:28:18        	raii/memberCtors                           PASSED     C 0:01.051 - R 0:00.004
23:28:18        	raii/init_once                             PASSED     C 0:01.462 - R 0:00.004
23:28:18        	result                                     PASSED     C 0:02.688 - R 0:00.005
23:28:18        	raii/dtor-early-exit                       PASSED     C 0:16.279 - R 0:00.004
23:28:18        	raii/globals                               PASSED     C 0:10.267 - R 0:00.004
23:28:18        	references                                 PASSED     C 0:09.630 - R 0:00.003
23:28:18        	smart-pointers                             PASSED     C 0:02.083 - R 0:00.008
23:28:18        	simpleGenericTriple                        PASSED     C 0:02.690 - R 0:00.005
23:28:18        	shortCircuit                               PASSED     C 0:12.501 - R 0:00.066
23:28:18        	switch                                     PASSED     C 0:01.210 - R 0:00.003
23:28:18        	strstream                                  PASSED     C 0:09.801 - R 0:00.004
23:28:18        	searchsort                                 PASSED     C 0:19.191 - R 0:00.004
23:28:18        	tuple/tupleCast                            PASSED     C 0:01.086 - R 0:00.004
23:28:18        	tuple/tupleFunction                        PASSED     C 0:02.347 - R 0:00.006
23:28:18        	tuple/tupleMember                          PASSED     C 0:02.004 - R 0:00.004
23:28:18        	tuple/tuplePolymorphism                    PASSED     C 0:03.025 - R 0:00.004
23:28:18        	sum                                        PASSED     C 0:17.326 - R 0:00.004
23:28:18        	typedefRedef                               PASSED     C 0:01.175 - R 0:00.002
23:28:18        	typedefRedef-ERR1                          PASSED     C 0:00.095 - R n/a
23:28:18        	time                                       PASSED     C 0:14.407 - R 0:00.005
23:28:18        	typeof                                     PASSED     C 0:02.240 - R 0:00.006
23:28:18        	swap                                       PASSED     C 0:21.550 - R 0:00.005
23:28:18        	tuple/tupleVariadic                        PASSED     C 0:06.376 - R 0:00.004
23:28:18        	tuple/tupleAssign                          PASSED     C 0:15.017 - R 0:00.005
23:28:18        	rational                                   PASSED     C 0:55.155 - R 0:00.005
23:28:18        	unified_locking/timeout_lock               PASSED     C 0:28.385 - R 0:01.070
23:28:18        	unified_locking/lin_backoff                PASSED     C 0:32.751 - R 0:00.018
23:28:18        	variableDeclarator                         PASSED     C 0:00.908 - R 0:00.022
23:28:18        	unified_locking/fast                       PASSED     C 0:33.688 - R 0:00.049
23:28:18        	userLiterals                               PASSED     C 0:11.011 - R 0:00.021
23:28:18        	unified_locking/mcs                        PASSED     C 0:31.347 - R 0:02.292
23:28:18        	unified_locking/locks                      PASSED     C 0:32.027 - R 0:08.544
23:28:18        	vector                                     PASSED     C 0:14.601 - R 0:00.005
23:28:18        	vector_math/vec2_double                    PASSED     C 0:18.040 - R 0:00.005
23:28:18        	vector_math/vec2_uint                      PASSED     C 0:22.337 - R 0:00.005
23:28:18        	vector_math/vec3_int                       PASSED     C 0:46.264 - R 0:00.010
23:28:18        	voidPtr                                    PASSED     C 0:03.036 - R 0:00.003
23:28:18        	warnings/self-assignment                   PASSED     C 0:03.900 - R 0:00.001
23:28:18        	KRfunctions                                PASSED     C 0:00.554 - R 0:00.002
23:28:18        	vector_math/vec4_float                     PASSED     C 0:50.100 - R 0:00.004
23:28:18        	vector_math/vec4_int                       PASSED     C 0:49.122 - R 0:00.005
23:28:18        	vector_math/vec2_float                     PASSED     C 1:21.142 - R 0:00.005
23:28:18        	attributes                                 PASSED     C 0:01.669 - R 0:00.050
23:28:18        	vector_math/vec3_float                     PASSED     C 1:15.358 - R 0:00.005
23:28:18        	abs                                        PASSED     C 0:17.932 - R 0:00.004
23:28:18        	ato                                        PASSED     C 0:11.440 - R 0:00.004
23:28:18        	declarationSpecifier                       PASSED     C 0:01.114 - R 0:00.063
23:28:18        	errors/completeType                        PASSED     C 0:00.371 - R n/a
23:28:18        	extension                                  PASSED     C 0:00.687 - R 0:00.018
23:28:18        	functions                                  PASSED     C 0:00.646 - R 0:00.003
23:28:18        	gccExtensions                              PASSED     C 0:00.647 - R 0:00.003
23:28:18        	array-container/array-md-sbscr-cases       PASSED     C 0:24.899 - R 0:00.005
23:28:18        	vector_math/vec2_int                       PASSED     C 1:35.135 - R 0:00.005
23:28:18        	io/manipulatorsInput                       PASSED     C 0:14.907 - R 0:00.005
23:28:18        	bitmanip1                                  PASSED     C 0:31.262 - R 0:00.267
23:28:18        	bitmanip2                                  PASSED     C 0:35.748 - R 0:00.008
23:28:18        	meta/archVast                              PASSED     C 0:00.387 - R n/a
23:28:18        	bitmanip3                                  PASSED     C 0:51.102 - R 0:00.266
23:28:18        	random                                     PASSED     C 0:25.009 - R 0:00.005
23:28:18        	io/manipulatorsOutput2                     PASSED     C 0:51.123 - R 0:00.005
23:28:18        	math                                       PASSED     C 0:37.456 - R 0:00.005
23:28:18        	mathX                                      PASSED     C 0:51.039 - R 0:00.019
23:28:18        	vector_math/vec2_ldouble                   PASSED     C 0:22.347 - R 0:00.006
23:28:18        	io/manipulatorsOutput1                     PASSED     C 1:37.155 - R 0:00.006
23:28:18 Tests took  9:27.054
23:28:18 Makefile:862: recipe for target 'all-tests' failed
23:28:18 make: *** [all-tests] Error 1
23:28:18 [Pipeline] }
23:28:18 [Pipeline] // dir
23:28:18 [Pipeline] }
23:28:18 [Pipeline] // stage
23:28:18 [Pipeline] echo
23:28:18 Archiving core dumps
23:28:18 [Pipeline] dir
23:28:18 Running in /var/lib/jenkins/workspace/Cforall_master@tmp
23:28:18 [Pipeline] {
23:28:18 [Pipeline] fileExists
23:28:18 [Pipeline] sh
23:28:18 + /var/lib/jenkins/workspace/Cforall_master/tools/jenkins/archive-gen.sh
23:28:18 [Pipeline] archiveArtifacts
23:28:18 Archiving artifacts
23:28:18 Recording fingerprints
23:28:18 [Pipeline] }
23:28:18 [Pipeline] // dir
23:28:18 [Pipeline] }
23:28:18 [Pipeline] // wrap
23:28:18 [Pipeline] }
23:28:18 [Pipeline] // node
23:28:18 [Pipeline] echo
23:28:18 hudson.AbortException: script returned exit code 2
23:28:18 [Pipeline] node
23:28:18 Running on Brokk 5 in /var/lib/jenkins/workspace/Cforall_master
23:28:18 [Pipeline] {
23:28:18 [Pipeline] echo
23:28:18 Notifying users of result
23:28:18 [Pipeline] echo
23:28:18 Reusing previously constructed message
23:28:18 [Pipeline] echo
23:28:18 Would send email to: cforall@lists.uwaterloo.ca
23:28:18 [Pipeline] echo
23:28:18 With title: [cforall git][BUILD# 16270 - FAILURE] - branch master
23:28:18 [Pipeline] echo
23:28:18 Content: 
23:28:18 <p>This is an automated email from the Jenkins build machine. It was
23:28:18 generated because of a git hooks/post-receive script following
23:28:18 a ref change which was pushed to the C∀ repository.</p>
23:28:18 
23:28:18 <p>- Status --------------------------------------------------------------</p>
23:28:18 
23:28:18 <p>BUILD# 16270 - FAILURE</p>
23:28:18 <p>Check console output at https://cforall.uwaterloo.ca/jenkins/job/Cforall/job/master/16270/ to view the results.</p>
23:28:18 
23:28:18 <p>- Changes -------------------------------------------------------------</p>
23:28:18 
23:28:18 <pre>
23:28:18 The branch master has been updated.
23:28:18       from  a3cadfcf7de2a83c2d884dd711e7f82979272284 (commit)
23:28:18 </pre>
23:28:18 
23:28:18 <p>- Log -----------------------------------------------------------------</p>
23:28:18 
23:28:18 <pre>
23:28:18 
23:28:18 </pre>
23:28:18 
23:28:18 <p>-----------------------------------------------------------------------</p>
23:28:18 <pre>
23:28:18 Summary of changes:
23:28:18 
23:28:18 </pre>
23:28:18 
23:28:18 [Pipeline] }
23:28:18 [Pipeline] // node
23:28:18 [Pipeline] echo
23:28:18 Build Completed
23:28:18 [Pipeline] End of Pipeline
23:28:18 ERROR: script returned exit code 2
23:28:18 Finished: FAILURE
[Pipeline] error
[Pipeline] }
23:28:18 Failed in branch gcc_08_x86_new
[Pipeline] // parallel
[Pipeline] }
[Pipeline] // stage
[Pipeline] }
[Pipeline] // wrap
[Pipeline] echo
error caught
[Pipeline] node
Running on Brokk 4 in /var/lib/jenkins/workspace/Cforall_Full_Build
[Pipeline] {
[Pipeline] echo
notifying users
[Pipeline] emailext
Sending email to: cforall@lists.uwaterloo.ca
[Pipeline] }
[Pipeline] // node
[Pipeline] }
[Pipeline] // node
[Pipeline] End of Pipeline
ERROR: FAILURE
Finished: FAILURE