Console Output

Skipping 601 KB.. Full Log
23:11:08        	references                                 PASSED     C 0:08.367 - R 0:00.017
23:11:08        	shortCircuit                               PASSED     C 0:07.369 - R 0:00.017
23:11:08        	switch                                     PASSED     C 0:00.742 - R 0:00.001
23:11:08        	searchsort                                 PASSED     C 0:11.234 - R 0:00.032
23:11:08        	strstream                                  PASSED     C 0:07.528 - R 0:00.016
23:11:08        	tuple/tupleCast                            PASSED     C 0:00.798 - R 0:00.016
23:11:08        	tuple/tupleFunction                        PASSED     C 0:00.926 - R 0:00.016
23:11:08        	tuple/tupleMember                          PASSED     C 0:00.944 - R 0:00.017
23:11:08        	sum                                        PASSED     C 0:10.564 - R 0:00.016
23:11:08        	tuple/tuplePolymorphism                    PASSED     C 0:01.149 - R 0:00.016
23:11:08        	typedefRedef                               PASSED     C 0:00.760 - R 0:00.001
23:11:08        	typedefRedef-ERR1                          PASSED     C 0:00.070 - R n/a
23:11:08        	typeof                                     PASSED     C 0:00.860 - R 0:00.019
23:11:08        	tuple/tupleVariadic                        PASSED     C 0:02.545 - R 0:00.017
23:11:08        	swap                                       PASSED     C 0:12.615 - R 0:00.016
23:11:08        	time                                       PASSED     C 0:11.665 - R 0:00.017
23:11:08        	tuple/tupleAssign                          PASSED     C 0:10.240 - R 0:00.016
23:11:08        	rational                                   PASSED     C 0:26.417 - R 0:00.033
23:11:08        	unified_locking/fast                       PASSED     C 0:16.703 - R 0:00.064
23:11:08        	userLiterals                               PASSED     C 0:09.736 - R 0:00.017
23:11:08        	variableDeclarator                         PASSED     C 0:00.774 - R 0:00.019
23:11:08        	unified_locking/lin_backoff                PASSED     C 0:17.332 - R 0:00.135
23:11:08        	unified_locking/timeout_lock               PASSED     C 0:13.645 - R 0:01.166
23:11:08        	vector_math/vec2_double                    PASSED     C 0:13.007 - R 0:00.016
23:11:08        	vector                                     PASSED     C 0:14.259 - R 0:00.059
23:11:08        	unified_locking/mcs                        PASSED     C 0:15.947 - R 0:15.787
23:11:08        	vector_math/vec2_int                       PASSED     C 0:21.208 - R 0:00.050
23:11:08        	vector_math/vec2_float                     PASSED     C 0:22.295 - R 0:00.053
23:11:08        	vector_math/vec2_uint                      PASSED     C 0:13.793 - R 0:00.025
23:11:08        	voidPtr                                    PASSED     C 0:01.547 - R 0:00.037
23:11:08        	warnings/self-assignment                   PASSED     C 0:01.086 - R 0:00.001
23:11:08        	KRfunctions                                PASSED     C 0:00.856 - R 0:00.001
23:11:08        	vector_math/vec3_int                       PASSED     C 0:18.602 - R 0:00.028
23:11:08        	vector_math/vec3_float                     PASSED     C 0:21.784 - R 0:00.049
23:11:08        	vector_math/vec4_int                       PASSED     C 0:22.536 - R 0:00.019
23:11:08        	attributes                                 PASSED     C 0:01.013 - R 0:00.035
23:11:08        	abs                                        PASSED     C 0:16.139 - R 0:00.033
23:11:08        	unified_locking/locks                      PASSED     C 0:15.124 - R 0:49.420
23:11:08        	vector_math/vec4_float                     PASSED     C 0:26.361 - R 0:00.016
23:11:08        	ato                                        PASSED     C 0:13.989 - R 0:00.016
23:11:08        	declarationSpecifier                       PASSED     C 0:00.829 - R 0:00.001
23:11:08        	errors/completeType                        PASSED     C 0:00.391 - R n/a
23:11:08        	functions                                  PASSED     C 0:00.663 - R 0:00.025
23:11:08        	extension                                  PASSED     C 0:00.949 - R 0:00.034
23:11:08        	gccExtensions                              PASSED     C 0:00.672 - R 0:00.001
23:11:08        	array-container/array-md-sbscr-cases       PASSED     C 0:16.252 - R 0:00.016
23:11:08        	io/manipulatorsInput                       PASSED     C 0:16.461 - R 0:00.033
23:11:08        	bitmanip1                                  PASSED     C 0:24.507 - R 0:00.033
23:11:08        	bitmanip2                                  PASSED     C 0:25.169 - R 0:00.033
23:11:08        	meta/archVast                              PASSED     C 0:00.398 - R n/a
23:11:08        	io/manipulatorsOutput2                     PASSED     C 0:21.339 - R 0:00.016
23:11:08        	io/manipulatorsOutput1                     PASSED     C 0:29.751 - R 0:00.017
23:11:08        	bitmanip3                                  PASSED     C 0:33.668 - R 0:00.066
23:11:08        	random                                     PASSED     C 0:12.102 - R 0:00.018
23:11:08        	vector_math/vec2_ldouble                   PASSED     C 0:14.508 - R 0:00.018
23:11:08        	math                                       PASSED     C 0:23.120 - R 0:00.018
23:11:08        	mathX                                      PASSED     C 0:32.419 - R 0:00.168
23:11:08 Tests took  6:15.594
23:11:08 [Pipeline] sh
23:11:08 + make --no-print-directory -C tests timeouts=--timeout=600 --global-timeout=14400 all-tests debug=no archiveerrors=/var/lib/jenkins/workspace/Cforall_master@tmp/tests/crashes/full-nodebug
23:11:08 Running 218 tests on 6 cores (Default AST (new):x86 - no debug)
23:11:08        	array-container/language-dim-mismatch      PASSED     C 0:00.184 - R n/a
23:11:08        	array                                      PASSED     C 0:01.914 - R 0:00.009
23:11:08        	builtins/sync                              PASSED     C 0:01.918 - R 0:00.012
23:11:08        	array-container/array-basic                PASSED     C 0:04.233 - R 0:00.021
23:11:08        	castError                                  PASSED     C 0:00.534 - R n/a
23:11:08        	cast                                       PASSED     C 0:01.766 - R 0:00.001
23:11:08        	alloc-ERROR                                PASSED     C 0:07.303 - R n/a
23:11:08        	avl_test                                   PASSED     C 0:07.179 - R 0:00.004
23:11:08        	alloc                                      PASSED     C 0:22.664 - R 0:00.004
23:11:08        	collections/multi_list                     PASSED     C 0:17.841 - R 0:00.004
23:11:08        	collections/atomic_mpsc                    PASSED     C 0:22.577 - R 0:01.217
23:11:08        	collections/vector-demo                    PASSED     C 0:04.979 - R 0:00.005
23:11:08        	collections/queue                          PASSED     C 0:21.568 - R 0:00.004
23:11:08        	collections/sequence                       PASSED     C 0:21.570 - R 0:00.005
23:11:08        	collections/vector-err-retn-perm-it-byval  PASSED     C 0:01.499 - R n/a
23:11:08        	collections/vector-err-pass-perm-it-byval  PASSED     C 0:01.825 - R n/a
23:11:08        	concurrent/clib                            PASSED     C 0:05.011 - R 0:00.034
23:11:08        	collections/stack                          PASSED     C 0:12.743 - R 0:00.005
23:11:08        	concurrent/clib_tls                        PASSED     C 0:05.279 - R 0:00.005
23:11:08        	complex                                    PASSED     C 0:13.758 - R 0:00.005
23:11:08        	concurrent/cluster                         PASSED     C 0:18.889 - R 0:00.017
23:11:08        	alloc2                                     PASSED     C 0:52.546 - R 0:00.005
23:11:08        	concurrent/coroutineYield                  PASSED     C 0:22.278 - R 0:00.019
23:11:08        	concurrent/examples/boundedBufferEXT       PASSED     C 0:20.835 - R 0:01.422
23:11:08        	concurrent/examples/boundedBufferINT       PASSED     C 0:21.286 - R 0:01.571
23:11:08        	concurrent/examples/datingService          PASSED     C 0:16.040 - R 0:00.017
23:11:08        	concurrent/examples/gortn                  PASSED     C 0:16.412 - R 0:00.005
23:11:08        	concurrent/examples/matrixSum              PASSED     C 0:14.806 - R 0:00.004
23:11:08        	concurrent/futures/abandon                 PASSED     C 0:11.845 - R 0:00.033
23:11:08        	concurrent/keywordErrors                   PASSED     C 0:00.219 - R n/a
23:11:08        	concurrent/futures/basic                   PASSED     C 0:11.658 - R 0:00.033
23:11:08        	concurrent/futures/multi                   PASSED     C 0:17.682 - R 0:00.004
23:11:08        	concurrent/examples/quickSort              PASSED     C 0:21.132 - R 0:00.004
23:11:08        	concurrent/futures/typed                   PASSED     C 0:11.946 - R 0:00.033
23:11:08        	concurrent/join                            PASSED     C 0:16.070 - R 0:00.033
23:11:08        	concurrent/park/contention                 PASSED     C 0:13.227 - R 0:00.033
23:11:08        	concurrent/mutexstmt/monitors              PASSED     C 0:14.184 - R 0:00.518
23:11:08        	concurrent/mutexstmt/locks                 PASSED     C 0:15.297 - R 0:00.967
23:11:08        	concurrent/monitor                         PASSED     C 0:20.985 - R 0:02.977
23:11:08        	concurrent/multi-monitor                   PASSED     C 0:21.521 - R 0:04.272
23:11:08        	concurrent/park/force_preempt              PASSED     C 0:27.334 - R 0:00.267
23:11:08        	concurrent/park/start_parked               PASSED     C 0:19.757 - R 0:00.017
23:11:08        	concurrent/semaphore                       PASSED     C 0:21.990 - R 0:00.033
23:11:08        	concurrent/signal/disjoint                 PASSED     C 0:18.724 - R 0:00.465
23:11:08        	concurrent/signal/block                    PASSED     C 0:20.896 - R 0:00.323
23:11:08        	concurrent/preempt                         PASSED     C 0:19.064 - R 0:16.614
23:11:08        	concurrent/signal/wait                     PASSED     C 0:22.569 - R 0:00.066
23:11:08        	concurrent/sleep                           PASSED     C 0:21.532 - R 0:01.121
23:11:08        	concurrent/suspend_then                    PASSED     C 0:20.358 - R 0:00.019
23:11:08        	concurrent/spinaphore                      PASSED     C 0:20.786 - R 0:00.065
23:11:08        	concurrent/thread                          PASSED     C 0:21.070 - R 0:00.004
23:11:08        	concurrent/waitfor/barge                   PASSED     C 0:23.887 - R 0:00.065
23:11:08        	concurrent/waitfor/else                    PASSED     C 0:18.845 - R 0:00.004
23:11:08        	const-init                                 PASSED     C 0:00.988 - R 0:00.005
23:11:08        	concurrent/waitfor/dtor                    PASSED     C 0:20.272 - R 0:00.265
23:11:08        	concurrent/waitfor/statment                PASSED     C 0:19.814 - R 0:00.008
23:11:08        	concurrent/waitfor/when                    PASSED     C 0:19.371 - R 0:00.032
23:11:08        	concurrent/waitfor/recurse                 PASSED     C 0:20.077 - R 0:01.170
23:11:08        	copyfile                                   PASSED     C 0:12.209 - R 0:00.005
23:11:08        	coroutine/devicedriver                     PASSED     C 0:13.705 - R 0:00.009
23:11:08        	coroutine/fibonacci                        PASSED     C 0:12.483 - R 0:00.005
23:11:08        	coroutine/pingpong                         PASSED     C 0:11.660 - R 0:00.004
23:11:08        	coroutine/fmtLines                         PASSED     C 0:11.703 - R 0:00.004
23:11:08        	designations                               PASSED     C 0:01.300 - R 0:00.005
23:11:08        	coroutine/prodcons                         PASSED     C 0:14.007 - R 0:00.004
23:11:08        	enum                                       PASSED     C 0:00.863 - R 0:00.004
23:11:08        	errors/declaration                         PASSED     C 0:00.057 - R n/a
23:11:08        	errors/scope                               PASSED     C 0:00.135 - R n/a
23:11:08        	errors/signature                           PASSED     C 0:00.067 - R n/a
23:11:08        	counter                                    PASSED     C 0:09.050 - R 0:00.005
23:11:08        	coroutine/raii                             PASSED     C 0:11.438 - R 0:00.004
23:11:08        	coroutine/runningTotal                     PASSED     C 0:09.854 - R 0:00.004
23:11:08        	exceptions/conditional                     PASSED     C 0:01.835 - R 0:00.004
23:11:08        	exceptions/data-except                     PASSED     C 0:02.030 - R 0:00.010
23:11:08        	exceptions/cancel/coroutine                PASSED     C 0:08.923 - R 0:00.005
23:11:08        	exceptions/defaults                        PASSED     C 0:02.825 - R 0:00.004
23:11:08        	exceptions/finally                         PASSED     C 0:00.980 - R 0:00.004
23:11:08        	exceptions/conditional-threads             PASSED     C 0:07.540 - R 0:00.004
23:11:08        	exceptions/finally-error                   PASSED     C 0:00.217 - R n/a
23:11:08        	div                                        PASSED     C 0:15.826 - R 0:00.004
23:11:08        	device/cpu                                 PASSED     C 0:17.366 - R 0:00.005
23:11:08        	exceptions/cancel/thread                   PASSED     C 0:09.302 - R 0:00.004
23:11:08        	exceptions/interact                        PASSED     C 0:02.036 - R 0:00.005
23:11:08        	exceptions/resume                          PASSED     C 0:03.142 - R 0:00.005
23:11:08        	exceptions/polymorphic                     PASSED     C 0:03.392 - R 0:00.004
23:11:08        	exceptions/terminate                       PASSED     C 0:01.553 - R 0:00.004
23:11:08        	exceptions/type-check                      PASSED     C 0:00.203 - R n/a
23:11:08        	exceptions/defaults-threads                PASSED     C 0:07.390 - R 0:00.004
23:11:08        	exceptions/trash                           PASSED     C 0:01.917 - R 0:00.005
23:11:08        	expression                                 PASSED     C 0:00.811 - R 0:00.001
23:11:08        	exceptions/virtual-poly                    PASSED     C 0:02.374 - R 0:00.004
23:11:08        	exceptions/virtual-cast                    PASSED     C 0:04.808 - R 0:00.010
23:11:08        	forall                                     PASSED     C 0:02.498 - R 0:00.002
23:11:08        	exceptions/finally-threads                 PASSED     C 0:09.310 - R 0:00.004
23:11:08        	exceptions/resume-threads                  PASSED     C 0:08.884 - R 0:00.006
23:11:08        	exceptions/terminate-threads               PASSED     C 0:06.686 - R 0:00.004
23:11:08        	generator/fibonacci                        PASSED     C 0:10.228 - R 0:00.017
23:11:08        	fallthrough                                PASSED     C 0:13.079 - R 0:00.017
23:11:08        	fstream_test                               PASSED     C 0:10.841 - R 0:00.002
23:11:08        	generator/suspend_then                     PASSED     C 0:09.935 - R 0:00.065
23:11:08        	global-monomorph                           PASSED     C 0:00.920 - R 0:00.003
23:11:08        	genericUnion                               PASSED     C 0:01.107 - R 0:00.004
23:11:08        	generator/fmtLines                         PASSED     C 0:10.846 - R 0:00.009
23:11:08        	identFuncDeclarator                        PASSED     C 0:00.786 - R 0:00.001
23:11:08        	identParamDeclarator                       PASSED     C 0:01.256 - R 0:00.005
23:11:08        	function-operator                          PASSED     C 0:14.516 - R 0:00.004
23:11:08        	hello                                      PASSED     C 0:09.508 - R 0:00.004
23:11:08        	ifwhileCtl                                 PASSED     C 0:08.825 - R 0:00.002
23:11:08        	identity                                   PASSED     C 0:09.540 - R 0:00.004
23:11:08        	include/vector-sequence                    PASSED     C 0:05.407 - R 0:00.021
23:11:08        	include/vector-containers                  PASSED     C 0:06.203 - R 0:00.025
23:11:08        	include/stdincludes                        PASSED     C 0:12.947 - R 0:00.001
23:11:08        	init1-ERROR                                PASSED     C 0:00.981 - R n/a
23:11:08        	init1                                      PASSED     C 0:02.501 - R 0:00.014
23:11:08        	include/vector-fstream                     PASSED     C 0:10.413 - R 0:00.021
23:11:08        	heap                                       PASSED     C 0:11.572 - R 0:11.841
23:11:08        	labelledExit                               PASSED     C 0:01.122 - R 0:00.001
23:11:08        	limits                                     PASSED     C 0:00.885 - R 0:00.001
23:11:08        	linking/exception-nothreads                PASSED     C 0:02.447 - R 0:00.004
23:11:08        	include/includes                           PASSED     C 0:32.168 - R 0:00.002
23:11:08        	linking/exception-withthreads              PASSED     C 0:09.237 - R 0:00.011
23:11:08        	linking/nostdlib                           PASSED     C 0:00.932 - R 0:00.004
23:11:08        	io/io-acquire                              PASSED     C 0:22.525 - R 0:00.016
23:11:08        	io/many_read                               PASSED     C 0:20.053 - R 0:00.004
23:11:08        	io/io                                      PASSED     C 0:27.051 - R 0:00.004
23:11:08        	linkonce                                   PASSED     C 0:02.491 - R 0:00.009
23:11:08        	io/manipulatorsOutput4                     PASSED     C 0:32.255 - R 0:00.034
23:11:08        	linking/io-acquire                         PASSED     C 0:19.263 - R 0:00.007
23:11:08        	linking/nothreads                          PASSED     C 0:16.319 - R 0:00.006
23:11:08        	linking/weakso_nothd                       PASSED     C 0:16.003 - R 0:00.004
23:11:08        	maybe                                      PASSED     C 0:03.365 - R 0:00.004
23:11:08        	linking/withthreads                        PASSED     C 0:23.637 - R 0:00.017
23:11:08        	literals                                   PASSED     C 0:13.618 - R 0:00.065
23:11:08        	nested-types-ERR1                          PASSED     C 0:00.094 - R n/a
23:11:08        	nested-types-ERR2                          PASSED     C 0:00.106 - R n/a
23:11:08        	nested-types                               PASSED     C 0:00.926 - R 0:00.001
23:11:08        	numericConstants                           PASSED     C 0:01.557 - R 0:00.002
23:11:08        	loopctrl                                   PASSED     C 0:13.331 - R 0:00.004
23:11:08        	operators                                  PASSED     C 0:01.364 - R 0:00.004
23:11:08        	poly-d-cycle                               PASSED     C 0:00.825 - R 0:00.004
23:11:08        	malloc                                     PASSED     C 0:13.621 - R 0:00.004
23:11:08        	poly-selection                             PASSED     C 0:01.322 - R 0:00.004
23:11:08        	poly-o-cycle                               PASSED     C 0:01.373 - R 0:00.004
23:11:08        	list/dlist-insert-remove                   PASSED     C 0:22.669 - R 0:00.008
23:11:08        	quasiKeyword                               PASSED     C 0:01.094 - R 0:00.001
23:11:08        	raii/ctor-autogen-ERR1                     PASSED     C 0:00.466 - R n/a
23:11:08        	raii/ctor-autogen                          PASSED     C 0:01.430 - R 0:00.004
23:11:08        	minmax                                     PASSED     C 0:13.332 - R 0:00.004
23:11:08        	polymorphism                               PASSED     C 0:09.715 - R 0:00.004
23:11:08        	quotedKeyword                              PASSED     C 0:08.819 - R 0:00.004
23:11:08        	raii/boxed-types                           PASSED     C 0:08.821 - R 0:00.004
23:11:08        	raii/dtor-early-exit-ERR1                  PASSED     C 0:06.861 - R n/a
23:11:08        	raii/memberCtors-ERR1                      PASSED     C 0:00.505 - R n/a
23:11:08        	raii/memberCtors                           PASSED     C 0:01.124 - R 0:00.004
23:11:08        	raii/init_once                             PASSED     C 0:01.175 - R 0:00.004
23:11:08        	raii/dtor-early-exit-ERR2                  PASSED     C 0:06.776 - R n/a
23:11:08        	result                                     PASSED     C 0:01.542 - R 0:00.004
23:11:08        	raii/dtor-early-exit                       PASSED     C 0:11.428 - R 0:00.004
23:11:08        	simpleGenericTriple                        PASSED     C 0:01.495 - R 0:00.004
23:11:08        	smart-pointers                             PASSED     C 0:01.287 - R 0:00.004
23:11:08        	raii/globals                               PASSED     C 0:08.135 - R 0:00.004
23:11:08        	shortCircuit                               PASSED     C 0:10.482 - R 0:00.005
23:11:08        	references                                 PASSED     C 0:12.789 - R 0:00.005
23:11:08        	switch                                     PASSED     C 0:00.873 - R 0:00.001
23:11:08        	strstream                                  PASSED     C 0:13.261 - R 0:00.005
23:11:08        	searchsort                                 PASSED     C 0:20.872 - R 0:00.005
23:11:08        	tuple/tupleCast                            PASSED     C 0:00.980 - R 0:00.004
23:11:08        	sum                                        PASSED     C 0:17.090 - R 0:00.004
23:11:08        	tuple/tupleFunction                        PASSED     C 0:01.088 - R 0:00.004
23:11:08        	tuple/tupleMember                          PASSED     C 0:01.824 - R 0:00.005
23:11:08        	time                                       PASSED     C 0:12.569 - R 0:00.116
23:11:08        	tuple/tuplePolymorphism                    PASSED     C 0:02.469 - R 0:00.005
23:11:08        	typedefRedef-ERR1                          PASSED     C 0:00.076 - R n/a
23:11:08        	typedefRedef                               PASSED     C 0:00.817 - R 0:00.001
23:11:08        	typeof                                     PASSED     C 0:01.127 - R 0:00.005
23:11:08        	tuple/tupleAssign                          PASSED     C 0:10.501 - R 0:00.005
23:11:08        	swap                                       PASSED     C 0:17.793 - R 0:00.004
23:11:08        	tuple/tupleVariadic                        PASSED     C 0:04.045 - R 0:00.017
23:11:08        	rational                                   PASSED     C 0:43.889 - R 0:00.006
23:11:08        	unified_locking/fast                       FAILED with code 1    C 0:18.493 - R 0:00.009
23:11:08 		expected :
23:11:08 		3	Match!
23:11:08 		got :
23:11:08 		3	No Match! 3232506982 vs 3251362123
23:11:08 
23:11:08        	variableDeclarator                         PASSED     C 0:00.789 - R 0:00.003
23:11:08        	unified_locking/timeout_lock               PASSED     C 0:17.085 - R 0:01.070
23:11:08        	unified_locking/lin_backoff                PASSED     C 0:21.001 - R 0:00.050
23:11:08        	unified_locking/mcs                        PASSED     C 0:19.281 - R 0:02.234
23:11:08        	userLiterals                               PASSED     C 0:11.301 - R 0:00.017
23:11:08        	unified_locking/locks                      PASSED     C 0:19.694 - R 0:07.186
23:11:08        	vector                                     PASSED     C 0:12.507 - R 0:00.005
23:11:08        	vector_math/vec2_double                    PASSED     C 0:13.642 - R 0:00.004
23:11:08        	vector_math/vec2_uint                      PASSED     C 0:20.229 - R 0:00.002
23:11:08        	vector_math/vec2_float                     PASSED     C 0:38.974 - R 0:00.006
23:11:08        	vector_math/vec3_int                       PASSED     C 0:30.748 - R 0:00.005
23:11:08        	voidPtr                                    PASSED     C 0:01.707 - R 0:00.002
23:11:08        	KRfunctions                                PASSED     C 0:00.601 - R 0:00.004
23:11:08        	warnings/self-assignment                   PASSED     C 0:02.238 - R 0:00.003
23:11:08        	vector_math/vec4_float                     PASSED     C 0:32.014 - R 0:00.005
23:11:08        	vector_math/vec2_int                       PASSED     C 0:45.657 - R 0:00.004
23:11:08        	attributes                                 PASSED     C 0:01.065 - R 0:00.002
23:11:08        	vector_math/vec3_float                     PASSED     C 0:43.980 - R 0:00.006
23:11:08        	abs                                        PASSED     C 0:12.002 - R 0:00.004
23:11:08        	ato                                        PASSED     C 0:12.165 - R 0:00.004
23:11:08        	array-container/array-md-sbscr-cases       PASSED     C 0:13.899 - R 0:00.004
23:11:08        	errors/completeType                        PASSED     C 0:00.381 - R n/a
23:11:08        	declarationSpecifier                       PASSED     C 0:00.808 - R 0:00.001
23:11:08        	extension                                  PASSED     C 0:00.754 - R 0:00.001
23:11:08        	functions                                  PASSED     C 0:00.708 - R 0:00.001
23:11:08        	gccExtensions                              PASSED     C 0:00.722 - R 0:00.001
23:11:08        	vector_math/vec4_int                       PASSED     C 0:45.630 - R 0:00.010
23:11:08        	io/manipulatorsInput                       PASSED     C 0:18.959 - R 0:00.004
23:11:08        	bitmanip1                                  PASSED     C 0:36.012 - R 0:00.670
23:11:08        	bitmanip2                                  PASSED     C 0:40.613 - R 0:00.367
23:11:08        	meta/archVast                              PASSED     C 0:00.362 - R n/a
23:11:08        	bitmanip3                                  PASSED     C 0:54.957 - R 0:00.018
23:11:08        	random                                     PASSED     C 0:20.390 - R 0:00.005
23:11:08        	io/manipulatorsOutput2                     PASSED     C 0:45.332 - R 0:00.010
23:11:08        	math                                       PASSED     C 0:32.835 - R 0:00.004
23:11:08        	io/manipulatorsOutput1                     PASSED     C 1:03.708 - R 0:00.010
23:11:08        	mathX                                      PASSED     C 0:45.306 - R 0:00.019
23:11:08        	vector_math/vec2_ldouble                   PASSED     C 0:15.962 - R 0:00.010
23:11:08 Tests took  7:37.223
23:11:08 Makefile:862: recipe for target 'all-tests' failed
23:11:08 make: *** [all-tests] Error 1
23:11:08 [Pipeline] }
23:11:08 [Pipeline] // dir
23:11:08 [Pipeline] }
23:11:08 [Pipeline] // stage
23:11:08 [Pipeline] echo
23:11:08 Archiving core dumps
23:11:08 [Pipeline] dir
23:11:08 Running in /var/lib/jenkins/workspace/Cforall_master@tmp
23:11:08 [Pipeline] {
23:11:08 [Pipeline] fileExists
23:11:08 [Pipeline] }
23:11:08 [Pipeline] // dir
23:11:08 [Pipeline] }
23:11:08 [Pipeline] // wrap
23:11:08 [Pipeline] }
23:11:08 [Pipeline] // node
23:11:08 [Pipeline] echo
23:11:08 hudson.AbortException: script returned exit code 2
23:11:08 [Pipeline] node
23:11:08 Running on Brokk 5 in /var/lib/jenkins/workspace/Cforall_master
23:11:08 [Pipeline] {
23:11:08 [Pipeline] echo
23:11:08 Notifying users of result
23:11:08 [Pipeline] echo
23:11:08 Reusing previously constructed message
23:11:08 [Pipeline] echo
23:11:08 Would send email to: cforall@lists.uwaterloo.ca
23:11:08 [Pipeline] echo
23:11:08 With title: [cforall git][BUILD# 16257 - FAILURE] - branch master
23:11:08 [Pipeline] echo
23:11:08 Content: 
23:11:08 <p>This is an automated email from the Jenkins build machine. It was
23:11:08 generated because of a git hooks/post-receive script following
23:11:08 a ref change which was pushed to the C∀ repository.</p>
23:11:08 
23:11:08 <p>- Status --------------------------------------------------------------</p>
23:11:08 
23:11:08 <p>BUILD# 16257 - FAILURE</p>
23:11:08 <p>Check console output at https://cforall.uwaterloo.ca/jenkins/job/Cforall/job/master/16257/ to view the results.</p>
23:11:08 
23:11:08 <p>- Changes -------------------------------------------------------------</p>
23:11:08 
23:11:08 <pre>
23:11:08 The branch master has been updated.
23:11:08       from  8baaf74ec35f56f5ef89ff6a591d6a4005b30650 (commit)
23:11:08 </pre>
23:11:08 
23:11:08 <p>- Log -----------------------------------------------------------------</p>
23:11:08 
23:11:08 <pre>
23:11:08 
23:11:08 </pre>
23:11:08 
23:11:08 <p>-----------------------------------------------------------------------</p>
23:11:08 <pre>
23:11:08 Summary of changes:
23:11:08 
23:11:08 </pre>
23:11:08 
23:11:08 [Pipeline] }
23:11:08 [Pipeline] // node
23:11:08 [Pipeline] echo
23:11:08 Build Completed
23:11:08 [Pipeline] End of Pipeline
23:11:08 ERROR: script returned exit code 2
23:11:08 Finished: FAILURE
[Pipeline] error
[Pipeline] }
23:11:08 Failed in branch gcc_06_x86_new
[Pipeline] echo
23:17:25 SUCCESS
[Pipeline] }
[Pipeline] echo
23:19:34 SUCCESS
[Pipeline] }
[Pipeline] // parallel
[Pipeline] }
[Pipeline] // stage
[Pipeline] }
[Pipeline] // wrap
[Pipeline] echo
error caught
[Pipeline] node
Running on Brokk 4 in /var/lib/jenkins/workspace/Cforall_Full_Build
[Pipeline] {
[Pipeline] echo
notifying users
[Pipeline] emailext
Sending email to: cforall@lists.uwaterloo.ca
[Pipeline] }
[Pipeline] // node
[Pipeline] }
[Pipeline] // node
[Pipeline] End of Pipeline
ERROR: FAILURE
Finished: FAILURE