Console Output

Skipping 1,017 KB.. Full Log
03:06:59  /bin/mkdir -p '/var/lib/jenkins/workspace/Cforall_master@tmp/include/cfa//concurrency/clib'
03:06:59  /usr/bin/install -c -m 644  /var/lib/jenkins/workspace/Cforall_master/libcfa/src/concurrency/clib/cfathread.h '/var/lib/jenkins/workspace/Cforall_master@tmp/include/cfa//concurrency/clib'
03:06:59  /bin/mkdir -p '/var/lib/jenkins/workspace/Cforall_master@tmp/include/cfa//device'
03:06:59  /usr/bin/install -c -m 644  /var/lib/jenkins/workspace/Cforall_master/libcfa/src/device/cpu.hfa '/var/lib/jenkins/workspace/Cforall_master@tmp/include/cfa//device'
03:06:59  /bin/mkdir -p '/var/lib/jenkins/workspace/Cforall_master@tmp/include/cfa//stdhdr/libltdl'
03:06:59  /usr/bin/install -c -m 644  /var/lib/jenkins/workspace/Cforall_master/libcfa/src/stdhdr/libltdl/lt_dlloader.h '/var/lib/jenkins/workspace/Cforall_master@tmp/include/cfa//stdhdr/libltdl'
03:06:59  /bin/mkdir -p '/var/lib/jenkins/workspace/Cforall_master@tmp/include/cfa//vec'
03:06:59  /usr/bin/install -c -m 644  /var/lib/jenkins/workspace/Cforall_master/libcfa/src/vec/vec.hfa /var/lib/jenkins/workspace/Cforall_master/libcfa/src/vec/vec2.hfa /var/lib/jenkins/workspace/Cforall_master/libcfa/src/vec/vec3.hfa /var/lib/jenkins/workspace/Cforall_master/libcfa/src/vec/vec4.hfa '/var/lib/jenkins/workspace/Cforall_master@tmp/include/cfa//vec'
03:06:59  /bin/mkdir -p '/var/lib/jenkins/workspace/Cforall_master@tmp/include/cfa//bits'
03:06:59  /usr/bin/install -c -m 644  /var/lib/jenkins/workspace/Cforall_master/libcfa/src/bits/weakso_locks.hfa /var/lib/jenkins/workspace/Cforall_master/libcfa/src/bits/align.hfa /var/lib/jenkins/workspace/Cforall_master/libcfa/src/bits/containers.hfa /var/lib/jenkins/workspace/Cforall_master/libcfa/src/bits/debug.hfa /var/lib/jenkins/workspace/Cforall_master/libcfa/src/bits/defs.hfa /var/lib/jenkins/workspace/Cforall_master/libcfa/src/bits/locks.hfa /var/lib/jenkins/workspace/Cforall_master/libcfa/src/bits/collection.hfa /var/lib/jenkins/workspace/Cforall_master/libcfa/src/bits/stack.hfa /var/lib/jenkins/workspace/Cforall_master/libcfa/src/bits/queue.hfa /var/lib/jenkins/workspace/Cforall_master/libcfa/src/bits/sequence.hfa /var/lib/jenkins/workspace/Cforall_master/libcfa/src/bits/random.hfa '/var/lib/jenkins/workspace/Cforall_master@tmp/include/cfa//bits'
03:06:59  /bin/mkdir -p '/var/lib/jenkins/workspace/Cforall_master@tmp/include/cfa//stdhdr'
03:06:59  /usr/bin/install -c -m 644  /var/lib/jenkins/workspace/Cforall_master/libcfa/src/stdhdr/limits.h /var/lib/jenkins/workspace/Cforall_master/libcfa/src/stdhdr/iso646.h /var/lib/jenkins/workspace/Cforall_master/libcfa/src/stdhdr/float.h /var/lib/jenkins/workspace/Cforall_master/libcfa/src/stdhdr/malloc.h /var/lib/jenkins/workspace/Cforall_master/libcfa/src/stdhdr/stdlib.h /var/lib/jenkins/workspace/Cforall_master/libcfa/src/stdhdr/tgmath.h /var/lib/jenkins/workspace/Cforall_master/libcfa/src/stdhdr/errno.h /var/lib/jenkins/workspace/Cforall_master/libcfa/src/stdhdr/stdnoreturn.h /var/lib/jenkins/workspace/Cforall_master/libcfa/src/stdhdr/stdarg.h /var/lib/jenkins/workspace/Cforall_master/libcfa/src/stdhdr/stddef.h /var/lib/jenkins/workspace/Cforall_master/libcfa/src/stdhdr/assert.h /var/lib/jenkins/workspace/Cforall_master/libcfa/src/stdhdr/gmp.h /var/lib/jenkins/workspace/Cforall_master/libcfa/src/stdhdr/ctype.h /var/lib/jenkins/workspace/Cforall_master/libcfa/src/stdhdr/math.h /var/lib/jenkins/workspace/Cforall_master/libcfa/src/stdhdr/stdbool.h /var/lib/jenkins/workspace/Cforall_master/libcfa/src/stdhdr/signal.h /var/lib/jenkins/workspace/Cforall_master/libcfa/src/stdhdr/setjmp.h /var/lib/jenkins/workspace/Cforall_master/libcfa/src/stdhdr/fenv.h /var/lib/jenkins/workspace/Cforall_master/libcfa/src/stdhdr/stdio.h /var/lib/jenkins/workspace/Cforall_master/libcfa/src/stdhdr/unistd.h /var/lib/jenkins/workspace/Cforall_master/libcfa/src/stdhdr/string.h /var/lib/jenkins/workspace/Cforall_master/libcfa/src/stdhdr/locale.h /var/lib/jenkins/workspace/Cforall_master/libcfa/src/stdhdr/wchar.h /var/lib/jenkins/workspace/Cforall_master/libcfa/src/stdhdr/pthread.h /var/lib/jenkins/workspace/Cforall_master/libcfa/src/stdhdr/unwind.h /var/lib/jenkins/workspace/Cforall_master/libcfa/src/stdhdr/wctype.h /var/lib/jenkins/workspace/Cforall_master/libcfa/src/stdhdr/inttypes.h /var/lib/jenkins/workspace/Cforall_master/libcfa/src/stdhdr/stdatomic.h /var/lib/jenkins/workspace/Cforall_master/libcfa/src/stdhdr/complex.h /var/lib/jenkins/workspace/Cforall_master/libcfa/src/stdhdr/threads.h /var/lib/jenkins/workspace/Cforall_master/libcfa/src/stdhdr/stdalign.h /var/lib/jenkins/workspace/Cforall_master/libcfa/src/stdhdr/time.h /var/lib/jenkins/workspace/Cforall_master/libcfa/src/stdhdr/stdint.h /var/lib/jenkins/workspace/Cforall_master/libcfa/src/stdhdr/uchar.h '/var/lib/jenkins/workspace/Cforall_master@tmp/include/cfa//stdhdr'
03:06:59 libtool: install: (cd /var/lib/jenkins/workspace/Cforall_master@tmp/lib/cfa/x86-nodebug && { ln -s -f libcfa.so.1.0.0 libcfa.so.1 || { rm -f libcfa.so.1 && ln -s libcfa.so.1.0.0 libcfa.so.1; }; })
03:06:59 libtool: install: (cd /var/lib/jenkins/workspace/Cforall_master@tmp/lib/cfa/x86-nodebug && { ln -s -f libcfa.so.1.0.0 libcfa.so || { rm -f libcfa.so && ln -s libcfa.so.1.0.0 libcfa.so; }; })
03:06:59 libtool: install: /usr/bin/install -c .libs/libcfa.lai /var/lib/jenkins/workspace/Cforall_master@tmp/lib/cfa/x86-nodebug/libcfa.la
03:06:59 libtool: install: /usr/bin/install -c .libs/libcfathread.so.1.0.0 /var/lib/jenkins/workspace/Cforall_master@tmp/lib/cfa/x86-nodebug/libcfathread.so.1.0.0
03:06:59 libtool: install: (cd /var/lib/jenkins/workspace/Cforall_master@tmp/lib/cfa/x86-nodebug && { ln -s -f libcfathread.so.1.0.0 libcfathread.so.1 || { rm -f libcfathread.so.1 && ln -s libcfathread.so.1.0.0 libcfathread.so.1; }; })
03:06:59 libtool: install: (cd /var/lib/jenkins/workspace/Cforall_master@tmp/lib/cfa/x86-nodebug && { ln -s -f libcfathread.so.1.0.0 libcfathread.so || { rm -f libcfathread.so && ln -s libcfathread.so.1.0.0 libcfathread.so; }; })
03:06:59 libtool: install: /usr/bin/install -c .libs/libcfathread.lai /var/lib/jenkins/workspace/Cforall_master@tmp/lib/cfa/x86-nodebug/libcfathread.la
03:06:59 libtool: warning: remember to run 'libtool --finish /var/lib/jenkins/workspace/Cforall_master@tmp/lib/cfa/x86-nodebug/'
03:06:59 make[3]: Nothing to be done for 'install-exec-am'.
03:06:59 make[3]: Nothing to be done for 'install-data-am'.
03:06:59 [Pipeline] }
03:06:59 [Pipeline] // dir
03:06:59 [Pipeline] }
03:06:59 [Pipeline] // stage
03:06:59 [Pipeline] sh
03:06:59 + free -h
03:06:59               total        used        free      shared  buff/cache   available
03:06:59 Mem:            15G        146M         11G        9.0M        4.2G         14G
03:06:59 Swap:          975M          0B        975M
03:06:59 [Pipeline] sh
03:06:59 + ulimit -a
03:06:59 time(seconds)        unlimited
03:06:59 file(blocks)         unlimited
03:06:59 data(kbytes)         unlimited
03:06:59 stack(kbytes)        8192
03:06:59 coredump(blocks)     0
03:06:59 memory(kbytes)       unlimited
03:06:59 locked memory(kbytes) 64
03:06:59 process              128880
03:06:59 nofiles              1048576
03:06:59 vmemory(kbytes)      unlimited
03:06:59 locks                unlimited
03:06:59 rtprio               0
03:06:59 [Pipeline] echo
03:06:59  -------- Test: short -------- 
03:06:59 [Pipeline] stage
03:06:59 [Pipeline] { (Test: short)
03:06:59 [Pipeline] }
03:06:59 [Pipeline] // stage
03:06:59 [Pipeline] echo
03:06:59  -------- Test: full -------- 
03:06:59 [Pipeline] stage
03:06:59 [Pipeline] { (Test: full)
03:06:59 [Pipeline] dir
03:06:59 Running in /var/lib/jenkins/workspace/Cforall_master@tmp
03:06:59 [Pipeline] {
03:06:59 [Pipeline] sh
03:06:59 + make --no-print-directory -C tests timeouts=--timeout=600 --global-timeout=14400 all-tests debug=yes archiveerrors=/var/lib/jenkins/workspace/Cforall_master@tmp/tests/crashes/full-debug
03:06:59 Running 218 tests on 6 cores (Default AST (new):x86 - debug)
03:06:59        	array-container/language-dim-mismatch      PASSED     C 0:00.112 - R n/a
03:06:59        	array                                      PASSED     C 0:02.260 - R 0:00.014
03:06:59        	builtins/sync                              PASSED     C 0:02.401 - R 0:00.003
03:06:59        	array-container/array-basic                PASSED     C 0:06.841 - R 0:00.026
03:06:59        	cast                                       PASSED     C 0:02.042 - R 0:00.002
03:06:59        	castError                                  PASSED     C 0:00.577 - R n/a
03:06:59        	avl_test                                   PASSED     C 0:07.836 - R 0:00.035
03:06:59        	alloc-ERROR                                PASSED     C 0:09.028 - R n/a
03:06:59        	alloc                                      PASSED     C 0:17.656 - R 0:00.016
03:06:59        	alloc2                                     PASSED     C 0:27.838 - R 0:00.034
03:06:59        	collections/multi_list                     PASSED     C 0:23.938 - R 0:00.034
03:06:59        	collections/vector-err-pass-perm-it-byval  PASSED     C 0:01.789 - R n/a
03:06:59        	collections/vector-err-retn-perm-it-byval  PASSED     C 0:01.483 - R n/a
03:06:59        	collections/stack                          PASSED     C 0:18.117 - R 0:00.032
03:06:59        	collections/vector-demo                    PASSED     C 0:08.198 - R 0:00.033
03:06:59        	collections/sequence                       PASSED     C 0:27.321 - R 0:00.029
03:06:59        	collections/queue                          PASSED     C 0:29.372 - R 0:00.073
03:06:59        	collections/atomic_mpsc                    PASSED     C 0:29.338 - R 0:10.986
03:06:59        	concurrent/clib_tls                        PASSED     C 0:11.294 - R 0:00.115
03:06:59        	concurrent/clib                            PASSED     C 0:11.675 - R 0:00.717
03:06:59        	complex                                    PASSED     C 0:13.532 - R 0:00.017
03:06:59        	concurrent/cluster                         PASSED     C 0:24.173 - R 0:00.115
03:06:59        	concurrent/coroutineYield                  PASSED     C 0:24.471 - R 0:00.070
03:06:59        	concurrent/examples/datingService          PASSED     C 0:27.978 - R 0:00.065
03:06:59        	concurrent/examples/gortn                  PASSED     C 0:34.616 - R 0:00.043
03:06:59        	concurrent/examples/matrixSum              PASSED     C 0:23.785 - R 0:00.123
03:06:59        	concurrent/examples/quickSort              PASSED     C 0:22.552 - R 0:00.065
03:06:59        	concurrent/examples/boundedBufferINT       PASSED     C 0:29.829 - R 0:13.995
03:06:59        	concurrent/futures/abandon                 PASSED     C 0:17.215 - R 0:00.229
03:06:59        	concurrent/keywordErrors                   PASSED     C 0:00.773 - R n/a
03:06:59        	concurrent/futures/basic                   PASSED     C 0:15.338 - R 0:00.275
03:06:59        	concurrent/examples/boundedBufferEXT       PASSED     C 0:36.533 - R 0:15.714
03:06:59        	concurrent/futures/typed                   PASSED     C 0:22.166 - R 0:00.165
03:06:59        	concurrent/futures/multi                   PASSED     C 0:31.482 - R 0:00.115
03:06:59        	concurrent/join                            PASSED     C 0:35.681 - R 0:00.083
03:06:59        	concurrent/park/contention                 PASSED     C 0:12.804 - R 0:00.578
03:06:59        	concurrent/mutexstmt/monitors              PASSED     C 0:20.834 - R 0:09.674
03:06:59        	concurrent/mutexstmt/locks                 PASSED     C 0:25.937 - R 0:24.883
03:06:59        	concurrent/park/start_parked               PASSED     C 0:21.605 - R 0:00.170
03:06:59        	concurrent/monitor                         PASSED     C 0:32.279 - R 0:46.519
03:06:59        	concurrent/multi-monitor                   PASSED     C 0:28.850 - R 0:50.357
03:06:59        	concurrent/park/force_preempt              PASSED     C 0:56.835 - R 0:00.315
03:06:59        	concurrent/semaphore                       PASSED     C 0:35.805 - R 0:00.127
03:06:59        	concurrent/signal/block                    PASSED     C 0:34.026 - R 0:03.478
03:06:59        	concurrent/preempt                         PASSED     C 0:46.118 - R 0:14.588
03:06:59        	concurrent/signal/wait                     PASSED     C 0:26.817 - R 0:00.430
03:06:59        	concurrent/sleep                           PASSED     C 0:20.628 - R 0:01.173
03:06:59        	concurrent/suspend_then                    PASSED     C 0:17.029 - R 0:00.315
03:06:59        	concurrent/signal/disjoint                 PASSED     C 0:29.096 - R 0:04.473
03:06:59        	concurrent/spinaphore                      PASSED     C 0:23.606 - R 0:00.967
03:06:59        	concurrent/thread                          PASSED     C 0:33.869 - R 0:00.066
03:06:59        	concurrent/waitfor/barge                   PASSED     C 0:33.734 - R 0:01.168
03:06:59        	const-init                                 PASSED     C 0:01.912 - R 0:00.033
03:06:59        	concurrent/waitfor/dtor                    PASSED     C 0:33.670 - R 0:02.669
03:06:59        	concurrent/waitfor/statment                PASSED     C 0:31.998 - R 0:00.516
03:06:59        	concurrent/waitfor/recurse                 PASSED     C 0:33.222 - R 0:08.081
03:06:59        	copyfile                                   PASSED     C 0:10.644 - R 0:00.033
03:06:59        	concurrent/waitfor/when                    PASSED     C 0:24.588 - R 0:01.218
03:06:59        	coroutine/devicedriver                     PASSED     C 0:16.622 - R 0:00.039
03:06:59        	coroutine/fibonacci                        PASSED     C 0:16.872 - R 0:00.032
03:06:59        	coroutine/fmtLines                         PASSED     C 0:12.518 - R 0:00.033
03:06:59        	coroutine/pingpong                         PASSED     C 0:18.820 - R 0:00.066
03:06:59        	designations                               PASSED     C 0:02.168 - R 0:00.033
03:06:59        	counter                                    PASSED     C 0:13.704 - R 0:00.033
03:06:59        	coroutine/raii                             PASSED     C 0:17.348 - R 0:00.065
03:06:59        	coroutine/runningTotal                     PASSED     C 0:17.668 - R 0:00.065
03:06:59        	errors/declaration                         PASSED     C 0:00.081 - R n/a
03:06:59        	errors/scope                               PASSED     C 0:00.164 - R n/a
03:06:59        	enum                                       PASSED     C 0:01.674 - R 0:00.017
03:06:59        	errors/signature                           PASSED     C 0:00.088 - R n/a
03:06:59        	coroutine/prodcons                         PASSED     C 0:21.395 - R 0:00.032
03:06:59        	exceptions/conditional                     PASSED     C 0:03.168 - R 0:00.033
03:06:59        	exceptions/cancel/coroutine                PASSED     C 0:14.399 - R 0:00.067
03:06:59        	exceptions/conditional-threads             PASSED     C 0:10.919 - R 0:00.065
03:06:59        	div                                        PASSED     C 0:19.690 - R 0:00.033
03:06:59        	exceptions/data-except                     PASSED     C 0:01.483 - R 0:00.033
03:06:59        	device/cpu                                 PASSED     C 0:21.342 - R 0:00.032
03:06:59        	exceptions/cancel/thread                   PASSED     C 0:16.689 - R 0:00.032
03:06:59        	exceptions/defaults                        PASSED     C 0:01.609 - R 0:00.016
03:06:59        	exceptions/finally-error                   PASSED     C 0:00.380 - R n/a
03:06:59        	exceptions/finally                         PASSED     C 0:02.012 - R 0:00.016
03:06:59        	exceptions/resume                          PASSED     C 0:01.858 - R 0:00.032
03:06:59        	exceptions/interact                        PASSED     C 0:02.911 - R 0:00.032
03:06:59        	exceptions/polymorphic                     PASSED     C 0:02.865 - R 0:00.016
03:06:59        	exceptions/terminate                       PASSED     C 0:04.132 - R 0:00.034
03:06:59        	exceptions/trash                           PASSED     C 0:02.179 - R 0:00.033
03:06:59        	exceptions/type-check                      PASSED     C 0:00.217 - R n/a
03:06:59        	exceptions/finally-threads                 PASSED     C 0:10.096 - R 0:00.067
03:06:59        	exceptions/defaults-threads                PASSED     C 0:11.723 - R 0:00.066
03:06:59        	expression                                 PASSED     C 0:01.153 - R 0:00.001
03:06:59        	exceptions/virtual-poly                    PASSED     C 0:01.946 - R 0:00.035
03:06:59        	exceptions/resume-threads                  PASSED     C 0:09.969 - R 0:00.066
03:06:59        	exceptions/virtual-cast                    PASSED     C 0:04.912 - R 0:00.033
03:06:59        	forall                                     PASSED     C 0:03.064 - R 0:00.002
03:06:59        	exceptions/terminate-threads               PASSED     C 0:12.022 - R 0:00.032
03:06:59        	fallthrough                                PASSED     C 0:14.821 - R 0:00.019
03:06:59        	fstream_test                               PASSED     C 0:14.347 - R 0:00.033
03:06:59        	generator/fibonacci                        PASSED     C 0:12.708 - R 0:00.033
03:06:59        	generator/fmtLines                         PASSED     C 0:13.692 - R 0:00.033
03:06:59        	genericUnion                               PASSED     C 0:01.584 - R 0:00.032
03:06:59        	global-monomorph                           PASSED     C 0:01.452 - R 0:00.017
03:06:59        	identFuncDeclarator                        PASSED     C 0:01.258 - R 0:00.002
03:06:59        	function-operator                          PASSED     C 0:16.071 - R 0:00.032
03:06:59        	identParamDeclarator                       PASSED     C 0:03.886 - R 0:00.016
03:06:59        	generator/suspend_then                     PASSED     C 0:10.138 - R 0:00.016
03:06:59        	hello                                      PASSED     C 0:08.848 - R 0:00.016
03:06:59        	identity                                   PASSED     C 0:10.332 - R 0:00.033
03:06:59        	include/vector-containers                  PASSED     C 0:05.608 - R 0:00.033
03:06:59        	ifwhileCtl                                 PASSED     C 0:15.564 - R 0:00.034
03:06:59        	include/vector-sequence                    PASSED     C 0:02.304 - R 0:00.016
03:06:59        	include/stdincludes                        PASSED     C 0:14.766 - R 0:00.002
03:06:59        	init1-ERROR                                PASSED     C 0:00.815 - R n/a
03:06:59        	init1                                      PASSED     C 0:01.512 - R 0:00.012
03:06:59        	include/vector-fstream                     PASSED     C 0:09.241 - R 0:00.054
03:06:59        	heap                                       PASSED     C 0:23.795 - R 0:41.651
03:06:59        	io/manipulatorsOutput4                     PASSED     C 0:41.582 - R 0:00.116
03:06:59        	include/includes                           PASSED     C 1:02.209 - R 0:00.003
03:06:59        	labelledExit                               PASSED     C 0:02.246 - R 0:00.002
03:06:59        	limits                                     PASSED     C 0:01.572 - R 0:00.001
03:06:59        	io/io-acquire                              PASSED     C 0:48.200 - R 0:00.115
03:06:59        	io/io                                      PASSED     C 0:51.982 - R 0:00.033
03:06:59        	linking/exception-nothreads                PASSED     C 0:05.789 - R 0:00.016
03:06:59        	linking/nostdlib                           PASSED     C 0:00.981 - R 0:00.016
03:06:59        	linking/exception-withthreads              PASSED     C 0:16.470 - R 0:00.066
03:06:59        	linking/io-acquire                         PASSED     C 0:22.606 - R 0:00.033
03:06:59        	linking/weakso_nothd                       PASSED     C 0:19.713 - R 0:00.036
03:06:59        	linking/nothreads                          PASSED     C 0:20.591 - R 0:00.033
03:06:59        	linkonce                                   PASSED     C 0:01.945 - R 0:00.033
03:06:59        	io/many_read                               PASSED     C 0:33.336 - R 0:00.065
03:06:59        	literals                                   PASSED     C 0:15.306 - R 0:00.033
03:06:59        	linking/withthreads                        PASSED     C 0:25.771 - R 0:00.065
03:06:59        	maybe                                      PASSED     C 0:02.883 - R 0:00.033
03:06:59        	nested-types                               PASSED     C 0:01.330 - R 0:00.002
03:06:59        	nested-types-ERR1                          PASSED     C 0:00.095 - R n/a
03:06:59        	nested-types-ERR2                          PASSED     C 0:00.107 - R n/a
03:06:59        	malloc                                     PASSED     C 0:20.839 - R 0:00.033
03:06:59        	loopctrl                                   PASSED     C 0:21.816 - R 0:00.034
03:06:59        	numericConstants                           PASSED     C 0:02.428 - R 0:00.002
03:06:59        	operators                                  PASSED     C 0:01.879 - R 0:00.033
03:06:59        	poly-d-cycle                               PASSED     C 0:01.733 - R 0:00.016
03:06:59        	poly-o-cycle                               PASSED     C 0:01.738 - R 0:00.020
03:06:59        	quasiKeyword                               PASSED     C 0:01.050 - R 0:00.002
03:06:59        	poly-selection                             PASSED     C 0:01.396 - R 0:00.016
03:06:59        	list/dlist-insert-remove                   PASSED     C 0:29.222 - R 0:00.165
03:06:59        	raii/ctor-autogen                          PASSED     C 0:03.215 - R 0:00.033
03:06:59        	raii/ctor-autogen-ERR1                     PASSED     C 0:00.492 - R n/a
03:06:59        	minmax                                     PASSED     C 0:16.758 - R 0:00.033
03:06:59        	raii/dtor-early-exit-ERR1                  PASSED     C 0:05.790 - R n/a
03:06:59        	raii/boxed-types                           PASSED     C 0:16.789 - R 0:00.033
03:06:59        	quotedKeyword                              PASSED     C 0:16.999 - R 0:00.033
03:06:59        	polymorphism                               PASSED     C 0:18.499 - R 0:00.016
03:06:59        	raii/init_once                             PASSED     C 0:02.314 - R 0:00.033
03:06:59        	raii/memberCtors-ERR1                      PASSED     C 0:00.593 - R n/a
03:06:59        	raii/memberCtors                           PASSED     C 0:02.633 - R 0:00.033
03:06:59        	raii/dtor-early-exit-ERR2                  PASSED     C 0:06.106 - R n/a
03:06:59        	raii/dtor-early-exit                       PASSED     C 0:14.511 - R 0:00.032
03:06:59        	result                                     PASSED     C 0:02.825 - R 0:00.032
03:06:59        	raii/globals                               PASSED     C 0:10.874 - R 0:00.065
03:06:59        	simpleGenericTriple                        PASSED     C 0:01.481 - R 0:00.016
03:06:59        	smart-pointers                             PASSED     C 0:03.173 - R 0:00.033
03:06:59        	references                                 PASSED     C 0:17.758 - R 0:00.033
03:06:59        	shortCircuit                               PASSED     C 0:16.596 - R 0:00.033
03:06:59        	searchsort                                 PASSED     C 0:24.260 - R 0:00.034
03:06:59        	switch                                     PASSED     C 0:01.780 - R 0:00.002
03:06:59        	strstream                                  PASSED     C 0:18.221 - R 0:00.033
03:06:59        	sum                                        PASSED     C 0:23.019 - R 0:00.034
03:06:59        	swap                                       PASSED     C 0:21.548 - R 0:00.034
03:06:59        	tuple/tupleCast                            PASSED     C 0:01.182 - R 0:00.033
03:06:59        	tuple/tupleFunction                        PASSED     C 0:01.488 - R 0:00.034
03:06:59        	tuple/tupleMember                          PASSED     C 0:01.946 - R 0:00.033
03:06:59        	tuple/tuplePolymorphism                    PASSED     C 0:01.993 - R 0:00.033
03:06:59        	time                                       PASSED     C 0:16.397 - R 0:00.033
03:06:59        	typedefRedef-ERR1                          PASSED     C 0:00.110 - R n/a
03:06:59        	tuple/tupleAssign                          PASSED     C 0:14.777 - R 0:00.033
03:06:59        	typedefRedef                               PASSED     C 0:02.618 - R 0:00.003
03:06:59        	typeof                                     PASSED     C 0:02.468 - R 0:00.033
03:06:59        	rational                                   PASSED     C 0:50.806 - R 0:00.033
03:06:59        	tuple/tupleVariadic                        PASSED     C 0:07.043 - R 0:00.016
03:06:59        	unified_locking/fast                       PASSED     C 0:31.984 - R 0:00.115
03:06:59        	unified_locking/timeout_lock               PASSED     C 0:26.061 - R 0:01.216
03:06:59        	unified_locking/lin_backoff                PASSED     C 0:31.980 - R 0:00.165
03:06:59        	variableDeclarator                         PASSED     C 0:01.627 - R 0:00.002
03:06:59        	unified_locking/mcs                        PASSED     C 0:29.471 - R 0:17.995
03:06:59        	userLiterals                               PASSED     C 0:24.802 - R 0:00.032
03:06:59        	vector_math/vec2_double                    PASSED     C 0:26.355 - R 0:00.028
03:06:59        	vector                                     PASSED     C 0:28.021 - R 0:00.046
03:06:59        	unified_locking/locks                      PASSED     C 0:27.333 - R 0:48.305
03:06:59        	vector_math/vec2_uint                      PASSED     C 0:27.321 - R 0:00.034
03:06:59        	vector_math/vec2_float                     PASSED     C 0:47.999 - R 0:00.033
03:06:59        	vector_math/vec2_int                       PASSED     C 0:45.843 - R 0:00.033
03:06:59        	vector_math/vec3_float                     PASSED     C 0:41.342 - R 0:00.033
03:06:59        	warnings/self-assignment                   PASSED     C 0:01.222 - R 0:00.001Cannot contact Ada: hudson.remoting.ChannelClosedException: Channel "hudson.remoting.Channel@45d5142d:Ada": Remote call on Ada failed. The channel is closing down or has closed down
03:06:59 ERROR: Test suite timed out
03:06:59 
03:06:59        	voidPtr                                    PASSED     C 0:01.729 - R 0:00.033
03:06:59        	KRfunctions                                PASSED     C 0:00.707 - R 0:00.001
03:06:59        	vector_math/vec3_int                       PASSED     C 0:36.640 - R 0:00.033
03:06:59        	array-container/array-md-sbscr-cases       PASSED     C 0:18.068 - R 0:00.033
03:06:59        	attributes                                 PASSED     C 0:00.845 - R 0:00.002
03:06:59        	abs                                        PASSED     C 0:20.684 - R 0:00.034
03:06:59        	vector_math/vec4_float                     PASSED     C 0:44.673 - R 0:00.032
03:06:59        	ato                                        PASSED     C 0:21.410 - R 0:00.017
03:06:59        	declarationSpecifier                       PASSED     C 0:01.406 - R 0:00.002
03:06:59        	errors/completeType                        PASSED     C 0:00.539 - R n/a
03:06:59        	extension                                  PASSED     C 0:00.751 - R 0:00.012
03:06:59        	vector_math/vec4_int                       PASSED     C 0:37.838 - R 0:00.033
03:06:59        	gccExtensions                              PASSED     C 0:00.778 - R 0:00.002
03:06:59        	functions                                  PASSED     C 0:00.943 - R 0:00.015
03:06:59        	bitmanip1                                  PASSED     C 0:29.770 - R 0:00.115
03:06:59        	io/manipulatorsInput                       PASSED     C 0:22.778 - R 0:00.034
03:06:59        	bitmanip2                                  PASSED     C 0:38.108 - R 0:00.817
03:06:59        	io/manipulatorsOutput1                     PASSED     C 0:35.838 - R 0:00.033
03:06:59        	meta/archVast                              PASSED     C 0:00.428 - R n/a
03:06:59        	bitmanip3                                  PASSED     C 0:52.623 - R 0:00.215
03:06:59        	io/manipulatorsOutput2                     PASSED     C 0:31.766 - R 0:00.032
03:06:59        	random                                     PASSED     C 0:11.337 - R 0:00.032
03:06:59        	math                                       PASSED     C 0:24.937 - R 0:00.033
03:06:59        	vector_math/vec2_ldouble                   PASSED     C 0:16.008 - R 0:00.034
03:06:59        	mathX                                      PASSED     C 0:43.543 - R 0:00.034
03:06:59 Tests took  0:01.054
03:06:59 Makefile:861: recipe for target 'all-tests' failed
03:06:59 make: *** [all-tests] Error 1
03:06:59 [Pipeline] }
03:06:59 [Pipeline] // dir
03:06:59 [Pipeline] }
03:06:59 [Pipeline] // stage
03:06:59 [Pipeline] echo
03:06:59 Archiving core dumps
03:06:59 [Pipeline] dir
03:06:59 Running in /var/lib/jenkins/workspace/Cforall_master@tmp
03:06:59 [Pipeline] {
03:06:59 [Pipeline] fileExists
03:06:59 [Pipeline] }
03:06:59 [Pipeline] // dir
03:06:59 [Pipeline] }
03:06:59 [Pipeline] // wrap
03:06:59 [Pipeline] }
03:06:59 [Pipeline] // node
03:06:59 [Pipeline] echo
03:06:59 hudson.AbortException: script returned exit code 2
03:06:59 [Pipeline] node
03:06:59 Running on Brokk 5 in /var/lib/jenkins/workspace/Cforall_master
03:06:59 [Pipeline] {
03:06:59 [Pipeline] echo
03:06:59 Notifying users of result
03:06:59 [Pipeline] echo
03:06:59 Reusing previously constructed message
03:06:59 [Pipeline] echo
03:06:59 Would send email to: cforall@lists.uwaterloo.ca
03:06:59 [Pipeline] echo
03:06:59 With title: [cforall git][BUILD# 16242 - FAILURE] - branch master
03:06:59 [Pipeline] echo
03:06:59 Content: 
03:06:59 <p>This is an automated email from the Jenkins build machine. It was
03:06:59 generated because of a git hooks/post-receive script following
03:06:59 a ref change which was pushed to the C∀ repository.</p>
03:06:59 
03:06:59 <p>- Status --------------------------------------------------------------</p>
03:06:59 
03:06:59 <p>BUILD# 16242 - FAILURE</p>
03:06:59 <p>Check console output at https://cforall.uwaterloo.ca/jenkins/job/Cforall/job/master/16242/ to view the results.</p>
03:06:59 
03:06:59 <p>- Changes -------------------------------------------------------------</p>
03:06:59 
03:06:59 <pre>
03:06:59 The branch master has been updated.
03:06:59       from  cd03b76d2be3680d03e99bc17ed4afd74cb2e0b3 (commit)
03:06:59 </pre>
03:06:59 
03:06:59 <p>- Log -----------------------------------------------------------------</p>
03:06:59 
03:06:59 <pre>
03:06:59 
03:06:59 </pre>
03:06:59 
03:06:59 <p>-----------------------------------------------------------------------</p>
03:06:59 <pre>
03:06:59 Summary of changes:
03:06:59 
03:06:59 </pre>
03:06:59 
03:06:59 [Pipeline] }
03:06:59 [Pipeline] // node
03:06:59 [Pipeline] echo
03:06:59 Build Completed
03:06:59 [Pipeline] End of Pipeline
03:06:59 ERROR: script returned exit code 2
03:06:59 Finished: FAILURE
[Pipeline] error
[Pipeline] }
03:06:59 Failed in branch gcc_07_x86_new
[Pipeline] // parallel
[Pipeline] }
[Pipeline] // stage
[Pipeline] }
[Pipeline] // wrap
[Pipeline] echo
error caught
[Pipeline] node
Running on Brokk 4 in /var/lib/jenkins/workspace/Cforall_Full_Build
[Pipeline] {
[Pipeline] echo
notifying users
[Pipeline] emailext
Sending email to: cforall@lists.uwaterloo.ca
[Pipeline] }
[Pipeline] // node
[Pipeline] }
[Pipeline] // node
[Pipeline] End of Pipeline
ERROR: FAILURE
Finished: FAILURE