Console Output

Skipping 738 KB.. Full Log
01:30:31   154 |  struct S_fill   { char tag; char c; size_t size; T * at; char t[50]; };
01:30:31       |                                                                  ~~~~~~~                           ^          
01:30:31 /var/lib/jenkins/workspace/Cforall_Distribute_Ref@tmp/cfa-cc-1.0.0.1838/_build/sub/../../libcfa/src/stdlib.hfa:154:130: warning: ‘_X4_srcS6S_fill_Y12__T_generic___1._X2atPY12__T_generic__1’ may be used uninitialized in this function [-Wmaybe-uninitialized]
01:30:31   154 |  struct S_fill   { char tag; char c; size_t size; T * at; char t[50]; };
01:30:31       |                                                                                                                                  ^                       
01:30:31   CCLD     libcfathread.la
01:30:31 make[4]: Leaving directory '/var/lib/jenkins/workspace/Cforall_Distribute_Ref@tmp/cfa-cc-1.0.0.1838/_build/sub/libcfa/x64-nodebug/src'
01:30:31 make[4]: Entering directory '/var/lib/jenkins/workspace/Cforall_Distribute_Ref@tmp/cfa-cc-1.0.0.1838/_build/sub/libcfa/x64-nodebug'
01:30:31 make[4]: Nothing to be done for 'all-am'.
01:30:31 make[4]: Leaving directory '/var/lib/jenkins/workspace/Cforall_Distribute_Ref@tmp/cfa-cc-1.0.0.1838/_build/sub/libcfa/x64-nodebug'
01:30:31 make[3]: Leaving directory '/var/lib/jenkins/workspace/Cforall_Distribute_Ref@tmp/cfa-cc-1.0.0.1838/_build/sub/libcfa/x64-nodebug'
01:30:31 make[2]: Leaving directory '/var/lib/jenkins/workspace/Cforall_Distribute_Ref@tmp/cfa-cc-1.0.0.1838/_build/sub'
01:30:31 make[1]: Leaving directory '/var/lib/jenkins/workspace/Cforall_Distribute_Ref@tmp/cfa-cc-1.0.0.1838/_build/sub'
01:30:31 make[1]: Entering directory '/var/lib/jenkins/workspace/Cforall_Distribute_Ref@tmp/cfa-cc-1.0.0.1838/_build/sub'
01:30:31 Making dvi in driver
01:30:31 make[2]: Entering directory '/var/lib/jenkins/workspace/Cforall_Distribute_Ref@tmp/cfa-cc-1.0.0.1838/_build/sub/driver'
01:30:31 make[2]: Nothing to be done for 'dvi'.
01:30:31 make[2]: Leaving directory '/var/lib/jenkins/workspace/Cforall_Distribute_Ref@tmp/cfa-cc-1.0.0.1838/_build/sub/driver'
01:30:31 Making dvi in src
01:30:31 make[2]: Entering directory '/var/lib/jenkins/workspace/Cforall_Distribute_Ref@tmp/cfa-cc-1.0.0.1838/_build/sub/src'
01:30:31 make[2]: Nothing to be done for 'dvi'.
01:30:31 make[2]: Leaving directory '/var/lib/jenkins/workspace/Cforall_Distribute_Ref@tmp/cfa-cc-1.0.0.1838/_build/sub/src'
01:30:31 Making dvi in .
01:30:31 make[2]: Entering directory '/var/lib/jenkins/workspace/Cforall_Distribute_Ref@tmp/cfa-cc-1.0.0.1838/_build/sub'
01:30:31 make[2]: Nothing to be done for 'dvi-am'.
01:30:31 make[2]: Leaving directory '/var/lib/jenkins/workspace/Cforall_Distribute_Ref@tmp/cfa-cc-1.0.0.1838/_build/sub'
01:30:31 Making dvi in libcfa/x64-debug
01:30:31 make[2]: Entering directory '/var/lib/jenkins/workspace/Cforall_Distribute_Ref@tmp/cfa-cc-1.0.0.1838/_build/sub/libcfa/x64-debug'
01:30:31 Making dvi in prelude
01:30:31 make[3]: Entering directory '/var/lib/jenkins/workspace/Cforall_Distribute_Ref@tmp/cfa-cc-1.0.0.1838/_build/sub/libcfa/x64-debug/prelude'
01:30:31 make[3]: Nothing to be done for 'dvi'.
01:30:31 make[3]: Leaving directory '/var/lib/jenkins/workspace/Cforall_Distribute_Ref@tmp/cfa-cc-1.0.0.1838/_build/sub/libcfa/x64-debug/prelude'
01:30:31 Making dvi in src
01:30:31 make[3]: Entering directory '/var/lib/jenkins/workspace/Cforall_Distribute_Ref@tmp/cfa-cc-1.0.0.1838/_build/sub/libcfa/x64-debug/src'
01:30:31 make[3]: Nothing to be done for 'dvi'.
01:30:31 make[3]: Leaving directory '/var/lib/jenkins/workspace/Cforall_Distribute_Ref@tmp/cfa-cc-1.0.0.1838/_build/sub/libcfa/x64-debug/src'
01:30:31 make[3]: Entering directory '/var/lib/jenkins/workspace/Cforall_Distribute_Ref@tmp/cfa-cc-1.0.0.1838/_build/sub/libcfa/x64-debug'
01:30:31 make[3]: Nothing to be done for 'dvi-am'.
01:30:31 make[3]: Leaving directory '/var/lib/jenkins/workspace/Cforall_Distribute_Ref@tmp/cfa-cc-1.0.0.1838/_build/sub/libcfa/x64-debug'
01:30:31 make[2]: Leaving directory '/var/lib/jenkins/workspace/Cforall_Distribute_Ref@tmp/cfa-cc-1.0.0.1838/_build/sub/libcfa/x64-debug'
01:30:31 Making dvi in libcfa/x64-nodebug
01:30:31 make[2]: Entering directory '/var/lib/jenkins/workspace/Cforall_Distribute_Ref@tmp/cfa-cc-1.0.0.1838/_build/sub/libcfa/x64-nodebug'
01:30:31 Making dvi in prelude
01:30:31 make[3]: Entering directory '/var/lib/jenkins/workspace/Cforall_Distribute_Ref@tmp/cfa-cc-1.0.0.1838/_build/sub/libcfa/x64-nodebug/prelude'
01:30:31 make[3]: Nothing to be done for 'dvi'.
01:30:31 make[3]: Leaving directory '/var/lib/jenkins/workspace/Cforall_Distribute_Ref@tmp/cfa-cc-1.0.0.1838/_build/sub/libcfa/x64-nodebug/prelude'
01:30:31 Making dvi in src
01:30:31 make[3]: Entering directory '/var/lib/jenkins/workspace/Cforall_Distribute_Ref@tmp/cfa-cc-1.0.0.1838/_build/sub/libcfa/x64-nodebug/src'
01:30:31 make[3]: Nothing to be done for 'dvi'.
01:30:31 make[3]: Leaving directory '/var/lib/jenkins/workspace/Cforall_Distribute_Ref@tmp/cfa-cc-1.0.0.1838/_build/sub/libcfa/x64-nodebug/src'
01:30:31 make[3]: Entering directory '/var/lib/jenkins/workspace/Cforall_Distribute_Ref@tmp/cfa-cc-1.0.0.1838/_build/sub/libcfa/x64-nodebug'
01:30:31 make[3]: Nothing to be done for 'dvi-am'.
01:30:31 make[3]: Leaving directory '/var/lib/jenkins/workspace/Cforall_Distribute_Ref@tmp/cfa-cc-1.0.0.1838/_build/sub/libcfa/x64-nodebug'
01:30:31 make[2]: Leaving directory '/var/lib/jenkins/workspace/Cforall_Distribute_Ref@tmp/cfa-cc-1.0.0.1838/_build/sub/libcfa/x64-nodebug'
01:30:31 make[1]: Leaving directory '/var/lib/jenkins/workspace/Cforall_Distribute_Ref@tmp/cfa-cc-1.0.0.1838/_build/sub'
01:30:31 make[1]: Entering directory '/var/lib/jenkins/workspace/Cforall_Distribute_Ref@tmp/cfa-cc-1.0.0.1838/_build/sub'
01:30:31 Making check in driver
01:30:31 make[2]: Entering directory '/var/lib/jenkins/workspace/Cforall_Distribute_Ref@tmp/cfa-cc-1.0.0.1838/_build/sub/driver'
01:30:31 make[2]: Nothing to be done for 'check'.
01:30:31 make[2]: Leaving directory '/var/lib/jenkins/workspace/Cforall_Distribute_Ref@tmp/cfa-cc-1.0.0.1838/_build/sub/driver'
01:30:31 Making check in src
01:30:31 make[2]: Entering directory '/var/lib/jenkins/workspace/Cforall_Distribute_Ref@tmp/cfa-cc-1.0.0.1838/_build/sub/src'
01:30:31 make  check-am
01:30:31 make[3]: Entering directory '/var/lib/jenkins/workspace/Cforall_Distribute_Ref@tmp/cfa-cc-1.0.0.1838/_build/sub/src'
01:30:31 make[3]: Nothing to be done for 'check-am'.
01:30:31 make[3]: Leaving directory '/var/lib/jenkins/workspace/Cforall_Distribute_Ref@tmp/cfa-cc-1.0.0.1838/_build/sub/src'
01:30:31 make[2]: Leaving directory '/var/lib/jenkins/workspace/Cforall_Distribute_Ref@tmp/cfa-cc-1.0.0.1838/_build/sub/src'
01:30:31 Making check in .
01:30:31 make[2]: Entering directory '/var/lib/jenkins/workspace/Cforall_Distribute_Ref@tmp/cfa-cc-1.0.0.1838/_build/sub'
01:30:31 make[2]: Leaving directory '/var/lib/jenkins/workspace/Cforall_Distribute_Ref@tmp/cfa-cc-1.0.0.1838/_build/sub'
01:30:31 Making check in libcfa/x64-debug
01:30:31 make[2]: Entering directory '/var/lib/jenkins/workspace/Cforall_Distribute_Ref@tmp/cfa-cc-1.0.0.1838/_build/sub/libcfa/x64-debug'
01:30:31 Making check in prelude
01:30:31 make[3]: Entering directory '/var/lib/jenkins/workspace/Cforall_Distribute_Ref@tmp/cfa-cc-1.0.0.1838/_build/sub/libcfa/x64-debug/prelude'
01:30:31 make[3]: Leaving directory '/var/lib/jenkins/workspace/Cforall_Distribute_Ref@tmp/cfa-cc-1.0.0.1838/_build/sub/libcfa/x64-debug/prelude'
01:30:31 Making check in src
01:30:31 make[3]: Entering directory '/var/lib/jenkins/workspace/Cforall_Distribute_Ref@tmp/cfa-cc-1.0.0.1838/_build/sub/libcfa/x64-debug/src'
01:30:31 make[3]: Nothing to be done for 'check'.
01:30:31 make[3]: Leaving directory '/var/lib/jenkins/workspace/Cforall_Distribute_Ref@tmp/cfa-cc-1.0.0.1838/_build/sub/libcfa/x64-debug/src'
01:30:31 make[3]: Entering directory '/var/lib/jenkins/workspace/Cforall_Distribute_Ref@tmp/cfa-cc-1.0.0.1838/_build/sub/libcfa/x64-debug'
01:30:31 make[3]: Nothing to be done for 'check-am'.
01:30:31 make[3]: Leaving directory '/var/lib/jenkins/workspace/Cforall_Distribute_Ref@tmp/cfa-cc-1.0.0.1838/_build/sub/libcfa/x64-debug'
01:30:31 make[2]: Leaving directory '/var/lib/jenkins/workspace/Cforall_Distribute_Ref@tmp/cfa-cc-1.0.0.1838/_build/sub/libcfa/x64-debug'
01:30:31 Making check in libcfa/x64-nodebug
01:30:31 make[2]: Entering directory '/var/lib/jenkins/workspace/Cforall_Distribute_Ref@tmp/cfa-cc-1.0.0.1838/_build/sub/libcfa/x64-nodebug'
01:30:31 Making check in prelude
01:30:31 make[3]: Entering directory '/var/lib/jenkins/workspace/Cforall_Distribute_Ref@tmp/cfa-cc-1.0.0.1838/_build/sub/libcfa/x64-nodebug/prelude'
01:30:31 make[3]: Leaving directory '/var/lib/jenkins/workspace/Cforall_Distribute_Ref@tmp/cfa-cc-1.0.0.1838/_build/sub/libcfa/x64-nodebug/prelude'
01:30:31 Making check in src
01:30:31 make[3]: Entering directory '/var/lib/jenkins/workspace/Cforall_Distribute_Ref@tmp/cfa-cc-1.0.0.1838/_build/sub/libcfa/x64-nodebug/src'
01:30:31 make[3]: Nothing to be done for 'check'.
01:30:31 make[3]: Leaving directory '/var/lib/jenkins/workspace/Cforall_Distribute_Ref@tmp/cfa-cc-1.0.0.1838/_build/sub/libcfa/x64-nodebug/src'
01:30:31 make[3]: Entering directory '/var/lib/jenkins/workspace/Cforall_Distribute_Ref@tmp/cfa-cc-1.0.0.1838/_build/sub/libcfa/x64-nodebug'
01:30:31 make[3]: Nothing to be done for 'check-am'.
01:30:31 make[3]: Leaving directory '/var/lib/jenkins/workspace/Cforall_Distribute_Ref@tmp/cfa-cc-1.0.0.1838/_build/sub/libcfa/x64-nodebug'
01:30:31 make[2]: Leaving directory '/var/lib/jenkins/workspace/Cforall_Distribute_Ref@tmp/cfa-cc-1.0.0.1838/_build/sub/libcfa/x64-nodebug'
01:30:31 make -C tests all-tests installed=no debug=yes
01:30:31 make[2]: Entering directory '/var/lib/jenkins/workspace/Cforall_Distribute_Ref@tmp/cfa-cc-1.0.0.1838/_build/sub/tests'
01:30:31 Running 220 tests on 7 cores (Default AST (new):x64 - debug)
01:30:31        	array-container/language-dim-mismatch      PASSED     C 0:00.088 - R n/a
01:30:31        	array                                      PASSED     C 0:00.459 - R 0:00.001
01:30:31        	builtins/sync                              PASSED     C 0:00.580 - R 0:00.001
01:30:31        	cast                                       PASSED     C 0:00.460 - R 0:00.001
01:30:31        	castError                                  PASSED     C 0:00.252 - R n/a
01:30:31        	array-container/array-basic                PASSED     C 0:01.277 - R 0:00.017
01:30:31        	avl_test                                   PASSED     C 0:02.201 - R 0:00.016
01:30:31        	alloc-ERROR                                PASSED     C 0:03.429 - R n/a
01:30:31        	alloc                                      PASSED     C 0:06.888 - R 0:00.016
01:30:31        	collections/multi_list                     PASSED     C 0:06.389 - R 0:00.016
01:30:31        	collections/vector-err-pass-perm-it-byval  PASSED     C 0:01.201 - R n/a
01:30:31        	alloc2                                     PASSED     C 0:08.755 - R 0:00.016
01:30:31        	collections/vector-demo                    PASSED     C 0:02.645 - R 0:00.016
01:30:31        	collections/vector-err-retn-perm-it-byval  PASSED     C 0:01.023 - R n/a
01:30:31        	collections/stack                          PASSED     C 0:06.703 - R 0:00.016
01:30:31        	collections/queue                          PASSED     C 0:09.855 - R 0:00.016
01:30:31        	concurrent/clib                            PASSED     C 0:02.805 - R 0:00.165
01:30:31        	concurrent/clib_tls                        PASSED     C 0:02.764 - R 0:00.215
01:30:31        	collections/sequence                       PASSED     C 0:10.681 - R 0:00.016
01:30:31        	collections/atomic_mpsc                    PASSED     C 0:08.502 - R 0:03.872
01:30:31        	complex                                    PASSED     C 0:04.685 - R 0:00.016
01:30:31        	concurrent/cluster                         PASSED     C 0:06.069 - R 0:00.115
01:30:31        	concurrent/coroutineYield                  PASSED     C 0:08.438 - R 0:00.115
01:30:31        	concurrent/examples/datingService          PASSED     C 0:08.495 - R 0:00.064
01:30:31        	concurrent/examples/matrixSum              PASSED     C 0:08.145 - R 0:00.114
01:30:31        	concurrent/examples/gortn                  PASSED     C 0:08.490 - R 0:00.114
01:30:31        	concurrent/examples/quickSort              PASSED     C 0:08.628 - R 0:00.064
01:30:31        	concurrent/futures/abandon                 PASSED     C 0:06.425 - R 0:00.165
01:30:31        	concurrent/keywordErrors                   PASSED     C 0:00.145 - R n/a
01:30:31        	concurrent/examples/boundedBufferINT       PASSED     C 0:08.353 - R 0:05.773
01:30:31        	concurrent/examples/boundedBufferEXT       PASSED     C 0:08.851 - R 0:05.722
01:30:31        	concurrent/futures/basic                   PASSED     C 0:06.274 - R 0:00.114
01:30:31        	concurrent/futures/typed                   PASSED     C 0:06.550 - R 0:00.115
01:30:31        	concurrent/futures/multi                   PASSED     C 0:07.287 - R 0:00.123
01:30:31        	concurrent/join                            PASSED     C 0:08.550 - R 0:00.114
01:30:31        	concurrent/park/contention                 PASSED     C 0:06.309 - R 0:00.274
01:30:31        	concurrent/mutexstmt/monitors              PASSED     C 0:06.573 - R 0:02.629
01:30:31        	concurrent/park/force_preempt              PASSED     C 0:09.355 - R 0:00.415
01:30:31        	concurrent/mutexstmt/locks                 PASSED     C 0:07.814 - R 0:04.948
01:30:31        	concurrent/park/start_parked               PASSED     C 0:06.439 - R 0:00.114
01:30:31        	concurrent/semaphore                       PASSED     C 0:09.534 - R 0:00.064
01:30:31        	concurrent/signal/wait                     PASSED     C 0:09.332 - R 0:00.217
01:30:31        	concurrent/signal/block                    PASSED     C 0:09.421 - R 0:01.467
01:30:31        	concurrent/signal/disjoint                 PASSED     C 0:09.108 - R 0:01.867
01:30:31        	concurrent/monitor                         PASSED     C 0:08.082 - R 0:21.374
01:30:31        	concurrent/multi-monitor                   PASSED     C 0:08.239 - R 0:21.468
01:30:31        	concurrent/sleep                           PASSED     C 0:08.602 - R 0:01.216
01:30:31        	concurrent/preempt                         PASSED     C 0:06.970 - R 0:15.443
01:30:31        	concurrent/suspend_then                    PASSED     C 0:08.622 - R 0:00.165
01:30:31        	concurrent/spinaphore                      PASSED     C 0:09.412 - R 0:00.415
01:30:31        	concurrent/thread                          PASSED     C 0:09.045 - R 0:00.114
01:30:31        	const-init                                 PASSED     C 0:00.560 - R 0:00.016
01:30:31        	concurrent/waitfor/else                    PASSED     C 0:07.059 - R 0:00.114
01:30:31        	concurrent/waitfor/barge                   PASSED     C 0:08.428 - R 0:00.265
01:30:31        	copyfile                                   PASSED     C 0:04.982 - R 0:00.016
01:30:31        	concurrent/waitfor/dtor                    PASSED     C 0:08.397 - R 0:01.267
01:30:31        	concurrent/waitfor/recurse                 PASSED     C 0:08.633 - R 0:00.966
01:30:31        	concurrent/waitfor/statment                PASSED     C 0:09.329 - R 0:00.114
01:30:31        	concurrent/waitfor/when                    PASSED     C 0:08.758 - R 0:00.215
01:30:31        	coroutine/devicedriver                     PASSED     C 0:05.792 - R 0:00.064
01:30:31        	coroutine/fibonacci                        PASSED     C 0:05.708 - R 0:00.065
01:30:31        	designations                               PASSED     C 0:00.641 - R 0:00.016
01:30:31        	coroutine/fmtLines                         PASSED     C 0:05.732 - R 0:00.064
01:30:31        	coroutine/pingpong                         PASSED     C 0:05.679 - R 0:00.115
01:30:31        	enum                                       PASSED     C 0:00.505 - R 0:00.017
01:30:31        	errors/declaration                         PASSED     C 0:00.062 - R n/a
01:30:31        	errors/scope                               PASSED     C 0:00.099 - R n/a
01:30:31        	errors/signature                           PASSED     C 0:00.064 - R n/a
01:30:31        	coroutine/raii                             PASSED     C 0:05.706 - R 0:00.114
01:30:31        	counter                                    PASSED     C 0:04.602 - R 0:00.016
01:30:31        	coroutine/prodcons                         PASSED     C 0:06.915 - R 0:00.064
01:30:31        	coroutine/runningTotal                     PASSED     C 0:05.636 - R 0:00.064
01:30:31        	exceptions/conditional                     PASSED     C 0:00.583 - R 0:00.016
01:30:31        	exceptions/data-except                     PASSED     C 0:00.634 - R 0:00.016
01:30:31        	exceptions/defaults                        PASSED     C 0:00.878 - R 0:00.016
01:30:31        	exceptions/finally                         PASSED     C 0:00.685 - R 0:00.016
01:30:31        	exceptions/cancel/coroutine                PASSED     C 0:03.806 - R 0:00.115
01:30:31        	exceptions/finally-error                   PASSED     C 0:00.135 - R n/a
01:30:31        	exceptions/interact                        PASSED     C 0:00.731 - R 0:00.016
01:30:31        	div                                        PASSED     C 0:06.116 - R 0:00.016
01:30:31        	device/cpu                                 PASSED     C 0:06.767 - R 0:00.016
01:30:31        	exceptions/conditional-threads             PASSED     C 0:03.777 - R 0:00.114
01:30:31        	exceptions/polymorphic                     PASSED     C 0:00.822 - R 0:00.016
01:30:31        	exceptions/resume                          PASSED     C 0:00.776 - R 0:00.016
01:30:31        	exceptions/trash                           PASSED     C 0:00.625 - R 0:00.016
01:30:31        	exceptions/terminate                       PASSED     C 0:00.785 - R 0:00.016
01:30:31        	exceptions/type-check                      PASSED     C 0:00.135 - R n/a
01:30:31        	exceptions/defaults-threads                PASSED     C 0:04.215 - R 0:00.065
01:30:31        	expression                                 PASSED     C 0:00.490 - R 0:00.001
01:30:31        	exceptions/virtual-poly                    PASSED     C 0:00.685 - R 0:00.016
01:30:31        	exceptions/cancel/thread                   PASSED     C 0:06.050 - R 0:00.064
01:30:31        	exceptions/virtual-cast                    PASSED     C 0:01.476 - R 0:00.016
01:30:31        	exceptions/finally-threads                 PASSED     C 0:03.885 - R 0:00.115
01:30:31        	forall                                     PASSED     C 0:00.900 - R 0:00.001
01:30:31        	exceptions/resume-threads                  PASSED     C 0:04.034 - R 0:00.115
01:30:31        	exceptions/terminate-threads               PASSED     C 0:04.006 - R 0:00.064
01:30:31        	genericUnion                               PASSED     C 0:00.548 - R 0:00.016
01:30:31        	global-monomorph                           PASSED     C 0:00.526 - R 0:00.016
01:30:31        	fallthrough                                PASSED     C 0:04.789 - R 0:00.016
01:30:31        	fstream_test                               PASSED     C 0:04.739 - R 0:00.016
01:30:31        	identFuncDeclarator                        PASSED     C 0:00.490 - R 0:00.001
01:30:31        	generator/fibonacci                        PASSED     C 0:04.727 - R 0:00.016
01:30:31        	generator/fmtLines                         PASSED     C 0:04.745 - R 0:00.016
01:30:31        	identParamDeclarator                       PASSED     C 0:00.560 - R 0:00.016
01:30:31        	function-operator                          PASSED     C 0:06.024 - R 0:00.016
01:30:31        	generator/suspend_then                     PASSED     C 0:04.675 - R 0:00.016
01:30:31        	include/vector-containers                  PASSED     C 0:02.505 - R 0:00.016
01:30:31        	hello                                      PASSED     C 0:04.709 - R 0:00.016
01:30:31        	ifwhileCtl                                 PASSED     C 0:04.641 - R 0:00.016
01:30:31        	include/vector-sequence                    PASSED     C 0:00.963 - R 0:00.016
01:30:31        	identity                                   PASSED     C 0:05.114 - R 0:00.016
01:30:31        	init1-ERROR                                PASSED     C 0:00.245 - R n/a
01:30:31        	init1                                      PASSED     C 0:00.504 - R 0:00.001
01:30:31        	include/stdincludes                        PASSED     C 0:05.444 - R 0:00.001
01:30:31        	include/vector-fstream                     PASSED     C 0:04.734 - R 0:00.016
01:30:31        	labelledExit                               PASSED     C 0:00.508 - R 0:00.001
01:30:31        	limits                                     PASSED     C 0:00.491 - R 0:00.001
01:30:31        	linking/exception-nothreads                PASSED     C 0:01.473 - R 0:00.016
01:30:31        	io/manipulatorsOutput4                     PASSED     C 0:07.570 - R 0:00.016
01:30:31        	io/io-acquire                              PASSED     C 0:09.307 - R 0:00.165
01:30:31        	linking/nostdlib                           PASSED     C 0:00.533 - R 0:00.016
01:30:31        	linking/exception-withthreads              PASSED     C 0:04.794 - R 0:00.065
01:30:31        	include/includes                           PASSED     C 0:16.015 - R 0:00.001
01:30:31        	io/many_read                               PASSED     C 0:09.919 - R 0:00.164
01:30:31        	linkonce                                   PASSED     C 0:00.554 - R 0:00.008
01:30:31        	io/io                                      PASSED     C 0:12.925 - R 0:00.016
01:30:31        	linking/io-acquire                         PASSED     C 0:06.053 - R 0:00.016
01:30:31        	heap                                       PASSED     C 0:06.739 - R 0:15.594
01:30:31        	linking/nothreads                          PASSED     C 0:05.609 - R 0:00.016
01:30:31        	maybe                                      PASSED     C 0:00.714 - R 0:00.016
01:30:31        	linking/weakso_nothd                       PASSED     C 0:05.977 - R 0:00.016
01:30:31        	nested-types                               PASSED     C 0:00.477 - R 0:00.001
01:30:31        	nested-types-ERR1                          PASSED     C 0:00.096 - R n/a
01:30:31        	nested-types-ERR2                          PASSED     C 0:00.074 - R n/a
01:30:31        	literals                                   PASSED     C 0:04.956 - R 0:00.016
01:30:31        	numericConstants                           PASSED     C 0:00.458 - R 0:00.001
01:30:31        	operators                                  PASSED     C 0:00.521 - R 0:00.016
01:30:31        	poly-d-cycle                               PASSED     C 0:00.552 - R 0:00.016
01:30:31        	poly-o-cycle                               PASSED     C 0:00.555 - R 0:00.016
01:30:31        	poly-selection                             PASSED     C 0:00.591 - R 0:00.016
01:30:31        	linking/withthreads                        PASSED     C 0:08.183 - R 0:00.064
01:30:31        	quasiKeyword                               PASSED     C 0:00.506 - R 0:00.001
01:30:31        	loopctrl                                   PASSED     C 0:06.712 - R 0:00.016
01:30:31        	malloc                                     PASSED     C 0:05.967 - R 0:00.016
01:30:31        	raii/ctor-autogen-ERR1                     PASSED     C 0:00.286 - R n/a
01:30:31        	raii/ctor-autogen                          PASSED     C 0:00.983 - R 0:00.016
01:30:31        	list/dlist-insert-remove                   PASSED     C 0:10.053 - R 0:00.016
01:30:31        	polymorphism                               PASSED     C 0:04.769 - R 0:00.016
01:30:31        	minmax                                     PASSED     C 0:07.638 - R 0:00.016
01:30:31        	quotedKeyword                              PASSED     C 0:04.554 - R 0:00.016
01:30:31        	raii/boxed-types                           PASSED     C 0:04.676 - R 0:00.016
01:30:31        	raii/memberCtors-ERR1                      PASSED     C 0:00.317 - R n/a
01:30:31        	raii/init_once                             PASSED     C 0:00.624 - R 0:00.016
01:30:31        	raii/memberCtors                           PASSED     C 0:00.574 - R 0:00.016
01:30:31        	raii/dtor-early-exit-ERR1                  PASSED     C 0:03.592 - R n/a
01:30:31        	raii/dtor-early-exit-ERR2                  PASSED     C 0:03.505 - R n/a
01:30:31        	result                                     PASSED     C 0:00.930 - R 0:00.016
01:30:31        	simpleGenericTriple                        PASSED     C 0:00.710 - R 0:00.016
01:30:31        	smart-pointers                             PASSED     C 0:00.708 - R 0:00.016
01:30:31        	raii/dtor-early-exit                       PASSED     C 0:06.128 - R 0:00.016
01:30:31        	raii/globals                               PASSED     C 0:04.790 - R 0:00.016
01:30:31        	references                                 PASSED     C 0:05.497 - R 0:00.016
01:30:31        	shortCircuit                               PASSED     C 0:04.931 - R 0:00.016
01:30:31        	switch                                     PASSED     C 0:00.438 - R 0:00.001
01:30:31        	strstream                                  PASSED     C 0:04.974 - R 0:00.016
01:30:31        	searchsort                                 PASSED     C 0:07.307 - R 0:00.016
01:30:31        	tuple/tupleCast                            PASSED     C 0:00.510 - R 0:00.016
01:30:31        	tuple/tupleFunction                        PASSED     C 0:00.563 - R 0:00.016
01:30:31        	tuple/tupleMember                          PASSED     C 0:00.572 - R 0:00.016
01:30:31        	tuple/tuplePolymorphism                    PASSED     C 0:00.741 - R 0:00.016
01:30:31        	typedefRedef                               PASSED     C 0:00.459 - R 0:00.001
01:30:31        	sum                                        PASSED     C 0:06.706 - R 0:00.016
01:30:31        	typedefRedef-ERR1                          PASSED     C 0:00.068 - R n/a
01:30:31        	unified_locking/fast                       FAILED with code 1    C 0:00.060 - R n/a
01:30:31 		expected :
01:30:31 		1	Starting
01:30:31 		2	Done!
01:30:31 		3	Match!
01:30:31 		got :
01:30:31 		1	unified_locking/fast.cfa:4:10: fatal error: mutex_test.hfa: No such file or directory
01:30:31 		2	compilation terminated.
01:30:31 
01:30:31        	unified_locking/lin_backoff                FAILED with code 1    C 0:00.065 - R n/a
01:30:31 		expected :
01:30:31 		1	Starting
01:30:31 		2	Done!
01:30:31 		3	Match!
01:30:31 		got :
01:30:31 		1	unified_locking/lin_backoff.cfa:4:10: fatal error: mutex_test.hfa: No such file or directory
01:30:31 		2	compilation terminated.
01:30:31 
01:30:31        	tuple/tupleVariadic                        PASSED     C 0:01.533 - R 0:00.016
01:30:31        	typeof                                     PASSED     C 0:00.504 - R 0:00.016
01:30:31        	swap                                       PASSED     C 0:07.153 - R 0:00.016
01:30:31        	tuple/tupleAssign                          PASSED     C 0:05.803 - R 0:00.016
01:30:31        	variableDeclarator                         PASSED     C 0:00.447 - R 0:00.001
01:30:31        	time                                       PASSED     C 0:06.326 - R 0:00.016
01:30:31        	rational                                   PASSED     C 0:15.394 - R 0:00.016
01:30:31        	userLiterals                               PASSED     C 0:05.174 - R 0:00.016
01:30:31        	vector_math/vec2_double                    PASSED     C 0:06.338 - R 0:00.016
01:30:31        	unified_locking/timeout_lock               PASSED     C 0:07.549 - R 0:01.117
01:30:31        	vector                                     PASSED     C 0:07.143 - R 0:00.016
01:30:31        	vector_math/vec2_uint                      PASSED     C 0:06.627 - R 0:00.016
01:30:31        	unified_locking/mcs                        PASSED     C 0:09.645 - R 0:06.378
01:30:31        	vector_math/vec2_float                     PASSED     C 0:11.683 - R 0:00.016
01:30:31        	voidPtr                                    PASSED     C 0:00.484 - R 0:00.008
01:30:31        	vector_math/vec2_int                       PASSED     C 0:11.496 - R 0:00.016
01:30:31        	warnings/self-assignment                   PASSED     C 0:00.431 - R 0:00.001
01:30:31        	KRfunctions                                PASSED     C 0:00.389 - R 0:00.001
01:30:31        	vector_math/vec3_int                       PASSED     C 0:10.131 - R 0:00.016
01:30:31        	vector_math/vec3_float                     PASSED     C 0:12.013 - R 0:00.016
01:30:31        	attributes                                 PASSED     C 0:00.484 - R 0:00.001
01:30:31        	abs                                        PASSED     C 0:06.478 - R 0:00.016
01:30:31        	ato                                        PASSED     C 0:06.143 - R 0:00.016
01:30:31        	array-container/array-md-sbscr-cases       PASSED     C 0:08.394 - R 0:00.016
01:30:31        	declarationSpecifier                       PASSED     C 0:00.488 - R 0:00.001
01:30:31        	vector_math/vec4_int                       PASSED     C 0:10.954 - R 0:00.016
01:30:31        	vector_math/vec4_float                     PASSED     C 0:11.871 - R 0:00.016
01:30:31        	errors/completeType                        PASSED     C 0:00.241 - R n/a
01:30:31        	functions                                  PASSED     C 0:00.410 - R 0:00.001
01:30:31        	extension                                  PASSED     C 0:00.460 - R 0:00.001
01:30:31        	gccExtensions                              PASSED     C 0:00.418 - R 0:00.001
01:30:31        	unified_locking/locks                      PASSED     C 0:08.286 - R 0:20.904
01:30:31        	bitmanip1                                  PASSED     C 0:10.254 - R 0:00.016
01:30:31        	io/manipulatorsInput                       PASSED     C 0:06.811 - R 0:00.016
01:30:31        	gmp                                        PASSED     C 0:07.057 - R 0:00.016
01:30:31        	bitmanip2                                  PASSED     C 0:11.228 - R 0:00.016
01:30:31        	meta/archVast                              PASSED     C 0:00.241 - R n/a
01:30:31        	io/manipulatorsOutput2                     PASSED     C 0:08.532 - R 0:00.016
01:30:31        	io/manipulatorsOutput1                     PASSED     C 0:11.795 - R 0:00.016
01:30:31        	random                                     PASSED     C 0:05.745 - R 0:00.016
01:30:31        	bitmanip3                                  PASSED     C 0:16.480 - R 0:00.016
01:30:31        	vector_math/vec2_ldouble                   PASSED     C 0:06.387 - R 0:00.016
01:30:31        	io/manipulatorsOutput3                     PASSED     C 0:13.207 - R 0:00.016
01:30:31        	math                                       PASSED     C 0:12.517 - R 0:00.017
01:30:31        	mathX                                      PASSED     C 0:18.942 - R 0:00.034
01:30:31 Tests took  2:59.463
01:30:31 make[2]: *** [Makefile:879: all-tests] Error 1
01:30:31 make[2]: Leaving directory '/var/lib/jenkins/workspace/Cforall_Distribute_Ref@tmp/cfa-cc-1.0.0.1838/_build/sub/tests'
01:30:31 make[1]: *** [Makefile:951: check] Error 2
01:30:31 make[1]: Leaving directory '/var/lib/jenkins/workspace/Cforall_Distribute_Ref@tmp/cfa-cc-1.0.0.1838/_build/sub'
01:30:31 make: *** [Makefile:734: distcheck] Error 1
01:30:31 [Pipeline] }
01:30:31 [Pipeline] // dir
01:30:31 [Pipeline] }
01:30:31 [Pipeline] // stage
01:30:31 [Pipeline] }
01:30:31 [Pipeline] // wrap
01:30:31 [Pipeline] }
01:30:31 [Pipeline] // node
01:30:31 [Pipeline] End of Pipeline
01:30:31 ERROR: script returned exit code 2
01:30:31 Finished: FAILURE
[Pipeline] error
[Pipeline] }
[Pipeline] // stage
[Pipeline] }
[Pipeline] // wrap
[Pipeline] echo
error caught
[Pipeline] node
Running on Brokk 4 in /var/lib/jenkins/workspace/Cforall_Full_Build
[Pipeline] {
[Pipeline] echo
notifying users
[Pipeline] emailext
Sending email to: cforall@lists.uwaterloo.ca
[Pipeline] }
[Pipeline] // node
[Pipeline] }
[Pipeline] // node
[Pipeline] End of Pipeline
ERROR: FAILURE
Finished: FAILURE