Console Output

Skipping 697 KB.. Full Log
01:13:15 Making dvi in driver
01:13:15 make[2]: Entering directory '/var/lib/jenkins/workspace/Cforall_Distribute_Ref@tmp/cfa-cc-1.0.0.1836/_build/sub/driver'
01:13:15 make[2]: Nothing to be done for 'dvi'.
01:13:15 make[2]: Leaving directory '/var/lib/jenkins/workspace/Cforall_Distribute_Ref@tmp/cfa-cc-1.0.0.1836/_build/sub/driver'
01:13:15 Making dvi in src
01:13:15 make[2]: Entering directory '/var/lib/jenkins/workspace/Cforall_Distribute_Ref@tmp/cfa-cc-1.0.0.1836/_build/sub/src'
01:13:15 make[2]: Nothing to be done for 'dvi'.
01:13:15 make[2]: Leaving directory '/var/lib/jenkins/workspace/Cforall_Distribute_Ref@tmp/cfa-cc-1.0.0.1836/_build/sub/src'
01:13:15 Making dvi in .
01:13:15 make[2]: Entering directory '/var/lib/jenkins/workspace/Cforall_Distribute_Ref@tmp/cfa-cc-1.0.0.1836/_build/sub'
01:13:15 make[2]: Nothing to be done for 'dvi-am'.
01:13:15 make[2]: Leaving directory '/var/lib/jenkins/workspace/Cforall_Distribute_Ref@tmp/cfa-cc-1.0.0.1836/_build/sub'
01:13:15 Making dvi in libcfa/x64-debug
01:13:15 make[2]: Entering directory '/var/lib/jenkins/workspace/Cforall_Distribute_Ref@tmp/cfa-cc-1.0.0.1836/_build/sub/libcfa/x64-debug'
01:13:15 Making dvi in prelude
01:13:15 make[3]: Entering directory '/var/lib/jenkins/workspace/Cforall_Distribute_Ref@tmp/cfa-cc-1.0.0.1836/_build/sub/libcfa/x64-debug/prelude'
01:13:15 make[3]: Nothing to be done for 'dvi'.
01:13:15 make[3]: Leaving directory '/var/lib/jenkins/workspace/Cforall_Distribute_Ref@tmp/cfa-cc-1.0.0.1836/_build/sub/libcfa/x64-debug/prelude'
01:13:15 Making dvi in src
01:13:15 make[3]: Entering directory '/var/lib/jenkins/workspace/Cforall_Distribute_Ref@tmp/cfa-cc-1.0.0.1836/_build/sub/libcfa/x64-debug/src'
01:13:15 make[3]: Nothing to be done for 'dvi'.
01:13:15 make[3]: Leaving directory '/var/lib/jenkins/workspace/Cforall_Distribute_Ref@tmp/cfa-cc-1.0.0.1836/_build/sub/libcfa/x64-debug/src'
01:13:15 make[3]: Entering directory '/var/lib/jenkins/workspace/Cforall_Distribute_Ref@tmp/cfa-cc-1.0.0.1836/_build/sub/libcfa/x64-debug'
01:13:15 make[3]: Nothing to be done for 'dvi-am'.
01:13:15 make[3]: Leaving directory '/var/lib/jenkins/workspace/Cforall_Distribute_Ref@tmp/cfa-cc-1.0.0.1836/_build/sub/libcfa/x64-debug'
01:13:15 make[2]: Leaving directory '/var/lib/jenkins/workspace/Cforall_Distribute_Ref@tmp/cfa-cc-1.0.0.1836/_build/sub/libcfa/x64-debug'
01:13:15 Making dvi in libcfa/x64-nodebug
01:13:15 make[2]: Entering directory '/var/lib/jenkins/workspace/Cforall_Distribute_Ref@tmp/cfa-cc-1.0.0.1836/_build/sub/libcfa/x64-nodebug'
01:13:15 Making dvi in prelude
01:13:15 make[3]: Entering directory '/var/lib/jenkins/workspace/Cforall_Distribute_Ref@tmp/cfa-cc-1.0.0.1836/_build/sub/libcfa/x64-nodebug/prelude'
01:13:15 make[3]: Nothing to be done for 'dvi'.
01:13:15 make[3]: Leaving directory '/var/lib/jenkins/workspace/Cforall_Distribute_Ref@tmp/cfa-cc-1.0.0.1836/_build/sub/libcfa/x64-nodebug/prelude'
01:13:15 Making dvi in src
01:13:15 make[3]: Entering directory '/var/lib/jenkins/workspace/Cforall_Distribute_Ref@tmp/cfa-cc-1.0.0.1836/_build/sub/libcfa/x64-nodebug/src'
01:13:15 make[3]: Nothing to be done for 'dvi'.
01:13:15 make[3]: Leaving directory '/var/lib/jenkins/workspace/Cforall_Distribute_Ref@tmp/cfa-cc-1.0.0.1836/_build/sub/libcfa/x64-nodebug/src'
01:13:15 make[3]: Entering directory '/var/lib/jenkins/workspace/Cforall_Distribute_Ref@tmp/cfa-cc-1.0.0.1836/_build/sub/libcfa/x64-nodebug'
01:13:15 make[3]: Nothing to be done for 'dvi-am'.
01:13:15 make[3]: Leaving directory '/var/lib/jenkins/workspace/Cforall_Distribute_Ref@tmp/cfa-cc-1.0.0.1836/_build/sub/libcfa/x64-nodebug'
01:13:15 make[2]: Leaving directory '/var/lib/jenkins/workspace/Cforall_Distribute_Ref@tmp/cfa-cc-1.0.0.1836/_build/sub/libcfa/x64-nodebug'
01:13:15 make[1]: Leaving directory '/var/lib/jenkins/workspace/Cforall_Distribute_Ref@tmp/cfa-cc-1.0.0.1836/_build/sub'
01:13:15 make[1]: Entering directory '/var/lib/jenkins/workspace/Cforall_Distribute_Ref@tmp/cfa-cc-1.0.0.1836/_build/sub'
01:13:15 Making check in driver
01:13:15 make[2]: Entering directory '/var/lib/jenkins/workspace/Cforall_Distribute_Ref@tmp/cfa-cc-1.0.0.1836/_build/sub/driver'
01:13:15 make[2]: Nothing to be done for 'check'.
01:13:15 make[2]: Leaving directory '/var/lib/jenkins/workspace/Cforall_Distribute_Ref@tmp/cfa-cc-1.0.0.1836/_build/sub/driver'
01:13:15 Making check in src
01:13:15 make[2]: Entering directory '/var/lib/jenkins/workspace/Cforall_Distribute_Ref@tmp/cfa-cc-1.0.0.1836/_build/sub/src'
01:13:15 make  check-am
01:13:15 make[3]: Entering directory '/var/lib/jenkins/workspace/Cforall_Distribute_Ref@tmp/cfa-cc-1.0.0.1836/_build/sub/src'
01:13:15 make[3]: Nothing to be done for 'check-am'.
01:13:15 make[3]: Leaving directory '/var/lib/jenkins/workspace/Cforall_Distribute_Ref@tmp/cfa-cc-1.0.0.1836/_build/sub/src'
01:13:15 make[2]: Leaving directory '/var/lib/jenkins/workspace/Cforall_Distribute_Ref@tmp/cfa-cc-1.0.0.1836/_build/sub/src'
01:13:15 Making check in .
01:13:15 make[2]: Entering directory '/var/lib/jenkins/workspace/Cforall_Distribute_Ref@tmp/cfa-cc-1.0.0.1836/_build/sub'
01:13:15 make[2]: Leaving directory '/var/lib/jenkins/workspace/Cforall_Distribute_Ref@tmp/cfa-cc-1.0.0.1836/_build/sub'
01:13:15 Making check in libcfa/x64-debug
01:13:15 make[2]: Entering directory '/var/lib/jenkins/workspace/Cforall_Distribute_Ref@tmp/cfa-cc-1.0.0.1836/_build/sub/libcfa/x64-debug'
01:13:15 Making check in prelude
01:13:15 make[3]: Entering directory '/var/lib/jenkins/workspace/Cforall_Distribute_Ref@tmp/cfa-cc-1.0.0.1836/_build/sub/libcfa/x64-debug/prelude'
01:13:15 make[3]: Leaving directory '/var/lib/jenkins/workspace/Cforall_Distribute_Ref@tmp/cfa-cc-1.0.0.1836/_build/sub/libcfa/x64-debug/prelude'
01:13:15 Making check in src
01:13:15 make[3]: Entering directory '/var/lib/jenkins/workspace/Cforall_Distribute_Ref@tmp/cfa-cc-1.0.0.1836/_build/sub/libcfa/x64-debug/src'
01:13:15 make[3]: Nothing to be done for 'check'.
01:13:15 make[3]: Leaving directory '/var/lib/jenkins/workspace/Cforall_Distribute_Ref@tmp/cfa-cc-1.0.0.1836/_build/sub/libcfa/x64-debug/src'
01:13:15 make[3]: Entering directory '/var/lib/jenkins/workspace/Cforall_Distribute_Ref@tmp/cfa-cc-1.0.0.1836/_build/sub/libcfa/x64-debug'
01:13:15 make[3]: Nothing to be done for 'check-am'.
01:13:15 make[3]: Leaving directory '/var/lib/jenkins/workspace/Cforall_Distribute_Ref@tmp/cfa-cc-1.0.0.1836/_build/sub/libcfa/x64-debug'
01:13:15 make[2]: Leaving directory '/var/lib/jenkins/workspace/Cforall_Distribute_Ref@tmp/cfa-cc-1.0.0.1836/_build/sub/libcfa/x64-debug'
01:13:15 Making check in libcfa/x64-nodebug
01:13:15 make[2]: Entering directory '/var/lib/jenkins/workspace/Cforall_Distribute_Ref@tmp/cfa-cc-1.0.0.1836/_build/sub/libcfa/x64-nodebug'
01:13:15 Making check in prelude
01:13:15 make[3]: Entering directory '/var/lib/jenkins/workspace/Cforall_Distribute_Ref@tmp/cfa-cc-1.0.0.1836/_build/sub/libcfa/x64-nodebug/prelude'
01:13:15 make[3]: Leaving directory '/var/lib/jenkins/workspace/Cforall_Distribute_Ref@tmp/cfa-cc-1.0.0.1836/_build/sub/libcfa/x64-nodebug/prelude'
01:13:15 Making check in src
01:13:15 make[3]: Entering directory '/var/lib/jenkins/workspace/Cforall_Distribute_Ref@tmp/cfa-cc-1.0.0.1836/_build/sub/libcfa/x64-nodebug/src'
01:13:15 make[3]: Nothing to be done for 'check'.
01:13:15 make[3]: Leaving directory '/var/lib/jenkins/workspace/Cforall_Distribute_Ref@tmp/cfa-cc-1.0.0.1836/_build/sub/libcfa/x64-nodebug/src'
01:13:15 make[3]: Entering directory '/var/lib/jenkins/workspace/Cforall_Distribute_Ref@tmp/cfa-cc-1.0.0.1836/_build/sub/libcfa/x64-nodebug'
01:13:15 make[3]: Nothing to be done for 'check-am'.
01:13:15 make[3]: Leaving directory '/var/lib/jenkins/workspace/Cforall_Distribute_Ref@tmp/cfa-cc-1.0.0.1836/_build/sub/libcfa/x64-nodebug'
01:13:15 make[2]: Leaving directory '/var/lib/jenkins/workspace/Cforall_Distribute_Ref@tmp/cfa-cc-1.0.0.1836/_build/sub/libcfa/x64-nodebug'
01:13:15 make -C tests all-tests installed=no debug=yes
01:13:15 make[2]: Entering directory '/var/lib/jenkins/workspace/Cforall_Distribute_Ref@tmp/cfa-cc-1.0.0.1836/_build/sub/tests'
01:13:15 Running 220 tests on 7 cores (Default AST (new):x64 - debug)
01:13:15        	array-container/language-dim-mismatch      PASSED     C 0:00.081 - R n/a
01:13:15        	array                                      PASSED     C 0:00.473 - R 0:00.001
01:13:15        	builtins/sync                              PASSED     C 0:00.587 - R 0:00.001
01:13:15        	castError                                  PASSED     C 0:00.248 - R n/a
01:13:15        	cast                                       PASSED     C 0:00.462 - R 0:00.001
01:13:15        	array-container/array-basic                PASSED     C 0:01.281 - R 0:00.017
01:13:15        	avl_test                                   PASSED     C 0:01.968 - R 0:00.016
01:13:15        	alloc-ERROR                                PASSED     C 0:03.397 - R n/a
01:13:15        	alloc                                      PASSED     C 0:06.927 - R 0:00.016
01:13:15        	collections/multi_list                     PASSED     C 0:06.263 - R 0:00.016
01:13:15        	collections/vector-err-pass-perm-it-byval  PASSED     C 0:01.180 - R n/a
01:13:15        	alloc2                                     PASSED     C 0:08.583 - R 0:00.016
01:13:15        	collections/vector-err-retn-perm-it-byval  PASSED     C 0:00.989 - R n/a
01:13:15        	collections/vector-demo                    PASSED     C 0:02.671 - R 0:00.016
01:13:15        	collections/stack                          PASSED     C 0:06.985 - R 0:00.016
01:13:15        	collections/queue                          PASSED     C 0:09.939 - R 0:00.016
01:13:15        	collections/sequence                       PASSED     C 0:10.113 - R 0:00.016
01:13:15        	concurrent/clib                            PASSED     C 0:02.669 - R 0:00.165
01:13:15        	concurrent/clib_tls                        PASSED     C 0:02.806 - R 0:00.215
01:13:15        	collections/atomic_mpsc                    PASSED     C 0:08.396 - R 0:03.872
01:13:15        	complex                                    PASSED     C 0:04.995 - R 0:00.016
01:13:15        	concurrent/cluster                         PASSED     C 0:06.172 - R 0:00.165
01:13:15        	concurrent/coroutineYield                  PASSED     C 0:08.731 - R 0:00.115
01:13:15        	concurrent/examples/datingService          PASSED     C 0:08.691 - R 0:00.114
01:13:15        	concurrent/examples/gortn                  PASSED     C 0:08.346 - R 0:00.114
01:13:15        	concurrent/examples/matrixSum              PASSED     C 0:08.186 - R 0:00.114
01:13:15        	concurrent/examples/quickSort              PASSED     C 0:08.519 - R 0:00.064
01:13:15        	concurrent/futures/abandon                 PASSED     C 0:06.250 - R 0:00.114
01:13:15        	concurrent/keywordErrors                   PASSED     C 0:00.144 - R n/a
01:13:15        	concurrent/examples/boundedBufferEXT       PASSED     C 0:09.157 - R 0:05.825
01:13:15        	concurrent/examples/boundedBufferINT       PASSED     C 0:08.576 - R 0:06.277
01:13:15        	concurrent/mutexstmt/locks                 FAILED with code 1    C 0:00.077 - R n/a
01:13:15 		expected :
01:13:15 		1	Start Test: single lock mutual exclusion
01:13:15 		2	End Test: single lock mutual exclusion
01:13:15 		3	Start Test: multi lock deadlock/mutual exclusion
01:13:15 		4	End Test: multi lock deadlock/mutual exclusion
01:13:15 		got :
01:13:15 		1	concurrent/mutexstmt/locks.cfa:1:10: fatal error: mutex_stmt.hfa: No such file or directory
01:13:15 		2	compilation terminated.
01:13:15 
01:13:15        	concurrent/mutexstmt/monitors              FAILED with code 1    C 0:00.054 - R n/a
01:13:15 		expected :
01:13:15 		1	Start Test: single monitor mutual exclusion
01:13:15 		2	End Test: single monitor mutual exclusion
01:13:15 		3	Start Test: multi monitor deadlock/mutual exclusion
01:13:15 		4	End Test: multi monitor deadlock/mutual exclusion
01:13:15 		got :
01:13:15 		1	concurrent/mutexstmt/monitors.cfa:2:10: fatal error: mutex_stmt.hfa: No such file or directory
01:13:15 		2	compilation terminated.
01:13:15 
01:13:15        	concurrent/futures/basic                   PASSED     C 0:06.217 - R 0:00.165
01:13:15        	concurrent/futures/typed                   PASSED     C 0:06.498 - R 0:00.114
01:13:15        	concurrent/futures/multi                   PASSED     C 0:07.859 - R 0:00.114
01:13:15        	concurrent/park/contention                 PASSED     C 0:06.252 - R 0:00.215
01:13:15        	concurrent/join                            PASSED     C 0:08.313 - R 0:00.114
01:13:15        	concurrent/park/start_parked               PASSED     C 0:06.191 - R 0:00.114
01:13:15        	concurrent/park/force_preempt              PASSED     C 0:08.487 - R 0:00.365
01:13:15        	concurrent/semaphore                       PASSED     C 0:09.536 - R 0:00.064
01:13:15        	concurrent/signal/block                    PASSED     C 0:09.311 - R 0:01.316
01:13:15        	concurrent/signal/disjoint                 PASSED     C 0:08.647 - R 0:01.918
01:13:15        	concurrent/signal/wait                     PASSED     C 0:08.637 - R 0:00.265
01:13:15        	concurrent/preempt                         PASSED     C 0:06.476 - R 0:15.938
01:13:15        	concurrent/sleep                           PASSED     C 0:08.660 - R 0:01.217
01:13:15        	concurrent/monitor                         PASSED     C 0:08.090 - R 0:19.152
01:13:15        	concurrent/spinaphore                      PASSED     C 0:09.198 - R 0:00.415
01:13:15        	concurrent/suspend_then                    PASSED     C 0:08.646 - R 0:00.115
01:13:15        	concurrent/thread                          PASSED     C 0:09.088 - R 0:00.114
01:13:15        	concurrent/multi-monitor                   PASSED     C 0:08.331 - R 0:21.301
01:13:15        	const-init                                 PASSED     C 0:00.503 - R 0:00.016
01:13:15        	concurrent/waitfor/barge                   PASSED     C 0:08.171 - R 0:00.315
01:13:15        	concurrent/waitfor/else                    PASSED     C 0:07.083 - R 0:00.065
01:13:15        	copyfile                                   PASSED     C 0:04.835 - R 0:00.016
01:13:15        	concurrent/waitfor/dtor                    PASSED     C 0:08.177 - R 0:01.217
01:13:15        	concurrent/waitfor/recurse                 PASSED     C 0:08.542 - R 0:01.016
01:13:15        	concurrent/waitfor/statment                PASSED     C 0:09.449 - R 0:00.165
01:13:15        	concurrent/waitfor/when                    PASSED     C 0:09.346 - R 0:00.165
01:13:15        	coroutine/devicedriver                     PASSED     C 0:05.811 - R 0:00.064
01:13:15        	coroutine/fibonacci                        PASSED     C 0:05.626 - R 0:00.069
01:13:15        	designations                               PASSED     C 0:00.643 - R 0:00.016
01:13:15        	coroutine/fmtLines                         PASSED     C 0:05.612 - R 0:00.114
01:13:15        	coroutine/pingpong                         PASSED     C 0:05.652 - R 0:00.115
01:13:15        	enum                                       PASSED     C 0:00.514 - R 0:00.016
01:13:15        	errors/declaration                         PASSED     C 0:00.060 - R n/a
01:13:15        	errors/scope                               PASSED     C 0:00.099 - R n/a
01:13:15        	errors/signature                           PASSED     C 0:00.152 - R n/a
01:13:15        	coroutine/raii                             PASSED     C 0:05.652 - R 0:00.064
01:13:15        	coroutine/runningTotal                     PASSED     C 0:05.783 - R 0:00.115
01:13:15        	coroutine/prodcons                         PASSED     C 0:06.853 - R 0:00.064
01:13:15        	exceptions/conditional                     PASSED     C 0:00.590 - R 0:00.016
01:13:15        	counter                                    PASSED     C 0:04.884 - R 0:00.016
01:13:15        	exceptions/data-except                     PASSED     C 0:00.636 - R 0:00.016
01:13:15        	exceptions/defaults                        PASSED     C 0:00.898 - R 0:00.016
01:13:15        	exceptions/finally                         PASSED     C 0:00.619 - R 0:00.016
01:13:15        	exceptions/finally-error                   PASSED     C 0:00.139 - R n/a
01:13:15        	exceptions/cancel/coroutine                PASSED     C 0:03.953 - R 0:00.064
01:13:15        	div                                        PASSED     C 0:05.944 - R 0:00.016
01:13:15        	exceptions/interact                        PASSED     C 0:00.720 - R 0:00.016
01:13:15        	device/cpu                                 PASSED     C 0:06.721 - R 0:00.016
01:13:15        	exceptions/conditional-threads             PASSED     C 0:03.882 - R 0:00.114
01:13:15        	exceptions/polymorphic                     PASSED     C 0:00.947 - R 0:00.016
01:13:15        	exceptions/resume                          PASSED     C 0:00.796 - R 0:00.016
01:13:15        	exceptions/terminate                       PASSED     C 0:00.780 - R 0:00.016
01:13:15        	exceptions/type-check                      PASSED     C 0:00.136 - R n/a
01:13:15        	exceptions/trash                           PASSED     C 0:00.651 - R 0:00.016
01:13:15        	exceptions/cancel/thread                   PASSED     C 0:06.228 - R 0:00.064
01:13:15        	exceptions/defaults-threads                PASSED     C 0:04.221 - R 0:00.064
01:13:15        	exceptions/virtual-poly                    PASSED     C 0:00.671 - R 0:00.016
01:13:15        	expression                                 PASSED     C 0:00.497 - R 0:00.001
01:13:15        	exceptions/virtual-cast                    PASSED     C 0:01.446 - R 0:00.008
01:13:15        	exceptions/finally-threads                 PASSED     C 0:03.784 - R 0:00.114
01:13:15        	forall                                     PASSED     C 0:00.900 - R 0:00.001
01:13:15        	exceptions/resume-threads                  PASSED     C 0:03.985 - R 0:00.064
01:13:15        	exceptions/terminate-threads               PASSED     C 0:04.011 - R 0:00.064
01:13:15        	genericUnion                               PASSED     C 0:00.564 - R 0:00.008
01:13:15        	global-monomorph                           PASSED     C 0:00.509 - R 0:00.016
01:13:15        	fallthrough                                PASSED     C 0:04.945 - R 0:00.016
01:13:15        	fstream_test                               PASSED     C 0:04.786 - R 0:00.016
01:13:15        	generator/fibonacci                        PASSED     C 0:04.605 - R 0:00.016
01:13:15        	identFuncDeclarator                        PASSED     C 0:00.454 - R 0:00.001
01:13:15        	generator/fmtLines                         PASSED     C 0:04.676 - R 0:00.016
01:13:15        	identParamDeclarator                       PASSED     C 0:00.527 - R 0:00.016
01:13:15        	generator/suspend_then                     PASSED     C 0:04.662 - R 0:00.016
01:13:15        	function-operator                          PASSED     C 0:06.111 - R 0:00.016
01:13:15        	hello                                      PASSED     C 0:04.729 - R 0:00.016
01:13:15        	include/vector-containers                  PASSED     C 0:02.514 - R 0:00.016
01:13:15        	include/vector-sequence                    PASSED     C 0:00.907 - R 0:00.016
01:13:15        	identity                                   PASSED     C 0:04.921 - R 0:00.016
01:13:15        	ifwhileCtl                                 PASSED     C 0:04.669 - R 0:00.016
01:13:15        	init1-ERROR                                PASSED     C 0:00.266 - R n/a
01:13:15        	init1                                      PASSED     C 0:00.428 - R 0:00.001
01:13:15        	include/stdincludes                        PASSED     C 0:05.404 - R 0:00.001
01:13:15        	include/vector-fstream                     PASSED     C 0:04.699 - R 0:00.016
01:13:15        	labelledExit                               PASSED     C 0:00.471 - R 0:00.001
01:13:15        	limits                                     PASSED     C 0:00.489 - R 0:00.001
01:13:15        	linking/exception-nothreads                PASSED     C 0:01.445 - R 0:00.016
01:13:15        	io/manipulatorsOutput4                     PASSED     C 0:07.441 - R 0:00.016
01:13:15        	io/io-acquire                              PASSED     C 0:09.362 - R 0:00.165
01:13:15        	linking/nostdlib                           PASSED     C 0:00.556 - R 0:00.016
01:13:15        	linking/exception-withthreads              PASSED     C 0:04.739 - R 0:00.115
01:13:15        	include/includes                           PASSED     C 0:15.640 - R 0:00.001
01:13:15        	io/many_read                               PASSED     C 0:10.069 - R 0:00.165
01:13:15        	linkonce                                   PASSED     C 0:00.621 - R 0:00.016
01:13:15        	io/io                                      PASSED     C 0:12.762 - R 0:00.016
01:13:15        	linking/io-acquire                         PASSED     C 0:05.826 - R 0:00.008
01:13:15        	linking/nothreads                          PASSED     C 0:05.636 - R 0:00.016
01:13:15        	heap                                       PASSED     C 0:06.930 - R 0:15.793
01:13:15        	linking/weakso_nothd                       PASSED     C 0:05.567 - R 0:00.017
01:13:15        	maybe                                      PASSED     C 0:00.747 - R 0:00.016
01:13:15        	nested-types                               PASSED     C 0:00.497 - R 0:00.001
01:13:15        	nested-types-ERR1                          PASSED     C 0:00.082 - R n/a
01:13:15        	nested-types-ERR2                          PASSED     C 0:00.071 - R n/a
01:13:15        	literals                                   PASSED     C 0:05.143 - R 0:00.016
01:13:15        	numericConstants                           PASSED     C 0:00.495 - R 0:00.001
01:13:15        	operators                                  PASSED     C 0:00.528 - R 0:00.016
01:13:15        	poly-d-cycle                               PASSED     C 0:00.579 - R 0:00.016
01:13:15        	poly-o-cycle                               PASSED     C 0:00.588 - R 0:00.016
01:13:15        	poly-selection                             PASSED     C 0:00.671 - R 0:00.016
01:13:15        	linking/withthreads                        PASSED     C 0:08.451 - R 0:00.114
01:13:15        	quasiKeyword                               PASSED     C 0:00.538 - R 0:00.001
01:13:15        	loopctrl                                   PASSED     C 0:06.494 - R 0:00.016
01:13:15        	raii/ctor-autogen                          PASSED     C 0:01.011 - R 0:00.016
01:13:15        	raii/ctor-autogen-ERR1                     PASSED     C 0:00.290 - R n/a
01:13:15        	malloc                                     PASSED     C 0:06.286 - R 0:00.016
01:13:15        	list/dlist-insert-remove                   PASSED     C 0:10.870 - R 0:00.016
01:13:15        	polymorphism                               PASSED     C 0:04.848 - R 0:00.016
01:13:15        	minmax                                     PASSED     C 0:07.465 - R 0:00.016
01:13:15        	quotedKeyword                              PASSED     C 0:04.499 - R 0:00.016
01:13:15        	raii/boxed-types                           PASSED     C 0:04.734 - R 0:00.016
01:13:15        	raii/init_once                             PASSED     C 0:00.631 - R 0:00.016
01:13:15        	raii/memberCtors                           PASSED     C 0:00.589 - R 0:00.016
01:13:15        	raii/memberCtors-ERR1                      PASSED     C 0:00.321 - R n/a
01:13:15        	raii/dtor-early-exit-ERR1                  PASSED     C 0:03.547 - R n/a
01:13:15        	result                                     PASSED     C 0:00.918 - R 0:00.016
01:13:15        	raii/dtor-early-exit-ERR2                  PASSED     C 0:03.585 - R n/a
01:13:15        	raii/dtor-early-exit                       PASSED     C 0:06.152 - R 0:00.016
01:13:15        	simpleGenericTriple                        PASSED     C 0:00.657 - R 0:00.016
01:13:15        	smart-pointers                             PASSED     C 0:00.716 - R 0:00.016
01:13:15        	raii/globals                               PASSED     C 0:05.214 - R 0:00.016
01:13:15        	references                                 PASSED     C 0:05.336 - R 0:00.016
01:13:15        	switch                                     PASSED     C 0:00.443 - R 0:00.001
01:13:15        	shortCircuit                               PASSED     C 0:04.750 - R 0:00.016
01:13:15        	strstream                                  PASSED     C 0:04.997 - R 0:00.016
01:13:15        	tuple/tupleCast                            PASSED     C 0:00.503 - R 0:00.016
01:13:15        	searchsort                                 PASSED     C 0:07.441 - R 0:00.016
01:13:15        	tuple/tupleFunction                        PASSED     C 0:00.630 - R 0:00.016
01:13:15        	tuple/tupleMember                          PASSED     C 0:00.605 - R 0:00.016
01:13:15        	tuple/tuplePolymorphism                    PASSED     C 0:00.749 - R 0:00.016
01:13:15        	sum                                        PASSED     C 0:06.691 - R 0:00.016
01:13:15        	typedefRedef                               PASSED     C 0:00.481 - R 0:00.001
01:13:15        	typedefRedef-ERR1                          PASSED     C 0:00.066 - R n/a
01:13:15        	unified_locking/fast                       FAILED with code 1    C 0:00.096 - R n/a
01:13:15 		expected :
01:13:15 		1	Starting
01:13:15 		2	Done!
01:13:15 		3	Match!
01:13:15 		got :
01:13:15 		1	unified_locking/fast.cfa:4:10: fatal error: mutex_test.hfa: No such file or directory
01:13:15 		2	compilation terminated.
01:13:15 
01:13:15        	unified_locking/lin_backoff                FAILED with code 1    C 0:00.082 - R n/a
01:13:15 		expected :
01:13:15 		1	Starting
01:13:15 		2	Done!
01:13:15 		3	Match!
01:13:15 		got :
01:13:15 		1	unified_locking/lin_backoff.cfa:4:10: fatal error: mutex_test.hfa: No such file or directory
01:13:15 		2	compilation terminated.
01:13:15 
01:13:15        	tuple/tupleVariadic                        PASSED     C 0:01.569 - R 0:00.016
01:13:15        	typeof                                     PASSED     C 0:00.520 - R 0:00.016
01:13:15        	swap                                       PASSED     C 0:07.257 - R 0:00.016
01:13:15        	tuple/tupleAssign                          PASSED     C 0:05.835 - R 0:00.016
01:13:15        	time                                       PASSED     C 0:06.231 - R 0:00.016
01:13:15        	variableDeclarator                         PASSED     C 0:00.451 - R 0:00.001
01:13:15        	rational                                   PASSED     C 0:15.025 - R 0:00.016
01:13:15        	userLiterals                               PASSED     C 0:05.075 - R 0:00.016
01:13:15        	vector_math/vec2_double                    PASSED     C 0:06.425 - R 0:00.016
01:13:15        	vector                                     PASSED     C 0:07.034 - R 0:00.016
01:13:15        	unified_locking/timeout_lock               PASSED     C 0:07.610 - R 0:01.116
01:13:15        	vector_math/vec2_uint                      PASSED     C 0:06.269 - R 0:00.016
01:13:15        	unified_locking/mcs                        PASSED     C 0:09.101 - R 0:06.177
01:13:15        	vector_math/vec2_float                     PASSED     C 0:11.547 - R 0:00.016
01:13:15        	voidPtr                                    PASSED     C 0:00.513 - R 0:00.016
01:13:15        	warnings/self-assignment                   PASSED     C 0:00.453 - R 0:00.001
01:13:15        	KRfunctions                                PASSED     C 0:00.399 - R 0:00.001
01:13:15        	vector_math/vec2_int                       PASSED     C 0:11.525 - R 0:00.016
01:13:15        	vector_math/vec3_int                       PASSED     C 0:11.039 - R 0:00.016
01:13:15        	vector_math/vec3_float                     PASSED     C 0:11.641 - R 0:00.016
01:13:15        	attributes                                 PASSED     C 0:00.540 - R 0:00.001
01:13:15        	abs                                        PASSED     C 0:06.448 - R 0:00.016
01:13:15        	vector_math/vec4_int                       PASSED     C 0:10.575 - R 0:00.016
01:13:15        	ato                                        PASSED     C 0:05.901 - R 0:00.016
01:13:15        	vector_math/vec4_float                     PASSED     C 0:11.763 - R 0:00.016
01:13:15        	array-container/array-md-sbscr-cases       PASSED     C 0:08.644 - R 0:00.016
01:13:15        	errors/completeType                        PASSED     C 0:00.236 - R n/a
01:13:15        	declarationSpecifier                       PASSED     C 0:00.458 - R 0:00.001
01:13:15        	functions                                  PASSED     C 0:00.393 - R 0:00.001
01:13:15        	extension                                  PASSED     C 0:00.442 - R 0:00.001
01:13:15        	gccExtensions                              PASSED     C 0:00.403 - R 0:00.001
01:13:15        	unified_locking/locks                      PASSED     C 0:08.438 - R 0:20.303
01:13:15        	bitmanip1                                  PASSED     C 0:10.240 - R 0:00.016
01:13:15        	io/manipulatorsInput                       PASSED     C 0:06.601 - R 0:00.016
01:13:15        	gmp                                        PASSED     C 0:06.970 - R 0:00.016
01:13:15        	bitmanip2                                  PASSED     C 0:11.220 - R 0:00.016
01:13:15        	meta/archVast                              PASSED     C 0:00.238 - R n/a
01:13:15        	io/manipulatorsOutput2                     PASSED     C 0:08.544 - R 0:00.016
01:13:15        	io/manipulatorsOutput1                     PASSED     C 0:11.665 - R 0:00.016
01:13:15        	random                                     PASSED     C 0:05.701 - R 0:00.016
01:13:15        	bitmanip3                                  PASSED     C 0:16.488 - R 0:00.016
01:13:15        	vector_math/vec2_ldouble                   PASSED     C 0:06.462 - R 0:00.016
01:13:15        	io/manipulatorsOutput3                     PASSED     C 0:13.056 - R 0:00.021
01:13:15        	math                                       PASSED     C 0:12.812 - R 0:00.016
01:13:15        	mathX                                      PASSED     C 0:19.230 - R 0:00.033
01:13:15 Tests took  2:55.462
01:13:15 make[2]: *** [Makefile:879: all-tests] Error 1
01:13:15 make[2]: Leaving directory '/var/lib/jenkins/workspace/Cforall_Distribute_Ref@tmp/cfa-cc-1.0.0.1836/_build/sub/tests'
01:13:15 make[1]: *** [Makefile:951: check] Error 2
01:13:15 make[1]: Leaving directory '/var/lib/jenkins/workspace/Cforall_Distribute_Ref@tmp/cfa-cc-1.0.0.1836/_build/sub'
01:13:15 make: *** [Makefile:734: distcheck] Error 1
01:13:15 [Pipeline] }
01:13:15 [Pipeline] // dir
01:13:15 [Pipeline] }
01:13:15 [Pipeline] // stage
01:13:15 [Pipeline] }
01:13:15 [Pipeline] // wrap
01:13:15 [Pipeline] }
01:13:15 [Pipeline] // node
01:13:15 [Pipeline] End of Pipeline
01:13:15 ERROR: script returned exit code 2
01:13:15 Finished: FAILURE
[Pipeline] error
[Pipeline] }
[Pipeline] // stage
[Pipeline] }
[Pipeline] // wrap
[Pipeline] echo
error caught
[Pipeline] node
Running on Brokk 4 in /var/lib/jenkins/workspace/Cforall_Full_Build
[Pipeline] {
[Pipeline] echo
notifying users
[Pipeline] emailext
Sending email to: cforall@lists.uwaterloo.ca
[Pipeline] }
[Pipeline] // node
[Pipeline] }
[Pipeline] // node
[Pipeline] End of Pipeline
ERROR: FAILURE
Finished: FAILURE