Console Output

Skipping 1,909 KB.. Full Log
01:44:29        	minmax                                 PASSED     C 1:34.617 - R 0:00.035
01:44:29        	raii/dtor-early-exit-ERR1              PASSED     C 0:04.805 - R n/a
01:44:29        	raii/dtor-early-exit-ERR2              PASSED     C 0:04.802 - R n/a
01:44:29        	raii/ctor-autogen                      PASSED     C 0:32.600 - R 0:00.035
01:44:29        	raii/init_once                         PASSED     C 0:10.112 - R 0:00.018
01:44:29        	polymorphism                           PASSED     C 1:07.546 - R 0:00.035
01:44:29        	raii/memberCtors-ERR1                  PASSED     C 0:00.435 - R n/a
01:44:29        	raii/memberCtors                       PASSED     C 0:03.672 - R 0:00.018
01:44:29        	quotedKeyword                          PASSED     C 1:08.396 - R 0:00.017
01:44:29        	raii/boxed-types                       PASSED     C 1:08.310 - R 0:00.017
01:44:29        	raii/globals                           PASSED     C 0:42.514 - R 0:00.035
01:44:29        	result                                 PASSED     C 0:14.782 - R 0:00.034
01:44:29        	simpleGenericTriple                    PASSED     C 0:18.063 - R 0:00.018
01:44:29        	raii/dtor-early-exit                   PASSED     C 1:25.206 - R 0:00.035
01:44:29        	smart-pointers                         PASSED     C 0:16.793 - R 0:00.035
01:44:29        	references                             PASSED     C 1:55.967 - R 0:00.018
01:44:29        	shortCircuit                           PASSED     C 1:46.554 - R 0:00.018
01:44:29        	switch                                 PASSED     C 0:04.954 - R 0:00.004
01:44:29        	strstream                              PASSED     C 1:29.319 - R 0:00.018
01:44:29        	searchsort                             PASSED     C 2:13.004 - R 0:00.018
01:44:29        	tuple/tupleCast                        PASSED     C 0:04.824 - R 0:00.035
01:44:29        	tuple/tupleFunction                    PASSED     C 0:05.536 - R 0:00.017
01:44:29        	sum                                    PASSED     C 1:34.893 - R 0:00.019
01:44:29        	time                                   PASSED     C 0:27.931 - R 0:00.018
01:44:29        	rational                               PASSED     C 2:37.343 - R 0:00.034
01:44:29        	tuple/tupleMember                      PASSED     C 0:14.515 - R 0:00.018
01:44:29        	typedefRedef                           PASSED     C 0:03.167 - R 0:00.004
01:44:29        	typedefRedef-ERR1                      PASSED     C 0:00.073 - R n/a
01:44:29        	tuple/tuplePolymorphism                PASSED     C 0:14.328 - R 0:00.018
01:44:29        	swap                                   PASSED     C 0:44.208 - R 0:00.018
01:44:29        	tuple/tupleVariadic                    PASSED     C 0:22.648 - R 0:00.018
01:44:29        	typeof                                 PASSED     C 0:14.145 - R 0:00.035
01:44:29        	tuple/tupleAssign                      PASSED     C 0:41.763 - R 0:00.018
01:44:29        	variableDeclarator                     PASSED     C 0:24.821 - R 0:00.001
01:44:29        	userLiterals                           PASSED     C 0:43.764 - R 0:00.018
01:44:29        	unified_locking/fast                   PASSED     C 1:20.334 - R 0:00.067
01:44:29        	unified_locking/timeout_lock           PASSED     C 1:06.435 - R 0:01.122
01:44:29        	vector                                 PASSED     C 0:43.445 - R 0:00.016
01:44:29        	unified_locking/locks                  PASSED     C 1:21.014 - R 0:14.766
01:44:29        	unified_locking/mcs                    PASSED     C 1:34.879 - R 0:12.075
01:44:29        	vector_math/vec2_double                PASSED     C 1:12.712 - R 0:00.035
01:44:29        	vector_math/vec2_uint                  PASSED     C 1:09.799 - R 0:00.034
01:44:29        	vector_math/vec2_int                   PASSED     C 1:38.630 - R 0:00.035
01:44:29        	vector_math/vec2_float                 PASSED     C 1:43.202 - R 0:00.035
01:44:29        	voidPtr                                PASSED     C 0:17.812 - R 0:00.019
01:44:29        	warnings/self-assignment               PASSED     C 0:14.574 - R 0:00.002
01:44:29        	KRfunctions                            PASSED     C 0:00.575 - R 0:00.026
01:44:29        	vector_math/vec3_int                   PASSED     C 1:32.355 - R 0:00.035
01:44:29        	vector_math/vec3_float                 PASSED     C 1:59.798 - R 0:00.034
01:44:29        	attributes                             PASSED     C 0:01.117 - R 0:00.002
01:44:29        	array-container/array-md-sbscr-cases   PASSED     C 0:48.162 - R 0:00.018
01:44:29        	vector_math/vec4_float                 PASSED     C 2:11.704 - R 0:00.035
01:44:29        	abs                                    PASSED     C 1:27.520 - R 0:00.017
01:44:29        	ato                                    PASSED     C 1:25.262 - R 0:00.019
01:44:29        	errors/completeType                    PASSED     C 0:00.342 - R n/a
01:44:29        	extension                              PASSED     C 0:00.608 - R 0:00.010
01:44:29        	functions                              PASSED     C 0:00.565 - R 0:00.016
01:44:29        	gccExtensions                          PASSED     C 0:00.581 - R 0:00.014
01:44:29        	declarationSpecifier                   PASSED     C 0:05.289 - R 0:00.248
01:44:29        	vector_math/vec4_int                   PASSED     C 2:23.794 - R 0:00.035
01:44:29        	bitmanip1                              PASSED     C 1:19.846 - R 0:02.530
01:44:29        	bitmanip3                              PASSED     C 1:11.976 - R 0:00.620
01:44:29        	bitmanip2                              PASSED     C 1:53.395 - R 0:06.047
01:44:29        	meta/archVast                          PASSED     C 0:00.350 - R n/a
01:44:29        	io/manipulatorsInput                   PASSED     C 1:21.959 - R 0:00.018
01:44:29        	io/manipulatorsOutput2                 PASSED     C 1:31.968 - R 0:00.018
01:44:29        	mathX                                  PASSED     C 1:37.955 - R 0:02.730
01:44:29        	io/manipulatorsOutput1                 PASSED     C 1:56.886 - R 0:00.018
01:44:29        	math                                   PASSED     C 1:17.968 - R 0:00.018
01:44:29        	random                                 PASSED     C 0:53.156 - R 0:00.018
01:44:29        	vector_math/vec2_ldouble               PASSED     C 2:22.441 - R 0:00.035
01:44:29 Tests took 33:38.076
01:44:29 [Pipeline] sh
01:44:29 + make --no-print-directory -C tests timeouts=--timeout=600 --global-timeout=14400 all-tests debug=no archiveerrors=/var/lib/jenkins/workspace/Cforall_master@tmp/tests/crashes/full-nodebug
01:44:29 Running 212 tests on 6 cores (Default AST (new):x86 - no debug)
01:44:29        	array-container/language-dim-mismatch  PASSED     C 0:00.101 - R n/a
01:44:29        	alloc-ERROR                            PASSED     C 0:05.657 - R n/a
01:44:29        	array                                  PASSED     C 0:12.418 - R 0:00.002
01:44:29        	builtins/sync                          PASSED     C 0:07.091 - R 0:00.004
01:44:29        	castError                              PASSED     C 0:00.378 - R n/a
01:44:29        	array-container/array-basic            PASSED     C 0:14.843 - R 0:00.004
01:44:29        	cast                                   PASSED     C 0:02.605 - R 0:00.002
01:44:29        	avl_test                               PASSED     C 0:30.770 - R 0:00.006
01:44:29        	alloc                                  PASSED     C 1:19.151 - R 0:00.006
01:44:29        	collections/multi_list                 PASSED     C 1:16.023 - R 0:00.011
01:44:29        	collections/queue                      PASSED     C 1:44.208 - R 0:00.010
01:44:29        	collections/sequence                   PASSED     C 1:42.632 - R 0:00.010
01:44:29        	collections/atomic_mpsc                PASSED     C 2:13.903 - R 0:00.719
01:44:29        	concurrent/clib_tls                    PASSED     C 0:17.358 - R 0:00.010
01:44:29        	concurrent/clib                        PASSED     C 0:31.831 - R 0:00.018
01:44:29        	complex                                PASSED     C 1:02.698 - R 0:00.003
01:44:29        	alloc2                                 PASSED     C 2:48.102 - R 0:00.011
01:44:29        	collections/stack                      PASSED     C 1:34.816 - R 0:00.004
01:44:29        	concurrent/cluster                     PASSED     C 1:06.024 - R 0:00.004
01:44:29        	concurrent/coroutineYield              PASSED     C 1:20.116 - R 0:09.967
01:44:29        	concurrent/examples/boundedBufferEXT   PASSED     C 1:31.957 - R 0:01.273
01:44:29        	concurrent/examples/boundedBufferINT   PASSED     C 1:34.184 - R 0:01.323
01:44:29        	concurrent/examples/gortn              PASSED     C 1:47.589 - R 0:00.006
01:44:29        	concurrent/examples/datingService      PASSED     C 1:54.327 - R 0:00.006
01:44:29        	concurrent/futures/basic               PASSED     C 0:48.189 - R 0:00.017
01:44:29        	concurrent/futures/abandon             PASSED     C 1:03.860 - R 0:00.018
01:44:29        	concurrent/keywordErrors               PASSED     C 0:00.290 - R n/a
01:44:29        	concurrent/examples/matrixSum          PASSED     C 1:37.237 - R 0:00.010
01:44:29        	concurrent/examples/quickSort          PASSED     C 1:26.181 - R 0:00.011
01:44:29        	concurrent/futures/multi               PASSED     C 1:18.486 - R 0:00.010
01:44:29        	concurrent/futures/typed               PASSED     C 1:21.107 - R 0:00.019
01:44:29        	concurrent/join                        PASSED     C 1:34.036 - R 0:00.005
01:44:29        	concurrent/multi-monitor               PASSED     C 1:39.987 - R 0:04.437
01:44:29        	concurrent/park/contention             PASSED     C 1:35.465 - R 0:00.034
01:44:29        	concurrent/park/start_parked           PASSED     C 0:59.359 - R 0:00.010
01:44:29        	concurrent/monitor                     PASSED     C 1:54.607 - R 0:02.428
01:44:29        	concurrent/park/force_preempt          PASSED     C 1:35.419 - R 0:00.268
01:44:29        	concurrent/preempt                     PASSED     C 1:13.564 - R 0:16.240
01:44:29        	concurrent/semaphore                   PASSED     C 1:22.033 - R 0:00.005
01:44:29        	concurrent/signal/wait                 PASSED     C 1:12.135 - R 0:00.066
01:44:29        	concurrent/signal/disjoint             PASSED     C 1:14.805 - R 0:00.418
01:44:29        	concurrent/signal/block                PASSED     C 1:52.713 - R 0:00.218
01:44:29        	concurrent/sleep                       PASSED     C 1:54.456 - R 0:01.123
01:44:29        	concurrent/waitfor/barge               PASSED     C 2:01.333 - R 0:00.067
01:44:29        	concurrent/thread                      PASSED     C 2:12.146 - R 0:00.011
01:44:29        	concurrent/spinaphore                  PASSED     C 2:29.371 - R 0:00.067
01:44:29        	concurrent/suspend_then                PASSED     C 2:24.070 - R 0:00.018
01:44:29        	concurrent/waitfor/dtor                PASSED     C 1:46.207 - R 0:00.167
01:44:29        	const-init                             PASSED     C 0:05.047 - R 0:00.005
01:44:29        	concurrent/waitfor/else                PASSED     C 1:16.410 - R 0:00.010
01:44:29        	copyfile                               PASSED     C 0:48.476 - R 0:00.005
01:44:29        	coroutine/fibonacci                    PASSED     C 0:58.249 - R 0:00.006
01:44:29        	coroutine/devicedriver                 PASSED     C 1:00.441 - R 0:00.006
01:44:29        	concurrent/waitfor/recurse             PASSED     C 1:27.184 - R 0:13.585
01:44:29        	concurrent/waitfor/when                PASSED     C 1:34.888 - R 0:00.034
01:44:29        	concurrent/waitfor/statment            PASSED     C 1:43.776 - R 0:00.019
01:44:29        	counter                                PASSED     C 0:01.141 - R 0:00.010
01:44:29        	coroutine/fmtLines                     PASSED     C 0:47.436 - R 0:00.011
01:44:29        	designations                           PASSED     C 0:18.393 - R 0:00.005
01:44:29        	coroutine/pingpong                     PASSED     C 1:21.917 - R 0:00.006
01:44:29        	enum                                   PASSED     C 0:15.967 - R 0:00.003
01:44:29        	errors/declaration                     PASSED     C 0:00.092 - R n/a
01:44:29        	errors/scope                           PASSED     C 0:00.150 - R n/a
01:44:29        	errors/signature                       PASSED     C 0:00.104 - R n/a
01:44:29        	coroutine/raii                         PASSED     C 1:31.482 - R 0:00.011
01:44:29        	coroutine/runningTotal                 PASSED     C 1:27.382 - R 0:00.006
01:44:29        	coroutine/prodcons                     PASSED     C 1:46.467 - R 0:00.006
01:44:29        	exceptions/conditional                 PASSED     C 0:08.002 - R 0:00.006
01:44:29        	exceptions/data-except                 PASSED     C 0:19.891 - R 0:00.006
01:44:29        	exceptions/defaults                    PASSED     C 0:11.904 - R 0:00.005
01:44:29        	exceptions/cancel/coroutine            PASSED     C 0:48.497 - R 0:00.005
01:44:29        	exceptions/conditional-threads         PASSED     C 0:39.751 - R 0:00.010
01:44:29        	exceptions/finally-error               PASSED     C 0:00.209 - R n/a
01:44:29        	div                                    PASSED     C 1:40.590 - R 0:00.011
01:44:29        	device/cpu                             PASSED     C 1:56.473 - R 0:00.006
01:44:29        	exceptions/finally                     PASSED     C 0:13.391 - R 0:00.010
01:44:29        	exceptions/interact                    PASSED     C 0:12.974 - R 0:00.010
01:44:29        	exceptions/polymorphic                 PASSED     C 0:13.671 - R 0:00.006
01:44:29        	exceptions/resume                      PASSED     C 0:07.447 - R 0:00.006
01:44:29        	exceptions/terminate                   PASSED     C 0:06.676 - R 0:00.007
01:44:29        	exceptions/finally-threads             PASSED     C 0:29.578 - R 0:00.011
01:44:29        	exceptions/type-check                  PASSED     C 0:00.199 - R n/a
01:44:29        	exceptions/trash                       PASSED     C 0:18.967 - R 0:00.006
01:44:29        	exceptions/defaults-threads            PASSED     C 0:46.107 - R 0:00.066
01:44:29        	exceptions/virtual-cast                PASSED     C 0:15.765 - R 0:00.011
01:44:29        	exceptions/cancel/thread               PASSED     C 1:27.587 - R 0:00.009
01:44:29        	exceptions/resume-threads              PASSED     C 0:32.524 - R 0:00.011
01:44:29        	exceptions/virtual-poly                PASSED     C 0:05.823 - R 0:00.006
01:44:29        	expression                             PASSED     C 0:10.190 - R 0:00.002
01:44:29        	forall                                 PASSED     C 0:10.190 - R 0:00.003
01:44:29        	exceptions/terminate-threads           PASSED     C 0:36.505 - R 0:00.010
01:44:29        	fstream_test                           PASSED     C 0:39.402 - R 0:00.117
01:44:29        	genericUnion                           PASSED     C 0:04.918 - R 0:00.005
01:44:29        	fallthrough                            PASSED     C 0:45.027 - R 0:00.217
01:44:29        	global-monomorph                       PASSED     C 0:10.428 - R 0:00.002
01:44:29        	generator/fibonacci                    PASSED     C 0:45.809 - R 0:00.006
01:44:29        	generator/suspend_then                 PASSED     C 0:44.839 - R 0:00.006
01:44:29        	generator/fmtLines                     PASSED     C 0:45.563 - R 0:00.009
01:44:29        	function-operator                      PASSED     C 0:59.411 - R 0:00.006
01:44:29        	identFuncDeclarator                    PASSED     C 0:11.159 - R 0:00.001
01:44:29        	identParamDeclarator                   PASSED     C 0:11.354 - R 0:00.004
01:44:29        	hello                                  PASSED     C 1:04.251 - R 0:00.006
01:44:29        	ifwhileCtl                             PASSED     C 0:59.971 - R 0:00.006
01:44:29        	identity                               PASSED     C 1:04.071 - R 0:00.011
01:44:29        	heap                                   PASSED     C 1:15.129 - R 0:10.800
01:44:29        	init1                                  PASSED     C 0:04.018 - R 0:00.001
01:44:29        	init1-ERROR                            PASSED     C 0:00.341 - R n/a
01:44:29        	include/stdincludes                    PASSED     C 1:13.335 - R 0:00.002
01:44:29        	include/vector-sequence                PASSED     C 0:22.081 - R 0:00.004
01:44:29        	include/vector-containers              PASSED     C 0:22.796 - R 0:00.002
01:44:29        	include/vector-fstream                 PASSED     C 0:53.621 - R 0:00.010
01:44:29        	labelledExit                           PASSED     C 0:13.629 - R 0:00.003
01:44:29        	limits                                 PASSED     C 0:05.255 - R 0:00.003
01:44:29        	linking/exception-nothreads            PASSED     C 0:05.234 - R 0:00.011
01:44:29        	io/io                                  PASSED     C 1:08.992 - R 0:00.011
01:44:29        	io/manipulatorsOutput4                 PASSED     C 1:30.260 - R 0:00.065
01:44:29        	linking/exception-withthreads          PASSED     C 0:35.237 - R 0:00.009
01:44:29        	include/includes                       PASSED     C 2:46.118 - R 0:00.002
01:44:29        	io/many_read                           PASSED     C 1:31.452 - R 0:00.010
01:44:29        	io/io-acquire                          PASSED     C 1:33.444 - R 0:00.035
01:44:29        	linking/nostdlib                       PASSED     C 0:13.103 - R 0:00.006
01:44:29        	linkonce                               PASSED     C 0:11.695 - R 0:00.003
01:44:29        	linking/io-acquire                     PASSED     C 1:08.680 - R 0:00.004
01:44:29        	linking/weakso_nothd                   PASSED     C 1:25.726 - R 0:00.006
01:44:29        	linking/nothreads                      PASSED     C 1:26.257 - R 0:00.006
01:44:29        	literals                               PASSED     C 1:16.722 - R 0:00.011
01:44:29        	maybe                                  PASSED     C 0:15.195 - R 0:00.011
01:44:29        	nested-types                           PASSED     C 0:01.635 - R 0:00.003
01:44:29        	nested-types-ERR1                      PASSED     C 0:00.091 - R n/a
01:44:29        	nested-types-ERR2                      PASSED     C 0:00.115 - R n/a
01:44:29        	numericConstants                       PASSED     C 0:07.554 - R 0:00.004
01:44:29        	list/dlist-insert-remove               PASSED     C 1:40.434 - R 0:00.008
01:44:29        	operators                              PASSED     C 0:02.176 - R 0:00.011
01:44:29        	loopctrl                               PASSED     C 1:15.204 - R 0:00.010
01:44:29        	poly-d-cycle                           PASSED     C 0:10.020 - R 0:00.005
01:44:29        	poly-selection                         PASSED     C 0:07.549 - R 0:00.004
01:44:29        	poly-o-cycle                           PASSED     C 0:09.990 - R 0:00.005
01:44:29        	linking/withthreads                    PASSED     C 2:02.885 - R 0:00.006
01:44:29        	quasiKeyword                           PASSED     C 0:13.792 - R 0:00.001
01:44:29        	malloc                                 PASSED     C 0:52.572 - R 0:00.005
01:44:29        	raii/ctor-autogen-ERR1                 PASSED     C 0:00.394 - R n/a
01:44:29        	minmax                                 PASSED     C 0:50.310 - R 0:00.006
01:44:29        	raii/dtor-early-exit-ERR1              PASSED     C 0:06.075 - R n/a
01:44:29        	raii/dtor-early-exit-ERR2              PASSED     C 0:06.056 - R n/a
01:44:29        	raii/ctor-autogen                      PASSED     C 0:26.545 - R 0:00.004
01:44:29        	raii/boxed-types                       PASSED     C 0:40.728 - R 0:00.010
01:44:29        	polymorphism                           PASSED     C 0:43.587 - R 0:00.011
01:44:29        	raii/memberCtors-ERR1                  PASSED     C 0:00.431 - R n/a
01:44:29        	raii/init_once                         PASSED     C 0:14.176 - R 0:00.006
01:44:29        	quotedKeyword                          PASSED     C 0:55.007 - R 0:00.005
01:44:29        	raii/memberCtors                       PASSED     C 0:13.882 - R 0:00.004
01:44:29        	raii/globals                           PASSED     C 0:26.971 - R 0:00.117
01:44:29        	raii/dtor-early-exit                   PASSED     C 0:51.410 - R 0:00.006
01:44:29        	result                                 PASSED     C 0:17.284 - R 0:00.011
01:44:29        	smart-pointers                         PASSED     C 0:03.180 - R 0:00.011
01:44:29        	simpleGenericTriple                    PASSED     C 0:08.959 - R 0:00.011
01:44:29        	shortCircuit                           PASSED     C 0:48.627 - R 0:00.006
01:44:29        	references                             PASSED     C 0:51.378 - R 0:00.011
01:44:29        	switch                                 PASSED     C 0:05.049 - R 0:00.004
01:44:29        	searchsort                             PASSED     C 1:19.668 - R 0:00.011
01:44:29        	strstream                              PASSED     C 1:07.872 - R 0:00.011
01:44:29        	sum                                    PASSED     C 1:09.762 - R 0:00.005
01:44:29        	tuple/tupleCast                        PASSED     C 0:04.433 - R 0:00.006
01:44:29        	tuple/tupleFunction                    PASSED     C 0:02.325 - R 0:00.004
01:44:29        	tuple/tupleMember                      PASSED     C 0:11.453 - R 0:00.010
01:44:29        	tuple/tuplePolymorphism                PASSED     C 0:21.336 - R 0:00.006
01:44:29        	time                                   PASSED     C 1:09.306 - R 0:00.003
01:44:29        	typedefRedef                           PASSED     C 0:10.809 - R 0:00.002
01:44:29        	typedefRedef-ERR1                      PASSED     C 0:00.080 - R n/a
01:44:29        	rational                               PASSED     C 2:18.526 - R 0:00.005
01:44:29        	swap                                   PASSED     C 1:20.050 - R 0:00.005
01:44:29        	typeof                                 PASSED     C 0:17.741 - R 0:00.019
01:44:29        	tuple/tupleVariadic                    PASSED     C 0:39.915 - R 0:00.005
01:44:29        	tuple/tupleAssign                      PASSED     C 1:16.041 - R 0:00.010
01:44:29        	variableDeclarator                     PASSED     C 0:19.972 - R 0:00.002
01:44:29        	userLiterals                           PASSED     C 1:06.882 - R 0:00.010
01:44:29        	vector                                 PASSED     C 1:00.357 - R 0:00.011
01:44:29        	unified_locking/locks                  PASSED     C 2:01.878 - R 0:03.432
01:44:29        	unified_locking/timeout_lock           PASSED     C 1:51.134 - R 0:01.072
01:44:29        	unified_locking/fast                   FAILED with code 1    C 2:24.421 - R 0:00.009
01:44:29 		expected :
01:44:29 		3	Match!
01:44:29 		got :
01:44:29 		3	No Match! 843043892 vs 1769028993
01:44:29 
01:44:29        	unified_locking/mcs                    PASSED     C 2:19.716 - R 0:01.272
01:44:29        	vector_math/vec2_double                PASSED     C 1:21.436 - R 0:00.002
01:44:29        	vector_math/vec2_uint                  PASSED     C 0:59.580 - R 0:00.011
01:44:29        	vector_math/vec2_float                 PASSED     C 2:26.080 - R 0:00.011
01:44:29        	voidPtr                                PASSED     C 0:03.210 - R 0:00.006
01:44:29        	warnings/self-assignment               PASSED     C 0:09.450 - R 0:00.004
01:44:29        	KRfunctions                            PASSED     C 0:00.556 - R 0:00.004
01:44:29        	vector_math/vec3_int                   PASSED     C 2:06.299 - R 0:00.010
01:44:29        	vector_math/vec2_int                   PASSED     C 2:26.227 - R 0:00.010
01:44:29        	vector_math/vec3_float                 PASSED     C 2:33.123 - R 0:00.010
01:44:29        	attributes                             PASSED     C 0:04.604 - R 0:00.053
01:44:29        	array-container/array-md-sbscr-cases   PASSED     C 0:42.965 - R 0:00.004
01:44:29        	vector_math/vec4_float                 PASSED     C 2:46.682 - R 0:00.011
01:44:29        	vector_math/vec4_int                   PASSED     C 2:29.479 - R 0:00.011
01:44:29        	declarationSpecifier                   PASSED     C 0:04.022 - R 0:00.001
01:44:29        	errors/completeType                    PASSED     C 0:00.982 - R n/a
01:44:29        	abs                                    PASSED     C 1:14.138 - R 0:00.003
01:44:29        	extension                              PASSED     C 0:00.639 - R 0:00.004
01:44:29        	functions                              PASSED     C 0:00.614 - R 0:00.011
01:44:29        	gccExtensions                          PASSED     C 0:00.602 - R 0:00.002
01:44:29        	ato                                    PASSED     C 1:12.218 - R 0:00.006
01:44:29        	io/manipulatorsInput                   PASSED     C 1:14.957 - R 0:00.005
01:44:29        	bitmanip1                              PASSED     C 1:57.309 - R 0:00.620
01:44:29        	bitmanip3                              PASSED     C 1:34.283 - R 0:01.072
01:44:29        	meta/archVast                          PASSED     C 0:00.353 - R n/a
01:44:29        	bitmanip2                              PASSED     C 2:06.222 - R 0:05.594
01:44:29        	io/manipulatorsOutput2                 PASSED     C 2:29.482 - R 0:00.010
01:44:29        	random                                 PASSED     C 1:48.848 - R 0:00.006
01:44:29        	math                                   PASSED     C 2:03.736 - R 0:00.005
01:44:29        	mathX                                  PASSED     C 2:27.898 - R 0:05.596
01:44:29        	io/manipulatorsOutput1                 PASSED     C 3:52.408 - R 0:00.009
01:44:29        	vector_math/vec2_ldouble               PASSED     C 2:37.565 - R 0:00.011
01:44:29 Tests took 34:20.206
01:44:29 Makefile:861: recipe for target 'all-tests' failed
01:44:29 make: *** [all-tests] Error 1
01:44:29 [Pipeline] }
01:44:29 [Pipeline] // dir
01:44:29 [Pipeline] }
01:44:29 [Pipeline] // stage
01:44:29 [Pipeline] echo
01:44:29 Archiving core dumps
01:44:29 [Pipeline] dir
01:44:29 Running in /var/lib/jenkins/workspace/Cforall_master@tmp
01:44:29 [Pipeline] {
01:44:29 [Pipeline] fileExists
01:44:29 [Pipeline] }
01:44:29 [Pipeline] // dir
01:44:29 [Pipeline] }
01:44:29 [Pipeline] // wrap
01:44:29 [Pipeline] }
01:44:29 [Pipeline] // node
01:44:29 [Pipeline] echo
01:44:29 hudson.AbortException: script returned exit code 2
01:44:29 [Pipeline] node
01:44:29 Running on Brokk 5 in /var/lib/jenkins/workspace/Cforall_master
01:44:29 [Pipeline] {
01:44:29 [Pipeline] echo
01:44:29 Notifying users of result
01:44:29 [Pipeline] echo
01:44:29 Reusing previously constructed message
01:44:29 [Pipeline] echo
01:44:29 Would send email to: cforall@lists.uwaterloo.ca
01:44:29 [Pipeline] echo
01:44:29 With title: [cforall git][BUILD# 15492 - FAILURE] - branch master
01:44:29 [Pipeline] echo
01:44:29 Content: 
01:44:29 <p>This is an automated email from the Jenkins build machine. It was
01:44:29 			generated because of a git hooks/post-receive script following
01:44:29 			a ref change which was pushed to the C∀ repository.</p>
01:44:29 
01:44:29 			<p>- Status --------------------------------------------------------------</p>
01:44:29 
01:44:29 			<p>BUILD# 15492 - FAILURE</p>
01:44:29 			<p>Check console output at https://cforall.uwaterloo.ca/jenkins/job/Cforall/job/master/15492/ to view the results.</p>
01:44:29 			
01:44:29 <p>- Changes -------------------------------------------------------------</p>
01:44:29 
01:44:29 <pre>
01:44:29 The branch master has been updated.
01:44:29       from  15f769c5a6daaba101da73f81e228415eeeb0967 (commit)
01:44:29 </pre>
01:44:29 
01:44:29 <p>- Log -----------------------------------------------------------------</p>
01:44:29 
01:44:29 <pre>
01:44:29 
01:44:29 </pre>
01:44:29 
01:44:29 <p>-----------------------------------------------------------------------</p>
01:44:29 <pre>
01:44:29 Summary of changes:
01:44:29 
01:44:29 </pre>
01:44:29 
01:44:29 [Pipeline] }
01:44:29 [Pipeline] // node
01:44:29 [Pipeline] echo
01:44:29 Build Completed
01:44:29 [Pipeline] End of Pipeline
01:44:29 ERROR: script returned exit code 2
01:44:29 Finished: FAILURE
[Pipeline] error
[Pipeline] }
01:44:29 Failed in branch gcc_6_x86_new
[Pipeline] // parallel
[Pipeline] }
[Pipeline] // stage
[Pipeline] }
[Pipeline] // wrap
[Pipeline] echo
error caught
[Pipeline] node
Running on Brokk 4 in /var/lib/jenkins/workspace/Cforall_Full_Build
[Pipeline] {
[Pipeline] echo
notifying users
[Pipeline] emailext
Sending email to: cforall@lists.uwaterloo.ca
[Pipeline] }
[Pipeline] // node
[Pipeline] }
[Pipeline] // node
[Pipeline] End of Pipeline
ERROR: FAILURE
Finished: FAILURE