Console Output

Started by timer
Running as Jenkins Build User
Checking out git cforall@plg.uwaterloo.ca:software/cfa/cfa-cc into /var/lib/jenkins/workspace/Cforall_Full_Build@script to read Jenkins/FullBuild
The recommended git tool is: NONE
using credential git_key_aug20
 > git rev-parse --resolve-git-dir /var/lib/jenkins/workspace/Cforall_Full_Build@script/.git # timeout=10
Fetching changes from the remote Git repository
 > git config remote.origin.url cforall@plg.uwaterloo.ca:software/cfa/cfa-cc # timeout=10
Fetching upstream changes from cforall@plg.uwaterloo.ca:software/cfa/cfa-cc
 > git --version # timeout=10
 > git --version # 'git version 2.25.1'
using GIT_SSH to set credentials SSH key used for git, ed25519 generated August 2020
 > git fetch --tags --force --progress -- cforall@plg.uwaterloo.ca:software/cfa/cfa-cc +refs/heads/*:refs/remotes/origin/* # timeout=10
 > git rev-parse refs/remotes/origin/master^{commit} # timeout=10
Checking out Revision c7d8696ab8aef324ab4bad76ac71d4ad2bc126dc (refs/remotes/origin/master)
 > git config core.sparsecheckout # timeout=10
 > git checkout -f c7d8696ab8aef324ab4bad76ac71d4ad2bc126dc # timeout=10
Commit message: "add .expect file for array-md-sbscr-cases.txt to be architecture dependent x86"
 > git rev-list --no-walk dcbfcbc5b3b9231d2f0ddc5dc07e9986e2843cd7 # timeout=10
Resume disabled by user, switching to high-performance, low-durability mode.
[Pipeline] Start of Pipeline
[Pipeline] node
Running on Brokk 3 in /var/lib/jenkins/workspace/Cforall_Full_Build
[Pipeline] {
[Pipeline] checkout
The recommended git tool is: NONE
using credential git_key_aug20
Fetching changes from the remote Git repository
 > git rev-parse --resolve-git-dir /var/lib/jenkins/workspace/Cforall_Full_Build/.git # timeout=10
 > git config remote.origin.url cforall@plg.uwaterloo.ca:software/cfa/cfa-cc # timeout=10
Fetching upstream changes from cforall@plg.uwaterloo.ca:software/cfa/cfa-cc
 > git --version # timeout=10
 > git --version # 'git version 2.25.1'
using GIT_SSH to set credentials SSH key used for git, ed25519 generated August 2020
 > git fetch --tags --force --progress -- cforall@plg.uwaterloo.ca:software/cfa/cfa-cc +refs/heads/*:refs/remotes/origin/* # timeout=10
Checking out Revision c7d8696ab8aef324ab4bad76ac71d4ad2bc126dc (refs/remotes/origin/master)
Commit message: "add .expect file for array-md-sbscr-cases.txt to be architecture dependent x86"
[Pipeline] wrap
[Pipeline] {
[Pipeline] stage
[Pipeline] { (Build)
[Pipeline] parallel
[Pipeline] { (Branch: gcc_8_x86_new)
[Pipeline] { (Branch: gcc_7_x86_new)
[Pipeline] { (Branch: gcc_6_x86_new)
[Pipeline] { (Branch: gcc_9_x64_new)
[Pipeline] { (Branch: gcc_8_x64_new)
[Pipeline] { (Branch: gcc_7_x64_new)
[Pipeline] { (Branch: gcc_6_x64_new)
[Pipeline] { (Branch: gcc_5_x64_new)
[Pipeline] { (Branch: clang_x64_new)
[Pipeline] sleep
22:47:05 No need to sleep any longer
[Pipeline] sleep
22:47:05 No need to sleep any longer
[Pipeline] sleep
22:47:05 Sleeping for 3 min 0 sec
[Pipeline] sleep
22:47:05 Sleeping for 4 min 0 sec
[Pipeline] sleep
22:47:05 No need to sleep any longer
[Pipeline] sleep
22:47:05 Sleeping for 1 min 0 sec
[Pipeline] sleep
22:47:05 Sleeping for 4 min 0 sec
[Pipeline] sleep
22:47:05 Sleeping for 2 min 0 sec
[Pipeline] sleep
22:47:05 Sleeping for 1 min 0 sec
[Pipeline] build
22:47:05 Scheduling project: Cforall » master
[Pipeline] build
22:47:05 Scheduling project: Cforall » master
[Pipeline] build
22:47:05 Scheduling project: Cforall » master
 > git rev-parse refs/remotes/origin/master^{commit} # timeout=10
 > git config core.sparsecheckout # timeout=10
 > git checkout -f c7d8696ab8aef324ab4bad76ac71d4ad2bc126dc # timeout=10
22:47:14 Starting building: Cforall » master #15467
22:47:14 Starting building: Cforall » master #15468
22:47:14 Starting building: Cforall » master #15469
[Pipeline] build
22:48:05 Scheduling project: Cforall » master
[Pipeline] build
22:48:05 Scheduling project: Cforall » master
22:48:14 Starting building: Cforall » master #15470
22:48:14 Starting building: Cforall » master #15471
[Pipeline] build
22:49:05 Scheduling project: Cforall » master
22:49:13 Starting building: Cforall » master #15472
[Pipeline] build
22:50:05 Scheduling project: Cforall » master
22:50:14 Starting building: Cforall » master #15473
[Pipeline] build
22:51:05 Scheduling project: Cforall » master
[Pipeline] build
22:51:05 Scheduling project: Cforall » master
22:51:14 Starting building: Cforall » master #15474
22:51:14 Starting building: Cforall » master #15475
[Pipeline] echo
22:59:55 SUCCESS
[Pipeline] }
[Pipeline] echo
23:00:06 SUCCESS
[Pipeline] }
[Pipeline] echo
23:00:17 SUCCESS
[Pipeline] }
[Pipeline] echo
23:00:47 SUCCESS
[Pipeline] }
[Pipeline] echo
23:03:16 SUCCESS
[Pipeline] }
[Pipeline] echo
23:05:24 SUCCESS
[Pipeline] }
[Pipeline] echo
23:16:04 SUCCESS
[Pipeline] }
[Pipeline] echo
23:17:34 SUCCESS
[Pipeline] }
[Pipeline] echo
01:40:19 FAILURE
[Pipeline] sh
01:40:20 + wget -q -O - https://cforall.uwaterloo.ca/jenkins/job/Cforall/job/master/15468/consoleText
01:40:20 Started by upstream project "Cforall_Full_Build" build number 1766
01:40:20 originally caused by:
01:40:20  Started by timer
01:40:20 Running as Jenkins Build User
01:40:20  > git rev-parse --resolve-git-dir /var/lib/jenkins/caches/git-914b6fdde163b7e17ee75d99ca23f18a/.git # timeout=10
01:40:20 Setting origin to cforall@plg.uwaterloo.ca:software/cfa/cfa-cc
01:40:20  > git config remote.origin.url cforall@plg.uwaterloo.ca:software/cfa/cfa-cc # timeout=10
01:40:20 Fetching origin...
01:40:20 Fetching upstream changes from origin
01:40:20  > git --version # timeout=10
01:40:20  > git --version # 'git version 2.25.1'
01:40:20  > git config --get remote.origin.url # timeout=10
01:40:20 using GIT_SSH to set credentials SSH key used for git, ed25519 generated August 2020
01:40:20  > git fetch --tags --force --progress -- origin +refs/heads/*:refs/remotes/origin/* # timeout=10
01:40:20 Seen branch in repository origin/aaron-thesis
01:40:20 Seen branch in repository origin/arm-eh
01:40:20 Seen branch in repository origin/cleanup-dtors
01:40:20 Seen branch in repository origin/ctor
01:40:20 Seen branch in repository origin/deferred_resn
01:40:20 Seen branch in repository origin/demangler
01:40:20 Seen branch in repository origin/gc_noraii
01:40:20 Seen branch in repository origin/jacob/cs343-translation
01:40:20 Seen branch in repository origin/jenkins-sandbox
01:40:20 Seen branch in repository origin/master
01:40:20 Seen branch in repository origin/memory
01:40:20 Seen branch in repository origin/new-ast
01:40:20 Seen branch in repository origin/new-env
01:40:20 Seen branch in repository origin/no_list
01:40:20 Seen branch in repository origin/persistent-indexer
01:40:20 Seen branch in repository origin/resolv-new
01:40:20 Seen branch in repository origin/string
01:40:20 Seen branch in repository origin/with_gc
01:40:20 Seen 18 remote branches
01:40:20 Obtained Jenkinsfile from c7d8696ab8aef324ab4bad76ac71d4ad2bc126dc
01:40:20 Running in Durability level: PERFORMANCE_OPTIMIZED
01:40:20 [Pipeline] Start of Pipeline
01:40:20 [Pipeline] node
01:40:20 Running on Brokk 2 in /var/lib/jenkins/workspace/Cforall_master
01:40:20 [Pipeline] {
01:40:20 [Pipeline] wrap
01:40:20 [Pipeline] {
01:40:20 [Pipeline] properties
01:40:20 WARNING: Unknown parameter(s) found for class type 'hudson.model.ChoiceParameterDefinition': defaultValue
01:40:20 WARNING: Unknown parameter(s) found for class type 'hudson.model.ChoiceParameterDefinition': defaultValue
01:40:20 [Pipeline] checkout
01:40:20 The recommended git tool is: NONE
01:40:20 using credential git_key_aug20
01:40:20 Fetching changes from the remote Git repository
01:40:20 Cleaning workspace
01:40:20 Fetching without tags
01:40:20  > git rev-parse --resolve-git-dir /var/lib/jenkins/workspace/Cforall_master/.git # timeout=10
01:40:20  > git config remote.origin.url cforall@plg.uwaterloo.ca:software/cfa/cfa-cc # timeout=10
01:40:20  > git rev-parse --verify HEAD # timeout=10
01:40:20 Resetting working tree
01:40:20  > git reset --hard # timeout=10
01:40:20  > git clean -fdx # timeout=10
01:40:20 Fetching upstream changes from cforall@plg.uwaterloo.ca:software/cfa/cfa-cc
01:40:20  > git --version # timeout=10
01:40:20  > git --version # 'git version 2.25.1'
01:40:20 using GIT_SSH to set credentials SSH key used for git, ed25519 generated August 2020
01:40:20  > git fetch --no-tags --force --progress -- cforall@plg.uwaterloo.ca:software/cfa/cfa-cc +refs/heads/*:refs/remotes/origin/* # timeout=10
01:40:20 Checking out Revision c7d8696ab8aef324ab4bad76ac71d4ad2bc126dc (master)
01:40:20 Commit message: "add .expect file for array-md-sbscr-cases.txt to be architecture dependent x86"
01:40:20 [Pipeline] load
01:40:20 [Pipeline] { (Jenkins/tools.groovy)
01:40:20 [Pipeline] }
01:40:20 [Pipeline] // load
01:40:20 [Pipeline] echo
01:40:20 Compiler 	         : gcc-7 (g++-7/gcc-7)
01:40:20 AST Version             : New AST
01:40:20 Architecture            : x86
01:40:20 Arc Flags               : --host=i386
01:40:20 Run All Tests           : true
01:40:20 Run Benchmark           : true
01:40:20 Build Documentation     : true
01:40:20 Publish                 : true
01:40:20 Silent                  : true
01:40:20 
01:40:20 [Pipeline] }
01:40:20 [Pipeline] // wrap
01:40:20 [Pipeline] }
01:40:20 [Pipeline] // node
01:40:20 [Pipeline] node
01:40:20  > git config core.sparsecheckout # timeout=10
01:40:20  > git checkout -f c7d8696ab8aef324ab4bad76ac71d4ad2bc126dc # timeout=10
01:40:20  > git rev-list --no-walk c7d8696ab8aef324ab4bad76ac71d4ad2bc126dc # timeout=10
01:40:20 Running on Ruby in /var/lib/jenkins/workspace/Cforall_master
01:40:20 [Pipeline] {
01:40:20 [Pipeline] wrap
01:40:20 [Pipeline] {
01:40:20 [Pipeline] pwd
01:40:20 [Pipeline] pwd
01:40:20 [Pipeline] echo
01:40:20  -------- Cleanup -------- 
01:40:20 [Pipeline] stage
01:40:20 [Pipeline] { (Cleanup)
01:40:20 [Pipeline] dir
01:40:20 Running in /var/lib/jenkins/workspace/Cforall_master@tmp
01:40:20 [Pipeline] {
01:40:20 [Pipeline] deleteDir
01:40:20 [Pipeline] }
01:40:20 [Pipeline] // dir
01:40:20 [Pipeline] }
01:40:20 [Pipeline] // stage
01:40:20 [Pipeline] echo
01:40:20  -------- Checkout -------- 
01:40:20 [Pipeline] stage
01:40:20 [Pipeline] { (Checkout)
01:40:20 [Pipeline] checkout
01:40:20 The recommended git tool is: NONE
01:40:20 using credential git_key_aug20
01:40:20 Fetching changes from the remote Git repository
01:40:20 Cleaning workspace
01:40:20  > git rev-parse --resolve-git-dir /var/lib/jenkins/workspace/Cforall_master/.git # timeout=10
01:40:20  > git config remote.origin.url cforall@plg.uwaterloo.ca:software/cfa/cfa-cc # timeout=10
01:40:20  > git rev-parse --verify HEAD # timeout=10
01:40:20 Resetting working tree
01:40:20  > git reset --hard # timeout=10
01:40:20  > git clean -fdx # timeout=10
01:40:20 Fetching without tags
01:40:20 Fetching upstream changes from cforall@plg.uwaterloo.ca:software/cfa/cfa-cc
01:40:20  > git --version # timeout=10
01:40:20  > git --version # 'git version 2.7.4'
01:40:20 using GIT_SSH to set credentials SSH key used for git, ed25519 generated August 2020
01:40:20  > git fetch --no-tags --progress cforall@plg.uwaterloo.ca:software/cfa/cfa-cc +refs/heads/*:refs/remotes/origin/* # timeout=10
01:40:20 Checking out Revision c7d8696ab8aef324ab4bad76ac71d4ad2bc126dc (master)
01:40:20  > git config core.sparsecheckout # timeout=10
01:40:20  > git checkout -f c7d8696ab8aef324ab4bad76ac71d4ad2bc126dc # timeout=10
01:40:20 Commit message: "add .expect file for array-md-sbscr-cases.txt to be architecture dependent x86"
01:40:20 [Pipeline] echo
01:40:20 Constructing new git message
01:40:20 [Pipeline] sh
01:40:20 + git rev-list c7d8696ab8aef324ab4bad76ac71d4ad2bc126dc..c7d8696ab8aef324ab4bad76ac71d4ad2bc126dc
01:40:20 [Pipeline] sh
01:40:20 + git cat-file -t c7d8696ab8aef324ab4bad76ac71d4ad2bc126dc
01:40:20 [Pipeline] sh
01:40:20 + git rev-list --format=short c7d8696ab8aef324ab4bad76ac71d4ad2bc126dc...c7d8696ab8aef324ab4bad76ac71d4ad2bc126dc
01:40:20 [Pipeline] sh
01:40:20 + git diff --stat --color c7d8696ab8aef324ab4bad76ac71d4ad2bc126dc c7d8696ab8aef324ab4bad76ac71d4ad2bc126dc
01:40:20 [Pipeline] echo
01:40:20 
01:40:20 <p>- Changes -------------------------------------------------------------</p>
01:40:20 
01:40:20 <pre>
01:40:20 The branch master has been updated.
01:40:20       from  c7d8696ab8aef324ab4bad76ac71d4ad2bc126dc (commit)
01:40:20 </pre>
01:40:20 
01:40:20 <p>- Log -----------------------------------------------------------------</p>
01:40:20 
01:40:20 <pre>
01:40:20 
01:40:20 </pre>
01:40:20 
01:40:20 <p>-----------------------------------------------------------------------</p>
01:40:20 <pre>
01:40:20 Summary of changes:
01:40:20 
01:40:20 </pre>
01:40:20 
01:40:20 [Pipeline] }
01:40:20 [Pipeline] // stage
01:40:20 [Pipeline] echo
01:40:20  -------- Build : configure -------- 
01:40:20 [Pipeline] stage
01:40:20 [Pipeline] { (Build : configure)
01:40:20 [Pipeline] dir
01:40:20 Running in /var/lib/jenkins/workspace/Cforall_master
01:40:20 [Pipeline] {
01:40:20 [Pipeline] sh
01:40:20 + ./autogen.sh
01:40:20 Running aclocal in root
01:40:20 Running libtoolize in root
01:40:20 libtoolize: putting auxiliary files in AC_CONFIG_AUX_DIR, 'automake'.
01:40:20 libtoolize: linking file 'automake/ltmain.sh'
01:40:20 libtoolize: putting macros in AC_CONFIG_MACRO_DIRS, 'automake'.
01:40:20 libtoolize: linking file 'automake/libtool.m4'
01:40:20 libtoolize: linking file 'automake/ltoptions.m4'
01:40:20 libtoolize: linking file 'automake/ltsugar.m4'
01:40:20 libtoolize: linking file 'automake/ltversion.m4'
01:40:20 libtoolize: linking file 'automake/lt~obsolete.m4'
01:40:20 Running autoconf in root
01:40:20 Running automake in root
01:40:20 configure.ac:241: installing 'automake/compile'
01:40:20 configure.ac:156: installing 'automake/config.guess'
01:40:20 configure.ac:156: installing 'automake/config.sub'
01:40:20 configure.ac:17: installing 'automake/install-sh'
01:40:20 benchmark/Makefile.am: installing 'automake/depcomp'
01:40:20 parallel-tests: installing 'automake/test-driver'
01:40:20 configure.ac: installing 'automake/ylwrap'
01:40:20 Running aclocal in libcfa
01:40:20 Running libtoolize in libcfa
01:40:20 libtoolize: putting auxiliary files in AC_CONFIG_AUX_DIR, 'automake'.
01:40:20 libtoolize: linking file 'automake/ltmain.sh'
01:40:20 libtoolize: putting macros in AC_CONFIG_MACRO_DIRS, 'automake'.
01:40:20 libtoolize: linking file 'automake/libtool.m4'
01:40:20 libtoolize: linking file 'automake/ltoptions.m4'
01:40:20 libtoolize: linking file 'automake/ltsugar.m4'
01:40:20 libtoolize: linking file 'automake/ltversion.m4'
01:40:20 libtoolize: linking file 'automake/lt~obsolete.m4'
01:40:20 Running autoconf in libcfa
01:40:20 Running automake in libcfa
01:40:20 configure.ac:119: installing 'automake/compile'
01:40:20 configure.ac:119: installing 'automake/config.guess'
01:40:20 configure.ac:119: installing 'automake/config.sub'
01:40:20 configure.ac:12: installing 'automake/install-sh'
01:40:20 src/Makefile.am: installing 'automake/depcomp'
01:40:20 [Pipeline] }
01:40:20 [Pipeline] // dir
01:40:20 [Pipeline] dir
01:40:20 Running in /var/lib/jenkins/workspace/Cforall_master@tmp
01:40:20 [Pipeline] {
01:40:20 [Pipeline] sh
01:40:20 + /var/lib/jenkins/workspace/Cforall_master/configure CXX=g++-7 CC=gcc-7 --host=i386 AR=gcc-ar RANLIB=gcc-ranlib --with-target-hosts=host:debug,host:nodebug --enable-new-ast --quiet --prefix=/var/lib/jenkins/workspace/Cforall_master@tmp
01:40:20 [Pipeline] sh
01:40:20 + make -j 8 --no-print-directory configure-libcfa
01:40:20 libcfa/x86-debug/config.data
01:40:20 Configuring libcfa (/var/lib/jenkins/workspace/Cforall_master/libcfa/configure) with ''CXX=g++-7' 'CC=gcc-7' 'AR=gcc-ar' 'RANLIB=gcc-ranlib' '--enable-new-ast' '--prefix=/var/lib/jenkins/workspace/Cforall_master@tmp' DRIVER_DIR=/var/lib/jenkins/workspace/Cforall_master@tmp/driver/ ARCHITECTURE=x86 CONFIGURATION=debug CFA_VERSION=1:0:0' from /var/lib/jenkins/workspace/Cforall_master@tmp / libcfa/x86-debug/
01:40:20 libcfa/x86-nodebug/config.data
01:40:20 Configuring libcfa (/var/lib/jenkins/workspace/Cforall_master/libcfa/configure) with ''CXX=g++-7' 'CC=gcc-7' 'AR=gcc-ar' 'RANLIB=gcc-ranlib' '--enable-new-ast' '--prefix=/var/lib/jenkins/workspace/Cforall_master@tmp' DRIVER_DIR=/var/lib/jenkins/workspace/Cforall_master@tmp/driver/ ARCHITECTURE=x86 CONFIGURATION=nodebug CFA_VERSION=1:0:0' from /var/lib/jenkins/workspace/Cforall_master@tmp / libcfa/x86-nodebug/
01:40:20 configure: WARNING: unrecognized options: --enable-new-ast
01:40:20 configure: WARNING: unrecognized options: --enable-new-ast
01:40:20 checking whether make supports nested variables... yes
01:40:20 checking for a BSD-compatible install... /usr/bin/install -c
01:40:20 checking whether build environment is sane... yes
01:40:20 checking for a thread-safe mkdir -p... /bin/mkdir -p
01:40:20 checking for gawk... checking whether make supports nested variables... gawk
01:40:20 yes
01:40:20 checking whether make sets $(MAKE)... checking for a BSD-compatible install... yes
01:40:20 /usr/bin/install -c
01:40:20 checking for distributated build... checking whether build environment is sane... no
01:40:20 yes
01:40:20 checking for a thread-safe mkdir -p... checking build system type... /bin/mkdir -p
01:40:20 checking for gawk... gawk
01:40:20 checking whether make sets $(MAKE)... i686-pc-linux-gnu
01:40:20 yes
01:40:20 checking host system type... i686-pc-linux-gnu
01:40:20 checking for distributated build... checking how to print strings... no
01:40:20 printf
01:40:20 checking build system type... checking for style of include used by make... GNU
01:40:20 checking for gcc... gcc-7
01:40:20 i686-pc-linux-gnu
01:40:20 checking host system type... i686-pc-linux-gnu
01:40:20 checking how to print strings... printf
01:40:20 checking for style of include used by make... checking whether the C compiler works... GNU
01:40:20 checking for gcc... gcc-7
01:40:20 yes
01:40:20 checking for C compiler default output file name... a.out
01:40:20 checking for suffix of executables... 
01:40:20 checking whether the C compiler works... checking whether we are cross compiling... yes
01:40:20 checking for C compiler default output file name... a.out
01:40:20 checking for suffix of executables... no
01:40:20 
01:40:20 checking for suffix of object files... checking whether we are cross compiling... o
01:40:20 checking whether we are using the GNU C compiler... yes
01:40:20 checking whether gcc-7 accepts -g... no
01:40:20 checking for suffix of object files... yes
01:40:20 o
01:40:20 checking for gcc-7 option to accept ISO C89... checking whether we are using the GNU C compiler... yes
01:40:20 none needed
01:40:20 checking whether gcc-7 accepts -g... checking whether gcc-7 understands -c and -o together... yes
01:40:20 checking for gcc-7 option to accept ISO C89... yes
01:40:20 checking dependency style of gcc-7... none needed
01:40:20 checking whether gcc-7 understands -c and -o together... yes
01:40:20 checking dependency style of gcc-7... gcc3
01:40:20 checking for a sed that does not truncate output... /bin/sed
01:40:20 checking for grep that handles long lines and -e... /bin/grep
01:40:20 checking for egrep... /bin/grep -E
01:40:20 checking for fgrep... /bin/grep -F
01:40:20 checking for ld used by gcc-7... /usr/bin/ld
01:40:20 checking if the linker (/usr/bin/ld) is GNU ld... yes
01:40:20 checking for BSD- or MS-compatible name lister (nm)... /usr/bin/nm -B
01:40:20 checking the name lister (/usr/bin/nm -B) interface... gcc3
01:40:20 checking for a sed that does not truncate output... /bin/sed
01:40:20 checking for grep that handles long lines and -e... BSD nm
01:40:20 /bin/grep
01:40:20 checking whether ln -s works... checking for egrep... yes
01:40:20 /bin/grep -E
01:40:20 checking the maximum length of command line arguments... checking for fgrep... 1572864
01:40:20 /bin/grep -F
01:40:20 checking how to convert i686-pc-linux-gnu file names to i686-pc-linux-gnu format... checking for ld used by gcc-7... func_convert_file_noop
01:40:20 checking how to convert i686-pc-linux-gnu file names to toolchain format... /usr/bin/ld
01:40:20 func_convert_file_noop
01:40:20 checking if the linker (/usr/bin/ld) is GNU ld... checking for /usr/bin/ld option to reload object files... yes
01:40:20 -r
01:40:20 checking for BSD- or MS-compatible name lister (nm)... checking for objdump... /usr/bin/nm -B
01:40:20 objdump
01:40:20 checking the name lister (/usr/bin/nm -B) interface... checking how to recognize dependent libraries... pass_all
01:40:20 checking for dlltool... no
01:40:20 BSD nm
01:40:20 checking how to associate runtime and link libraries... checking whether ln -s works... printf %s\n
01:40:20 yes
01:40:20 checking for archiver @FILE support... checking the maximum length of command line arguments... 1572864
01:40:20 checking how to convert i686-pc-linux-gnu file names to i686-pc-linux-gnu format... func_convert_file_noop
01:40:20 checking how to convert i686-pc-linux-gnu file names to toolchain format... func_convert_file_noop
01:40:20 checking for /usr/bin/ld option to reload object files... @
01:40:20 -r
01:40:20 checking for strip... checking for objdump... strip
01:40:20 objdump
01:40:20 checking for ranlib... checking how to recognize dependent libraries... gcc-ranlib
01:40:20 pass_all
01:40:20 checking command to parse /usr/bin/nm -B output from gcc-7 object... checking for dlltool... no
01:40:20 checking how to associate runtime and link libraries... printf %s\n
01:40:20 checking for archiver @FILE support... @
01:40:20 checking for strip... strip
01:40:20 checking for ranlib... gcc-ranlib
01:40:20 checking command to parse /usr/bin/nm -B output from gcc-7 object... ok
01:40:20 checking for sysroot... ok
01:40:20 no
01:40:20 checking for sysroot... checking for a working dd... no
01:40:20 checking for a working dd... /bin/dd
01:40:20 checking how to truncate binary pipes... /bin/dd
01:40:20 checking how to truncate binary pipes... /bin/dd bs=4096 count=1
01:40:20 checking for mt... /bin/dd bs=4096 count=1
01:40:20 mt
01:40:20 checking for mt... checking if mt is a manifest tool... mt
01:40:20 checking if mt is a manifest tool... no
01:40:20 no
01:40:20 checking how to run the C preprocessor... checking how to run the C preprocessor... gcc-7 -E
01:40:20 gcc-7 -E
01:40:20 checking for ANSI C header files... checking for ANSI C header files... yes
01:40:20 checking for sys/types.h... yes
01:40:20 checking for sys/types.h... yes
01:40:20 checking for sys/stat.h... yes
01:40:20 checking for sys/stat.h... yes
01:40:20 checking for stdlib.h... yes
01:40:20 checking for stdlib.h... yes
01:40:20 checking for string.h... yes
01:40:20 checking for string.h... yes
01:40:20 checking for memory.h... yes
01:40:20 checking for memory.h... yes
01:40:20 checking for strings.h... yes
01:40:20 checking for strings.h... yes
01:40:20 checking for inttypes.h... yes
01:40:20 checking for inttypes.h... yes
01:40:20 checking for stdint.h... yes
01:40:20 checking for stdint.h... yes
01:40:20 checking for unistd.h... yes
01:40:20 checking for unistd.h... yes
01:40:20 checking for dlfcn.h... yes
01:40:20 checking for dlfcn.h... yes
01:40:20 checking for objdir... .libs
01:40:20 yes
01:40:20 checking for objdir... .libs
01:40:20 checking if gcc-7 supports -fno-rtti -fno-exceptions... no
01:40:20 checking for gcc-7 option to produce PIC... -fPIC -DPIC
01:40:20 checking if gcc-7 PIC flag -fPIC -DPIC works... yes
01:40:20 checking if gcc-7 static flag -static works... checking if gcc-7 supports -fno-rtti -fno-exceptions... no
01:40:20 checking for gcc-7 option to produce PIC... -fPIC -DPIC
01:40:20 checking if gcc-7 PIC flag -fPIC -DPIC works... yes
01:40:20 checking if gcc-7 static flag -static works... yes
01:40:20 yes
01:40:20 checking if gcc-7 supports -c -o file.o... checking if gcc-7 supports -c -o file.o... yes
01:40:20 yes
01:40:20 checking if gcc-7 supports -c -o file.o... checking if gcc-7 supports -c -o file.o... (cached) (cached) yes
01:40:20 yes
01:40:20 checking whether the gcc-7 linker (/usr/bin/ld) supports shared libraries... checking whether the gcc-7 linker (/usr/bin/ld) supports shared libraries... yes
01:40:20 yes
01:40:20 checking whether -lc should be explicitly linked in... checking whether -lc should be explicitly linked in... no
01:40:20 no
01:40:20 checking dynamic linker characteristics... checking dynamic linker characteristics... GNU/Linux ld.so
01:40:20 checking how to hardcode library paths into programs... GNU/Linux ld.so
01:40:20 immediate
01:40:20 checking how to hardcode library paths into programs... checking whether stripping libraries is possible... immediate
01:40:20 yes
01:40:20 checking whether stripping libraries is possible... checking if libtool supports shared libraries... yes
01:40:20 yes
01:40:20 checking if libtool supports shared libraries... checking whether to build shared libraries... yes
01:40:20 yes
01:40:20 checking whether to build shared libraries... checking whether to build static libraries... yes
01:40:20 no
01:40:20 checking whether to build static libraries... no
01:40:20 checking whether we are using the GNU C++ compiler... checking whether we are using the GNU C++ compiler... yes
01:40:20 checking whether g++-7 accepts -g... yes
01:40:20 checking whether g++-7 accepts -g... yes
01:40:20 checking dependency style of g++-7... yes
01:40:20 checking dependency style of g++-7... gcc3
01:40:20 checking how to run the C++ preprocessor... gcc3
01:40:20 checking how to run the C++ preprocessor... g++-7 -E
01:40:20 g++-7 -E
01:40:20 checking for ld used by g++-7... /usr/bin/ld
01:40:20 checking if the linker (/usr/bin/ld) is GNU ld... yes
01:40:20 checking whether the g++-7 linker (/usr/bin/ld) supports shared libraries... yes
01:40:20 checking for g++-7 option to produce PIC... -fPIC -DPIC
01:40:20 checking if g++-7 PIC flag -fPIC -DPIC works... checking for ld used by g++-7... /usr/bin/ld
01:40:20 checking if the linker (/usr/bin/ld) is GNU ld... yes
01:40:20 yes
01:40:20 checking if g++-7 static flag -static works... checking whether the g++-7 linker (/usr/bin/ld) supports shared libraries... yes
01:40:20 checking for g++-7 option to produce PIC... -fPIC -DPIC
01:40:20 checking if g++-7 PIC flag -fPIC -DPIC works... yes
01:40:20 checking if g++-7 static flag -static works... yes
01:40:20 checking if g++-7 supports -c -o file.o... yes
01:40:20 yes
01:40:20 checking if g++-7 supports -c -o file.o... checking if g++-7 supports -c -o file.o... (cached) yes
01:40:20 checking whether the g++-7 linker (/usr/bin/ld) supports shared libraries... yes
01:40:20 yes
01:40:20 checking if g++-7 supports -c -o file.o... checking dynamic linker characteristics... (cached) (cached) yes
01:40:20 GNU/Linux ld.so
01:40:20 checking whether the g++-7 linker (/usr/bin/ld) supports shared libraries... checking how to hardcode library paths into programs... yes
01:40:20 immediate
01:40:20 checking dynamic linker characteristics... (cached) checking for gcc... (cached) GNU/Linux ld.so
01:40:20 gcc-7
01:40:20 checking how to hardcode library paths into programs... immediate
01:40:20 checking for gcc... (cached) gcc-7
01:40:20 checking whether we are using the GNU C compiler... checking whether we are using the GNU C compiler... (cached) (cached) yes
01:40:20 yes
01:40:20 checking whether gcc-7 accepts -g... checking whether gcc-7 accepts -g... (cached) (cached) yes
01:40:20 yes
01:40:20 checking for gcc-7 option to accept ISO C89... checking for gcc-7 option to accept ISO C89... (cached) (cached) none needed
01:40:20 none needed
01:40:20 checking whether gcc-7 understands -c and -o together... checking whether gcc-7 understands -c and -o together... (cached) (cached) yes
01:40:20 yes
01:40:20 checking dependency style of gcc-7... checking dependency style of gcc-7... (cached) (cached) gcc3
01:40:20 gcc3
01:40:20 checking dependency style of gcc-7... checking dependency style of gcc-7... gcc3
01:40:20 gcc3
01:40:20 checking whether make sets $(MAKE)... checking whether make sets $(MAKE)... (cached) (cached) yes
01:40:20 yes
01:40:20 checking linux/rseq.h usability... checking linux/rseq.h usability... no
01:40:20 no
01:40:20 checking linux/rseq.h presence... checking linux/rseq.h presence... no
01:40:20 no
01:40:20 checking for linux/rseq.h... checking for linux/rseq.h... no
01:40:20 no
01:40:20 checking for rseq_available in -lrseq... checking for rseq_available in -lrseq... no
01:40:20 checking linux/io_uring.h usability... no
01:40:20 no
01:40:20 checking linux/io_uring.h usability... checking linux/io_uring.h presence... no
01:40:20 no
01:40:20 checking for linux/io_uring.h... checking linux/io_uring.h presence... no
01:40:20 checking for preadv2... no
01:40:20 checking for linux/io_uring.h... no
01:40:20 checking for preadv2... no
01:40:20 checking for pwritev2... no
01:40:20 no
01:40:20 checking for pwritev2... checking that generated files are newer than configure... no
01:40:20 done
01:40:20 configure: creating ./config.status
01:40:20 checking that generated files are newer than configure... done
01:40:20 configure: creating ./config.status
01:40:20 config.status: creating Makefile
01:40:20 config.status: creating Makefile
01:40:20 config.status: creating src/Makefile
01:40:20 config.status: creating src/Makefile
01:40:20 config.status: creating prelude/Makefile
01:40:20 config.status: creating prelude/Makefile
01:40:20 config.status: creating src/concurrency/io/call.cfa
01:40:20 config.status: creating src/concurrency/io/call.cfa
01:40:20 config.status: creating prelude/defines.hfa
01:40:20 config.status: creating prelude/defines.hfa
01:40:20 config.status: executing depfiles commands
01:40:20 config.status: executing depfiles commands
01:40:20 config.status: executing libtool commands
01:40:20 config.status: executing libtool commands
01:40:20 configure: WARNING: unrecognized options: --enable-new-ast
01:40:20 Cforall library configuraton completed. Type "make -j 8 install".
01:40:20 configure: WARNING: unrecognized options: --enable-new-ast
01:40:20 Cforall library configuraton completed. Type "make -j 8 install".
01:40:20 [Pipeline] }
01:40:20 [Pipeline] // dir
01:40:20 [Pipeline] }
01:40:20 [Pipeline] // stage
01:40:20 [Pipeline] echo
01:40:20  -------- Build : cfa-cpp -------- 
01:40:20 [Pipeline] stage
01:40:20 [Pipeline] { (Build : cfa-cpp)
01:40:20 [Pipeline] dir
01:40:20 Running in /var/lib/jenkins/workspace/Cforall_master@tmp
01:40:20 [Pipeline] {
01:40:20 [Pipeline] sh
01:40:20 + make -j 8 --no-print-directory -C driver
01:40:20   CXX      as.o
01:40:20   CXX      cc1.o
01:40:20   CXX      cfa.o
01:40:20   CXXLD    as
01:40:20   CXXLD    cc1
01:40:20   CXXLD    cfa
01:40:20 [Pipeline] sh
01:40:20 + make -j 8 --no-print-directory -C src
01:40:20   YACC     Parser/parser.cc
01:40:20 updating Parser/parser.output
01:40:20 updating Parser/parser.hh
01:40:20 make  all-am
01:40:20   CXX      CompilationState.o
01:40:20   CXX      main.o
01:40:20   CXX      MakeLibCfa.o
01:40:20   CXX      CodeGen/Generate.o
01:40:20   CXX      CodeGen/FixNames.o
01:40:20   CXX      Concurrency/Waitfor.o
01:40:20   CXX      Common/DebugMalloc.o
01:40:20   CXX      ControlStruct/ExceptTranslate.o
01:40:20   CXX      GenPoly/Box.o
01:40:20   CXX      GenPoly/FindFunction.o
01:40:20   CXX      GenPoly/InstantiateGeneric.o
01:40:20   CXX      GenPoly/ScrubTyVars.o
01:40:20   CXX      GenPoly/Specialize.o
01:40:20   CXX      InitTweak/FixGlobalInit.o
01:40:20   CXX      InitTweak/FixInit.o
01:40:20   CXX      InitTweak/FixInitNew.o
01:40:20   LEX      Parser/lex.cc
01:40:20   CXX      Parser/ParseNode.o
01:40:20   CXX      Parser/parser.o
01:40:20   CXX      Parser/parserutility.o
01:40:20   CXX      Parser/StatementNode.o
01:40:20   CXX      Parser/TypeData.o
01:40:20   CXX      Parser/TypedefTable.o
01:40:20   CXX      ResolvExpr/AlternativePrinter.o
01:40:20   CXX      Virtual/ExpandCasts.o
01:40:20   CXX      SymTab/demangler.o
01:40:20   CXX      AST/AssertAcyclic.o
01:40:20   CXX      AST/Attribute.o
01:40:20   CXX      AST/Convert.o
01:40:20   CXX      AST/Decl.o
01:40:20   CXX      AST/DeclReplacer.o
01:40:20   CXX      AST/Expr.o
01:40:20   CXX      AST/GenericSubstitution.o
01:40:20   CXX      AST/Init.o
01:40:20   CXX      AST/LinkageSpec.o
01:40:20   CXX      AST/Node.o
01:40:20   CXX      AST/Pass.o
01:40:20   CXX      AST/Print.o
01:40:20   CXX      AST/Stmt.o
01:40:20   CXX      AST/SymbolTable.o
01:40:20   CXX      AST/Type.o
01:40:20   CXX      AST/TypeEnvironment.o
01:40:20   CXX      AST/TypeSubstitution.o
01:40:20   CXX      CodeGen/CodeGenerator.o
01:40:20   CXX      CodeGen/FixMain.o
01:40:20   CXX      CodeGen/GenType.o
01:40:20   CXX      CodeGen/LinkOnce.o
01:40:20   CXX      CodeGen/OperatorTable.o
01:40:20   CXX      Concurrency/Keywords.o
01:40:20   CXX      Common/Assert.o
01:40:20   CXX      Common/CodeLocationTools.o
01:40:20   CXX      Common/Eval.o
01:40:20   CXX      Common/Examine.o
01:40:20   CXX      Common/PassVisitor.o
01:40:20   CXX      Common/SemanticError.o
01:40:20   CXX      Common/Stats/Counter.o
01:40:20   CXX      Common/Stats/Heap.o
01:40:20   CXX      Common/Stats/ResolveTime.o
01:40:20   CXX      Common/Stats/Stats.o
01:40:20   CXX      Common/Stats/Time.o
01:40:20   CXX      Common/UniqueName.o
01:40:20   CXX      ControlStruct/ForExprMutator.o
01:40:20   CXX      ControlStruct/LabelFixer.o
01:40:20   CXX      ControlStruct/LabelGenerator.o
01:40:20   CXX      ControlStruct/MLEMutator.o
01:40:20   CXX      ControlStruct/Mutate.o
01:40:20   CXX      GenPoly/GenPoly.o
01:40:20   CXX      GenPoly/Lvalue.o
01:40:20 /var/lib/jenkins/workspace/Cforall_master/src/GenPoly/GenPoly.cc:66:8: warning: ‘bool GenPoly::{anonymous}::hasPolyParams(const std::vector<ast::ptr_base<ast::Expr, (ast::Node::ref_type)0> >&, const TyVarMap&, const ast::TypeSubstitution*)’ defined but not used [-Wunused-function]
01:40:20    bool hasPolyParams( const std::vector<ast::ptr<ast::Expr>> & params, const TyVarMap & tyVars, const ast::TypeSubstitution * env) {
01:40:20         ^~~~~~~~~~~~~
01:40:20   CXX      InitTweak/GenInit.o
01:40:20   CXX      InitTweak/InitTweak.o
01:40:20   CXX      ResolvExpr/AdjustExprType.o
01:40:20   CXX      ResolvExpr/Alternative.o
01:40:20   CXX      ResolvExpr/AlternativeFinder.o
01:40:20   CXX      ResolvExpr/Candidate.o
01:40:20   CXX      ResolvExpr/CandidateFinder.o
01:40:20   CXX      ResolvExpr/CastCost.o
01:40:20 In file included from /var/lib/jenkins/workspace/Cforall_master/src/ResolvExpr/CastCost.cc:22:0:
01:40:20 /var/lib/jenkins/workspace/Cforall_master/src/ResolvExpr/ConversionCost.h:79:2: warning: #warning when the old ConversionCost is removed, get ride of the _new suffix. [-Wcpp]
01:40:20  #warning when the old ConversionCost is removed, get ride of the _new suffix.
01:40:20   ^~~~~~~
01:40:20 /var/lib/jenkins/workspace/Cforall_master/src/ResolvExpr/CastCost.cc:186:3: warning: #warning For overload resolution between the two versions. [-Wcpp]
01:40:20   #warning For overload resolution between the two versions.
01:40:20    ^~~~~~~
01:40:20 /var/lib/jenkins/workspace/Cforall_master/src/ResolvExpr/CastCost.cc:236:4: warning: #warning cast on ptrsCastable artifact of having two functions, remove when port done [-Wcpp]
01:40:20    #warning cast on ptrsCastable artifact of having two functions, remove when port done
01:40:20     ^~~~~~~
01:40:20 /var/lib/jenkins/workspace/Cforall_master/src/ResolvExpr/CastCost.cc:240:4: warning: #warning cast on castCost artifact of having two functions, remove when port done [-Wcpp]
01:40:20    #warning cast on castCost artifact of having two functions, remove when port done
01:40:20     ^~~~~~~
01:40:20   CXX      ResolvExpr/CommonType.o
01:40:20 /var/lib/jenkins/workspace/Cforall_master/src/ResolvExpr/CommonType.cc:682:6: warning: #warning remove casts when `commonTypes` moved to new AST [-Wcpp]
01:40:20      #warning remove casts when `commonTypes` moved to new AST
01:40:20       ^~~~~~~
01:40:20 /var/lib/jenkins/workspace/Cforall_master/src/ResolvExpr/CommonType.cc:697:6: warning: #warning remove casts when `commonTypes` moved to new AST [-Wcpp]
01:40:20      #warning remove casts when `commonTypes` moved to new AST
01:40:20       ^~~~~~~
01:40:20   CXX      ResolvExpr/ConversionCost.o
01:40:20 In file included from /var/lib/jenkins/workspace/Cforall_master/src/ResolvExpr/ConversionCost.cc:16:0:
01:40:20 /var/lib/jenkins/workspace/Cforall_master/src/ResolvExpr/ConversionCost.h:79:2: warning: #warning when the old ConversionCost is removed, get ride of the _new suffix. [-Wcpp]
01:40:20  #warning when the old ConversionCost is removed, get ride of the _new suffix.
01:40:20   ^~~~~~~
01:40:20 /var/lib/jenkins/workspace/Cforall_master/src/ResolvExpr/ConversionCost.cc:484:4: warning: #warning For overload resolution between the two versions. [-Wcpp]
01:40:20   # warning For overload resolution between the two versions.
01:40:20     ^~~~~~~
01:40:20   CXX      ResolvExpr/CurrentObject.o
01:40:20   CXX      ResolvExpr/ExplodedActual.o
01:40:20   CXX      ResolvExpr/ExplodedArg.o
01:40:20   CXX      ResolvExpr/FindOpenVars.o
01:40:20   CXX      ResolvExpr/Occurs.o
01:40:20   CXX      ResolvExpr/PolyCost.o
01:40:20   CXX      ResolvExpr/PtrsAssignable.o
01:40:20   CXX      ResolvExpr/PtrsCastable.o
01:40:20   CXX      ResolvExpr/RenameVars.o
01:40:20   CXX      ResolvExpr/ResolveAssertions.o
01:40:20   CXX      ResolvExpr/Resolver.o
01:40:20   CXX      ResolvExpr/ResolveTypeof.o
01:40:20   CXX      ResolvExpr/SatisfyAssertions.o
01:40:20   CXX      ResolvExpr/SpecCost.o
01:40:20 /var/lib/jenkins/workspace/Cforall_master/src/ResolvExpr/SpecCost.cc:133:4: warning: #warning Should use a standard maybe_accept [-Wcpp]
01:40:20    #warning Should use a standard maybe_accept
01:40:20     ^~~~~~~
01:40:20   CXX      ResolvExpr/TypeEnvironment.o
01:40:20   CXX      ResolvExpr/Unify.o
01:40:20   CXX      SymTab/Autogen.o
01:40:20   CXX      SymTab/FixFunction.o
01:40:20   CXX      SymTab/Indexer.o
01:40:20   CXX      SymTab/Mangler.o
01:40:20   CXX      SymTab/ManglerCommon.o
01:40:20   CXX      SymTab/Validate.o
01:40:20 /var/lib/jenkins/workspace/Cforall_master/src/SymTab/Validate.cc:1633:7: warning: ‘void SymTab::{anonymous}::expandAssertions(const ast::TraitInstType*, std::vector<ast::ptr_base<ast::DeclWithType, (ast::Node::ref_type)0> >&)’ defined but not used [-Wunused-function]
01:40:20   void expandAssertions(
01:40:20        ^~~~~~~~~~~~~~~~
01:40:20   CXX      SymTab/Demangle.o
01:40:20   CXX      SynTree/AddressExpr.o
01:40:20   CXX      SynTree/AggregateDecl.o
01:40:20   CXX      SynTree/ApplicationExpr.o
01:40:20   CXX      SynTree/ArrayType.o
01:40:20   CXX      SynTree/Attribute.o
01:40:20   CXX      SynTree/AttrType.o
01:40:20   CXX      SynTree/BasicType.o
01:40:20   CXX      SynTree/CommaExpr.o
01:40:20   CXX      SynTree/CompoundStmt.o
01:40:20   CXX      SynTree/Constant.o
01:40:20   CXX      SynTree/Declaration.o
01:40:20   CXX      SynTree/DeclarationWithType.o
01:40:20   CXX      SynTree/DeclReplacer.o
01:40:20   CXX      SynTree/DeclStmt.o
01:40:20   CXX      SynTree/Expression.o
01:40:20   CXX      SynTree/FunctionDecl.o
01:40:20   CXX      SynTree/FunctionType.o
01:40:20   CXX      SynTree/Initializer.o
01:40:20   CXX      SynTree/LinkageSpec.o
01:40:20   CXX      SynTree/NamedTypeDecl.o
01:40:20   CXX      SynTree/ObjectDecl.o
01:40:20   CXX      SynTree/PointerType.o
01:40:20   CXX      SynTree/ReferenceToType.o
01:40:20   CXX      SynTree/ReferenceType.o
01:40:20 /var/lib/jenkins/workspace/Cforall_master/src/SynTree/ReferenceToType.cc: In member function ‘virtual void TypeInstType::print(std::ostream&, Indenter) const’:
01:40:20 /var/lib/jenkins/workspace/Cforall_master/src/SynTree/ReferenceToType.cc:209:15: warning: unused variable ‘name_’ [-Wunused-variable]
01:40:20   const auto & name_ = get_name();
01:40:20                ^~~~~
01:40:20   CXX      SynTree/Statement.o
01:40:20   CXX      SynTree/TupleExpr.o
01:40:20   CXX      SynTree/TupleType.o
01:40:20   CXX      SynTree/Type.o
01:40:20   CXX      SynTree/TypeDecl.o
01:40:20   CXX      SynTree/TypeExpr.o
01:40:20   CXX      SynTree/TypeofType.o
01:40:20   CXX      SynTree/TypeSubstitution.o
01:40:20   CXX      SynTree/VarArgsType.o
01:40:20   CXX      SynTree/VoidType.o
01:40:20   CXX      SynTree/ZeroOneType.o
01:40:20   CXX      Tuples/Explode.o
01:40:20   CXX      Tuples/TupleAssignment.o
01:40:20   CXX      Tuples/TupleExpansion.o
01:40:20   CXX      Tuples/Tuples.o
01:40:20   CXX      Validate/HandleAttributes.o
01:40:20   CXX      Validate/FindSpecialDecls.o
01:40:20   CXX      Virtual/Tables.o
01:40:20   CXX      CodeTools/DeclStats.o
01:40:20   CXX      CodeTools/ResolvProtoDump.o
01:40:20   CXX      CodeTools/TrackLoc.o
01:40:20   CXX      Parser/DeclarationNode.o
01:40:20   CXX      Parser/ExpressionNode.o
01:40:20   CXX      Parser/InitializerNode.o
01:40:20   CXX      Parser/lex.o
01:40:20   CXXLD    ../driver/cfa-cpp
01:40:20   AR       libdemangle.a
01:40:20   CXXLD    demangler
01:40:20 [Pipeline] }
01:40:20 [Pipeline] // dir
01:40:20 [Pipeline] }
01:40:20 [Pipeline] // stage
01:40:20 [Pipeline] echo
01:40:20  -------- Build : libcfa(debug) -------- 
01:40:20 [Pipeline] stage
01:40:20 [Pipeline] { (Build : libcfa(debug))
01:40:20 [Pipeline] dir
01:40:20 Running in /var/lib/jenkins/workspace/Cforall_master@tmp
01:40:20 [Pipeline] {
01:40:20 [Pipeline] sh
01:40:20 + make -j 8 --no-print-directory -C libcfa/x86-debug
01:40:20 Making all in prelude
01:40:20 (CDPATH="${ZSH_VERSION+.}:" && cd /var/lib/jenkins/workspace/Cforall_master/libcfa && /bin/bash /var/lib/jenkins/workspace/Cforall_master/libcfa/automake/missing autoheader)
01:40:20 rm -f stamp-h1
01:40:20 touch /var/lib/jenkins/workspace/Cforall_master/libcfa/prelude/defines.hfa.in
01:40:20 cd .. && /bin/bash ./config.status prelude/defines.hfa
01:40:20 config.status: creating prelude/defines.hfa
01:40:20 config.status: prelude/defines.hfa is unchanged
01:40:20 make  all-am
01:40:20   GEN      builtins.cf
01:40:20   GEN      gcc-builtins.c
01:40:20   GEN      extras.cf
01:40:20   GEN      prelude.cfa
01:40:20   GEN      extras.cf
01:40:20   GEN      gcc-builtins.cf
01:40:20   GEN      bootloader.c
01:40:20 Making all in src
01:40:20   CFA      fstream.lo
01:40:20   CFA      limits.lo
01:40:20   CFA      common.lo
01:40:20   CFA      heap.lo
01:40:20   CFA      iostream.lo
01:40:20   CFA      iterator.lo
01:40:20   CFA      memory.lo
01:40:20   CFA      parseargs.lo
01:40:20   CFA      rational.lo
01:40:20   CFA      stdlib.lo
01:40:20   CFA      strstream.lo
01:40:20   CFA      time.lo
01:40:20   CFA      assert.lo
01:40:20   CFA      bits/debug.lo
01:40:20   CC       exception.lo
01:40:20   CFA      interpose.lo
01:40:20   CFA      startup.lo
01:40:20   CC       virtual.lo
01:40:20   GEN      prelude.lo
01:40:20   CPPAS    concurrency/CtxSwitch-x86.lo
01:40:20   CC       concurrency/invoke.lo
01:40:20   CFA      concurrency/io.lo
01:40:20   CFA      concurrency/preemption.lo
01:40:20   CFA      concurrency/ready_queue.lo
01:40:20   CFA      concurrency/stats.lo
01:40:20   CFA      bits/weakso_locks.lo
01:40:20   CFA      containers/maybe.lo
01:40:20   CFA      containers/pair.lo
01:40:20   CFA      containers/result.lo
01:40:20   CFA      containers/vector.lo
01:40:20   CFA      device/cpu.lo
01:40:20   CFA      concurrency/alarm.lo
01:40:20   CFA      concurrency/coroutine.lo
01:40:20   CFA      concurrency/exception.lo
01:40:20   CFA      concurrency/kernel.lo
01:40:20   CFA      concurrency/locks.lo
01:40:20   CFA      concurrency/monitor.lo
01:40:20   CFA      concurrency/mutex.lo
01:40:20   CFA      concurrency/thread.lo
01:40:20   CFA      concurrency/clib/cfathread.lo
01:40:20   CFA      concurrency/io/setup.lo
01:40:20   CFA      concurrency/io/call.lo
01:40:20   CFA      concurrency/kernel/startup.lo
01:40:20   CCLD     libcfa.la
01:40:20   CCLD     libcfathread.la
01:40:20 make[1]: Nothing to be done for 'all-am'.
01:40:20 [Pipeline] }
01:40:20 [Pipeline] // dir
01:40:20 [Pipeline] }
01:40:20 [Pipeline] // stage
01:40:20 [Pipeline] echo
01:40:20  -------- Build : libcfa(nodebug) -------- 
01:40:20 [Pipeline] stage
01:40:20 [Pipeline] { (Build : libcfa(nodebug))
01:40:20 [Pipeline] dir
01:40:20 Running in /var/lib/jenkins/workspace/Cforall_master@tmp
01:40:20 [Pipeline] {
01:40:20 [Pipeline] sh
01:40:20 + make -j 8 --no-print-directory -C libcfa/x86-nodebug
01:40:20 Making all in prelude
01:40:20 cd .. && /bin/bash ./config.status prelude/defines.hfa
01:40:20 config.status: creating prelude/defines.hfa
01:40:20 config.status: prelude/defines.hfa is unchanged
01:40:20 make  all-am
01:40:20   GEN      gcc-builtins.c
01:40:20   GEN      builtins.cf
01:40:20   GEN      extras.cf
01:40:20   GEN      prelude.cfa
01:40:20   GEN      extras.cf
01:40:20   GEN      gcc-builtins.cf
01:40:20   GEN      bootloader.c
01:40:20 Making all in src
01:40:20   CFA      fstream.lo
01:40:20   CFA      common.lo
01:40:20   CFA      heap.lo
01:40:20   CFA      iterator.lo
01:40:20   CFA      iostream.lo
01:40:20   CFA      limits.lo
01:40:20   CFA      memory.lo
01:40:20   CFA      parseargs.lo
01:40:20   CFA      rational.lo
01:40:20   CFA      stdlib.lo
01:40:20   CFA      strstream.lo
01:40:20   CFA      time.lo
01:40:20   CFA      assert.lo
01:40:20   CFA      bits/debug.lo
01:40:20   CC       exception.lo
01:40:20   CFA      interpose.lo
01:40:20 /var/lib/jenkins/workspace/Cforall_master/libcfa/src/stdlib.cfa: In function ‘_X4anewQ1_0_1_1__X12_constructorFv_BD0BT0__FPBD0_jBT0__1’:
01:40:20 /var/lib/jenkins/workspace/Cforall_master/libcfa/src/stdlib.hfa:154:97: warning: ‘_X4_srcS6S_fill_Y12__T_generic___1._X1cc_1’ is used uninitialized in this function [-Wuninitialized]
01:40:20   struct S_fill   { char tag; char c; size_t size; T * at; char t[50]; };
01:40:20                                                                ~~~~~~~~~~                        ^       
01:40:20 /var/lib/jenkins/workspace/Cforall_master/libcfa/src/stdlib.hfa:154:100: warning: ‘_X4_srcS6S_fill_Y12__T_generic___1._X4sizej_1’ is used uninitialized in this function [-Wuninitialized]
01:40:20   struct S_fill   { char tag; char c; size_t size; T * at; char t[50]; };
01:40:20                                                                   ~~~~~~~                           ^          
01:40:20 /var/lib/jenkins/workspace/Cforall_master/libcfa/src/stdlib.hfa:154:130: warning: ‘_X4_srcS6S_fill_Y12__T_generic___1._X2atPY12__T_generic__1’ is used uninitialized in this function [-Wuninitialized]
01:40:20   struct S_fill   { char tag; char c; size_t size; T * at; char t[50]; };
01:40:20                                                                                                                                   ^                       
01:40:20   CFA      startup.lo
01:40:20   CC       virtual.lo
01:40:20   GEN      prelude.lo
01:40:20   CPPAS    concurrency/CtxSwitch-x86.lo
01:40:20   CC       concurrency/invoke.lo
01:40:20   CFA      concurrency/io.lo
01:40:20   CFA      concurrency/preemption.lo
01:40:20   CFA      concurrency/ready_queue.lo
01:40:20   CFA      concurrency/stats.lo
01:40:20   CFA      bits/weakso_locks.lo
01:40:20   CFA      containers/maybe.lo
01:40:20   CFA      containers/pair.lo
01:40:20   CFA      containers/result.lo
01:40:20   CFA      containers/vector.lo
01:40:20   CFA      device/cpu.lo
01:40:20   CFA      concurrency/alarm.lo
01:40:20   CFA      concurrency/coroutine.lo
01:40:20   CFA      concurrency/exception.lo
01:40:20   CFA      concurrency/kernel.lo
01:40:20   CFA      concurrency/locks.lo
01:40:20   CFA      concurrency/monitor.lo
01:40:20   CFA      concurrency/mutex.lo
01:40:20 /var/lib/jenkins/workspace/Cforall_master/libcfa/src/stdlib.hfa: In function ‘_X5allocQ1_0_1_1__X15alloc_internal$FPBD0_PvPBD0jjS6S_fill_BD0_BT0__FPBD0_jBT0__1.isra.14.constprop’:
01:40:20 /var/lib/jenkins/workspace/Cforall_master/libcfa/src/stdlib.hfa:154:97: warning: ‘_X4_srcS6S_fill_Y12__T_generic___1._X1cc_1’ is used uninitialized in this function [-Wuninitialized]
01:40:20   struct S_fill   { char tag; char c; size_t size; T * at; char t[50]; };
01:40:20                                                                ~~~~~~~~~~                        ^       
01:40:20 /var/lib/jenkins/workspace/Cforall_master/libcfa/src/stdlib.hfa:154:100: warning: ‘_X4_srcS6S_fill_Y12__T_generic___1._X4sizej_1’ is used uninitialized in this function [-Wuninitialized]
01:40:20   struct S_fill   { char tag; char c; size_t size; T * at; char t[50]; };
01:40:20                                                                   ~~~~~~~                           ^          
01:40:20 /var/lib/jenkins/workspace/Cforall_master/libcfa/src/stdlib.hfa:154:130: warning: ‘_X4_srcS6S_fill_Y12__T_generic___1._X2atPY12__T_generic__1’ is used uninitialized in this function [-Wuninitialized]
01:40:20   struct S_fill   { char tag; char c; size_t size; T * at; char t[50]; };
01:40:20                                                                                                                                   ^                       
01:40:20 /var/lib/jenkins/workspace/Cforall_master/libcfa/src/stdlib.hfa: In function ‘_X5allocQ1_0_1_1__X15alloc_internal$FPBD0_PvPBD0jjS6S_fill_BD0_BT0__FPBD0_jBT0__1.isra.14.constprop’:
01:40:20 /var/lib/jenkins/workspace/Cforall_master/libcfa/src/stdlib.hfa:154:97: warning: ‘_X4_srcS6S_fill_Y12__T_generic___1._X1cc_1’ is used uninitialized in this function [-Wuninitialized]
01:40:20   struct S_fill   { char tag; char c; size_t size; T * at; char t[50]; };
01:40:20                                                                ~~~~~~~~~~                        ^       
01:40:20 /var/lib/jenkins/workspace/Cforall_master/libcfa/src/stdlib.hfa:154:100: warning: ‘_X4_srcS6S_fill_Y12__T_generic___1._X4sizej_1’ is used uninitialized in this function [-Wuninitialized]
01:40:20   struct S_fill   { char tag; char c; size_t size; T * at; char t[50]; };
01:40:20                                                                   ~~~~~~~                           ^          
01:40:20 /var/lib/jenkins/workspace/Cforall_master/libcfa/src/stdlib.hfa:154:130: warning: ‘_X4_srcS6S_fill_Y12__T_generic___1._X2atPY12__T_generic__1’ is used uninitialized in this function [-Wuninitialized]
01:40:20   struct S_fill   { char tag; char c; size_t size; T * at; char t[50]; };
01:40:20                                                                                                                                   ^                       
01:40:20   CFA      concurrency/thread.lo
01:40:20   CFA      concurrency/clib/cfathread.lo
01:40:20   CFA      concurrency/io/setup.lo
01:40:20   CFA      concurrency/io/call.lo
01:40:20   CFA      concurrency/kernel/startup.lo
01:40:20   CCLD     libcfa.la
01:40:20 /var/lib/jenkins/workspace/Cforall_master/libcfa/src/concurrency/clib/cfathread.cfa: In function ‘cfathread_cluster_add_worker’:
01:40:20 /var/lib/jenkins/workspace/Cforall_master/libcfa/src/stdlib.hfa:154:97: warning: ‘_X4_srcS6S_fill_Y12__T_generic___1._X1cc_1’ may be used uninitialized in this function [-Wmaybe-uninitialized]
01:40:20   struct S_fill   { char tag; char c; size_t size; T * at; char t[50]; };
01:40:20                                                                ~~~~~~~~~~                        ^       
01:40:20 /var/lib/jenkins/workspace/Cforall_master/libcfa/src/stdlib.hfa:154:100: warning: ‘_X4_srcS6S_fill_Y12__T_generic___1._X4sizej_1’ may be used uninitialized in this function [-Wmaybe-uninitialized]
01:40:20   struct S_fill   { char tag; char c; size_t size; T * at; char t[50]; };
01:40:20                                                                   ~~~~~~~                           ^          
01:40:20 /var/lib/jenkins/workspace/Cforall_master/libcfa/src/stdlib.hfa:154:130: warning: ‘_X4_srcS6S_fill_Y12__T_generic___1._X2atPY12__T_generic__1’ may be used uninitialized in this function [-Wmaybe-uninitialized]
01:40:20   struct S_fill   { char tag; char c; size_t size; T * at; char t[50]; };
01:40:20                                                                                                                                   ^                       
01:40:20   CCLD     libcfathread.la
01:40:20 make[1]: Nothing to be done for 'all-am'.
01:40:20 [Pipeline] }
01:40:20 [Pipeline] // dir
01:40:20 [Pipeline] }
01:40:20 [Pipeline] // stage
01:40:20 [Pipeline] echo
01:40:20  -------- Build : install -------- 
01:40:20 [Pipeline] stage
01:40:20 [Pipeline] { (Build : install)
01:40:20 [Pipeline] dir
01:40:20 Running in /var/lib/jenkins/workspace/Cforall_master@tmp
01:40:20 [Pipeline] {
01:40:20 [Pipeline] sh
01:40:20 + make -j 8 --no-print-directory install
01:40:20 Making install in driver
01:40:20 make  install-exec-hook
01:40:20  /bin/mkdir -p '/var/lib/jenkins/workspace/Cforall_master@tmp/lib/cfa/'
01:40:20   /usr/bin/install -c cfa '/var/lib/jenkins/workspace/Cforall_master@tmp/bin//cfa'
01:40:20   /bin/bash ../libtool   --mode=install /usr/bin/install -c as cc1 '/var/lib/jenkins/workspace/Cforall_master@tmp/lib/cfa/'
01:40:20 libtool: install: /usr/bin/install -c as /var/lib/jenkins/workspace/Cforall_master@tmp/lib/cfa/as
01:40:20 libtool: install: /usr/bin/install -c cc1 /var/lib/jenkins/workspace/Cforall_master@tmp/lib/cfa/cc1
01:40:20 Making install in src
01:40:20 make  install-am
01:40:20 make[3]: Nothing to be done for 'install-exec-am'.
01:40:20  /bin/mkdir -p '/var/lib/jenkins/workspace/Cforall_master@tmp/lib/cfa/'
01:40:20   /bin/bash ../libtool   --mode=install /usr/bin/install -c ../driver/cfa-cpp demangler '/var/lib/jenkins/workspace/Cforall_master@tmp/lib/cfa/'
01:40:20 libtool: install: /usr/bin/install -c ../driver/cfa-cpp /var/lib/jenkins/workspace/Cforall_master@tmp/lib/cfa/cfa-cpp
01:40:20 libtool: install: /usr/bin/install -c demangler /var/lib/jenkins/workspace/Cforall_master@tmp/lib/cfa/demangler
01:40:20 Making install in .
01:40:20 (CDPATH="${ZSH_VERSION+.}:" && cd /var/lib/jenkins/workspace/Cforall_master && /bin/bash /var/lib/jenkins/workspace/Cforall_master/automake/missing autoheader)
01:40:20 rm -f stamp-h1
01:40:20 touch /var/lib/jenkins/workspace/Cforall_master/src/config.h.in
01:40:20 cd . && /bin/bash ./config.status config.h
01:40:20 config.status: creating config.h
01:40:20 config.status: config.h is unchanged
01:40:20 make[2]: Nothing to be done for 'install-exec-am'.
01:40:20  /bin/mkdir -p '/var/lib/jenkins/workspace/Cforall_master@tmp/share/man/man1'
01:40:20  /usr/bin/install -c -m 644 /var/lib/jenkins/workspace/Cforall_master/doc/man/cfa.1 '/var/lib/jenkins/workspace/Cforall_master@tmp/share/man/man1'
01:40:20 Making install in libcfa/x86-debug
01:40:20 Making install in prelude
01:40:20 touch .deps/builtins.Po
01:40:20 make[3]: Nothing to be done for 'install-exec-am'.
01:40:20  /bin/mkdir -p '/var/lib/jenkins/workspace/Cforall_master@tmp/lib/cfa/x86-debug/'
01:40:20  /usr/bin/install -c -m 644 gcc-builtins.cf builtins.cf extras.cf prelude.cfa bootloader.c defines.hfa '/var/lib/jenkins/workspace/Cforall_master@tmp/lib/cfa/x86-debug/'
01:40:20 Making install in src
01:40:20  /bin/mkdir -p '/var/lib/jenkins/workspace/Cforall_master@tmp/lib/cfa/x86-debug/'
01:40:20  /bin/bash ../libtool   --mode=install /usr/bin/install -c   libcfa.la libcfathread.la '/var/lib/jenkins/workspace/Cforall_master@tmp/lib/cfa/x86-debug/'
01:40:20  /bin/mkdir -p '/var/lib/jenkins/workspace/Cforall_master@tmp/include/cfa/'
01:40:20  /bin/mkdir -p '/var/lib/jenkins/workspace/Cforall_master@tmp/include/cfa//stdhdr/sys'
01:40:20  /usr/bin/install -c -m 644  /var/lib/jenkins/workspace/Cforall_master/libcfa/src/stdhdr/sys/time.h /var/lib/jenkins/workspace/Cforall_master/libcfa/src/stdhdr/sys/socket.h /var/lib/jenkins/workspace/Cforall_master/libcfa/src/stdhdr/sys/mman.h '/var/lib/jenkins/workspace/Cforall_master@tmp/include/cfa//stdhdr/sys'
01:40:20  /bin/mkdir -p '/var/lib/jenkins/workspace/Cforall_master@tmp/include/cfa//containers'
01:40:20  /usr/bin/install -c -m 644  /var/lib/jenkins/workspace/Cforall_master/libcfa/src/containers/maybe.hfa /var/lib/jenkins/workspace/Cforall_master/libcfa/src/containers/pair.hfa /var/lib/jenkins/workspace/Cforall_master/libcfa/src/containers/result.hfa /var/lib/jenkins/workspace/Cforall_master/libcfa/src/containers/vector.hfa /var/lib/jenkins/workspace/Cforall_master/libcfa/src/containers/array.hfa /var/lib/jenkins/workspace/Cforall_master/libcfa/src/containers/list.hfa /var/lib/jenkins/workspace/Cforall_master/libcfa/src/containers/queueLockFree.hfa /var/lib/jenkins/workspace/Cforall_master/libcfa/src/containers/stackLockFree.hfa '/var/lib/jenkins/workspace/Cforall_master@tmp/include/cfa//containers'
01:40:20 libtool: install: /usr/bin/install -c .libs/libcfa.so.1.0.0 /var/lib/jenkins/workspace/Cforall_master@tmp/lib/cfa/x86-debug/libcfa.so.1.0.0
01:40:20  /bin/mkdir -p '/var/lib/jenkins/workspace/Cforall_master@tmp/include/cfa//concurrency/kernel'
01:40:20  /usr/bin/install -c -m 644  /var/lib/jenkins/workspace/Cforall_master/libcfa/src/concurrency/kernel/fwd.hfa '/var/lib/jenkins/workspace/Cforall_master@tmp/include/cfa//concurrency/kernel'
01:40:20  /usr/bin/install -c -m 644  /var/lib/jenkins/workspace/Cforall_master/libcfa/src/common.hfa /var/lib/jenkins/workspace/Cforall_master/libcfa/src/fstream.hfa /var/lib/jenkins/workspace/Cforall_master/libcfa/src/heap.hfa /var/lib/jenkins/workspace/Cforall_master/libcfa/src/iostream.hfa /var/lib/jenkins/workspace/Cforall_master/libcfa/src/iterator.hfa /var/lib/jenkins/workspace/Cforall_master/libcfa/src/limits.hfa /var/lib/jenkins/workspace/Cforall_master/libcfa/src/memory.hfa /var/lib/jenkins/workspace/Cforall_master/libcfa/src/parseargs.hfa /var/lib/jenkins/workspace/Cforall_master/libcfa/src/rational.hfa /var/lib/jenkins/workspace/Cforall_master/libcfa/src/stdlib.hfa /var/lib/jenkins/workspace/Cforall_master/libcfa/src/strstream.hfa /var/lib/jenkins/workspace/Cforall_master/libcfa/src/time.hfa /var/lib/jenkins/workspace/Cforall_master/libcfa/src/bitmanip.hfa /var/lib/jenkins/workspace/Cforall_master/libcfa/src/clock.hfa /var/lib/jenkins/workspace/Cforall_master/libcfa/src/exception.hfa /var/lib/jenkins/workspace/Cforall_master/libcfa/src/exception.h /var/lib/jenkins/workspace/Cforall_master/libcfa/src/gmp.hfa /var/lib/jenkins/workspace/Cforall_master/libcfa/src/math.hfa /var/lib/jenkins/workspace/Cforall_master/libcfa/src/time_t.hfa '/var/lib/jenkins/workspace/Cforall_master@tmp/include/cfa//.'
01:40:20  /bin/mkdir -p '/var/lib/jenkins/workspace/Cforall_master@tmp/include/cfa//concurrency'
01:40:20  /usr/bin/install -c -m 644  /var/lib/jenkins/workspace/Cforall_master/libcfa/src/concurrency/iofwd.hfa /var/lib/jenkins/workspace/Cforall_master/libcfa/src/concurrency/alarm.hfa /var/lib/jenkins/workspace/Cforall_master/libcfa/src/concurrency/coroutine.hfa /var/lib/jenkins/workspace/Cforall_master/libcfa/src/concurrency/exception.hfa /var/lib/jenkins/workspace/Cforall_master/libcfa/src/concurrency/kernel.hfa /var/lib/jenkins/workspace/Cforall_master/libcfa/src/concurrency/locks.hfa /var/lib/jenkins/workspace/Cforall_master/libcfa/src/concurrency/monitor.hfa /var/lib/jenkins/workspace/Cforall_master/libcfa/src/concurrency/mutex.hfa /var/lib/jenkins/workspace/Cforall_master/libcfa/src/concurrency/thread.hfa /var/lib/jenkins/workspace/Cforall_master/libcfa/src/concurrency/invoke.h /var/lib/jenkins/workspace/Cforall_master/libcfa/src/concurrency/future.hfa '/var/lib/jenkins/workspace/Cforall_master@tmp/include/cfa//concurrency'
01:40:20  /bin/mkdir -p '/var/lib/jenkins/workspace/Cforall_master@tmp/include/cfa//concurrency/clib'
01:40:20  /usr/bin/install -c -m 644  /var/lib/jenkins/workspace/Cforall_master/libcfa/src/concurrency/clib/cfathread.h '/var/lib/jenkins/workspace/Cforall_master@tmp/include/cfa//concurrency/clib'
01:40:20  /bin/mkdir -p '/var/lib/jenkins/workspace/Cforall_master@tmp/include/cfa//device'
01:40:20  /usr/bin/install -c -m 644  /var/lib/jenkins/workspace/Cforall_master/libcfa/src/device/cpu.hfa '/var/lib/jenkins/workspace/Cforall_master@tmp/include/cfa//device'
01:40:20  /bin/mkdir -p '/var/lib/jenkins/workspace/Cforall_master@tmp/include/cfa//stdhdr/libltdl'
01:40:20  /usr/bin/install -c -m 644  /var/lib/jenkins/workspace/Cforall_master/libcfa/src/stdhdr/libltdl/lt_dlloader.h '/var/lib/jenkins/workspace/Cforall_master@tmp/include/cfa//stdhdr/libltdl'
01:40:20  /bin/mkdir -p '/var/lib/jenkins/workspace/Cforall_master@tmp/include/cfa//vec'
01:40:20  /usr/bin/install -c -m 644  /var/lib/jenkins/workspace/Cforall_master/libcfa/src/vec/vec.hfa /var/lib/jenkins/workspace/Cforall_master/libcfa/src/vec/vec2.hfa /var/lib/jenkins/workspace/Cforall_master/libcfa/src/vec/vec3.hfa /var/lib/jenkins/workspace/Cforall_master/libcfa/src/vec/vec4.hfa '/var/lib/jenkins/workspace/Cforall_master@tmp/include/cfa//vec'
01:40:20  /bin/mkdir -p '/var/lib/jenkins/workspace/Cforall_master@tmp/include/cfa//bits'
01:40:20  /usr/bin/install -c -m 644  /var/lib/jenkins/workspace/Cforall_master/libcfa/src/bits/weakso_locks.hfa /var/lib/jenkins/workspace/Cforall_master/libcfa/src/bits/align.hfa /var/lib/jenkins/workspace/Cforall_master/libcfa/src/bits/containers.hfa /var/lib/jenkins/workspace/Cforall_master/libcfa/src/bits/debug.hfa /var/lib/jenkins/workspace/Cforall_master/libcfa/src/bits/defs.hfa /var/lib/jenkins/workspace/Cforall_master/libcfa/src/bits/locks.hfa /var/lib/jenkins/workspace/Cforall_master/libcfa/src/bits/collection.hfa /var/lib/jenkins/workspace/Cforall_master/libcfa/src/bits/stack.hfa /var/lib/jenkins/workspace/Cforall_master/libcfa/src/bits/queue.hfa /var/lib/jenkins/workspace/Cforall_master/libcfa/src/bits/sequence.hfa /var/lib/jenkins/workspace/Cforall_master/libcfa/src/bits/random.hfa '/var/lib/jenkins/workspace/Cforall_master@tmp/include/cfa//bits'
01:40:20  /bin/mkdir -p '/var/lib/jenkins/workspace/Cforall_master@tmp/include/cfa//stdhdr'
01:40:20  /usr/bin/install -c -m 644  /var/lib/jenkins/workspace/Cforall_master/libcfa/src/stdhdr/errno.h /var/lib/jenkins/workspace/Cforall_master/libcfa/src/stdhdr/stdbool.h /var/lib/jenkins/workspace/Cforall_master/libcfa/src/stdhdr/setjmp.h /var/lib/jenkins/workspace/Cforall_master/libcfa/src/stdhdr/stdlib.h /var/lib/jenkins/workspace/Cforall_master/libcfa/src/stdhdr/signal.h /var/lib/jenkins/workspace/Cforall_master/libcfa/src/stdhdr/uchar.h /var/lib/jenkins/workspace/Cforall_master/libcfa/src/stdhdr/float.h /var/lib/jenkins/workspace/Cforall_master/libcfa/src/stdhdr/time.h /var/lib/jenkins/workspace/Cforall_master/libcfa/src/stdhdr/stddef.h /var/lib/jenkins/workspace/Cforall_master/libcfa/src/stdhdr/assert.h /var/lib/jenkins/workspace/Cforall_master/libcfa/src/stdhdr/pthread.h /var/lib/jenkins/workspace/Cforall_master/libcfa/src/stdhdr/math.h /var/lib/jenkins/workspace/Cforall_master/libcfa/src/stdhdr/gmp.h /var/lib/jenkins/workspace/Cforall_master/libcfa/src/stdhdr/ctype.h /var/lib/jenkins/workspace/Cforall_master/libcfa/src/stdhdr/stdnoreturn.h /var/lib/jenkins/workspace/Cforall_master/libcfa/src/stdhdr/tgmath.h /var/lib/jenkins/workspace/Cforall_master/libcfa/src/stdhdr/threads.h /var/lib/jenkins/workspace/Cforall_master/libcfa/src/stdhdr/wctype.h /var/lib/jenkins/workspace/Cforall_master/libcfa/src/stdhdr/string.h /var/lib/jenkins/workspace/Cforall_master/libcfa/src/stdhdr/fenv.h /var/lib/jenkins/workspace/Cforall_master/libcfa/src/stdhdr/unistd.h /var/lib/jenkins/workspace/Cforall_master/libcfa/src/stdhdr/stdarg.h /var/lib/jenkins/workspace/Cforall_master/libcfa/src/stdhdr/stdint.h /var/lib/jenkins/workspace/Cforall_master/libcfa/src/stdhdr/stdio.h /var/lib/jenkins/workspace/Cforall_master/libcfa/src/stdhdr/iso646.h /var/lib/jenkins/workspace/Cforall_master/libcfa/src/stdhdr/wchar.h /var/lib/jenkins/workspace/Cforall_master/libcfa/src/stdhdr/malloc.h /var/lib/jenkins/workspace/Cforall_master/libcfa/src/stdhdr/stdatomic.h /var/lib/jenkins/workspace/Cforall_master/libcfa/src/stdhdr/complex.h /var/lib/jenkins/workspace/Cforall_master/libcfa/src/stdhdr/locale.h /var/lib/jenkins/workspace/Cforall_master/libcfa/src/stdhdr/limits.h /var/lib/jenkins/workspace/Cforall_master/libcfa/src/stdhdr/inttypes.h /var/lib/jenkins/workspace/Cforall_master/libcfa/src/stdhdr/stdalign.h /var/lib/jenkins/workspace/Cforall_master/libcfa/src/stdhdr/unwind.h '/var/lib/jenkins/workspace/Cforall_master@tmp/include/cfa//stdhdr'
01:40:20 libtool: install: (cd /var/lib/jenkins/workspace/Cforall_master@tmp/lib/cfa/x86-debug && { ln -s -f libcfa.so.1.0.0 libcfa.so.1 || { rm -f libcfa.so.1 && ln -s libcfa.so.1.0.0 libcfa.so.1; }; })
01:40:20 libtool: install: (cd /var/lib/jenkins/workspace/Cforall_master@tmp/lib/cfa/x86-debug && { ln -s -f libcfa.so.1.0.0 libcfa.so || { rm -f libcfa.so && ln -s libcfa.so.1.0.0 libcfa.so; }; })
01:40:20 libtool: install: /usr/bin/install -c .libs/libcfa.lai /var/lib/jenkins/workspace/Cforall_master@tmp/lib/cfa/x86-debug/libcfa.la
01:40:20 libtool: install: /usr/bin/install -c .libs/libcfathread.so.1.0.0 /var/lib/jenkins/workspace/Cforall_master@tmp/lib/cfa/x86-debug/libcfathread.so.1.0.0
01:40:20 libtool: install: (cd /var/lib/jenkins/workspace/Cforall_master@tmp/lib/cfa/x86-debug && { ln -s -f libcfathread.so.1.0.0 libcfathread.so.1 || { rm -f libcfathread.so.1 && ln -s libcfathread.so.1.0.0 libcfathread.so.1; }; })
01:40:20 libtool: install: (cd /var/lib/jenkins/workspace/Cforall_master@tmp/lib/cfa/x86-debug && { ln -s -f libcfathread.so.1.0.0 libcfathread.so || { rm -f libcfathread.so && ln -s libcfathread.so.1.0.0 libcfathread.so; }; })
01:40:20 libtool: install: /usr/bin/install -c .libs/libcfathread.lai /var/lib/jenkins/workspace/Cforall_master@tmp/lib/cfa/x86-debug/libcfathread.la
01:40:20 libtool: warning: remember to run 'libtool --finish /var/lib/jenkins/workspace/Cforall_master@tmp/lib/cfa/x86-debug/'
01:40:20 make[3]: Nothing to be done for 'install-exec-am'.
01:40:20 make[3]: Nothing to be done for 'install-data-am'.
01:40:20 Making install in libcfa/x86-nodebug
01:40:20 Making install in prelude
01:40:20 make[3]: Nothing to be done for 'install-exec-am'.
01:40:20  /bin/mkdir -p '/var/lib/jenkins/workspace/Cforall_master@tmp/lib/cfa/x86-nodebug/'
01:40:20  /usr/bin/install -c -m 644 gcc-builtins.cf builtins.cf extras.cf prelude.cfa bootloader.c defines.hfa '/var/lib/jenkins/workspace/Cforall_master@tmp/lib/cfa/x86-nodebug/'
01:40:20 Making install in src
01:40:20  /bin/mkdir -p '/var/lib/jenkins/workspace/Cforall_master@tmp/lib/cfa/x86-nodebug/'
01:40:20  /bin/bash ../libtool   --mode=install /usr/bin/install -c   libcfa.la libcfathread.la '/var/lib/jenkins/workspace/Cforall_master@tmp/lib/cfa/x86-nodebug/'
01:40:20  /bin/mkdir -p '/var/lib/jenkins/workspace/Cforall_master@tmp/include/cfa/'
01:40:20  /bin/mkdir -p '/var/lib/jenkins/workspace/Cforall_master@tmp/include/cfa//stdhdr/sys'
01:40:20  /usr/bin/install -c -m 644  /var/lib/jenkins/workspace/Cforall_master/libcfa/src/stdhdr/sys/time.h /var/lib/jenkins/workspace/Cforall_master/libcfa/src/stdhdr/sys/socket.h /var/lib/jenkins/workspace/Cforall_master/libcfa/src/stdhdr/sys/mman.h '/var/lib/jenkins/workspace/Cforall_master@tmp/include/cfa//stdhdr/sys'
01:40:20  /bin/mkdir -p '/var/lib/jenkins/workspace/Cforall_master@tmp/include/cfa//containers'
01:40:20  /usr/bin/install -c -m 644  /var/lib/jenkins/workspace/Cforall_master/libcfa/src/containers/maybe.hfa /var/lib/jenkins/workspace/Cforall_master/libcfa/src/containers/pair.hfa /var/lib/jenkins/workspace/Cforall_master/libcfa/src/containers/result.hfa /var/lib/jenkins/workspace/Cforall_master/libcfa/src/containers/vector.hfa /var/lib/jenkins/workspace/Cforall_master/libcfa/src/containers/array.hfa /var/lib/jenkins/workspace/Cforall_master/libcfa/src/containers/list.hfa /var/lib/jenkins/workspace/Cforall_master/libcfa/src/containers/queueLockFree.hfa /var/lib/jenkins/workspace/Cforall_master/libcfa/src/containers/stackLockFree.hfa '/var/lib/jenkins/workspace/Cforall_master@tmp/include/cfa//containers'
01:40:20 libtool: install: /usr/bin/install -c .libs/libcfa.so.1.0.0 /var/lib/jenkins/workspace/Cforall_master@tmp/lib/cfa/x86-nodebug/libcfa.so.1.0.0
01:40:20  /bin/mkdir -p '/var/lib/jenkins/workspace/Cforall_master@tmp/include/cfa//concurrency/kernel'
01:40:20  /usr/bin/install -c -m 644  /var/lib/jenkins/workspace/Cforall_master/libcfa/src/concurrency/kernel/fwd.hfa '/var/lib/jenkins/workspace/Cforall_master@tmp/include/cfa//concurrency/kernel'
01:40:20  /usr/bin/install -c -m 644  /var/lib/jenkins/workspace/Cforall_master/libcfa/src/common.hfa /var/lib/jenkins/workspace/Cforall_master/libcfa/src/fstream.hfa /var/lib/jenkins/workspace/Cforall_master/libcfa/src/heap.hfa /var/lib/jenkins/workspace/Cforall_master/libcfa/src/iostream.hfa /var/lib/jenkins/workspace/Cforall_master/libcfa/src/iterator.hfa /var/lib/jenkins/workspace/Cforall_master/libcfa/src/limits.hfa /var/lib/jenkins/workspace/Cforall_master/libcfa/src/memory.hfa /var/lib/jenkins/workspace/Cforall_master/libcfa/src/parseargs.hfa /var/lib/jenkins/workspace/Cforall_master/libcfa/src/rational.hfa /var/lib/jenkins/workspace/Cforall_master/libcfa/src/stdlib.hfa /var/lib/jenkins/workspace/Cforall_master/libcfa/src/strstream.hfa /var/lib/jenkins/workspace/Cforall_master/libcfa/src/time.hfa /var/lib/jenkins/workspace/Cforall_master/libcfa/src/bitmanip.hfa /var/lib/jenkins/workspace/Cforall_master/libcfa/src/clock.hfa /var/lib/jenkins/workspace/Cforall_master/libcfa/src/exception.hfa /var/lib/jenkins/workspace/Cforall_master/libcfa/src/exception.h /var/lib/jenkins/workspace/Cforall_master/libcfa/src/gmp.hfa /var/lib/jenkins/workspace/Cforall_master/libcfa/src/math.hfa /var/lib/jenkins/workspace/Cforall_master/libcfa/src/time_t.hfa '/var/lib/jenkins/workspace/Cforall_master@tmp/include/cfa//.'
01:40:20  /bin/mkdir -p '/var/lib/jenkins/workspace/Cforall_master@tmp/include/cfa//concurrency'
01:40:20  /usr/bin/install -c -m 644  /var/lib/jenkins/workspace/Cforall_master/libcfa/src/concurrency/iofwd.hfa /var/lib/jenkins/workspace/Cforall_master/libcfa/src/concurrency/alarm.hfa /var/lib/jenkins/workspace/Cforall_master/libcfa/src/concurrency/coroutine.hfa /var/lib/jenkins/workspace/Cforall_master/libcfa/src/concurrency/exception.hfa /var/lib/jenkins/workspace/Cforall_master/libcfa/src/concurrency/kernel.hfa /var/lib/jenkins/workspace/Cforall_master/libcfa/src/concurrency/locks.hfa /var/lib/jenkins/workspace/Cforall_master/libcfa/src/concurrency/monitor.hfa /var/lib/jenkins/workspace/Cforall_master/libcfa/src/concurrency/mutex.hfa /var/lib/jenkins/workspace/Cforall_master/libcfa/src/concurrency/thread.hfa /var/lib/jenkins/workspace/Cforall_master/libcfa/src/concurrency/invoke.h /var/lib/jenkins/workspace/Cforall_master/libcfa/src/concurrency/future.hfa '/var/lib/jenkins/workspace/Cforall_master@tmp/include/cfa//concurrency'
01:40:20  /bin/mkdir -p '/var/lib/jenkins/workspace/Cforall_master@tmp/include/cfa//concurrency/clib'
01:40:20  /usr/bin/install -c -m 644  /var/lib/jenkins/workspace/Cforall_master/libcfa/src/concurrency/clib/cfathread.h '/var/lib/jenkins/workspace/Cforall_master@tmp/include/cfa//concurrency/clib'
01:40:20  /bin/mkdir -p '/var/lib/jenkins/workspace/Cforall_master@tmp/include/cfa//device'
01:40:20  /usr/bin/install -c -m 644  /var/lib/jenkins/workspace/Cforall_master/libcfa/src/device/cpu.hfa '/var/lib/jenkins/workspace/Cforall_master@tmp/include/cfa//device'
01:40:20  /bin/mkdir -p '/var/lib/jenkins/workspace/Cforall_master@tmp/include/cfa//stdhdr/libltdl'
01:40:20  /usr/bin/install -c -m 644  /var/lib/jenkins/workspace/Cforall_master/libcfa/src/stdhdr/libltdl/lt_dlloader.h '/var/lib/jenkins/workspace/Cforall_master@tmp/include/cfa//stdhdr/libltdl'
01:40:20  /bin/mkdir -p '/var/lib/jenkins/workspace/Cforall_master@tmp/include/cfa//vec'
01:40:20  /usr/bin/install -c -m 644  /var/lib/jenkins/workspace/Cforall_master/libcfa/src/vec/vec.hfa /var/lib/jenkins/workspace/Cforall_master/libcfa/src/vec/vec2.hfa /var/lib/jenkins/workspace/Cforall_master/libcfa/src/vec/vec3.hfa /var/lib/jenkins/workspace/Cforall_master/libcfa/src/vec/vec4.hfa '/var/lib/jenkins/workspace/Cforall_master@tmp/include/cfa//vec'
01:40:20  /bin/mkdir -p '/var/lib/jenkins/workspace/Cforall_master@tmp/include/cfa//bits'
01:40:20  /usr/bin/install -c -m 644  /var/lib/jenkins/workspace/Cforall_master/libcfa/src/bits/weakso_locks.hfa /var/lib/jenkins/workspace/Cforall_master/libcfa/src/bits/align.hfa /var/lib/jenkins/workspace/Cforall_master/libcfa/src/bits/containers.hfa /var/lib/jenkins/workspace/Cforall_master/libcfa/src/bits/debug.hfa /var/lib/jenkins/workspace/Cforall_master/libcfa/src/bits/defs.hfa /var/lib/jenkins/workspace/Cforall_master/libcfa/src/bits/locks.hfa /var/lib/jenkins/workspace/Cforall_master/libcfa/src/bits/collection.hfa /var/lib/jenkins/workspace/Cforall_master/libcfa/src/bits/stack.hfa /var/lib/jenkins/workspace/Cforall_master/libcfa/src/bits/queue.hfa /var/lib/jenkins/workspace/Cforall_master/libcfa/src/bits/sequence.hfa /var/lib/jenkins/workspace/Cforall_master/libcfa/src/bits/random.hfa '/var/lib/jenkins/workspace/Cforall_master@tmp/include/cfa//bits'
01:40:20  /bin/mkdir -p '/var/lib/jenkins/workspace/Cforall_master@tmp/include/cfa//stdhdr'
01:40:20  /usr/bin/install -c -m 644  /var/lib/jenkins/workspace/Cforall_master/libcfa/src/stdhdr/errno.h /var/lib/jenkins/workspace/Cforall_master/libcfa/src/stdhdr/stdbool.h /var/lib/jenkins/workspace/Cforall_master/libcfa/src/stdhdr/setjmp.h /var/lib/jenkins/workspace/Cforall_master/libcfa/src/stdhdr/stdlib.h /var/lib/jenkins/workspace/Cforall_master/libcfa/src/stdhdr/signal.h /var/lib/jenkins/workspace/Cforall_master/libcfa/src/stdhdr/uchar.h /var/lib/jenkins/workspace/Cforall_master/libcfa/src/stdhdr/float.h /var/lib/jenkins/workspace/Cforall_master/libcfa/src/stdhdr/time.h /var/lib/jenkins/workspace/Cforall_master/libcfa/src/stdhdr/stddef.h /var/lib/jenkins/workspace/Cforall_master/libcfa/src/stdhdr/assert.h /var/lib/jenkins/workspace/Cforall_master/libcfa/src/stdhdr/pthread.h /var/lib/jenkins/workspace/Cforall_master/libcfa/src/stdhdr/math.h /var/lib/jenkins/workspace/Cforall_master/libcfa/src/stdhdr/gmp.h /var/lib/jenkins/workspace/Cforall_master/libcfa/src/stdhdr/ctype.h /var/lib/jenkins/workspace/Cforall_master/libcfa/src/stdhdr/stdnoreturn.h /var/lib/jenkins/workspace/Cforall_master/libcfa/src/stdhdr/tgmath.h /var/lib/jenkins/workspace/Cforall_master/libcfa/src/stdhdr/threads.h /var/lib/jenkins/workspace/Cforall_master/libcfa/src/stdhdr/wctype.h /var/lib/jenkins/workspace/Cforall_master/libcfa/src/stdhdr/string.h /var/lib/jenkins/workspace/Cforall_master/libcfa/src/stdhdr/fenv.h /var/lib/jenkins/workspace/Cforall_master/libcfa/src/stdhdr/unistd.h /var/lib/jenkins/workspace/Cforall_master/libcfa/src/stdhdr/stdarg.h /var/lib/jenkins/workspace/Cforall_master/libcfa/src/stdhdr/stdint.h /var/lib/jenkins/workspace/Cforall_master/libcfa/src/stdhdr/stdio.h /var/lib/jenkins/workspace/Cforall_master/libcfa/src/stdhdr/iso646.h /var/lib/jenkins/workspace/Cforall_master/libcfa/src/stdhdr/wchar.h /var/lib/jenkins/workspace/Cforall_master/libcfa/src/stdhdr/malloc.h /var/lib/jenkins/workspace/Cforall_master/libcfa/src/stdhdr/stdatomic.h /var/lib/jenkins/workspace/Cforall_master/libcfa/src/stdhdr/complex.h /var/lib/jenkins/workspace/Cforall_master/libcfa/src/stdhdr/locale.h /var/lib/jenkins/workspace/Cforall_master/libcfa/src/stdhdr/limits.h /var/lib/jenkins/workspace/Cforall_master/libcfa/src/stdhdr/inttypes.h /var/lib/jenkins/workspace/Cforall_master/libcfa/src/stdhdr/stdalign.h /var/lib/jenkins/workspace/Cforall_master/libcfa/src/stdhdr/unwind.h '/var/lib/jenkins/workspace/Cforall_master@tmp/include/cfa//stdhdr'
01:40:20 libtool: install: (cd /var/lib/jenkins/workspace/Cforall_master@tmp/lib/cfa/x86-nodebug && { ln -s -f libcfa.so.1.0.0 libcfa.so.1 || { rm -f libcfa.so.1 && ln -s libcfa.so.1.0.0 libcfa.so.1; }; })
01:40:20 libtool: install: (cd /var/lib/jenkins/workspace/Cforall_master@tmp/lib/cfa/x86-nodebug && { ln -s -f libcfa.so.1.0.0 libcfa.so || { rm -f libcfa.so && ln -s libcfa.so.1.0.0 libcfa.so; }; })
01:40:20 libtool: install: /usr/bin/install -c .libs/libcfa.lai /var/lib/jenkins/workspace/Cforall_master@tmp/lib/cfa/x86-nodebug/libcfa.la
01:40:20 libtool: install: /usr/bin/install -c .libs/libcfathread.so.1.0.0 /var/lib/jenkins/workspace/Cforall_master@tmp/lib/cfa/x86-nodebug/libcfathread.so.1.0.0
01:40:20 libtool: install: (cd /var/lib/jenkins/workspace/Cforall_master@tmp/lib/cfa/x86-nodebug && { ln -s -f libcfathread.so.1.0.0 libcfathread.so.1 || { rm -f libcfathread.so.1 && ln -s libcfathread.so.1.0.0 libcfathread.so.1; }; })
01:40:20 libtool: install: (cd /var/lib/jenkins/workspace/Cforall_master@tmp/lib/cfa/x86-nodebug && { ln -s -f libcfathread.so.1.0.0 libcfathread.so || { rm -f libcfathread.so && ln -s libcfathread.so.1.0.0 libcfathread.so; }; })
01:40:20 libtool: install: /usr/bin/install -c .libs/libcfathread.lai /var/lib/jenkins/workspace/Cforall_master@tmp/lib/cfa/x86-nodebug/libcfathread.la
01:40:20 libtool: warning: remember to run 'libtool --finish /var/lib/jenkins/workspace/Cforall_master@tmp/lib/cfa/x86-nodebug/'
01:40:20 make[3]: Nothing to be done for 'install-exec-am'.
01:40:20 make[3]: Nothing to be done for 'install-data-am'.
01:40:20 [Pipeline] }
01:40:20 [Pipeline] // dir
01:40:20 [Pipeline] }
01:40:20 [Pipeline] // stage
01:40:20 [Pipeline] sh
01:40:20 + free -h
01:40:20               total        used        free      shared  buff/cache   available
01:40:20 Mem:            15G        222M        9.5G         12M        5.8G         14G
01:40:20 Swap:           15G          0B         15G
01:40:20 [Pipeline] sh
01:40:20 + ulimit -a
01:40:20 time(seconds)        unlimited
01:40:20 file(blocks)         unlimited
01:40:20 data(kbytes)         unlimited
01:40:20 stack(kbytes)        8192
01:40:20 coredump(blocks)     0
01:40:20 memory(kbytes)       unlimited
01:40:20 locked memory(kbytes) 64
01:40:20 process              126672
01:40:20 nofiles              1048576
01:40:20 vmemory(kbytes)      unlimited
01:40:20 locks                unlimited
01:40:20 rtprio               0
01:40:20 [Pipeline] echo
01:40:20  -------- Test: short -------- 
01:40:20 [Pipeline] stage
01:40:20 [Pipeline] { (Test: short)
01:40:20 [Pipeline] }
01:40:20 [Pipeline] // stage
01:40:20 [Pipeline] echo
01:40:20  -------- Test: full -------- 
01:40:20 [Pipeline] stage
01:40:20 [Pipeline] { (Test: full)
01:40:20 [Pipeline] dir
01:40:20 Running in /var/lib/jenkins/workspace/Cforall_master@tmp
01:40:20 [Pipeline] {
01:40:20 [Pipeline] sh
01:40:20 + make --no-print-directory -C tests timeouts=--timeout=600 --global-timeout=14400 all-tests debug=yes archiveerrors=/var/lib/jenkins/workspace/Cforall_master@tmp/tests/crashes/full-debug
01:40:20 Running 212 tests on 6 cores (Default AST (new):x86 - debug)
01:40:20        	array-container/language-dim-mismatch  PASSED     C 0:00.092 - R n/a
01:40:20        	alloc-ERROR                            PASSED     C 0:05.886 - R n/a
01:40:20        	builtins/sync                          PASSED     C 0:08.690 - R 0:00.004
01:40:20        	array                                  PASSED     C 0:14.642 - R 0:00.002
01:40:20        	castError                              PASSED     C 0:00.351 - R n/a
01:40:20        	cast                                   PASSED     C 0:04.847 - R 0:00.003
01:40:20        	array-container/array-basic            PASSED     C 0:21.009 - R 0:00.018
01:40:20        	avl_test                               PASSED     C 0:40.318 - R 0:00.035
01:40:20        	collections/multi_list                 PASSED     C 0:45.446 - R 0:00.035
01:40:20        	collections/queue                      PASSED     C 1:00.941 - R 0:00.035
01:40:20        	alloc                                  PASSED     C 1:32.880 - R 0:00.017
01:40:20        	collections/sequence                   PASSED     C 1:21.140 - R 0:00.017
01:40:20        	concurrent/clib                        PASSED     C 0:28.788 - R 0:00.166
01:40:20        	alloc2                                 PASSED     C 2:13.313 - R 0:00.017
01:40:20        	complex                                PASSED     C 0:51.916 - R 0:00.017
01:40:20        	collections/stack                      PASSED     C 1:08.968 - R 0:00.017
01:40:20        	collections/atomic_mpsc                PASSED     C 1:57.037 - R 0:06.585
01:40:20        	concurrent/clib_tls                    PASSED     C 0:26.744 - R 0:00.066
01:40:20        	concurrent/cluster                     PASSED     C 0:49.409 - R 0:00.066
01:40:20        	concurrent/coroutineYield              PASSED     C 1:17.847 - R 0:00.065
01:40:20        	concurrent/examples/boundedBufferINT   PASSED     C 1:28.458 - R 0:10.564
01:40:20        	concurrent/examples/datingService      PASSED     C 1:40.181 - R 0:00.034
01:40:20        	concurrent/examples/boundedBufferEXT   PASSED     C 1:35.673 - R 0:10.516
01:40:20        	concurrent/examples/gortn              PASSED     C 1:42.425 - R 0:00.034
01:40:20        	concurrent/examples/matrixSum          PASSED     C 2:03.682 - R 0:00.067
01:40:20        	concurrent/futures/basic               PASSED     C 1:00.375 - R 0:00.117
01:40:20        	concurrent/keywordErrors               PASSED     C 0:00.351 - R n/a
01:40:20        	concurrent/futures/abandon             PASSED     C 1:11.359 - R 0:00.117
01:40:20        	concurrent/futures/typed               PASSED     C 0:56.490 - R 0:00.118
01:40:20        	concurrent/examples/quickSort          PASSED     C 1:37.755 - R 0:00.034
01:40:20        	concurrent/futures/multi               PASSED     C 1:09.109 - R 0:00.066
01:40:20        	concurrent/park/contention             PASSED     C 0:29.305 - R 0:00.168
01:40:20        	concurrent/park/start_parked           PASSED     C 0:30.760 - R 0:00.068
01:40:20        	concurrent/join                        PASSED     C 0:59.741 - R 0:00.034
01:40:20        	concurrent/park/force_preempt          PASSED     C 0:59.534 - R 0:00.318
01:40:20        	concurrent/monitor                     PASSED     C 1:00.917 - R 0:30.511
01:40:20        	concurrent/multi-monitor               PASSED     C 1:04.558 - R 0:37.698
01:40:20        	concurrent/preempt                     PASSED     C 1:19.382 - R 0:15.689
01:40:20        	concurrent/semaphore                   PASSED     C 2:24.229 - R 0:00.033
01:40:20        	concurrent/signal/wait                 PASSED     C 1:36.104 - R 0:00.266
01:40:20        	concurrent/signal/block                PASSED     C 2:11.979 - R 0:02.327
01:40:20        	concurrent/signal/disjoint             PASSED     C 2:01.369 - R 0:03.737
01:40:20        	concurrent/sleep                       PASSED     C 1:45.801 - R 0:01.173
01:40:20        	concurrent/spinaphore                  PASSED     C 2:00.001 - R 0:00.617
01:40:20        	concurrent/waitfor/else                PASSED     C 1:01.717 - R 0:00.034
01:40:20        	concurrent/suspend_then                PASSED     C 1:31.131 - R 0:00.065
01:40:20        	concurrent/thread                      PASSED     C 1:28.647 - R 0:00.066
01:40:20        	concurrent/waitfor/dtor                PASSED     C 1:21.054 - R 0:02.176
01:40:20        	const-init                             PASSED     C 0:25.219 - R 0:00.034
01:40:20        	concurrent/waitfor/barge               PASSED     C 1:26.421 - R 0:29.814
01:40:20        	copyfile                               PASSED     C 0:33.752 - R 0:00.018
01:40:20        	coroutine/devicedriver                 PASSED     C 0:34.031 - R 0:00.034
01:40:20        	concurrent/waitfor/statment            PASSED     C 1:04.230 - R 0:00.067
01:40:20        	coroutine/fibonacci                    PASSED     C 0:45.159 - R 0:00.034
01:40:20        	coroutine/fmtLines                     PASSED     C 0:39.753 - R 0:00.034
01:40:20        	concurrent/waitfor/when                PASSED     C 1:13.022 - R 0:02.785
01:40:20        	counter                                PASSED     C 0:11.143 - R 0:00.017
01:40:20        	designations                           PASSED     C 0:01.662 - R 0:00.019
01:40:20        	concurrent/waitfor/recurse             PASSED     C 1:24.071 - R 0:34.438
01:40:20        	coroutine/pingpong                     PASSED     C 1:13.188 - R 0:00.033
01:40:20        	coroutine/runningTotal                 PASSED     C 0:58.199 - R 0:00.034
01:40:20        	errors/declaration                     PASSED     C 0:00.088 - R n/a
01:40:20        	coroutine/prodcons                     PASSED     C 1:09.536 - R 0:00.035
01:40:20        	errors/scope                           PASSED     C 0:00.157 - R n/a
01:40:20        	errors/signature                       PASSED     C 0:00.088 - R n/a
01:40:20        	coroutine/raii                         PASSED     C 1:00.880 - R 0:00.034
01:40:20        	enum                                   PASSED     C 0:07.764 - R 0:00.018
01:40:20        	exceptions/conditional                 PASSED     C 0:09.452 - R 0:00.017
01:40:20        	div                                    PASSED     C 0:51.825 - R 0:00.018
01:40:20        	exceptions/cancel/coroutine            PASSED     C 0:21.282 - R 0:00.034
01:40:20        	exceptions/data-except                 PASSED     C 0:09.651 - R 0:00.017
01:40:20        	exceptions/defaults                    PASSED     C 0:08.878 - R 0:00.034
01:40:20        	exceptions/finally-error               PASSED     C 0:00.204 - R n/a
01:40:20        	exceptions/finally                     PASSED     C 0:04.206 - R 0:00.018
01:40:20        	exceptions/conditional-threads         PASSED     C 0:18.696 - R 0:00.036
01:40:20        	device/cpu                             PASSED     C 1:12.537 - R 0:00.035
01:40:20        	exceptions/interact                    PASSED     C 0:12.238 - R 0:00.034
01:40:20        	exceptions/polymorphic                 PASSED     C 0:12.214 - R 0:00.017
01:40:20        	exceptions/resume                      PASSED     C 0:10.716 - R 0:00.017
01:40:20        	exceptions/cancel/thread               PASSED     C 0:38.147 - R 0:00.033
01:40:20        	exceptions/finally-threads             PASSED     C 0:16.523 - R 0:00.034
01:40:20        	exceptions/type-check                  PASSED     C 0:00.196 - R n/a
01:40:20        	exceptions/defaults-threads            PASSED     C 0:18.909 - R 0:00.033
01:40:20        	exceptions/trash                       PASSED     C 0:02.412 - R 0:00.017
01:40:20        	exceptions/terminate                   PASSED     C 0:04.246 - R 0:00.019
01:40:20        	expression                             PASSED     C 0:15.094 - R 0:00.003
01:40:20        	exceptions/virtual-poly                PASSED     C 0:18.840 - R 0:00.017
01:40:20        	forall                                 PASSED     C 0:03.665 - R 0:00.001
01:40:20        	exceptions/virtual-cast                PASSED     C 0:19.798 - R 0:00.034
01:40:20        	exceptions/resume-threads              PASSED     C 0:22.279 - R 0:00.033
01:40:20        	exceptions/terminate-threads           PASSED     C 0:21.949 - R 0:00.034
01:40:20        	fallthrough                            PASSED     C 0:27.649 - R 0:00.019
01:40:20        	genericUnion                           PASSED     C 0:06.546 - R 0:00.017
01:40:20        	global-monomorph                       PASSED     C 0:15.265 - R 0:00.019
01:40:20        	generator/fibonacci                    PASSED     C 0:38.905 - R 0:00.018
01:40:20        	generator/fmtLines                     PASSED     C 0:38.246 - R 0:00.065
01:40:20        	fstream_test                           PASSED     C 0:40.097 - R 0:00.018
01:40:20        	generator/suspend_then                 PASSED     C 0:39.116 - R 0:00.017
01:40:20        	identFuncDeclarator                    PASSED     C 0:06.684 - R 0:00.002
01:40:20        	identParamDeclarator                   PASSED     C 0:05.998 - R 0:00.017
01:40:20        	function-operator                      PASSED     C 0:50.070 - R 0:00.019
01:40:20        	hello                                  PASSED     C 0:55.897 - R 0:00.018
01:40:20        	ifwhileCtl                             PASSED     C 0:53.925 - R 0:00.017
01:40:20        	identity                               PASSED     C 1:00.132 - R 0:00.018
01:40:20        	include/stdincludes                    PASSED     C 0:52.423 - R 0:00.003
01:40:20        	init1                                  PASSED     C 0:14.016 - R 0:00.003
01:40:20        	include/vector-sequence                PASSED     C 0:16.621 - R 0:00.017
01:40:20        	include/vector-containers              PASSED     C 0:21.813 - R 0:00.116
01:40:20        	init1-ERROR                            PASSED     C 0:00.372 - R n/a
01:40:20        	heap                                   PASSED     C 1:27.522 - R 0:26.778
01:40:20        	include/vector-fstream                 PASSED     C 1:21.157 - R 0:00.035
01:40:20        	labelledExit                           PASSED     C 0:15.167 - R 0:00.001
01:40:20        	limits                                 PASSED     C 0:06.132 - R 0:00.003
01:40:20        	io/manipulatorsOutput4                 PASSED     C 1:34.442 - R 0:01.022
01:40:20        	io/io                                  PASSED     C 1:46.430 - R 0:00.018
01:40:20        	linking/exception-nothreads            PASSED     C 0:25.481 - R 0:00.018
01:40:20        	linking/nostdlib                       PASSED     C 0:20.662 - R 0:00.018
01:40:20        	io/io-acquire                          PASSED     C 2:18.973 - R 0:00.066
01:40:20        	linking/exception-withthreads          PASSED     C 0:49.412 - R 0:00.067
01:40:20        	include/includes                       PASSED     C 3:36.373 - R 0:00.004
01:40:20        	io/many_read                           PASSED     C 1:56.269 - R 0:00.067
01:40:20        	linkonce                               PASSED     C 0:10.789 - R 0:00.019
01:40:20        	linking/io-acquire                     PASSED     C 1:14.985 - R 0:00.018
01:40:20        	linking/nothreads                      PASSED     C 0:49.802 - R 0:00.035
01:40:20        	linking/weakso_nothd                   PASSED     C 0:55.565 - R 0:00.018
01:40:20        	literals                               PASSED     C 0:52.109 - R 0:00.035
01:40:20        	maybe                                  PASSED     C 0:15.073 - R 0:00.035
01:40:20        	nested-types                           PASSED     C 0:06.619 - R 0:00.003
01:40:20        	nested-types-ERR1                      PASSED     C 0:00.105 - R n/a
01:40:20        	nested-types-ERR2                      PASSED     C 0:00.114 - R n/a
01:40:20        	numericConstants                       PASSED     C 0:17.477 - R 0:00.003
01:40:20        	operators                              PASSED     C 0:03.381 - R 0:00.018
01:40:20        	loopctrl                               PASSED     C 0:57.845 - R 0:00.018
01:40:20        	malloc                                 PASSED     C 0:57.714 - R 0:00.035
01:40:20        	poly-d-cycle                           PASSED     C 0:04.740 - R 0:00.018
01:40:20        	poly-selection                         PASSED     C 0:05.402 - R 0:00.018
01:40:20        	poly-o-cycle                           PASSED     C 0:07.213 - R 0:00.018
01:40:20        	quasiKeyword                           PASSED     C 0:03.811 - R 0:00.003
01:40:20        	list/dlist-insert-remove               PASSED     C 1:42.078 - R 0:00.034
01:40:20        	linking/withthreads                    PASSED     C 1:50.078 - R 0:00.034
01:40:20        	raii/ctor-autogen-ERR1                 PASSED     C 0:00.406 - R n/a
01:40:20        	minmax                                 PASSED     C 0:58.675 - R 0:00.019
01:40:20        	raii/ctor-autogen                      PASSED     C 0:20.740 - R 0:00.035
01:40:20        	raii/dtor-early-exit-ERR1              PASSED     C 0:04.786 - R n/a
01:40:20        	raii/dtor-early-exit-ERR2              PASSED     C 0:04.857 - R n/a
01:40:20        	raii/init_once                         PASSED     C 0:20.731 - R 0:00.035
01:40:20        	raii/memberCtors                       PASSED     C 0:09.313 - R 0:00.035
01:40:20        	quotedKeyword                          PASSED     C 0:58.276 - R 0:00.034
01:40:20        	raii/memberCtors-ERR1                  PASSED     C 0:00.494 - R n/a
01:40:20        	raii/boxed-types                       PASSED     C 0:56.847 - R 0:00.019
01:40:20        	polymorphism                           PASSED     C 1:03.686 - R 0:00.018
01:40:20        	raii/globals                           PASSED     C 0:47.140 - R 0:00.018
01:40:20        	raii/dtor-early-exit                   PASSED     C 1:03.859 - R 0:00.035
01:40:20        	result                                 PASSED     C 0:15.777 - R 0:00.034
01:40:20        	simpleGenericTriple                    PASSED     C 0:23.315 - R 0:00.035
01:40:20        	smart-pointers                         PASSED     C 0:24.364 - R 0:00.018
01:40:20        	references                             PASSED     C 0:49.719 - R 0:00.035
01:40:20        	shortCircuit                           PASSED     C 0:54.784 - R 0:00.018
01:40:20        	switch                                 PASSED     C 0:01.773 - R 0:00.004
01:40:20        	searchsort                             PASSED     C 1:09.546 - R 0:00.018
01:40:20        	strstream                              PASSED     C 0:34.429 - R 0:00.018
01:40:20        	sum                                    PASSED     C 0:33.078 - R 0:00.018
01:40:20        	tuple/tupleCast                        PASSED     C 0:27.962 - R 0:00.035
01:40:20        	tuple/tupleFunction                    PASSED     C 0:30.542 - R 0:00.022
01:40:20        	tuple/tupleMember                      PASSED     C 0:04.573 - R 0:00.019
01:40:20        	rational                               PASSED     C 1:47.238 - R 0:00.017
01:40:20        	swap                                   PASSED     C 0:58.419 - R 0:00.018
01:40:20        	typedefRedef-ERR1                      PASSED     C 0:00.106 - R n/a
01:40:20        	tuple/tuplePolymorphism                PASSED     C 0:04.622 - R 0:00.017
01:40:20        	typedefRedef                           PASSED     C 0:01.955 - R 0:00.003
01:40:20        	typeof                                 PASSED     C 0:03.191 - R 0:00.035
01:40:20        	tuple/tupleVariadic                    PASSED     C 0:07.000 - R 0:00.017
01:40:20        	tuple/tupleAssign                      PASSED     C 1:03.283 - R 0:00.035
01:40:20        	time                                   PASSED     C 1:04.986 - R 0:00.035
01:40:20        	variableDeclarator                     PASSED     C 0:09.288 - R 0:00.002
01:40:20        	userLiterals                           PASSED     C 0:30.647 - R 0:00.034
01:40:20        	unified_locking/timeout_lock           PASSED     C 0:54.287 - R 0:01.122
01:40:20        	unified_locking/fast                   PASSED     C 1:04.726 - R 0:00.115
01:40:20        	unified_locking/locks                  PASSED     C 0:58.828 - R 0:14.842
01:40:20        	vector                                 PASSED     C 0:54.110 - R 0:00.018
01:40:20        	unified_locking/mcs                    PASSED     C 1:23.624 - R 0:11.922
01:40:20        	vector_math/vec2_double                PASSED     C 1:37.912 - R 0:00.018
01:40:20        	vector_math/vec2_uint                  PASSED     C 1:32.557 - R 0:00.018
01:40:20        	vector_math/vec2_int                   PASSED     C 2:02.293 - R 0:00.034
01:40:20        	vector_math/vec2_float                 PASSED     C 2:09.117 - R 0:00.018
01:40:20        	voidPtr                                PASSED     C 0:04.265 - R 0:00.019
01:40:20        	KRfunctions                            PASSED     C 0:00.565 - R 0:00.002
01:40:20        	warnings/self-assignment               PASSED     C 0:04.857 - R 0:00.003
01:40:20        	vector_math/vec3_int                   PASSED     C 1:40.858 - R 0:00.018
01:40:20        	vector_math/vec3_float                 PASSED     C 2:00.831 - R 0:00.034
01:40:20        	attributes                             PASSED     C 0:06.053 - R 0:00.049
01:40:20        	array-container/array-md-sbscr-cases   PASSED     C 0:36.448 - R 0:00.018
01:40:20        	ato                                    PASSED     C 0:35.994 - R 0:00.018
01:40:20        	abs                                    PASSED     C 0:43.976 - R 0:00.018
01:40:20        	declarationSpecifier                   PASSED     C 0:03.016 - R 0:00.074
01:40:20        	errors/completeType                    PASSED     C 0:00.375 - R n/a
01:40:20        	extension                              PASSED     C 0:00.680 - R 0:00.002
01:40:20        	functions                              PASSED     C 0:00.638 - R 0:00.043
01:40:20        	gccExtensions                          PASSED     C 0:00.634 - R 0:00.003
01:40:20        	vector_math/vec4_float                 PASSED     C 1:37.927 - R 0:00.018
01:40:20        	vector_math/vec4_int                   PASSED     C 1:44.027 - R 0:00.035
01:40:20        	bitmanip1                              PASSED     C 1:20.061 - R 0:00.017
01:40:20        	io/manipulatorsInput                   PASSED     C 0:59.975 - R 0:00.035
01:40:20        	bitmanip3                              PASSED     C 1:09.200 - R 0:01.072
01:40:20        	meta/archVast                          PASSED     C 0:00.343 - R n/a
01:40:20        	bitmanip2                              PASSED     C 1:43.256 - R 0:01.775
01:40:20        	io/manipulatorsOutput2                 PASSED     C 1:16.606 - R 0:00.035
01:40:20        	io/manipulatorsOutput1                 PASSED     C 1:46.112 - R 0:00.017
01:40:20        	random                                 PASSED     C 1:57.684 - R 0:00.017
01:40:20        	math                                   PASSED     C 2:03.351 - R 0:00.019
01:40:20        	mathX                                  PASSED     C 2:17.938 - R 0:07.406
01:40:20        	vector_math/vec2_ldouble               PASSED     C 3:03.093 - R 0:00.035
01:40:20 Tests took 30:43.948
01:40:20 [Pipeline] sh
01:40:20 + make --no-print-directory -C tests timeouts=--timeout=600 --global-timeout=14400 all-tests debug=no archiveerrors=/var/lib/jenkins/workspace/Cforall_master@tmp/tests/crashes/full-nodebug
01:40:20 Running 212 tests on 6 cores (Default AST (new):x86 - no debug)
01:40:20        	array-container/language-dim-mismatch  PASSED     C 0:00.097 - R n/a
01:40:20        	alloc-ERROR                            PASSED     C 0:05.973 - R n/a
01:40:20        	array                                  PASSED     C 0:06.139 - R 0:00.002
01:40:20        	cast                                   PASSED     C 0:05.830 - R 0:00.002
01:40:20        	castError                              PASSED     C 0:00.350 - R n/a
01:40:20        	array-container/array-basic            PASSED     C 0:19.859 - R 0:00.010
01:40:20        	builtins/sync                          PASSED     C 0:14.296 - R 0:00.003
01:40:20        	avl_test                               PASSED     C 0:37.301 - R 0:00.011
01:40:20        	collections/multi_list                 PASSED     C 0:59.392 - R 0:00.006
01:40:20        	alloc                                  PASSED     C 1:27.733 - R 0:00.004
01:40:20        	collections/queue                      PASSED     C 1:11.302 - R 0:00.004
01:40:20        	collections/sequence                   PASSED     C 0:54.159 - R 0:00.004
01:40:20        	collections/atomic_mpsc                PASSED     C 1:22.218 - R 0:00.768
01:40:20        	concurrent/clib_tls                    PASSED     C 0:41.048 - R 0:00.011
01:40:20        	concurrent/clib                        PASSED     C 0:47.686 - R 0:00.034
01:40:20        	alloc2                                 PASSED     C 2:31.131 - R 0:00.006
01:40:20        	complex                                PASSED     C 1:07.843 - R 0:00.005
01:40:20        	collections/stack                      PASSED     C 1:27.699 - R 0:00.011
01:40:20        	concurrent/cluster                     PASSED     C 1:36.663 - R 0:00.008
01:40:20        	concurrent/coroutineYield              PASSED     C 1:19.336 - R 0:09.916
01:40:20        	concurrent/examples/boundedBufferEXT   PASSED     C 1:31.930 - R 0:01.373
01:40:20        	concurrent/examples/datingService      PASSED     C 1:18.432 - R 0:00.011
01:40:20        	concurrent/examples/boundedBufferINT   PASSED     C 1:23.430 - R 0:01.322
01:40:20        	concurrent/examples/gortn              PASSED     C 1:17.564 - R 0:00.010
01:40:20        	concurrent/examples/matrixSum          PASSED     C 1:27.449 - R 0:00.009
01:40:20        	concurrent/futures/basic               PASSED     C 0:58.315 - R 0:00.019
01:40:20        	concurrent/keywordErrors               PASSED     C 0:00.283 - R n/a
01:40:20        	concurrent/futures/abandon             PASSED     C 1:01.515 - R 0:00.024
01:40:20        	concurrent/futures/typed               PASSED     C 0:52.949 - R 0:00.018
01:40:20        	concurrent/futures/multi               PASSED     C 1:03.976 - R 0:00.009
01:40:20        	concurrent/examples/quickSort          PASSED     C 1:42.266 - R 0:00.011
01:40:20        	concurrent/park/contention             PASSED     C 1:18.566 - R 0:00.034
01:40:20        	concurrent/park/start_parked           PASSED     C 1:06.625 - R 0:00.009
01:40:20        	concurrent/join                        PASSED     C 1:51.699 - R 0:00.008
01:40:20        	concurrent/park/force_preempt          PASSED     C 1:31.388 - R 0:00.269
01:40:20        	concurrent/monitor                     PASSED     C 1:40.309 - R 0:02.170
01:40:20        	concurrent/multi-monitor               PASSED     C 1:38.940 - R 0:03.673
01:40:20        	concurrent/preempt                     PASSED     C 0:43.734 - R 0:15.185
01:40:20        	concurrent/sleep                       PASSED     C 1:16.573 - R 0:01.121
01:40:20        	concurrent/signal/block                PASSED     C 1:35.731 - R 0:00.217
01:40:20        	concurrent/signal/wait                 PASSED     C 1:33.897 - R 0:00.067
01:40:20        	concurrent/signal/disjoint             PASSED     C 1:41.185 - R 0:00.418
01:40:20        	concurrent/semaphore                   PASSED     C 1:56.113 - R 0:00.005
01:40:20        	concurrent/spinaphore                  PASSED     C 1:36.537 - R 0:00.067
01:40:20        	concurrent/suspend_then                PASSED     C 1:36.052 - R 0:01.774
01:40:20        	concurrent/thread                      PASSED     C 1:27.881 - R 0:00.005
01:40:20        	concurrent/waitfor/dtor                PASSED     C 1:27.211 - R 0:00.167
01:40:20        	concurrent/waitfor/barge               PASSED     C 1:32.029 - R 0:15.747
01:40:20        	const-init                             PASSED     C 0:16.463 - R 0:00.010
01:40:20        	concurrent/waitfor/else                PASSED     C 1:40.171 - R 0:00.006
01:40:20        	copyfile                               PASSED     C 0:33.618 - R 0:00.011
01:40:20        	coroutine/devicedriver                 PASSED     C 0:38.826 - R 0:00.010
01:40:20        	concurrent/waitfor/recurse             PASSED     C 1:34.041 - R 0:13.080
01:40:20        	concurrent/waitfor/statment            PASSED     C 1:21.968 - R 0:00.019
01:40:20        	coroutine/fibonacci                    PASSED     C 1:07.382 - R 0:00.011
01:40:20        	concurrent/waitfor/when                PASSED     C 1:44.662 - R 0:03.535
01:40:20        	counter                                PASSED     C 0:03.922 - R 0:00.003
01:40:20        	designations                           PASSED     C 0:06.154 - R 0:00.002
01:40:20        	coroutine/fmtLines                     PASSED     C 1:09.313 - R 0:00.010
01:40:20        	coroutine/pingpong                     PASSED     C 1:20.390 - R 0:00.011
01:40:20        	enum                                   PASSED     C 0:08.600 - R 0:00.004
01:40:20        	errors/declaration                     PASSED     C 0:00.082 - R n/a
01:40:20        	errors/scope                           PASSED     C 0:00.151 - R n/a
01:40:20        	errors/signature                       PASSED     C 0:00.089 - R n/a
01:40:20        	coroutine/raii                         PASSED     C 1:12.495 - R 0:00.006
01:40:20        	coroutine/runningTotal                 PASSED     C 0:52.736 - R 0:00.011
01:40:20        	coroutine/prodcons                     PASSED     C 1:29.941 - R 0:00.004
01:40:20        	exceptions/conditional                 PASSED     C 0:08.003 - R 0:00.002
01:40:20        	exceptions/data-except                 PASSED     C 0:23.926 - R 0:00.006
01:40:20        	exceptions/defaults                    PASSED     C 0:03.435 - R 0:00.006
01:40:20        	exceptions/conditional-threads         PASSED     C 0:34.845 - R 0:00.018
01:40:20        	exceptions/cancel/coroutine            PASSED     C 0:38.499 - R 0:00.011
01:40:20        	exceptions/finally-error               PASSED     C 0:00.207 - R n/a
01:40:20        	exceptions/finally                     PASSED     C 0:13.414 - R 0:00.005
01:40:20        	div                                    PASSED     C 1:23.101 - R 0:00.011
01:40:20        	exceptions/interact                    PASSED     C 0:08.444 - R 0:00.005
01:40:20        	exceptions/finally-threads             PASSED     C 0:22.739 - R 0:00.004
01:40:20        	exceptions/polymorphic                 PASSED     C 0:03.805 - R 0:00.004
01:40:20        	exceptions/cancel/thread               PASSED     C 0:59.997 - R 0:00.004
01:40:20        	exceptions/defaults-threads            PASSED     C 0:24.067 - R 0:00.005
01:40:20        	device/cpu                             PASSED     C 1:33.473 - R 0:00.004
01:40:20        	exceptions/type-check                  PASSED     C 0:00.238 - R n/a
01:40:20        	exceptions/resume                      PASSED     C 0:01.510 - R 0:00.005
01:40:20        	exceptions/trash                       PASSED     C 0:10.037 - R 0:00.006
01:40:20        	exceptions/virtual-poly                PASSED     C 0:10.070 - R 0:00.019
01:40:20        	exceptions/terminate                   PASSED     C 0:11.081 - R 0:00.011
01:40:20        	expression                             PASSED     C 0:06.974 - R 0:00.005
01:40:20        	exceptions/virtual-cast                PASSED     C 0:17.387 - R 0:00.003
01:40:20        	forall                                 PASSED     C 0:25.925 - R 0:00.004
01:40:20        	exceptions/resume-threads              PASSED     C 0:41.707 - R 0:00.011
01:40:20        	exceptions/terminate-threads           PASSED     C 0:43.052 - R 0:00.004
01:40:20        	fallthrough                            PASSED     C 0:50.146 - R 0:00.267
01:40:20        	fstream_test                           PASSED     C 0:43.724 - R 0:00.006
01:40:20        	global-monomorph                       PASSED     C 0:01.350 - R 0:00.006
01:40:20        	generator/fibonacci                    PASSED     C 0:26.355 - R 0:00.005
01:40:20        	genericUnion                           PASSED     C 0:02.893 - R 0:00.018
01:40:20        	identFuncDeclarator                    PASSED     C 0:08.619 - R 0:00.004
01:40:20        	function-operator                      PASSED     C 0:54.806 - R 0:00.004
01:40:20        	generator/suspend_then                 PASSED     C 0:30.067 - R 0:00.006
01:40:20        	generator/fmtLines                     PASSED     C 0:31.516 - R 0:00.005
01:40:20        	identParamDeclarator                   PASSED     C 0:05.813 - R 0:00.005
01:40:20        	hello                                  PASSED     C 0:44.548 - R 0:00.006
01:40:20        	include/vector-containers              PASSED     C 0:30.385 - R 0:00.002
01:40:20        	heap                                   PASSED     C 1:12.618 - R 0:10.922
01:40:20        	identity                               PASSED     C 1:20.936 - R 0:00.005
01:40:20        	include/vector-sequence                PASSED     C 0:07.726 - R 0:00.005
01:40:20        	init1-ERROR                            PASSED     C 0:00.357 - R n/a
01:40:20        	ifwhileCtl                             PASSED     C 1:20.900 - R 0:00.010
01:40:20        	init1                                  PASSED     C 0:22.126 - R 0:00.002
01:40:20        	include/stdincludes                    PASSED     C 1:40.913 - R 0:00.004
01:40:20        	include/vector-fstream                 PASSED     C 1:03.181 - R 0:00.004
01:40:20        	labelledExit                           PASSED     C 0:03.621 - R 0:00.002
01:40:20        	limits                                 PASSED     C 0:08.863 - R 0:00.001
01:40:20        	io/io                                  PASSED     C 1:05.726 - R 0:00.011
01:40:20        	io/io-acquire                          PASSED     C 1:19.906 - R 0:00.035
01:40:20        	linking/exception-nothreads            PASSED     C 0:20.391 - R 0:00.005
01:40:20        	linking/nostdlib                       PASSED     C 0:06.299 - R 0:00.011
01:40:20        	io/manipulatorsOutput4                 PASSED     C 1:16.827 - R 0:00.921
01:40:20        	io/many_read                           PASSED     C 1:31.164 - R 0:00.005
01:40:20        	include/includes                       PASSED     C 3:17.949 - R 0:00.003
01:40:20        	linking/exception-withthreads          PASSED     C 0:57.000 - R 0:00.005
01:40:20        	linkonce                               PASSED     C 0:18.054 - R 0:00.004
01:40:20        	linking/io-acquire                     PASSED     C 1:33.569 - R 0:00.006
01:40:20        	linking/nothreads                      PASSED     C 1:27.034 - R 0:00.011
01:40:20        	linking/weakso_nothd                   PASSED     C 1:16.286 - R 0:00.006
01:40:20        	maybe                                  PASSED     C 0:18.857 - R 0:00.007
01:40:20        	literals                               PASSED     C 1:14.225 - R 0:00.004
01:40:20        	nested-types                           PASSED     C 0:11.827 - R 0:00.003
01:40:20        	nested-types-ERR1                      PASSED     C 0:00.091 - R n/a
01:40:20        	nested-types-ERR2                      PASSED     C 0:00.100 - R n/a
01:40:20        	numericConstants                       PASSED     C 0:02.937 - R 0:00.002
01:40:20        	linking/withthreads                    PASSED     C 1:49.557 - R 0:00.005
01:40:20        	operators                              PASSED     C 0:01.675 - R 0:00.010
01:40:20        	list/dlist-insert-remove               PASSED     C 1:45.592 - R 0:00.010
01:40:20        	loopctrl                               PASSED     C 0:56.308 - R 0:00.006
01:40:20        	poly-d-cycle                           PASSED     C 0:08.736 - R 0:00.003
01:40:20        	poly-o-cycle                           PASSED     C 0:08.386 - R 0:00.005
01:40:20        	poly-selection                         PASSED     C 0:06.448 - R 0:00.005
01:40:20        	minmax                                 PASSED     C 0:46.837 - R 0:00.011
01:40:20        	quasiKeyword                           PASSED     C 0:19.076 - R 0:00.004
01:40:20        	raii/ctor-autogen-ERR1                 PASSED     C 0:00.401 - R n/a
01:40:20        	malloc                                 PASSED     C 1:24.349 - R 0:00.011
01:40:20        	raii/dtor-early-exit-ERR1              PASSED     C 0:06.102 - R n/a
01:40:20        	raii/ctor-autogen                      PASSED     C 0:26.723 - R 0:00.006
01:40:20        	raii/dtor-early-exit-ERR2              PASSED     C 0:06.071 - R n/a
01:40:20        	raii/init_once                         PASSED     C 0:03.922 - R 0:00.002
01:40:20        	raii/memberCtors                       PASSED     C 0:04.382 - R 0:00.010
01:40:20        	raii/memberCtors-ERR1                  PASSED     C 0:00.430 - R n/a
01:40:20        	raii/boxed-types                       PASSED     C 0:46.299 - R 0:00.005
01:40:20        	quotedKeyword                          PASSED     C 0:46.368 - R 0:00.005
01:40:20        	raii/globals                           PASSED     C 0:28.851 - R 0:00.006
01:40:20        	result                                 PASSED     C 0:17.016 - R 0:00.010
01:40:20        	polymorphism                           PASSED     C 1:08.599 - R 0:00.005
01:40:20        	simpleGenericTriple                    PASSED     C 0:10.163 - R 0:00.011
01:40:20        	raii/dtor-early-exit                   PASSED     C 0:57.417 - R 0:00.005
01:40:20        	smart-pointers                         PASSED     C 0:05.876 - R 0:00.005
01:40:20        	references                             PASSED     C 0:36.844 - R 0:00.005
01:40:20        	shortCircuit                           PASSED     C 0:57.308 - R 0:00.005
01:40:20        	switch                                 PASSED     C 0:01.589 - R 0:00.002
01:40:20        	searchsort                             PASSED     C 1:08.713 - R 0:00.010
01:40:20        	strstream                              PASSED     C 1:06.221 - R 0:00.005
01:40:20        	tuple/tupleCast                        PASSED     C 0:08.920 - R 0:00.010
01:40:20        	tuple/tupleFunction                    PASSED     C 0:09.458 - R 0:00.005
01:40:20        	sum                                    PASSED     C 1:23.926 - R 0:00.010
01:40:20        	swap                                   PASSED     C 1:28.990 - R 0:00.010
01:40:20        	tuple/tupleMember                      PASSED     C 0:12.887 - R 0:00.002
01:40:20        	tuple/tuplePolymorphism                PASSED     C 0:13.119 - R 0:00.006
01:40:20        	typedefRedef-ERR1                      PASSED     C 0:00.095 - R n/a
01:40:20        	rational                               PASSED     C 2:14.780 - R 0:00.004
01:40:20        	typedefRedef                           PASSED     C 0:04.937 - R 0:00.001
01:40:20        	typeof                                 PASSED     C 0:02.482 - R 0:00.004
01:40:20        	tuple/tupleVariadic                    PASSED     C 0:09.904 - R 0:00.005
01:40:20        	tuple/tupleAssign                      PASSED     C 0:51.301 - R 0:00.005
01:40:20        	time                                   PASSED     C 1:00.370 - R 0:00.004
01:40:20        	variableDeclarator                     PASSED     C 0:13.487 - R 0:00.003
01:40:20        	userLiterals                           PASSED     C 0:56.629 - R 0:00.011
01:40:20        	unified_locking/timeout_lock           PASSED     C 1:20.694 - R 0:01.071
01:40:20        	vector                                 PASSED     C 1:09.072 - R 0:00.007
01:40:20        	unified_locking/locks                  PASSED     C 1:27.083 - R 0:03.988
01:40:20        	unified_locking/fast                   FAILED with code 1    C 1:49.379 - R 0:00.009
01:40:20 		expected :
01:40:20 		3	Match!
01:40:20 		got :
01:40:20 		3	No Match! 1229302905 vs 1294449793
01:40:20 
01:40:20        	unified_locking/mcs                    PASSED     C 1:51.022 - R 0:01.324
01:40:20        	vector_math/vec2_double                PASSED     C 1:27.419 - R 0:00.011
01:40:20        	vector_math/vec2_uint                  PASSED     C 1:45.938 - R 0:00.010
01:40:20        	vector_math/vec2_int                   PASSED     C 3:02.903 - R 0:00.011
01:40:20        	vector_math/vec2_float                 PASSED     C 3:04.425 - R 0:00.005
01:40:20        	warnings/self-assignment               PASSED     C 0:18.158 - R 0:00.003
01:40:20        	voidPtr                                PASSED     C 0:18.300 - R 0:00.005
01:40:20        	KRfunctions                            PASSED     C 0:00.572 - R 0:00.003
01:40:20        	vector_math/vec3_int                   PASSED     C 3:05.216 - R 0:00.010
01:40:20        	vector_math/vec3_float                 PASSED     C 3:43.639 - R 0:00.011
01:40:20        	attributes                             PASSED     C 0:02.078 - R 0:00.064
01:40:20        	array-container/array-md-sbscr-cases   PASSED     C 0:58.623 - R 0:00.006
01:40:20        	vector_math/vec4_float                 PASSED     C 3:35.645 - R 0:00.005
01:40:20        	abs                                    PASSED     C 1:28.253 - R 0:00.006
01:40:20        	ato                                    PASSED     C 1:17.720 - R 0:00.005
01:40:20        	errors/completeType                    PASSED     C 0:00.356 - R n/a
01:40:20        	extension                              PASSED     C 0:00.613 - R 0:00.005
01:40:20        	functions                              PASSED     C 0:00.570 - R 0:00.019
01:40:20        	declarationSpecifier                   PASSED     C 0:01.892 - R 0:00.087
01:40:20        	gccExtensions                          PASSED     C 0:00.592 - R 0:00.005
01:40:20        	vector_math/vec4_int                   PASSED     C 3:38.016 - R 0:00.004
01:40:20        	bitmanip1                              PASSED     C 1:41.479 - R 0:05.593
01:40:20        	io/manipulatorsInput                   PASSED     C 1:11.615 - R 0:00.011
01:40:20        	bitmanip2                              PASSED     C 1:55.554 - R 0:05.847
01:40:20        	meta/archVast                          PASSED     C 0:00.365 - R n/a
01:40:20        	bitmanip3                              PASSED     C 1:48.880 - R 0:00.568
01:40:20        	random                                 PASSED     C 0:46.261 - R 0:00.006
01:40:20        	math                                   PASSED     C 1:08.864 - R 0:00.011
01:40:20        	mathX                                  PASSED     C 1:26.750 - R 0:03.787
01:40:20        	vector_math/vec2_ldouble               PASSED     C 1:02.114 - R 0:00.011
01:40:20        	io/manipulatorsOutput2                 PASSED     C 3:11.281 - R 0:00.010
01:40:20        	io/manipulatorsOutput1                 PASSED     C 6:27.049 - R 0:00.011
01:40:20 Tests took 35:29.616
01:40:20 Makefile:861: recipe for target 'all-tests' failed
01:40:20 make: *** [all-tests] Error 1
01:40:20 [Pipeline] }
01:40:20 [Pipeline] // dir
01:40:20 [Pipeline] }
01:40:20 [Pipeline] // stage
01:40:20 [Pipeline] echo
01:40:20 Archiving core dumps
01:40:20 [Pipeline] dir
01:40:20 Running in /var/lib/jenkins/workspace/Cforall_master@tmp
01:40:20 [Pipeline] {
01:40:20 [Pipeline] fileExists
01:40:20 [Pipeline] }
01:40:20 [Pipeline] // dir
01:40:20 [Pipeline] }
01:40:20 [Pipeline] // wrap
01:40:20 [Pipeline] }
01:40:20 [Pipeline] // node
01:40:20 [Pipeline] echo
01:40:20 hudson.AbortException: script returned exit code 2
01:40:20 [Pipeline] node
01:40:20 Running on Brokk 5 in /var/lib/jenkins/workspace/Cforall_master
01:40:20 [Pipeline] {
01:40:20 [Pipeline] echo
01:40:20 Notifying users of result
01:40:20 [Pipeline] echo
01:40:20 Reusing previously constructed message
01:40:20 [Pipeline] echo
01:40:20 Would send email to: cforall@lists.uwaterloo.ca
01:40:20 [Pipeline] echo
01:40:20 With title: [cforall git][BUILD# 15468 - FAILURE] - branch master
01:40:20 [Pipeline] echo
01:40:20 Content: 
01:40:20 <p>This is an automated email from the Jenkins build machine. It was
01:40:20 			generated because of a git hooks/post-receive script following
01:40:20 			a ref change which was pushed to the C∀ repository.</p>
01:40:20 
01:40:20 			<p>- Status --------------------------------------------------------------</p>
01:40:20 
01:40:20 			<p>BUILD# 15468 - FAILURE</p>
01:40:20 			<p>Check console output at https://cforall.uwaterloo.ca/jenkins/job/Cforall/job/master/15468/ to view the results.</p>
01:40:20 			
01:40:20 <p>- Changes -------------------------------------------------------------</p>
01:40:20 
01:40:20 <pre>
01:40:20 The branch master has been updated.
01:40:20       from  c7d8696ab8aef324ab4bad76ac71d4ad2bc126dc (commit)
01:40:20 </pre>
01:40:20 
01:40:20 <p>- Log -----------------------------------------------------------------</p>
01:40:20 
01:40:20 <pre>
01:40:20 
01:40:20 </pre>
01:40:20 
01:40:20 <p>-----------------------------------------------------------------------</p>
01:40:20 <pre>
01:40:20 Summary of changes:
01:40:20 
01:40:20 </pre>
01:40:20 
01:40:20 [Pipeline] }
01:40:20 [Pipeline] // node
01:40:20 [Pipeline] echo
01:40:20 Build Completed
01:40:20 [Pipeline] End of Pipeline
01:40:20 ERROR: script returned exit code 2
01:40:20 Finished: FAILURE
[Pipeline] error
[Pipeline] }
01:40:20 Failed in branch gcc_7_x86_new
[Pipeline] // parallel
[Pipeline] }
[Pipeline] // stage
[Pipeline] }
[Pipeline] // wrap
[Pipeline] echo
error caught
[Pipeline] node
Running on Brokk 4 in /var/lib/jenkins/workspace/Cforall_Full_Build
[Pipeline] {
[Pipeline] echo
notifying users
[Pipeline] emailext
Sending email to: cforall@lists.uwaterloo.ca
[Pipeline] }
[Pipeline] // node
[Pipeline] }
[Pipeline] // node
[Pipeline] End of Pipeline
ERROR: FAILURE
Finished: FAILURE