Console Output

Skipping 497 KB.. Full Log
01:40:20        	raii/ctor-autogen                      PASSED     C 0:20.740 - R 0:00.035
01:40:20        	raii/dtor-early-exit-ERR1              PASSED     C 0:04.786 - R n/a
01:40:20        	raii/dtor-early-exit-ERR2              PASSED     C 0:04.857 - R n/a
01:40:20        	raii/init_once                         PASSED     C 0:20.731 - R 0:00.035
01:40:20        	raii/memberCtors                       PASSED     C 0:09.313 - R 0:00.035
01:40:20        	quotedKeyword                          PASSED     C 0:58.276 - R 0:00.034
01:40:20        	raii/memberCtors-ERR1                  PASSED     C 0:00.494 - R n/a
01:40:20        	raii/boxed-types                       PASSED     C 0:56.847 - R 0:00.019
01:40:20        	polymorphism                           PASSED     C 1:03.686 - R 0:00.018
01:40:20        	raii/globals                           PASSED     C 0:47.140 - R 0:00.018
01:40:20        	raii/dtor-early-exit                   PASSED     C 1:03.859 - R 0:00.035
01:40:20        	result                                 PASSED     C 0:15.777 - R 0:00.034
01:40:20        	simpleGenericTriple                    PASSED     C 0:23.315 - R 0:00.035
01:40:20        	smart-pointers                         PASSED     C 0:24.364 - R 0:00.018
01:40:20        	references                             PASSED     C 0:49.719 - R 0:00.035
01:40:20        	shortCircuit                           PASSED     C 0:54.784 - R 0:00.018
01:40:20        	switch                                 PASSED     C 0:01.773 - R 0:00.004
01:40:20        	searchsort                             PASSED     C 1:09.546 - R 0:00.018
01:40:20        	strstream                              PASSED     C 0:34.429 - R 0:00.018
01:40:20        	sum                                    PASSED     C 0:33.078 - R 0:00.018
01:40:20        	tuple/tupleCast                        PASSED     C 0:27.962 - R 0:00.035
01:40:20        	tuple/tupleFunction                    PASSED     C 0:30.542 - R 0:00.022
01:40:20        	tuple/tupleMember                      PASSED     C 0:04.573 - R 0:00.019
01:40:20        	rational                               PASSED     C 1:47.238 - R 0:00.017
01:40:20        	swap                                   PASSED     C 0:58.419 - R 0:00.018
01:40:20        	typedefRedef-ERR1                      PASSED     C 0:00.106 - R n/a
01:40:20        	tuple/tuplePolymorphism                PASSED     C 0:04.622 - R 0:00.017
01:40:20        	typedefRedef                           PASSED     C 0:01.955 - R 0:00.003
01:40:20        	typeof                                 PASSED     C 0:03.191 - R 0:00.035
01:40:20        	tuple/tupleVariadic                    PASSED     C 0:07.000 - R 0:00.017
01:40:20        	tuple/tupleAssign                      PASSED     C 1:03.283 - R 0:00.035
01:40:20        	time                                   PASSED     C 1:04.986 - R 0:00.035
01:40:20        	variableDeclarator                     PASSED     C 0:09.288 - R 0:00.002
01:40:20        	userLiterals                           PASSED     C 0:30.647 - R 0:00.034
01:40:20        	unified_locking/timeout_lock           PASSED     C 0:54.287 - R 0:01.122
01:40:20        	unified_locking/fast                   PASSED     C 1:04.726 - R 0:00.115
01:40:20        	unified_locking/locks                  PASSED     C 0:58.828 - R 0:14.842
01:40:20        	vector                                 PASSED     C 0:54.110 - R 0:00.018
01:40:20        	unified_locking/mcs                    PASSED     C 1:23.624 - R 0:11.922
01:40:20        	vector_math/vec2_double                PASSED     C 1:37.912 - R 0:00.018
01:40:20        	vector_math/vec2_uint                  PASSED     C 1:32.557 - R 0:00.018
01:40:20        	vector_math/vec2_int                   PASSED     C 2:02.293 - R 0:00.034
01:40:20        	vector_math/vec2_float                 PASSED     C 2:09.117 - R 0:00.018
01:40:20        	voidPtr                                PASSED     C 0:04.265 - R 0:00.019
01:40:20        	KRfunctions                            PASSED     C 0:00.565 - R 0:00.002
01:40:20        	warnings/self-assignment               PASSED     C 0:04.857 - R 0:00.003
01:40:20        	vector_math/vec3_int                   PASSED     C 1:40.858 - R 0:00.018
01:40:20        	vector_math/vec3_float                 PASSED     C 2:00.831 - R 0:00.034
01:40:20        	attributes                             PASSED     C 0:06.053 - R 0:00.049
01:40:20        	array-container/array-md-sbscr-cases   PASSED     C 0:36.448 - R 0:00.018
01:40:20        	ato                                    PASSED     C 0:35.994 - R 0:00.018
01:40:20        	abs                                    PASSED     C 0:43.976 - R 0:00.018
01:40:20        	declarationSpecifier                   PASSED     C 0:03.016 - R 0:00.074
01:40:20        	errors/completeType                    PASSED     C 0:00.375 - R n/a
01:40:20        	extension                              PASSED     C 0:00.680 - R 0:00.002
01:40:20        	functions                              PASSED     C 0:00.638 - R 0:00.043
01:40:20        	gccExtensions                          PASSED     C 0:00.634 - R 0:00.003
01:40:20        	vector_math/vec4_float                 PASSED     C 1:37.927 - R 0:00.018
01:40:20        	vector_math/vec4_int                   PASSED     C 1:44.027 - R 0:00.035
01:40:20        	bitmanip1                              PASSED     C 1:20.061 - R 0:00.017
01:40:20        	io/manipulatorsInput                   PASSED     C 0:59.975 - R 0:00.035
01:40:20        	bitmanip3                              PASSED     C 1:09.200 - R 0:01.072
01:40:20        	meta/archVast                          PASSED     C 0:00.343 - R n/a
01:40:20        	bitmanip2                              PASSED     C 1:43.256 - R 0:01.775
01:40:20        	io/manipulatorsOutput2                 PASSED     C 1:16.606 - R 0:00.035
01:40:20        	io/manipulatorsOutput1                 PASSED     C 1:46.112 - R 0:00.017
01:40:20        	random                                 PASSED     C 1:57.684 - R 0:00.017
01:40:20        	math                                   PASSED     C 2:03.351 - R 0:00.019
01:40:20        	mathX                                  PASSED     C 2:17.938 - R 0:07.406
01:40:20        	vector_math/vec2_ldouble               PASSED     C 3:03.093 - R 0:00.035
01:40:20 Tests took 30:43.948
01:40:20 [Pipeline] sh
01:40:20 + make --no-print-directory -C tests timeouts=--timeout=600 --global-timeout=14400 all-tests debug=no archiveerrors=/var/lib/jenkins/workspace/Cforall_master@tmp/tests/crashes/full-nodebug
01:40:20 Running 212 tests on 6 cores (Default AST (new):x86 - no debug)
01:40:20        	array-container/language-dim-mismatch  PASSED     C 0:00.097 - R n/a
01:40:20        	alloc-ERROR                            PASSED     C 0:05.973 - R n/a
01:40:20        	array                                  PASSED     C 0:06.139 - R 0:00.002
01:40:20        	cast                                   PASSED     C 0:05.830 - R 0:00.002
01:40:20        	castError                              PASSED     C 0:00.350 - R n/a
01:40:20        	array-container/array-basic            PASSED     C 0:19.859 - R 0:00.010
01:40:20        	builtins/sync                          PASSED     C 0:14.296 - R 0:00.003
01:40:20        	avl_test                               PASSED     C 0:37.301 - R 0:00.011
01:40:20        	collections/multi_list                 PASSED     C 0:59.392 - R 0:00.006
01:40:20        	alloc                                  PASSED     C 1:27.733 - R 0:00.004
01:40:20        	collections/queue                      PASSED     C 1:11.302 - R 0:00.004
01:40:20        	collections/sequence                   PASSED     C 0:54.159 - R 0:00.004
01:40:20        	collections/atomic_mpsc                PASSED     C 1:22.218 - R 0:00.768
01:40:20        	concurrent/clib_tls                    PASSED     C 0:41.048 - R 0:00.011
01:40:20        	concurrent/clib                        PASSED     C 0:47.686 - R 0:00.034
01:40:20        	alloc2                                 PASSED     C 2:31.131 - R 0:00.006
01:40:20        	complex                                PASSED     C 1:07.843 - R 0:00.005
01:40:20        	collections/stack                      PASSED     C 1:27.699 - R 0:00.011
01:40:20        	concurrent/cluster                     PASSED     C 1:36.663 - R 0:00.008
01:40:20        	concurrent/coroutineYield              PASSED     C 1:19.336 - R 0:09.916
01:40:20        	concurrent/examples/boundedBufferEXT   PASSED     C 1:31.930 - R 0:01.373
01:40:20        	concurrent/examples/datingService      PASSED     C 1:18.432 - R 0:00.011
01:40:20        	concurrent/examples/boundedBufferINT   PASSED     C 1:23.430 - R 0:01.322
01:40:20        	concurrent/examples/gortn              PASSED     C 1:17.564 - R 0:00.010
01:40:20        	concurrent/examples/matrixSum          PASSED     C 1:27.449 - R 0:00.009
01:40:20        	concurrent/futures/basic               PASSED     C 0:58.315 - R 0:00.019
01:40:20        	concurrent/keywordErrors               PASSED     C 0:00.283 - R n/a
01:40:20        	concurrent/futures/abandon             PASSED     C 1:01.515 - R 0:00.024
01:40:20        	concurrent/futures/typed               PASSED     C 0:52.949 - R 0:00.018
01:40:20        	concurrent/futures/multi               PASSED     C 1:03.976 - R 0:00.009
01:40:20        	concurrent/examples/quickSort          PASSED     C 1:42.266 - R 0:00.011
01:40:20        	concurrent/park/contention             PASSED     C 1:18.566 - R 0:00.034
01:40:20        	concurrent/park/start_parked           PASSED     C 1:06.625 - R 0:00.009
01:40:20        	concurrent/join                        PASSED     C 1:51.699 - R 0:00.008
01:40:20        	concurrent/park/force_preempt          PASSED     C 1:31.388 - R 0:00.269
01:40:20        	concurrent/monitor                     PASSED     C 1:40.309 - R 0:02.170
01:40:20        	concurrent/multi-monitor               PASSED     C 1:38.940 - R 0:03.673
01:40:20        	concurrent/preempt                     PASSED     C 0:43.734 - R 0:15.185
01:40:20        	concurrent/sleep                       PASSED     C 1:16.573 - R 0:01.121
01:40:20        	concurrent/signal/block                PASSED     C 1:35.731 - R 0:00.217
01:40:20        	concurrent/signal/wait                 PASSED     C 1:33.897 - R 0:00.067
01:40:20        	concurrent/signal/disjoint             PASSED     C 1:41.185 - R 0:00.418
01:40:20        	concurrent/semaphore                   PASSED     C 1:56.113 - R 0:00.005
01:40:20        	concurrent/spinaphore                  PASSED     C 1:36.537 - R 0:00.067
01:40:20        	concurrent/suspend_then                PASSED     C 1:36.052 - R 0:01.774
01:40:20        	concurrent/thread                      PASSED     C 1:27.881 - R 0:00.005
01:40:20        	concurrent/waitfor/dtor                PASSED     C 1:27.211 - R 0:00.167
01:40:20        	concurrent/waitfor/barge               PASSED     C 1:32.029 - R 0:15.747
01:40:20        	const-init                             PASSED     C 0:16.463 - R 0:00.010
01:40:20        	concurrent/waitfor/else                PASSED     C 1:40.171 - R 0:00.006
01:40:20        	copyfile                               PASSED     C 0:33.618 - R 0:00.011
01:40:20        	coroutine/devicedriver                 PASSED     C 0:38.826 - R 0:00.010
01:40:20        	concurrent/waitfor/recurse             PASSED     C 1:34.041 - R 0:13.080
01:40:20        	concurrent/waitfor/statment            PASSED     C 1:21.968 - R 0:00.019
01:40:20        	coroutine/fibonacci                    PASSED     C 1:07.382 - R 0:00.011
01:40:20        	concurrent/waitfor/when                PASSED     C 1:44.662 - R 0:03.535
01:40:20        	counter                                PASSED     C 0:03.922 - R 0:00.003
01:40:20        	designations                           PASSED     C 0:06.154 - R 0:00.002
01:40:20        	coroutine/fmtLines                     PASSED     C 1:09.313 - R 0:00.010
01:40:20        	coroutine/pingpong                     PASSED     C 1:20.390 - R 0:00.011
01:40:20        	enum                                   PASSED     C 0:08.600 - R 0:00.004
01:40:20        	errors/declaration                     PASSED     C 0:00.082 - R n/a
01:40:20        	errors/scope                           PASSED     C 0:00.151 - R n/a
01:40:20        	errors/signature                       PASSED     C 0:00.089 - R n/a
01:40:20        	coroutine/raii                         PASSED     C 1:12.495 - R 0:00.006
01:40:20        	coroutine/runningTotal                 PASSED     C 0:52.736 - R 0:00.011
01:40:20        	coroutine/prodcons                     PASSED     C 1:29.941 - R 0:00.004
01:40:20        	exceptions/conditional                 PASSED     C 0:08.003 - R 0:00.002
01:40:20        	exceptions/data-except                 PASSED     C 0:23.926 - R 0:00.006
01:40:20        	exceptions/defaults                    PASSED     C 0:03.435 - R 0:00.006
01:40:20        	exceptions/conditional-threads         PASSED     C 0:34.845 - R 0:00.018
01:40:20        	exceptions/cancel/coroutine            PASSED     C 0:38.499 - R 0:00.011
01:40:20        	exceptions/finally-error               PASSED     C 0:00.207 - R n/a
01:40:20        	exceptions/finally                     PASSED     C 0:13.414 - R 0:00.005
01:40:20        	div                                    PASSED     C 1:23.101 - R 0:00.011
01:40:20        	exceptions/interact                    PASSED     C 0:08.444 - R 0:00.005
01:40:20        	exceptions/finally-threads             PASSED     C 0:22.739 - R 0:00.004
01:40:20        	exceptions/polymorphic                 PASSED     C 0:03.805 - R 0:00.004
01:40:20        	exceptions/cancel/thread               PASSED     C 0:59.997 - R 0:00.004
01:40:20        	exceptions/defaults-threads            PASSED     C 0:24.067 - R 0:00.005
01:40:20        	device/cpu                             PASSED     C 1:33.473 - R 0:00.004
01:40:20        	exceptions/type-check                  PASSED     C 0:00.238 - R n/a
01:40:20        	exceptions/resume                      PASSED     C 0:01.510 - R 0:00.005
01:40:20        	exceptions/trash                       PASSED     C 0:10.037 - R 0:00.006
01:40:20        	exceptions/virtual-poly                PASSED     C 0:10.070 - R 0:00.019
01:40:20        	exceptions/terminate                   PASSED     C 0:11.081 - R 0:00.011
01:40:20        	expression                             PASSED     C 0:06.974 - R 0:00.005
01:40:20        	exceptions/virtual-cast                PASSED     C 0:17.387 - R 0:00.003
01:40:20        	forall                                 PASSED     C 0:25.925 - R 0:00.004
01:40:20        	exceptions/resume-threads              PASSED     C 0:41.707 - R 0:00.011
01:40:20        	exceptions/terminate-threads           PASSED     C 0:43.052 - R 0:00.004
01:40:20        	fallthrough                            PASSED     C 0:50.146 - R 0:00.267
01:40:20        	fstream_test                           PASSED     C 0:43.724 - R 0:00.006
01:40:20        	global-monomorph                       PASSED     C 0:01.350 - R 0:00.006
01:40:20        	generator/fibonacci                    PASSED     C 0:26.355 - R 0:00.005
01:40:20        	genericUnion                           PASSED     C 0:02.893 - R 0:00.018
01:40:20        	identFuncDeclarator                    PASSED     C 0:08.619 - R 0:00.004
01:40:20        	function-operator                      PASSED     C 0:54.806 - R 0:00.004
01:40:20        	generator/suspend_then                 PASSED     C 0:30.067 - R 0:00.006
01:40:20        	generator/fmtLines                     PASSED     C 0:31.516 - R 0:00.005
01:40:20        	identParamDeclarator                   PASSED     C 0:05.813 - R 0:00.005
01:40:20        	hello                                  PASSED     C 0:44.548 - R 0:00.006
01:40:20        	include/vector-containers              PASSED     C 0:30.385 - R 0:00.002
01:40:20        	heap                                   PASSED     C 1:12.618 - R 0:10.922
01:40:20        	identity                               PASSED     C 1:20.936 - R 0:00.005
01:40:20        	include/vector-sequence                PASSED     C 0:07.726 - R 0:00.005
01:40:20        	init1-ERROR                            PASSED     C 0:00.357 - R n/a
01:40:20        	ifwhileCtl                             PASSED     C 1:20.900 - R 0:00.010
01:40:20        	init1                                  PASSED     C 0:22.126 - R 0:00.002
01:40:20        	include/stdincludes                    PASSED     C 1:40.913 - R 0:00.004
01:40:20        	include/vector-fstream                 PASSED     C 1:03.181 - R 0:00.004
01:40:20        	labelledExit                           PASSED     C 0:03.621 - R 0:00.002
01:40:20        	limits                                 PASSED     C 0:08.863 - R 0:00.001
01:40:20        	io/io                                  PASSED     C 1:05.726 - R 0:00.011
01:40:20        	io/io-acquire                          PASSED     C 1:19.906 - R 0:00.035
01:40:20        	linking/exception-nothreads            PASSED     C 0:20.391 - R 0:00.005
01:40:20        	linking/nostdlib                       PASSED     C 0:06.299 - R 0:00.011
01:40:20        	io/manipulatorsOutput4                 PASSED     C 1:16.827 - R 0:00.921
01:40:20        	io/many_read                           PASSED     C 1:31.164 - R 0:00.005
01:40:20        	include/includes                       PASSED     C 3:17.949 - R 0:00.003
01:40:20        	linking/exception-withthreads          PASSED     C 0:57.000 - R 0:00.005
01:40:20        	linkonce                               PASSED     C 0:18.054 - R 0:00.004
01:40:20        	linking/io-acquire                     PASSED     C 1:33.569 - R 0:00.006
01:40:20        	linking/nothreads                      PASSED     C 1:27.034 - R 0:00.011
01:40:20        	linking/weakso_nothd                   PASSED     C 1:16.286 - R 0:00.006
01:40:20        	maybe                                  PASSED     C 0:18.857 - R 0:00.007
01:40:20        	literals                               PASSED     C 1:14.225 - R 0:00.004
01:40:20        	nested-types                           PASSED     C 0:11.827 - R 0:00.003
01:40:20        	nested-types-ERR1                      PASSED     C 0:00.091 - R n/a
01:40:20        	nested-types-ERR2                      PASSED     C 0:00.100 - R n/a
01:40:20        	numericConstants                       PASSED     C 0:02.937 - R 0:00.002
01:40:20        	linking/withthreads                    PASSED     C 1:49.557 - R 0:00.005
01:40:20        	operators                              PASSED     C 0:01.675 - R 0:00.010
01:40:20        	list/dlist-insert-remove               PASSED     C 1:45.592 - R 0:00.010
01:40:20        	loopctrl                               PASSED     C 0:56.308 - R 0:00.006
01:40:20        	poly-d-cycle                           PASSED     C 0:08.736 - R 0:00.003
01:40:20        	poly-o-cycle                           PASSED     C 0:08.386 - R 0:00.005
01:40:20        	poly-selection                         PASSED     C 0:06.448 - R 0:00.005
01:40:20        	minmax                                 PASSED     C 0:46.837 - R 0:00.011
01:40:20        	quasiKeyword                           PASSED     C 0:19.076 - R 0:00.004
01:40:20        	raii/ctor-autogen-ERR1                 PASSED     C 0:00.401 - R n/a
01:40:20        	malloc                                 PASSED     C 1:24.349 - R 0:00.011
01:40:20        	raii/dtor-early-exit-ERR1              PASSED     C 0:06.102 - R n/a
01:40:20        	raii/ctor-autogen                      PASSED     C 0:26.723 - R 0:00.006
01:40:20        	raii/dtor-early-exit-ERR2              PASSED     C 0:06.071 - R n/a
01:40:20        	raii/init_once                         PASSED     C 0:03.922 - R 0:00.002
01:40:20        	raii/memberCtors                       PASSED     C 0:04.382 - R 0:00.010
01:40:20        	raii/memberCtors-ERR1                  PASSED     C 0:00.430 - R n/a
01:40:20        	raii/boxed-types                       PASSED     C 0:46.299 - R 0:00.005
01:40:20        	quotedKeyword                          PASSED     C 0:46.368 - R 0:00.005
01:40:20        	raii/globals                           PASSED     C 0:28.851 - R 0:00.006
01:40:20        	result                                 PASSED     C 0:17.016 - R 0:00.010
01:40:20        	polymorphism                           PASSED     C 1:08.599 - R 0:00.005
01:40:20        	simpleGenericTriple                    PASSED     C 0:10.163 - R 0:00.011
01:40:20        	raii/dtor-early-exit                   PASSED     C 0:57.417 - R 0:00.005
01:40:20        	smart-pointers                         PASSED     C 0:05.876 - R 0:00.005
01:40:20        	references                             PASSED     C 0:36.844 - R 0:00.005
01:40:20        	shortCircuit                           PASSED     C 0:57.308 - R 0:00.005
01:40:20        	switch                                 PASSED     C 0:01.589 - R 0:00.002
01:40:20        	searchsort                             PASSED     C 1:08.713 - R 0:00.010
01:40:20        	strstream                              PASSED     C 1:06.221 - R 0:00.005
01:40:20        	tuple/tupleCast                        PASSED     C 0:08.920 - R 0:00.010
01:40:20        	tuple/tupleFunction                    PASSED     C 0:09.458 - R 0:00.005
01:40:20        	sum                                    PASSED     C 1:23.926 - R 0:00.010
01:40:20        	swap                                   PASSED     C 1:28.990 - R 0:00.010
01:40:20        	tuple/tupleMember                      PASSED     C 0:12.887 - R 0:00.002
01:40:20        	tuple/tuplePolymorphism                PASSED     C 0:13.119 - R 0:00.006
01:40:20        	typedefRedef-ERR1                      PASSED     C 0:00.095 - R n/a
01:40:20        	rational                               PASSED     C 2:14.780 - R 0:00.004
01:40:20        	typedefRedef                           PASSED     C 0:04.937 - R 0:00.001
01:40:20        	typeof                                 PASSED     C 0:02.482 - R 0:00.004
01:40:20        	tuple/tupleVariadic                    PASSED     C 0:09.904 - R 0:00.005
01:40:20        	tuple/tupleAssign                      PASSED     C 0:51.301 - R 0:00.005
01:40:20        	time                                   PASSED     C 1:00.370 - R 0:00.004
01:40:20        	variableDeclarator                     PASSED     C 0:13.487 - R 0:00.003
01:40:20        	userLiterals                           PASSED     C 0:56.629 - R 0:00.011
01:40:20        	unified_locking/timeout_lock           PASSED     C 1:20.694 - R 0:01.071
01:40:20        	vector                                 PASSED     C 1:09.072 - R 0:00.007
01:40:20        	unified_locking/locks                  PASSED     C 1:27.083 - R 0:03.988
01:40:20        	unified_locking/fast                   FAILED with code 1    C 1:49.379 - R 0:00.009
01:40:20 		expected :
01:40:20 		3	Match!
01:40:20 		got :
01:40:20 		3	No Match! 1229302905 vs 1294449793
01:40:20 
01:40:20        	unified_locking/mcs                    PASSED     C 1:51.022 - R 0:01.324
01:40:20        	vector_math/vec2_double                PASSED     C 1:27.419 - R 0:00.011
01:40:20        	vector_math/vec2_uint                  PASSED     C 1:45.938 - R 0:00.010
01:40:20        	vector_math/vec2_int                   PASSED     C 3:02.903 - R 0:00.011
01:40:20        	vector_math/vec2_float                 PASSED     C 3:04.425 - R 0:00.005
01:40:20        	warnings/self-assignment               PASSED     C 0:18.158 - R 0:00.003
01:40:20        	voidPtr                                PASSED     C 0:18.300 - R 0:00.005
01:40:20        	KRfunctions                            PASSED     C 0:00.572 - R 0:00.003
01:40:20        	vector_math/vec3_int                   PASSED     C 3:05.216 - R 0:00.010
01:40:20        	vector_math/vec3_float                 PASSED     C 3:43.639 - R 0:00.011
01:40:20        	attributes                             PASSED     C 0:02.078 - R 0:00.064
01:40:20        	array-container/array-md-sbscr-cases   PASSED     C 0:58.623 - R 0:00.006
01:40:20        	vector_math/vec4_float                 PASSED     C 3:35.645 - R 0:00.005
01:40:20        	abs                                    PASSED     C 1:28.253 - R 0:00.006
01:40:20        	ato                                    PASSED     C 1:17.720 - R 0:00.005
01:40:20        	errors/completeType                    PASSED     C 0:00.356 - R n/a
01:40:20        	extension                              PASSED     C 0:00.613 - R 0:00.005
01:40:20        	functions                              PASSED     C 0:00.570 - R 0:00.019
01:40:20        	declarationSpecifier                   PASSED     C 0:01.892 - R 0:00.087
01:40:20        	gccExtensions                          PASSED     C 0:00.592 - R 0:00.005
01:40:20        	vector_math/vec4_int                   PASSED     C 3:38.016 - R 0:00.004
01:40:20        	bitmanip1                              PASSED     C 1:41.479 - R 0:05.593
01:40:20        	io/manipulatorsInput                   PASSED     C 1:11.615 - R 0:00.011
01:40:20        	bitmanip2                              PASSED     C 1:55.554 - R 0:05.847
01:40:20        	meta/archVast                          PASSED     C 0:00.365 - R n/a
01:40:20        	bitmanip3                              PASSED     C 1:48.880 - R 0:00.568
01:40:20        	random                                 PASSED     C 0:46.261 - R 0:00.006
01:40:20        	math                                   PASSED     C 1:08.864 - R 0:00.011
01:40:20        	mathX                                  PASSED     C 1:26.750 - R 0:03.787
01:40:20        	vector_math/vec2_ldouble               PASSED     C 1:02.114 - R 0:00.011
01:40:20        	io/manipulatorsOutput2                 PASSED     C 3:11.281 - R 0:00.010
01:40:20        	io/manipulatorsOutput1                 PASSED     C 6:27.049 - R 0:00.011
01:40:20 Tests took 35:29.616
01:40:20 Makefile:861: recipe for target 'all-tests' failed
01:40:20 make: *** [all-tests] Error 1
01:40:20 [Pipeline] }
01:40:20 [Pipeline] // dir
01:40:20 [Pipeline] }
01:40:20 [Pipeline] // stage
01:40:20 [Pipeline] echo
01:40:20 Archiving core dumps
01:40:20 [Pipeline] dir
01:40:20 Running in /var/lib/jenkins/workspace/Cforall_master@tmp
01:40:20 [Pipeline] {
01:40:20 [Pipeline] fileExists
01:40:20 [Pipeline] }
01:40:20 [Pipeline] // dir
01:40:20 [Pipeline] }
01:40:20 [Pipeline] // wrap
01:40:20 [Pipeline] }
01:40:20 [Pipeline] // node
01:40:20 [Pipeline] echo
01:40:20 hudson.AbortException: script returned exit code 2
01:40:20 [Pipeline] node
01:40:20 Running on Brokk 5 in /var/lib/jenkins/workspace/Cforall_master
01:40:20 [Pipeline] {
01:40:20 [Pipeline] echo
01:40:20 Notifying users of result
01:40:20 [Pipeline] echo
01:40:20 Reusing previously constructed message
01:40:20 [Pipeline] echo
01:40:20 Would send email to: cforall@lists.uwaterloo.ca
01:40:20 [Pipeline] echo
01:40:20 With title: [cforall git][BUILD# 15468 - FAILURE] - branch master
01:40:20 [Pipeline] echo
01:40:20 Content: 
01:40:20 <p>This is an automated email from the Jenkins build machine. It was
01:40:20 			generated because of a git hooks/post-receive script following
01:40:20 			a ref change which was pushed to the C∀ repository.</p>
01:40:20 
01:40:20 			<p>- Status --------------------------------------------------------------</p>
01:40:20 
01:40:20 			<p>BUILD# 15468 - FAILURE</p>
01:40:20 			<p>Check console output at https://cforall.uwaterloo.ca/jenkins/job/Cforall/job/master/15468/ to view the results.</p>
01:40:20 			
01:40:20 <p>- Changes -------------------------------------------------------------</p>
01:40:20 
01:40:20 <pre>
01:40:20 The branch master has been updated.
01:40:20       from  c7d8696ab8aef324ab4bad76ac71d4ad2bc126dc (commit)
01:40:20 </pre>
01:40:20 
01:40:20 <p>- Log -----------------------------------------------------------------</p>
01:40:20 
01:40:20 <pre>
01:40:20 
01:40:20 </pre>
01:40:20 
01:40:20 <p>-----------------------------------------------------------------------</p>
01:40:20 <pre>
01:40:20 Summary of changes:
01:40:20 
01:40:20 </pre>
01:40:20 
01:40:20 [Pipeline] }
01:40:20 [Pipeline] // node
01:40:20 [Pipeline] echo
01:40:20 Build Completed
01:40:20 [Pipeline] End of Pipeline
01:40:20 ERROR: script returned exit code 2
01:40:20 Finished: FAILURE
[Pipeline] error
[Pipeline] }
01:40:20 Failed in branch gcc_7_x86_new
[Pipeline] // parallel
[Pipeline] }
[Pipeline] // stage
[Pipeline] }
[Pipeline] // wrap
[Pipeline] echo
error caught
[Pipeline] node
Running on Brokk 4 in /var/lib/jenkins/workspace/Cforall_Full_Build
[Pipeline] {
[Pipeline] echo
notifying users
[Pipeline] emailext
Sending email to: cforall@lists.uwaterloo.ca
[Pipeline] }
[Pipeline] // node
[Pipeline] }
[Pipeline] // node
[Pipeline] End of Pipeline
ERROR: FAILURE
Finished: FAILURE