Console Output

Skipping 723 KB.. Full Log
23:30:13 /var/lib/jenkins/workspace/Cforall_Distribute_Ref@tmp/cfa-cc-1.0.0.1765/_build/sub/../../libcfa/src/stdlib.hfa:154:100: warning: ‘_X4_srcS6S_fill_Y12__T_generic___1._X4sizem_1’ is used uninitialized in this function [-Wuninitialized]
23:30:13   154 |  struct S_fill   { char tag; char c; size_t size; T * at; char t[50]; };
23:30:13       |                                                                  ~~~~~~~                           ^          
23:30:13 /var/lib/jenkins/workspace/Cforall_Distribute_Ref@tmp/cfa-cc-1.0.0.1765/_build/sub/../../libcfa/src/stdlib.hfa:154:130: warning: ‘_X4_srcS6S_fill_Y12__T_generic___1._X2atPY12__T_generic__1’ is used uninitialized in this function [-Wuninitialized]
23:30:13   154 |  struct S_fill   { char tag; char c; size_t size; T * at; char t[50]; };
23:30:13       |                                                                                                                                  ^                       
23:30:13 /usr/include/x86_64-linux-gnu/bits/socket.h: In function ‘_X16_operator_assignFS7cmsghdr_S7cmsghdrS7cmsghdr_autogen___1’:
23:30:13 /usr/include/x86_64-linux-gnu/bits/socket.h:285:44: note: the ABI of passing struct with a flexible array member has changed in GCC 4.4
23:30:13   285 |     __extension__ unsigned char __cmsg_data __flexarr; /* Ancillary data.  */
23:30:13       |                                            ^~~~~~~
23:30:13 /usr/include/x86_64-linux-gnu/bits/socket.h: In function ‘_X16_operator_assignFS7cmsghdr_S7cmsghdrS7cmsghdr_autogen___1’:
23:30:13 /usr/include/x86_64-linux-gnu/bits/socket.h:285:44: note: the ABI of passing struct with a flexible array member has changed in GCC 4.4
23:30:13   285 |     __extension__ unsigned char __cmsg_data __flexarr; /* Ancillary data.  */
23:30:13       |                                            ^~~~~~~
23:30:13 /var/lib/jenkins/workspace/Cforall_Distribute_Ref@tmp/cfa-cc-1.0.0.1765/_build/sub/../../libcfa/src/concurrency/clib/cfathread.cfa: In function ‘cfathread_cluster_add_worker’:
23:30:13 /var/lib/jenkins/workspace/Cforall_Distribute_Ref@tmp/cfa-cc-1.0.0.1765/_build/sub/../../libcfa/src/stdlib.hfa:154:97: warning: ‘_X4_srcS6S_fill_Y12__T_generic___1._X1cc_1’ may be used uninitialized in this function [-Wmaybe-uninitialized]
23:30:13   154 |  struct S_fill   { char tag; char c; size_t size; T * at; char t[50]; };
23:30:13       |                                                               ~~~~~~~~~~                        ^       
23:30:13 /var/lib/jenkins/workspace/Cforall_Distribute_Ref@tmp/cfa-cc-1.0.0.1765/_build/sub/../../libcfa/src/stdlib.hfa:154:100: warning: ‘_X4_srcS6S_fill_Y12__T_generic___1._X4sizem_1’ may be used uninitialized in this function [-Wmaybe-uninitialized]
23:30:13   154 |  struct S_fill   { char tag; char c; size_t size; T * at; char t[50]; };
23:30:13       |                                                                  ~~~~~~~                           ^          
23:30:13 /var/lib/jenkins/workspace/Cforall_Distribute_Ref@tmp/cfa-cc-1.0.0.1765/_build/sub/../../libcfa/src/stdlib.hfa:154:130: warning: ‘_X4_srcS6S_fill_Y12__T_generic___1._X2atPY12__T_generic__1’ may be used uninitialized in this function [-Wmaybe-uninitialized]
23:30:13   154 |  struct S_fill   { char tag; char c; size_t size; T * at; char t[50]; };
23:30:13       |                                                                                                                                  ^                       
23:30:13   CCLD     libcfathread.la
23:30:13 make[4]: Leaving directory '/var/lib/jenkins/workspace/Cforall_Distribute_Ref@tmp/cfa-cc-1.0.0.1765/_build/sub/libcfa/x64-nodebug/src'
23:30:13 make[4]: Entering directory '/var/lib/jenkins/workspace/Cforall_Distribute_Ref@tmp/cfa-cc-1.0.0.1765/_build/sub/libcfa/x64-nodebug'
23:30:13 make[4]: Nothing to be done for 'all-am'.
23:30:13 make[4]: Leaving directory '/var/lib/jenkins/workspace/Cforall_Distribute_Ref@tmp/cfa-cc-1.0.0.1765/_build/sub/libcfa/x64-nodebug'
23:30:13 make[3]: Leaving directory '/var/lib/jenkins/workspace/Cforall_Distribute_Ref@tmp/cfa-cc-1.0.0.1765/_build/sub/libcfa/x64-nodebug'
23:30:13 make[2]: Leaving directory '/var/lib/jenkins/workspace/Cforall_Distribute_Ref@tmp/cfa-cc-1.0.0.1765/_build/sub'
23:30:13 make[1]: Leaving directory '/var/lib/jenkins/workspace/Cforall_Distribute_Ref@tmp/cfa-cc-1.0.0.1765/_build/sub'
23:30:13 make[1]: Entering directory '/var/lib/jenkins/workspace/Cforall_Distribute_Ref@tmp/cfa-cc-1.0.0.1765/_build/sub'
23:30:13 Making dvi in driver
23:30:13 make[2]: Entering directory '/var/lib/jenkins/workspace/Cforall_Distribute_Ref@tmp/cfa-cc-1.0.0.1765/_build/sub/driver'
23:30:13 make[2]: Nothing to be done for 'dvi'.
23:30:13 make[2]: Leaving directory '/var/lib/jenkins/workspace/Cforall_Distribute_Ref@tmp/cfa-cc-1.0.0.1765/_build/sub/driver'
23:30:13 Making dvi in src
23:30:13 make[2]: Entering directory '/var/lib/jenkins/workspace/Cforall_Distribute_Ref@tmp/cfa-cc-1.0.0.1765/_build/sub/src'
23:30:13 make[2]: Nothing to be done for 'dvi'.
23:30:13 make[2]: Leaving directory '/var/lib/jenkins/workspace/Cforall_Distribute_Ref@tmp/cfa-cc-1.0.0.1765/_build/sub/src'
23:30:13 Making dvi in .
23:30:13 make[2]: Entering directory '/var/lib/jenkins/workspace/Cforall_Distribute_Ref@tmp/cfa-cc-1.0.0.1765/_build/sub'
23:30:13 make[2]: Nothing to be done for 'dvi-am'.
23:30:13 make[2]: Leaving directory '/var/lib/jenkins/workspace/Cforall_Distribute_Ref@tmp/cfa-cc-1.0.0.1765/_build/sub'
23:30:13 Making dvi in libcfa/x64-debug
23:30:13 make[2]: Entering directory '/var/lib/jenkins/workspace/Cforall_Distribute_Ref@tmp/cfa-cc-1.0.0.1765/_build/sub/libcfa/x64-debug'
23:30:13 Making dvi in prelude
23:30:13 make[3]: Entering directory '/var/lib/jenkins/workspace/Cforall_Distribute_Ref@tmp/cfa-cc-1.0.0.1765/_build/sub/libcfa/x64-debug/prelude'
23:30:13 make[3]: Nothing to be done for 'dvi'.
23:30:13 make[3]: Leaving directory '/var/lib/jenkins/workspace/Cforall_Distribute_Ref@tmp/cfa-cc-1.0.0.1765/_build/sub/libcfa/x64-debug/prelude'
23:30:13 Making dvi in src
23:30:13 make[3]: Entering directory '/var/lib/jenkins/workspace/Cforall_Distribute_Ref@tmp/cfa-cc-1.0.0.1765/_build/sub/libcfa/x64-debug/src'
23:30:13 make[3]: Nothing to be done for 'dvi'.
23:30:13 make[3]: Leaving directory '/var/lib/jenkins/workspace/Cforall_Distribute_Ref@tmp/cfa-cc-1.0.0.1765/_build/sub/libcfa/x64-debug/src'
23:30:13 make[3]: Entering directory '/var/lib/jenkins/workspace/Cforall_Distribute_Ref@tmp/cfa-cc-1.0.0.1765/_build/sub/libcfa/x64-debug'
23:30:13 make[3]: Nothing to be done for 'dvi-am'.
23:30:13 make[3]: Leaving directory '/var/lib/jenkins/workspace/Cforall_Distribute_Ref@tmp/cfa-cc-1.0.0.1765/_build/sub/libcfa/x64-debug'
23:30:13 make[2]: Leaving directory '/var/lib/jenkins/workspace/Cforall_Distribute_Ref@tmp/cfa-cc-1.0.0.1765/_build/sub/libcfa/x64-debug'
23:30:13 Making dvi in libcfa/x64-nodebug
23:30:13 make[2]: Entering directory '/var/lib/jenkins/workspace/Cforall_Distribute_Ref@tmp/cfa-cc-1.0.0.1765/_build/sub/libcfa/x64-nodebug'
23:30:13 Making dvi in prelude
23:30:13 make[3]: Entering directory '/var/lib/jenkins/workspace/Cforall_Distribute_Ref@tmp/cfa-cc-1.0.0.1765/_build/sub/libcfa/x64-nodebug/prelude'
23:30:13 make[3]: Nothing to be done for 'dvi'.
23:30:13 make[3]: Leaving directory '/var/lib/jenkins/workspace/Cforall_Distribute_Ref@tmp/cfa-cc-1.0.0.1765/_build/sub/libcfa/x64-nodebug/prelude'
23:30:13 Making dvi in src
23:30:13 make[3]: Entering directory '/var/lib/jenkins/workspace/Cforall_Distribute_Ref@tmp/cfa-cc-1.0.0.1765/_build/sub/libcfa/x64-nodebug/src'
23:30:13 make[3]: Nothing to be done for 'dvi'.
23:30:13 make[3]: Leaving directory '/var/lib/jenkins/workspace/Cforall_Distribute_Ref@tmp/cfa-cc-1.0.0.1765/_build/sub/libcfa/x64-nodebug/src'
23:30:13 make[3]: Entering directory '/var/lib/jenkins/workspace/Cforall_Distribute_Ref@tmp/cfa-cc-1.0.0.1765/_build/sub/libcfa/x64-nodebug'
23:30:13 make[3]: Nothing to be done for 'dvi-am'.
23:30:13 make[3]: Leaving directory '/var/lib/jenkins/workspace/Cforall_Distribute_Ref@tmp/cfa-cc-1.0.0.1765/_build/sub/libcfa/x64-nodebug'
23:30:13 make[2]: Leaving directory '/var/lib/jenkins/workspace/Cforall_Distribute_Ref@tmp/cfa-cc-1.0.0.1765/_build/sub/libcfa/x64-nodebug'
23:30:13 make[1]: Leaving directory '/var/lib/jenkins/workspace/Cforall_Distribute_Ref@tmp/cfa-cc-1.0.0.1765/_build/sub'
23:30:13 make[1]: Entering directory '/var/lib/jenkins/workspace/Cforall_Distribute_Ref@tmp/cfa-cc-1.0.0.1765/_build/sub'
23:30:13 Making check in driver
23:30:13 make[2]: Entering directory '/var/lib/jenkins/workspace/Cforall_Distribute_Ref@tmp/cfa-cc-1.0.0.1765/_build/sub/driver'
23:30:13 make[2]: Nothing to be done for 'check'.
23:30:13 make[2]: Leaving directory '/var/lib/jenkins/workspace/Cforall_Distribute_Ref@tmp/cfa-cc-1.0.0.1765/_build/sub/driver'
23:30:13 Making check in src
23:30:13 make[2]: Entering directory '/var/lib/jenkins/workspace/Cforall_Distribute_Ref@tmp/cfa-cc-1.0.0.1765/_build/sub/src'
23:30:13 make  check-am
23:30:13 make[3]: Entering directory '/var/lib/jenkins/workspace/Cforall_Distribute_Ref@tmp/cfa-cc-1.0.0.1765/_build/sub/src'
23:30:13 make[3]: Nothing to be done for 'check-am'.
23:30:13 make[3]: Leaving directory '/var/lib/jenkins/workspace/Cforall_Distribute_Ref@tmp/cfa-cc-1.0.0.1765/_build/sub/src'
23:30:13 make[2]: Leaving directory '/var/lib/jenkins/workspace/Cforall_Distribute_Ref@tmp/cfa-cc-1.0.0.1765/_build/sub/src'
23:30:13 Making check in .
23:30:13 make[2]: Entering directory '/var/lib/jenkins/workspace/Cforall_Distribute_Ref@tmp/cfa-cc-1.0.0.1765/_build/sub'
23:30:13 make[2]: Leaving directory '/var/lib/jenkins/workspace/Cforall_Distribute_Ref@tmp/cfa-cc-1.0.0.1765/_build/sub'
23:30:13 Making check in libcfa/x64-debug
23:30:13 make[2]: Entering directory '/var/lib/jenkins/workspace/Cforall_Distribute_Ref@tmp/cfa-cc-1.0.0.1765/_build/sub/libcfa/x64-debug'
23:30:13 Making check in prelude
23:30:13 make[3]: Entering directory '/var/lib/jenkins/workspace/Cforall_Distribute_Ref@tmp/cfa-cc-1.0.0.1765/_build/sub/libcfa/x64-debug/prelude'
23:30:13 make[3]: Leaving directory '/var/lib/jenkins/workspace/Cforall_Distribute_Ref@tmp/cfa-cc-1.0.0.1765/_build/sub/libcfa/x64-debug/prelude'
23:30:13 Making check in src
23:30:13 make[3]: Entering directory '/var/lib/jenkins/workspace/Cforall_Distribute_Ref@tmp/cfa-cc-1.0.0.1765/_build/sub/libcfa/x64-debug/src'
23:30:13 make[3]: Nothing to be done for 'check'.
23:30:13 make[3]: Leaving directory '/var/lib/jenkins/workspace/Cforall_Distribute_Ref@tmp/cfa-cc-1.0.0.1765/_build/sub/libcfa/x64-debug/src'
23:30:13 make[3]: Entering directory '/var/lib/jenkins/workspace/Cforall_Distribute_Ref@tmp/cfa-cc-1.0.0.1765/_build/sub/libcfa/x64-debug'
23:30:13 make[3]: Nothing to be done for 'check-am'.
23:30:13 make[3]: Leaving directory '/var/lib/jenkins/workspace/Cforall_Distribute_Ref@tmp/cfa-cc-1.0.0.1765/_build/sub/libcfa/x64-debug'
23:30:13 make[2]: Leaving directory '/var/lib/jenkins/workspace/Cforall_Distribute_Ref@tmp/cfa-cc-1.0.0.1765/_build/sub/libcfa/x64-debug'
23:30:13 Making check in libcfa/x64-nodebug
23:30:13 make[2]: Entering directory '/var/lib/jenkins/workspace/Cforall_Distribute_Ref@tmp/cfa-cc-1.0.0.1765/_build/sub/libcfa/x64-nodebug'
23:30:13 Making check in prelude
23:30:13 make[3]: Entering directory '/var/lib/jenkins/workspace/Cforall_Distribute_Ref@tmp/cfa-cc-1.0.0.1765/_build/sub/libcfa/x64-nodebug/prelude'
23:30:13 make[3]: Leaving directory '/var/lib/jenkins/workspace/Cforall_Distribute_Ref@tmp/cfa-cc-1.0.0.1765/_build/sub/libcfa/x64-nodebug/prelude'
23:30:13 Making check in src
23:30:13 make[3]: Entering directory '/var/lib/jenkins/workspace/Cforall_Distribute_Ref@tmp/cfa-cc-1.0.0.1765/_build/sub/libcfa/x64-nodebug/src'
23:30:13 make[3]: Nothing to be done for 'check'.
23:30:13 make[3]: Leaving directory '/var/lib/jenkins/workspace/Cforall_Distribute_Ref@tmp/cfa-cc-1.0.0.1765/_build/sub/libcfa/x64-nodebug/src'
23:30:13 make[3]: Entering directory '/var/lib/jenkins/workspace/Cforall_Distribute_Ref@tmp/cfa-cc-1.0.0.1765/_build/sub/libcfa/x64-nodebug'
23:30:13 make[3]: Nothing to be done for 'check-am'.
23:30:13 make[3]: Leaving directory '/var/lib/jenkins/workspace/Cforall_Distribute_Ref@tmp/cfa-cc-1.0.0.1765/_build/sub/libcfa/x64-nodebug'
23:30:13 make[2]: Leaving directory '/var/lib/jenkins/workspace/Cforall_Distribute_Ref@tmp/cfa-cc-1.0.0.1765/_build/sub/libcfa/x64-nodebug'
23:30:13 make -C tests all-tests installed=no debug=yes
23:30:13 make[2]: Entering directory '/var/lib/jenkins/workspace/Cforall_Distribute_Ref@tmp/cfa-cc-1.0.0.1765/_build/sub/tests'
23:30:13 Running 213 tests on 7 cores (Default AST (new):x64 - debug)
23:30:13        	array                                 PASSED     C 0:00.479 - R 0:00.001
23:30:13        	builtins/sync                         PASSED     C 0:00.613 - R 0:00.002
23:30:13        	castError                             PASSED     C 0:00.258 - R n/a
23:30:13        	cast                                  PASSED     C 0:00.476 - R 0:00.001
23:30:13        	array-container/array-basic           PASSED     C 0:01.298 - R 0:00.017
23:30:13        	avl_test                              PASSED     C 0:01.961 - R 0:00.016
23:30:13        	alloc-ERROR                           PASSED     C 0:03.465 - R n/a
23:30:13        	alloc                                 PASSED     C 0:06.761 - R 0:00.016
23:30:13        	collections/multi_list                PASSED     C 0:05.817 - R 0:00.016
23:30:13        	alloc2                                PASSED     C 0:09.063 - R 0:00.017
23:30:13        	concurrent/clib                       PASSED     C 0:02.782 - R 0:00.164
23:30:13        	collections/stack                     PASSED     C 0:06.471 - R 0:00.016
23:30:13        	collections/queue                     PASSED     C 0:09.384 - R 0:00.016
23:30:13        	complex                               PASSED     C 0:04.296 - R 0:00.016
23:30:13        	collections/sequence                  PASSED     C 0:09.675 - R 0:00.016
23:30:13        	concurrent/clib_tls                   PASSED     C 0:02.813 - R 0:00.215
23:30:13        	collections/atomic_mpsc               PASSED     C 0:08.025 - R 0:04.072
23:30:13        	concurrent/cluster                    PASSED     C 0:06.007 - R 0:00.164
23:30:13        	concurrent/coroutineYield             PASSED     C 0:08.248 - R 0:00.114
23:30:13        	concurrent/examples/datingService     PASSED     C 0:08.231 - R 0:00.114
23:30:13        	concurrent/examples/gortn             PASSED     C 0:08.157 - R 0:00.064
23:30:13        	concurrent/examples/matrixSum         PASSED     C 0:07.972 - R 0:00.164
23:30:13        	concurrent/examples/quickSort         PASSED     C 0:08.479 - R 0:00.064
23:30:13        	concurrent/futures/abandon            PASSED     C 0:06.379 - R 0:00.164
23:30:13        	concurrent/keywordErrors              PASSED     C 0:00.152 - R n/a
23:30:13        	concurrent/examples/boundedBufferEXT  PASSED     C 0:08.410 - R 0:06.574
23:30:13        	concurrent/examples/boundedBufferINT  PASSED     C 0:08.274 - R 0:06.373
23:30:13        	concurrent/futures/basic              PASSED     C 0:06.353 - R 0:00.165
23:30:13        	concurrent/futures/typed              PASSED     C 0:06.646 - R 0:00.114
23:30:13        	concurrent/futures/multi              PASSED     C 0:07.841 - R 0:00.115
23:30:13        	concurrent/park/contention            PASSED     C 0:06.176 - R 0:00.165
23:30:13        	concurrent/join                       PASSED     C 0:08.340 - R 0:00.064
23:30:13        	concurrent/park/start_parked          PASSED     C 0:06.134 - R 0:00.114
23:30:13        	concurrent/park/force_preempt         PASSED     C 0:08.354 - R 0:00.315
23:30:13        	concurrent/semaphore                  PASSED     C 0:08.741 - R 0:00.114
23:30:13        	concurrent/signal/block               PASSED     C 0:08.835 - R 0:01.467
23:30:13        	concurrent/signal/wait                PASSED     C 0:08.475 - R 0:00.214
23:30:13        	concurrent/signal/disjoint            FAILED with code 1    C 0:08.533 - R 0:02.418
23:30:13 		new lines : 
23:30:13 		1	ERROR Eager signal 2
23:30:13 
23:30:13        	concurrent/preempt                    PASSED     C 0:06.501 - R 0:14.085
23:30:13        	concurrent/sleep                      PASSED     C 0:08.232 - R 0:01.217
23:30:13        	concurrent/spinaphore                 PASSED     C 0:08.958 - R 0:00.415
23:30:13        	concurrent/suspend_then               PASSED     C 0:08.890 - R 0:00.114
23:30:13        	concurrent/monitor                    PASSED     C 0:07.883 - R 0:20.200
23:30:13        	concurrent/thread                     PASSED     C 0:08.821 - R 0:00.114
23:30:13        	concurrent/multi-monitor              PASSED     C 0:07.934 - R 0:22.405
23:30:13        	const-init                            PASSED     C 0:00.599 - R 0:00.016
23:30:13        	concurrent/waitfor/barge              PASSED     C 0:08.050 - R 0:00.315
23:30:13        	concurrent/waitfor/else               PASSED     C 0:06.445 - R 0:00.114
23:30:13        	concurrent/waitfor/dtor               PASSED     C 0:07.869 - R 0:01.317
23:30:13        	copyfile                              PASSED     C 0:04.394 - R 0:00.016
23:30:13        	concurrent/waitfor/statment           PASSED     C 0:09.194 - R 0:00.114
23:30:13        	concurrent/waitfor/when               PASSED     C 0:08.547 - R 0:00.164
23:30:13        	coroutine/devicedriver                PASSED     C 0:05.635 - R 0:00.115
23:30:13        	concurrent/waitfor/recurse            PASSED     C 0:09.391 - R 0:01.016
23:30:13        	counter                               PASSED     C 0:00.532 - R 0:00.016
23:30:13        	coroutine/fibonacci                   PASSED     C 0:05.163 - R 0:00.114
23:30:13        	designations                          PASSED     C 0:00.636 - R 0:00.016
23:30:13        	coroutine/fmtLines                    PASSED     C 0:05.193 - R 0:00.115
23:30:13        	enum                                  PASSED     C 0:00.521 - R 0:00.016
23:30:13        	errors/declaration                    PASSED     C 0:00.060 - R n/a
23:30:13        	errors/scope                          PASSED     C 0:00.106 - R n/a
23:30:13        	errors/signature                      PASSED     C 0:00.062 - R n/a
23:30:13        	coroutine/pingpong                    PASSED     C 0:05.089 - R 0:00.065
23:30:13        	coroutine/raii                        PASSED     C 0:05.087 - R 0:00.064
23:30:13        	coroutine/runningTotal                PASSED     C 0:05.105 - R 0:00.065
23:30:13        	exceptions/conditional                PASSED     C 0:00.613 - R 0:00.016
23:30:13        	coroutine/prodcons                    PASSED     C 0:06.554 - R 0:00.114
23:30:13        	exceptions/data-except                PASSED     C 0:00.596 - R 0:00.016
23:30:13        	exceptions/cancel/coroutine           PASSED     C 0:03.509 - R 0:00.064
23:30:13        	div                                   PASSED     C 0:05.285 - R 0:00.016
23:30:13        	exceptions/finally                    PASSED     C 0:00.607 - R 0:00.008
23:30:13        	exceptions/finally-error              PASSED     C 0:00.151 - R n/a
23:30:13        	exceptions/defaults                   PASSED     C 0:00.938 - R 0:00.016
23:30:13        	device/cpu                            PASSED     C 0:06.229 - R 0:00.016
23:30:13        	exceptions/interact                   PASSED     C 0:00.895 - R 0:00.016
23:30:13        	exceptions/polymorphic                PASSED     C 0:00.880 - R 0:00.016
23:30:13        	exceptions/resume                     PASSED     C 0:00.784 - R 0:00.016
23:30:13        	exceptions/conditional-threads        PASSED     C 0:03.455 - R 0:00.065
23:30:13        	exceptions/terminate                  PASSED     C 0:00.788 - R 0:00.016
23:30:13        	exceptions/type-check                 PASSED     C 0:00.148 - R n/a
23:30:13        	exceptions/trash                      PASSED     C 0:00.618 - R 0:00.016
23:30:13        	exceptions/cancel/thread              PASSED     C 0:06.157 - R 0:00.065
23:30:13        	expression                            PASSED     C 0:00.500 - R 0:00.001
23:30:13        	exceptions/virtual-poly               PASSED     C 0:00.690 - R 0:00.016
23:30:13        	exceptions/defaults-threads           PASSED     C 0:03.993 - R 0:00.064
23:30:13        	exceptions/virtual-cast               PASSED     C 0:01.481 - R 0:00.016
23:30:13        	exceptions/finally-threads            PASSED     C 0:03.609 - R 0:00.065
23:30:13        	forall                                PASSED     C 0:00.904 - R 0:00.001
23:30:13        	exceptions/resume-threads             PASSED     C 0:03.664 - R 0:00.065
23:30:13        	exceptions/terminate-threads          PASSED     C 0:03.783 - R 0:00.064
23:30:13        	genericUnion                          PASSED     C 0:00.606 - R 0:00.016
23:30:13        	global-monomorph                      PASSED     C 0:00.535 - R 0:00.016
23:30:13        	fallthrough                           PASSED     C 0:04.197 - R 0:00.017
23:30:13        	fstream_test                          PASSED     C 0:04.300 - R 0:00.016
23:30:13        	generator/fibonacci                   PASSED     C 0:04.109 - R 0:00.016
23:30:13        	identParamDeclarator                  PASSED     C 0:00.668 - R 0:00.112
23:30:13        	generator/fmtLines                    PASSED     C 0:04.495 - R 0:00.078
23:30:13        	identFuncDeclarator                   PASSED     C 0:00.953 - R 0:00.199
23:30:13        	generator/suspend_then                PASSED     C 0:04.444 - R 0:00.016
23:30:13        	function-operator                     PASSED     C 0:05.890 - R 0:00.016
23:30:13        	hello                                 PASSED     C 0:04.159 - R 0:00.016
23:30:13        	include/vector-containers             PASSED     C 0:02.596 - R 0:00.016
23:30:13        	include/vector-sequence               PASSED     C 0:00.995 - R 0:00.016
23:30:13        	ifwhileCtl                            PASSED     C 0:04.518 - R 0:00.016
23:30:13        	identity                              PASSED     C 0:04.663 - R 0:00.016
23:30:13        	init1-ERROR                           PASSED     C 0:00.256 - R n/a
23:30:13        	init1                                 PASSED     C 0:00.484 - R 0:00.001
23:30:13        	include/stdincludes                   PASSED     C 0:05.512 - R 0:00.001
23:30:13        	include/vector-fstream                PASSED     C 0:04.193 - R 0:00.016
23:30:13        	labelledExit                          PASSED     C 0:00.489 - R 0:00.001
23:30:13        	limits                                PASSED     C 0:00.487 - R 0:00.001
23:30:13        	linking/exception-nothreads           PASSED     C 0:01.462 - R 0:00.017
23:30:13        	io/manipulatorsOutput4                PASSED     C 0:06.985 - R 0:00.016
23:30:13        	linking/exception-withthreads         PASSED     C 0:04.548 - R 0:00.065
23:30:13        	io/io-acquire                         PASSED     C 0:09.341 - R 0:00.164
23:30:13        	linking/nostdlib                      PASSED     C 0:00.547 - R 0:00.016
23:30:13        	io/many_read                          PASSED     C 0:09.596 - R 0:00.114
23:30:13        	include/includes                      PASSED     C 0:16.079 - R 0:00.001
23:30:13        	linkonce                              PASSED     C 0:00.570 - R 0:00.008
23:30:13        	io/io                                 PASSED     C 0:12.402 - R 0:00.016
23:30:13        	linking/io-acquire                    PASSED     C 0:05.476 - R 0:00.016
23:30:13        	linking/nothreads                     PASSED     C 0:05.184 - R 0:00.016
23:30:13        	linking/weakso_nothd                  PASSED     C 0:05.127 - R 0:00.016
23:30:13        	heap                                  PASSED     C 0:06.806 - R 0:15.792
23:30:13        	maybe                                 PASSED     C 0:00.761 - R 0:00.016
23:30:13        	nested-types                          PASSED     C 0:00.497 - R 0:00.001
23:30:13        	nested-types-ERR1                     PASSED     C 0:00.065 - R n/a
23:30:13        	nested-types-ERR2                     PASSED     C 0:00.106 - R n/a
23:30:13        	literals                              PASSED     C 0:04.448 - R 0:00.016
23:30:13        	numericConstants                      PASSED     C 0:00.454 - R 0:00.001
23:30:13        	operators                             PASSED     C 0:00.528 - R 0:00.016
23:30:13        	poly-d-cycle                          PASSED     C 0:00.538 - R 0:00.016
23:30:13        	poly-o-cycle                          PASSED     C 0:00.572 - R 0:00.016
23:30:13        	poly-selection                        PASSED     C 0:00.596 - R 0:00.016
23:30:13        	loopctrl                              PASSED     C 0:06.073 - R 0:00.016
23:30:13        	quasiKeyword                          PASSED     C 0:00.509 - R 0:00.001
23:30:13        	linking/withthreads                   PASSED     C 0:07.982 - R 0:00.065
23:30:13        	raii/ctor-autogen                     PASSED     C 0:01.104 - R 0:00.016
23:30:13        	malloc                                PASSED     C 0:05.546 - R 0:00.016
23:30:13        	raii/ctor-autogen-ERR1                PASSED     C 0:00.300 - R n/a
23:30:13        	polymorphism                          PASSED     C 0:04.276 - R 0:00.016
23:30:13        	list/dlist-insert-remove              PASSED     C 0:10.315 - R 0:00.016
23:30:13        	minmax                                PASSED     C 0:06.963 - R 0:00.016
23:30:13        	quotedKeyword                         PASSED     C 0:04.085 - R 0:00.016
23:30:13        	raii/boxed-types                      PASSED     C 0:04.245 - R 0:00.008
23:30:13        	raii/memberCtors-ERR1                 PASSED     C 0:00.333 - R n/a
23:30:13        	raii/init_once                        PASSED     C 0:00.633 - R 0:00.016
23:30:13        	raii/memberCtors                      PASSED     C 0:00.619 - R 0:00.016
23:30:13        	raii/dtor-early-exit-ERR1             PASSED     C 0:03.245 - R n/a
23:30:13        	result                                PASSED     C 0:00.954 - R 0:00.016
23:30:13        	raii/dtor-early-exit-ERR2             PASSED     C 0:03.269 - R n/a
23:30:13        	raii/dtor-early-exit                  PASSED     C 0:05.752 - R 0:00.016
23:30:13        	simpleGenericTriple                   PASSED     C 0:00.667 - R 0:00.016
23:30:13        	raii/globals                          PASSED     C 0:04.342 - R 0:00.016
23:30:13        	smart-pointers                        PASSED     C 0:00.751 - R 0:00.016
23:30:13        	references                            PASSED     C 0:04.965 - R 0:00.016
23:30:13        	shortCircuit                          PASSED     C 0:04.274 - R 0:00.016
23:30:13        	switch                                PASSED     C 0:00.472 - R 0:00.001
23:30:13        	searchsort                            PASSED     C 0:06.826 - R 0:00.016
23:30:13        	strstream                             PASSED     C 0:04.479 - R 0:00.016
23:30:13        	tuple/tupleCast                       PASSED     C 0:00.519 - R 0:00.016
23:30:13        	tuple/tupleFunction                   PASSED     C 0:00.653 - R 0:00.016
23:30:13        	sum                                   PASSED     C 0:05.292 - R 0:00.086
23:30:13        	tuple/tupleMember                     PASSED     C 0:00.965 - R 0:00.043
23:30:13        	tuple/tuplePolymorphism               PASSED     C 0:00.960 - R 0:00.016
23:30:13        	typedefRedef-ERR1                     PASSED     C 0:00.062 - R n/a
23:30:13        	typedefRedef                          PASSED     C 0:00.464 - R 0:00.001
23:30:13        	typeof                                PASSED     C 0:00.521 - R 0:00.016
23:30:13        	swap                                  PASSED     C 0:06.781 - R 0:00.016
23:30:13        	tuple/tupleVariadic                   PASSED     C 0:01.593 - R 0:00.016
23:30:13        	rational                              PASSED     C 0:10.482 - R 0:00.016
23:30:13        	tuple/tupleAssign                     PASSED     C 0:05.513 - R 0:00.016
23:30:13        	time                                  PASSED     C 0:05.910 - R 0:00.016
23:30:13        	variableDeclarator                    PASSED     C 0:00.476 - R 0:00.001
23:30:13        	userLiterals                          PASSED     C 0:04.576 - R 0:00.016
23:30:13        	vector_math/vec2_double               PASSED     C 0:05.962 - R 0:00.016
23:30:13        	vector                                PASSED     C 0:06.488 - R 0:00.016
23:30:13        	unified_locking/fast                  PASSED     C 0:08.889 - R 0:00.114
23:30:13        	unified_locking/timeout_lock          PASSED     C 0:07.552 - R 0:01.116
23:30:13        	vector_math/vec2_uint                 PASSED     C 0:05.907 - R 0:00.016
23:30:13        	unified_locking/locks                 PASSED     C 0:08.027 - R 0:08.583
23:30:13        	vector_math/vec2_float                PASSED     C 0:11.121 - R 0:00.016
23:30:13        	unified_locking/mcs                   PASSED     C 0:08.763 - R 0:07.378
23:30:13        	voidPtr                               PASSED     C 0:00.556 - R 0:00.016
23:30:13        	warnings/self-assignment              PASSED     C 0:00.460 - R 0:00.001
23:30:13        	KRfunctions                           PASSED     C 0:00.418 - R 0:00.001
23:30:13        	vector_math/vec2_int                  PASSED     C 0:11.132 - R 0:00.016
23:30:13        	vector_math/vec3_int                  PASSED     C 0:09.621 - R 0:00.016
23:30:13        	attributes                            PASSED     C 0:00.532 - R 0:00.001
23:30:13        	vector_math/vec3_float                PASSED     C 0:10.978 - R 0:00.016
23:30:13        	abs                                   PASSED     C 0:05.864 - R 0:00.016
23:30:13        	ato                                   PASSED     C 0:05.615 - R 0:00.016
23:30:13        	declarationSpecifier                  PASSED     C 0:00.497 - R 0:00.001
23:30:13        	errors/completeType                   PASSED     C 0:00.259 - R n/a
23:30:13        	vector_math/vec4_float                PASSED     C 0:11.398 - R 0:00.016
23:30:13        	extension                             PASSED     C 0:00.456 - R 0:00.001
23:30:13        	functions                             PASSED     C 0:00.426 - R 0:00.001
23:30:13        	array-container/array-md-sbscr-cases  PASSED     C 0:08.694 - R 0:00.016
23:30:13        	gccExtensions                         PASSED     C 0:00.426 - R 0:00.001
23:30:13        	vector_math/vec4_int                  PASSED     C 0:10.085 - R 0:00.016
23:30:13        	bitmanip1                             PASSED     C 0:09.688 - R 0:00.016
23:30:13        	bitmanip3                             PASSED     C 0:07.195 - R 0:00.016
23:30:13        	bitmanip2                             PASSED     C 0:10.776 - R 0:00.016
23:30:13        	io/manipulatorsInput                  PASSED     C 0:06.276 - R 0:00.016
23:30:13        	gmp                                   PASSED     C 0:06.699 - R 0:00.016
23:30:13        	meta/archVast                         PASSED     C 0:00.249 - R n/a
23:30:13        	io/manipulatorsOutput2                PASSED     C 0:08.055 - R 0:00.016
23:30:13        	io/manipulatorsOutput1                PASSED     C 0:11.384 - R 0:00.016
23:30:13        	random                                PASSED     C 0:05.444 - R 0:00.016
23:30:13        	vector_math/vec2_ldouble              PASSED     C 0:05.922 - R 0:00.016
23:30:13        	io/manipulatorsOutput3                PASSED     C 0:12.621 - R 0:00.016
23:30:13        	math                                  PASSED     C 0:12.027 - R 0:00.017
23:30:13        	mathX                                 PASSED     C 0:18.714 - R 0:00.033
23:30:13 Tests took  2:46.208
23:30:13 make[2]: *** [Makefile:879: all-tests] Error 1
23:30:13 make[2]: Leaving directory '/var/lib/jenkins/workspace/Cforall_Distribute_Ref@tmp/cfa-cc-1.0.0.1765/_build/sub/tests'
23:30:13 make[1]: *** [Makefile:951: check] Error 2
23:30:13 make[1]: Leaving directory '/var/lib/jenkins/workspace/Cforall_Distribute_Ref@tmp/cfa-cc-1.0.0.1765/_build/sub'
23:30:13 make: *** [Makefile:734: distcheck] Error 1
23:30:13 [Pipeline] }
23:30:13 [Pipeline] // dir
23:30:13 [Pipeline] }
23:30:13 [Pipeline] // stage
23:30:13 [Pipeline] }
23:30:13 [Pipeline] // wrap
23:30:13 [Pipeline] }
23:30:13 [Pipeline] // node
23:30:13 [Pipeline] End of Pipeline
23:30:13 ERROR: script returned exit code 2
23:30:13 Finished: FAILURE
[Pipeline] error
[Pipeline] }
[Pipeline] // stage
[Pipeline] }
[Pipeline] // wrap
[Pipeline] echo
error caught
[Pipeline] node
Running on Brokk 3 in /var/lib/jenkins/workspace/Cforall_Full_Build
[Pipeline] {
[Pipeline] echo
notifying users
[Pipeline] emailext
Sending email to: cforall@lists.uwaterloo.ca
[Pipeline] }
[Pipeline] // node
[Pipeline] }
[Pipeline] // node
[Pipeline] End of Pipeline
ERROR: FAILURE
Finished: FAILURE