Console Output

Started by timer
Running as Jenkins Build User
Checking out git cforall@plg.uwaterloo.ca:software/cfa/cfa-cc into /var/lib/jenkins/workspace/Cforall_Full_Build@script to read Jenkins/FullBuild
The recommended git tool is: NONE
using credential git_key_aug20
 > git rev-parse --resolve-git-dir /var/lib/jenkins/workspace/Cforall_Full_Build@script/.git # timeout=10
Fetching changes from the remote Git repository
 > git config remote.origin.url cforall@plg.uwaterloo.ca:software/cfa/cfa-cc # timeout=10
Fetching upstream changes from cforall@plg.uwaterloo.ca:software/cfa/cfa-cc
 > git --version # timeout=10
 > git --version # 'git version 2.25.1'
using GIT_SSH to set credentials SSH key used for git, ed25519 generated August 2020
 > git fetch --tags --force --progress -- cforall@plg.uwaterloo.ca:software/cfa/cfa-cc +refs/heads/*:refs/remotes/origin/* # timeout=10
 > git rev-parse refs/remotes/origin/master^{commit} # timeout=10
Checking out Revision 02f4eb8677a64f5dfecc2133d01badd254fc0793 (refs/remotes/origin/master)
 > git config core.sparsecheckout # timeout=10
 > git checkout -f 02f4eb8677a64f5dfecc2133d01badd254fc0793 # timeout=10
Commit message: "simplify change for section .data attribute for global constructors"
 > git rev-list --no-walk 381495789427d10a74449ea5dff50edf33656ba2 # timeout=10
Resume disabled by user, switching to high-performance, low-durability mode.
[Pipeline] Start of Pipeline
[Pipeline] node
Running on Brokk 3 in /var/lib/jenkins/workspace/Cforall_Full_Build
[Pipeline] {
[Pipeline] checkout
The recommended git tool is: NONE
using credential git_key_aug20
Fetching changes from the remote Git repository
 > git rev-parse --resolve-git-dir /var/lib/jenkins/workspace/Cforall_Full_Build/.git # timeout=10
 > git config remote.origin.url cforall@plg.uwaterloo.ca:software/cfa/cfa-cc # timeout=10
Fetching upstream changes from cforall@plg.uwaterloo.ca:software/cfa/cfa-cc
 > git --version # timeout=10
 > git --version # 'git version 2.25.1'
using GIT_SSH to set credentials SSH key used for git, ed25519 generated August 2020
 > git fetch --tags --force --progress -- cforall@plg.uwaterloo.ca:software/cfa/cfa-cc +refs/heads/*:refs/remotes/origin/* # timeout=10
Checking out Revision 02f4eb8677a64f5dfecc2133d01badd254fc0793 (refs/remotes/origin/master)
Commit message: "simplify change for section .data attribute for global constructors"
[Pipeline] wrap
[Pipeline] {
[Pipeline] stage
[Pipeline] { (Build)
[Pipeline] parallel
[Pipeline] { (Branch: gcc_8_x86_new)
[Pipeline] { (Branch: gcc_7_x86_new)
[Pipeline] { (Branch: gcc_6_x86_new)
[Pipeline] { (Branch: gcc_9_x64_new)
[Pipeline] { (Branch: gcc_8_x64_new)
[Pipeline] { (Branch: gcc_7_x64_new)
[Pipeline] { (Branch: gcc_6_x64_new)
[Pipeline] { (Branch: gcc_5_x64_new)
[Pipeline] { (Branch: clang_x64_new)
[Pipeline] sleep
22:47:04 Sleeping for 1 min 0 sec
[Pipeline] sleep
22:47:04 Sleeping for 3 min 0 sec
[Pipeline] sleep
22:47:04 Sleeping for 4 min 0 sec
[Pipeline] sleep
22:47:04 No need to sleep any longer
[Pipeline] sleep
22:47:04 Sleeping for 3 min 0 sec
[Pipeline] sleep
22:47:04 No need to sleep any longer
[Pipeline] sleep
22:47:04 Sleeping for 2 min 0 sec
[Pipeline] sleep
22:47:04 Sleeping for 3 min 0 sec
[Pipeline] sleep
22:47:04 Sleeping for 1 min 0 sec
[Pipeline] build
22:47:04 Scheduling project: Cforall » master
[Pipeline] build
22:47:04 Scheduling project: Cforall » master
 > git rev-parse refs/remotes/origin/master^{commit} # timeout=10
 > git config core.sparsecheckout # timeout=10
 > git checkout -f 02f4eb8677a64f5dfecc2133d01badd254fc0793 # timeout=10
22:47:13 Starting building: Cforall » master #15441
22:47:13 Starting building: Cforall » master #15442
[Pipeline] build
22:48:04 Scheduling project: Cforall » master
[Pipeline] build
22:48:04 Scheduling project: Cforall » master
22:48:13 Starting building: Cforall » master #15443
22:48:13 Starting building: Cforall » master #15444
[Pipeline] build
22:49:04 Scheduling project: Cforall » master
22:49:13 Starting building: Cforall » master #15445
[Pipeline] build
22:50:04 Scheduling project: Cforall » master
[Pipeline] build
22:50:04 Scheduling project: Cforall » master
[Pipeline] build
22:50:04 Scheduling project: Cforall » master
22:50:13 Starting building: Cforall » master #15446
22:50:13 Starting building: Cforall » master #15447
22:50:13 Starting building: Cforall » master #15448
[Pipeline] build
22:51:04 Scheduling project: Cforall » master
22:51:13 Starting building: Cforall » master #15449
[Pipeline] echo
22:58:42 SUCCESS
[Pipeline] }
[Pipeline] echo
22:59:51 SUCCESS
[Pipeline] }
[Pipeline] echo
23:00:50 SUCCESS
[Pipeline] }
[Pipeline] echo
23:00:52 SUCCESS
[Pipeline] }
[Pipeline] echo
23:01:37 SUCCESS
[Pipeline] }
[Pipeline] echo
23:02:59 SUCCESS
[Pipeline] }
[Pipeline] echo
23:16:47 SUCCESS
[Pipeline] }
[Pipeline] echo
23:18:13 SUCCESS
[Pipeline] }
[Pipeline] echo
00:49:31 FAILURE
[Pipeline] sh
00:49:31 + wget -q -O - https://cforall.uwaterloo.ca/jenkins/job/Cforall/job/master/15446/consoleText
00:49:31 Started by upstream project "Cforall_Full_Build" build number 1764
00:49:31 originally caused by:
00:49:31  Started by timer
00:49:31 Running as Jenkins Build User
00:49:31  > git rev-parse --resolve-git-dir /var/lib/jenkins/caches/git-914b6fdde163b7e17ee75d99ca23f18a/.git # timeout=10
00:49:31 Setting origin to cforall@plg.uwaterloo.ca:software/cfa/cfa-cc
00:49:31  > git config remote.origin.url cforall@plg.uwaterloo.ca:software/cfa/cfa-cc # timeout=10
00:49:31 Fetching origin...
00:49:31 Fetching upstream changes from origin
00:49:31  > git --version # timeout=10
00:49:31  > git --version # 'git version 2.25.1'
00:49:31  > git config --get remote.origin.url # timeout=10
00:49:31 using GIT_SSH to set credentials SSH key used for git, ed25519 generated August 2020
00:49:31  > git fetch --tags --force --progress -- origin +refs/heads/*:refs/remotes/origin/* # timeout=10
00:49:31 Seen branch in repository origin/aaron-thesis
00:49:31 Seen branch in repository origin/arm-eh
00:49:31 Seen branch in repository origin/cleanup-dtors
00:49:31 Seen branch in repository origin/ctor
00:49:31 Seen branch in repository origin/deferred_resn
00:49:31 Seen branch in repository origin/demangler
00:49:31 Seen branch in repository origin/gc_noraii
00:49:31 Seen branch in repository origin/jacob/cs343-translation
00:49:31 Seen branch in repository origin/jenkins-sandbox
00:49:31 Seen branch in repository origin/master
00:49:31 Seen branch in repository origin/memory
00:49:31 Seen branch in repository origin/new-ast
00:49:31 Seen branch in repository origin/new-env
00:49:31 Seen branch in repository origin/no_list
00:49:31 Seen branch in repository origin/persistent-indexer
00:49:31 Seen branch in repository origin/resolv-new
00:49:31 Seen branch in repository origin/string
00:49:31 Seen branch in repository origin/with_gc
00:49:31 Seen 18 remote branches
00:49:31 Obtained Jenkinsfile from 02f4eb8677a64f5dfecc2133d01badd254fc0793
00:49:31 Running in Durability level: PERFORMANCE_OPTIMIZED
00:49:31 [Pipeline] Start of Pipeline
00:49:31 [Pipeline] node
00:49:31 Running on Brokk 1 in /var/lib/jenkins/workspace/Cforall_master
00:49:31 [Pipeline] {
00:49:31 [Pipeline] wrap
00:49:31 [Pipeline] {
00:49:31 [Pipeline] properties
00:49:31 WARNING: Unknown parameter(s) found for class type 'hudson.model.ChoiceParameterDefinition': defaultValue
00:49:31 WARNING: Unknown parameter(s) found for class type 'hudson.model.ChoiceParameterDefinition': defaultValue
00:49:31 [Pipeline] checkout
00:49:31 The recommended git tool is: NONE
00:49:31 using credential git_key_aug20
00:49:31 Fetching changes from the remote Git repository
00:49:31 Cleaning workspace
00:49:31 Fetching without tags
00:49:31  > git rev-parse --resolve-git-dir /var/lib/jenkins/workspace/Cforall_master/.git # timeout=10
00:49:31  > git config remote.origin.url cforall@plg.uwaterloo.ca:software/cfa/cfa-cc # timeout=10
00:49:31  > git rev-parse --verify HEAD # timeout=10
00:49:31 Resetting working tree
00:49:31  > git reset --hard # timeout=10
00:49:31  > git clean -fdx # timeout=10
00:49:31 Fetching upstream changes from cforall@plg.uwaterloo.ca:software/cfa/cfa-cc
00:49:31  > git --version # timeout=10
00:49:31  > git --version # 'git version 2.25.1'
00:49:31 using GIT_SSH to set credentials SSH key used for git, ed25519 generated August 2020
00:49:31  > git fetch --no-tags --force --progress -- cforall@plg.uwaterloo.ca:software/cfa/cfa-cc +refs/heads/*:refs/remotes/origin/* # timeout=10
00:49:31 Checking out Revision 02f4eb8677a64f5dfecc2133d01badd254fc0793 (master)
00:49:31 Commit message: "simplify change for section .data attribute for global constructors"
00:49:31 [Pipeline] load
00:49:31 [Pipeline] { (Jenkins/tools.groovy)
00:49:31 [Pipeline] }
00:49:31 [Pipeline] // load
00:49:31 [Pipeline] echo
00:49:31 Compiler 	         : gcc-7 (g++-7/gcc-7)
00:49:31 AST Version             : New AST
00:49:31 Architecture            : x86
00:49:31 Arc Flags               : --host=i386
00:49:31 Run All Tests           : true
00:49:31 Run Benchmark           : true
00:49:31 Build Documentation     : true
00:49:31 Publish                 : true
00:49:31 Silent                  : true
00:49:31 
00:49:31 [Pipeline] }
00:49:31 [Pipeline] // wrap
00:49:31 [Pipeline] }
00:49:31 [Pipeline] // node
00:49:31 [Pipeline] node
00:49:31 Running on Ruby in /var/lib/jenkins/workspace/Cforall_master
00:49:31 [Pipeline] {
00:49:31 [Pipeline] wrap
00:49:31 [Pipeline] {
00:49:31 [Pipeline] pwd
00:49:31 [Pipeline] pwd
00:49:31 [Pipeline] echo
00:49:31  -------- Cleanup -------- 
00:49:31 [Pipeline] stage
00:49:31 [Pipeline] { (Cleanup)
00:49:31 [Pipeline] dir
00:49:31 Running in /var/lib/jenkins/workspace/Cforall_master@tmp
00:49:31 [Pipeline] {
00:49:31 [Pipeline] deleteDir
00:49:31  > git config core.sparsecheckout # timeout=10
00:49:31  > git checkout -f 02f4eb8677a64f5dfecc2133d01badd254fc0793 # timeout=10
00:49:31  > git rev-list --no-walk 02f4eb8677a64f5dfecc2133d01badd254fc0793 # timeout=10
00:49:31 [Pipeline] }
00:49:31 [Pipeline] // dir
00:49:31 [Pipeline] }
00:49:31 [Pipeline] // stage
00:49:31 [Pipeline] echo
00:49:31  -------- Checkout -------- 
00:49:31 [Pipeline] stage
00:49:31 [Pipeline] { (Checkout)
00:49:31 [Pipeline] checkout
00:49:31 The recommended git tool is: NONE
00:49:31 using credential git_key_aug20
00:49:31 Fetching changes from the remote Git repository
00:49:31 Cleaning workspace
00:49:31  > git rev-parse --resolve-git-dir /var/lib/jenkins/workspace/Cforall_master/.git # timeout=10
00:49:31  > git config remote.origin.url cforall@plg.uwaterloo.ca:software/cfa/cfa-cc # timeout=10
00:49:31  > git rev-parse --verify HEAD # timeout=10
00:49:31 Resetting working tree
00:49:31  > git reset --hard # timeout=10
00:49:31 Fetching without tags
00:49:31  > git clean -fdx # timeout=10
00:49:31 Fetching upstream changes from cforall@plg.uwaterloo.ca:software/cfa/cfa-cc
00:49:31  > git --version # timeout=10
00:49:31  > git --version # 'git version 2.7.4'
00:49:31 using GIT_SSH to set credentials SSH key used for git, ed25519 generated August 2020
00:49:31  > git fetch --no-tags --progress cforall@plg.uwaterloo.ca:software/cfa/cfa-cc +refs/heads/*:refs/remotes/origin/* # timeout=10
00:49:31 Checking out Revision 02f4eb8677a64f5dfecc2133d01badd254fc0793 (master)
00:49:31  > git config core.sparsecheckout # timeout=10
00:49:31 Commit message: "simplify change for section .data attribute for global constructors"
00:49:31  > git checkout -f 02f4eb8677a64f5dfecc2133d01badd254fc0793 # timeout=10
00:49:31 [Pipeline] echo
00:49:31 Constructing new git message
00:49:31 [Pipeline] sh
00:49:31 + git rev-list 02f4eb8677a64f5dfecc2133d01badd254fc0793..02f4eb8677a64f5dfecc2133d01badd254fc0793
00:49:31 [Pipeline] sh
00:49:31 + git cat-file -t 02f4eb8677a64f5dfecc2133d01badd254fc0793
00:49:31 [Pipeline] sh
00:49:31 + git rev-list --format=short 02f4eb8677a64f5dfecc2133d01badd254fc0793...02f4eb8677a64f5dfecc2133d01badd254fc0793
00:49:31 [Pipeline] sh
00:49:31 + git diff --stat --color 02f4eb8677a64f5dfecc2133d01badd254fc0793 02f4eb8677a64f5dfecc2133d01badd254fc0793
00:49:31 [Pipeline] echo
00:49:31 
00:49:31 <p>- Changes -------------------------------------------------------------</p>
00:49:31 
00:49:31 <pre>
00:49:31 The branch master has been updated.
00:49:31       from  02f4eb8677a64f5dfecc2133d01badd254fc0793 (commit)
00:49:31 </pre>
00:49:31 
00:49:31 <p>- Log -----------------------------------------------------------------</p>
00:49:31 
00:49:31 <pre>
00:49:31 
00:49:31 </pre>
00:49:31 
00:49:31 <p>-----------------------------------------------------------------------</p>
00:49:31 <pre>
00:49:31 Summary of changes:
00:49:31 
00:49:31 </pre>
00:49:31 
00:49:31 [Pipeline] }
00:49:31 [Pipeline] // stage
00:49:31 [Pipeline] echo
00:49:31  -------- Build : configure -------- 
00:49:31 [Pipeline] stage
00:49:31 [Pipeline] { (Build : configure)
00:49:31 [Pipeline] dir
00:49:31 Running in /var/lib/jenkins/workspace/Cforall_master
00:49:31 [Pipeline] {
00:49:31 [Pipeline] sh
00:49:31 + ./autogen.sh
00:49:31 Running aclocal in root
00:49:31 Running libtoolize in root
00:49:31 libtoolize: putting auxiliary files in AC_CONFIG_AUX_DIR, 'automake'.
00:49:31 libtoolize: linking file 'automake/ltmain.sh'
00:49:31 libtoolize: putting macros in AC_CONFIG_MACRO_DIRS, 'automake'.
00:49:31 libtoolize: linking file 'automake/libtool.m4'
00:49:31 libtoolize: linking file 'automake/ltoptions.m4'
00:49:31 libtoolize: linking file 'automake/ltsugar.m4'
00:49:31 libtoolize: linking file 'automake/ltversion.m4'
00:49:31 libtoolize: linking file 'automake/lt~obsolete.m4'
00:49:31 Running autoconf in root
00:49:31 Running automake in root
00:49:31 configure.ac:241: installing 'automake/compile'
00:49:31 configure.ac:156: installing 'automake/config.guess'
00:49:31 configure.ac:156: installing 'automake/config.sub'
00:49:31 configure.ac:17: installing 'automake/install-sh'
00:49:31 benchmark/Makefile.am: installing 'automake/depcomp'
00:49:31 parallel-tests: installing 'automake/test-driver'
00:49:31 configure.ac: installing 'automake/ylwrap'
00:49:31 Running aclocal in libcfa
00:49:31 Running libtoolize in libcfa
00:49:31 libtoolize: putting auxiliary files in AC_CONFIG_AUX_DIR, 'automake'.
00:49:31 libtoolize: linking file 'automake/ltmain.sh'
00:49:31 libtoolize: putting macros in AC_CONFIG_MACRO_DIRS, 'automake'.
00:49:31 libtoolize: linking file 'automake/libtool.m4'
00:49:31 libtoolize: linking file 'automake/ltoptions.m4'
00:49:31 libtoolize: linking file 'automake/ltsugar.m4'
00:49:31 libtoolize: linking file 'automake/ltversion.m4'
00:49:31 libtoolize: linking file 'automake/lt~obsolete.m4'
00:49:31 Running autoconf in libcfa
00:49:31 Running automake in libcfa
00:49:31 configure.ac:119: installing 'automake/compile'
00:49:31 configure.ac:119: installing 'automake/config.guess'
00:49:31 configure.ac:119: installing 'automake/config.sub'
00:49:31 configure.ac:12: installing 'automake/install-sh'
00:49:31 src/Makefile.am: installing 'automake/depcomp'
00:49:31 [Pipeline] }
00:49:31 [Pipeline] // dir
00:49:31 [Pipeline] dir
00:49:31 Running in /var/lib/jenkins/workspace/Cforall_master@tmp
00:49:31 [Pipeline] {
00:49:31 [Pipeline] sh
00:49:31 + /var/lib/jenkins/workspace/Cforall_master/configure CXX=g++-7 CC=gcc-7 --host=i386 AR=gcc-ar RANLIB=gcc-ranlib --with-target-hosts=host:debug,host:nodebug --enable-new-ast --quiet --prefix=/var/lib/jenkins/workspace/Cforall_master@tmp
00:49:31 [Pipeline] sh
00:49:31 + make -j 8 --no-print-directory configure-libcfa
00:49:31 libcfa/x86-debug/config.data
00:49:31 Configuring libcfa (/var/lib/jenkins/workspace/Cforall_master/libcfa/configure) with ''CXX=g++-7' 'CC=gcc-7' 'AR=gcc-ar' 'RANLIB=gcc-ranlib' '--enable-new-ast' '--prefix=/var/lib/jenkins/workspace/Cforall_master@tmp' DRIVER_DIR=/var/lib/jenkins/workspace/Cforall_master@tmp/driver/ ARCHITECTURE=x86 CONFIGURATION=debug CFA_VERSION=1:0:0' from /var/lib/jenkins/workspace/Cforall_master@tmp / libcfa/x86-debug/
00:49:31 libcfa/x86-nodebug/config.data
00:49:31 Configuring libcfa (/var/lib/jenkins/workspace/Cforall_master/libcfa/configure) with ''CXX=g++-7' 'CC=gcc-7' 'AR=gcc-ar' 'RANLIB=gcc-ranlib' '--enable-new-ast' '--prefix=/var/lib/jenkins/workspace/Cforall_master@tmp' DRIVER_DIR=/var/lib/jenkins/workspace/Cforall_master@tmp/driver/ ARCHITECTURE=x86 CONFIGURATION=nodebug CFA_VERSION=1:0:0' from /var/lib/jenkins/workspace/Cforall_master@tmp / libcfa/x86-nodebug/
00:49:31 configure: WARNING: unrecognized options: --enable-new-ast
00:49:31 configure: WARNING: unrecognized options: --enable-new-ast
00:49:31 checking whether make supports nested variables... yes
00:49:31 checking for a BSD-compatible install... checking whether make supports nested variables... /usr/bin/install -c
00:49:31 yes
00:49:31 checking whether build environment is sane... checking for a BSD-compatible install... yes
00:49:31 checking for a thread-safe mkdir -p... /usr/bin/install -c
00:49:31 /bin/mkdir -p
00:49:31 checking whether build environment is sane... checking for gawk... yes
00:49:31 gawk
00:49:31 checking for a thread-safe mkdir -p... checking whether make sets $(MAKE)... /bin/mkdir -p
00:49:31 yes
00:49:31 checking for gawk... checking for distributated build... no
00:49:31 gawk
00:49:31 checking whether make sets $(MAKE)... yes
00:49:31 checking build system type... checking for distributated build... no
00:49:31 i686-pc-linux-gnu
00:49:31 checking build system type... checking host system type... i686-pc-linux-gnu
00:49:31 checking how to print strings... i686-pc-linux-gnu
00:49:31 printf
00:49:31 checking host system type... i686-pc-linux-gnu
00:49:31 checking for style of include used by make... checking how to print strings... GNU
00:49:31 checking for gcc... printf
00:49:31 gcc-7
00:49:31 checking for style of include used by make... GNU
00:49:31 checking for gcc... gcc-7
00:49:31 checking whether the C compiler works... checking whether the C compiler works... yes
00:49:31 checking for C compiler default output file name... a.out
00:49:31 checking for suffix of executables... yes
00:49:31 checking for C compiler default output file name... a.out
00:49:31 checking for suffix of executables... 
00:49:31 checking whether we are cross compiling... 
00:49:31 checking whether we are cross compiling... no
00:49:31 checking for suffix of object files... o
00:49:31 checking whether we are using the GNU C compiler... yes
00:49:31 checking whether gcc-7 accepts -g... no
00:49:31 checking for suffix of object files... yes
00:49:31 checking for gcc-7 option to accept ISO C89... o
00:49:31 checking whether we are using the GNU C compiler... none needed
00:49:31 checking whether gcc-7 understands -c and -o together... yes
00:49:31 checking whether gcc-7 accepts -g... yes
00:49:31 yes
00:49:31 checking dependency style of gcc-7... checking for gcc-7 option to accept ISO C89... none needed
00:49:31 checking whether gcc-7 understands -c and -o together... gcc3
00:49:31 checking for a sed that does not truncate output... /bin/sed
00:49:31 checking for grep that handles long lines and -e... /bin/grep
00:49:31 checking for egrep... /bin/grep -E
00:49:31 checking for fgrep... yes
00:49:31 /bin/grep -F
00:49:31 checking dependency style of gcc-7... checking for ld used by gcc-7... /usr/bin/ld
00:49:31 checking if the linker (/usr/bin/ld) is GNU ld... yes
00:49:31 checking for BSD- or MS-compatible name lister (nm)... /usr/bin/nm -B
00:49:31 checking the name lister (/usr/bin/nm -B) interface... BSD nm
00:49:31 checking whether ln -s works... gcc3
00:49:31 yes
00:49:31 checking for a sed that does not truncate output... checking the maximum length of command line arguments... 1572864
00:49:31 /bin/sed
00:49:31 checking how to convert i686-pc-linux-gnu file names to i686-pc-linux-gnu format... checking for grep that handles long lines and -e... func_convert_file_noop
00:49:31 /bin/grep
00:49:31 checking how to convert i686-pc-linux-gnu file names to toolchain format... checking for egrep... func_convert_file_noop
00:49:31 /bin/grep -E
00:49:31 checking for /usr/bin/ld option to reload object files... checking for fgrep... -r
00:49:31 /bin/grep -F
00:49:31 checking for objdump... checking for ld used by gcc-7... objdump
00:49:31 /usr/bin/ld
00:49:31 checking how to recognize dependent libraries... checking if the linker (/usr/bin/ld) is GNU ld... pass_all
00:49:31 yes
00:49:31 checking for dlltool... checking for BSD- or MS-compatible name lister (nm)... no
00:49:31 /usr/bin/nm -B
00:49:31 checking how to associate runtime and link libraries... checking the name lister (/usr/bin/nm -B) interface... printf %s\n
00:49:31 checking for archiver @FILE support... BSD nm
00:49:31 checking whether ln -s works... yes
00:49:31 checking the maximum length of command line arguments... 1572864
00:49:31 @
00:49:31 checking how to convert i686-pc-linux-gnu file names to i686-pc-linux-gnu format... checking for strip... func_convert_file_noop
00:49:31 checking how to convert i686-pc-linux-gnu file names to toolchain format... strip
00:49:31 func_convert_file_noop
00:49:31 checking for ranlib... checking for /usr/bin/ld option to reload object files... gcc-ranlib
00:49:31 -r
00:49:31 checking command to parse /usr/bin/nm -B output from gcc-7 object... checking for objdump... objdump
00:49:31 checking how to recognize dependent libraries... pass_all
00:49:31 checking for dlltool... no
00:49:31 checking how to associate runtime and link libraries... printf %s\n
00:49:31 checking for archiver @FILE support... ok
00:49:31 checking for sysroot... no
00:49:31 checking for a working dd... @
00:49:31 /bin/dd
00:49:31 checking for strip... checking how to truncate binary pipes... strip
00:49:31 checking for ranlib... /bin/dd bs=4096 count=1
00:49:31 gcc-ranlib
00:49:31 checking for mt... checking command to parse /usr/bin/nm -B output from gcc-7 object... mt
00:49:31 checking if mt is a manifest tool... no
00:49:31 checking how to run the C preprocessor... gcc-7 -E
00:49:31 checking for ANSI C header files... ok
00:49:31 yes
00:49:31 checking for sysroot... checking for sys/types.h... no
00:49:31 checking for a working dd... /bin/dd
00:49:31 checking how to truncate binary pipes... /bin/dd bs=4096 count=1
00:49:31 yes
00:49:31 checking for mt... checking for sys/stat.h... mt
00:49:31 checking if mt is a manifest tool... no
00:49:31 checking how to run the C preprocessor... yes
00:49:31 checking for stdlib.h... yes
00:49:31 gcc-7 -E
00:49:31 checking for string.h... yes
00:49:31 checking for memory.h... checking for ANSI C header files... yes
00:49:31 checking for strings.h... yes
00:49:31 checking for inttypes.h... yes
00:49:31 checking for stdint.h... yes
00:49:31 checking for unistd.h... yes
00:49:31 checking for dlfcn.h... yes
00:49:31 checking for sys/types.h... yes
00:49:31 checking for objdir... .libs
00:49:31 yes
00:49:31 checking for sys/stat.h... yes
00:49:31 checking if gcc-7 supports -fno-rtti -fno-exceptions... checking for stdlib.h... no
00:49:31 yes
00:49:31 checking for gcc-7 option to produce PIC... -fPIC -DPIC
00:49:31 checking for string.h... checking if gcc-7 PIC flag -fPIC -DPIC works... yes
00:49:31 yes
00:49:31 checking if gcc-7 static flag -static works... checking for memory.h... yes
00:49:31 checking for strings.h... yes
00:49:31 checking for inttypes.h... yes
00:49:31 checking for stdint.h... yes
00:49:31 checking for unistd.h... yes
00:49:31 checking for dlfcn.h... yes
00:49:31 checking for objdir... .libs
00:49:31 checking if gcc-7 supports -fno-rtti -fno-exceptions... no
00:49:31 checking for gcc-7 option to produce PIC... -fPIC -DPIC
00:49:31 checking if gcc-7 PIC flag -fPIC -DPIC works... yes
00:49:31 checking if gcc-7 static flag -static works... yes
00:49:31 checking if gcc-7 supports -c -o file.o... yes
00:49:31 checking if gcc-7 supports -c -o file.o... (cached) yes
00:49:31 checking whether the gcc-7 linker (/usr/bin/ld) supports shared libraries... yes
00:49:31 checking whether -lc should be explicitly linked in... no
00:49:31 checking dynamic linker characteristics... GNU/Linux ld.so
00:49:31 checking how to hardcode library paths into programs... immediate
00:49:31 checking whether stripping libraries is possible... yes
00:49:31 checking if libtool supports shared libraries... yes
00:49:31 checking whether to build shared libraries... yes
00:49:31 checking whether to build static libraries... no
00:49:31 checking whether we are using the GNU C++ compiler... yes
00:49:31 checking whether g++-7 accepts -g... yes
00:49:31 checking dependency style of g++-7... gcc3
00:49:31 yes
00:49:31 checking how to run the C++ preprocessor... checking if gcc-7 supports -c -o file.o... yes
00:49:31 g++-7 -E
00:49:31 checking if gcc-7 supports -c -o file.o... (cached) yes
00:49:31 checking whether the gcc-7 linker (/usr/bin/ld) supports shared libraries... yes
00:49:31 checking whether -lc should be explicitly linked in... no
00:49:31 checking dynamic linker characteristics... checking for ld used by g++-7... /usr/bin/ld
00:49:31 checking if the linker (/usr/bin/ld) is GNU ld... yes
00:49:31 checking whether the g++-7 linker (/usr/bin/ld) supports shared libraries... yes
00:49:31 checking for g++-7 option to produce PIC... -fPIC -DPIC
00:49:31 checking if g++-7 PIC flag -fPIC -DPIC works... yes
00:49:31 checking if g++-7 static flag -static works... GNU/Linux ld.so
00:49:31 checking how to hardcode library paths into programs... immediate
00:49:31 checking whether stripping libraries is possible... yes
00:49:31 checking if libtool supports shared libraries... yes
00:49:31 checking whether to build shared libraries... yes
00:49:31 checking whether to build static libraries... no
00:49:31 checking whether we are using the GNU C++ compiler... yes
00:49:31 checking whether g++-7 accepts -g... yes
00:49:31 checking dependency style of g++-7... gcc3
00:49:31 checking how to run the C++ preprocessor... g++-7 -E
00:49:31 checking for ld used by g++-7... /usr/bin/ld
00:49:31 checking if the linker (/usr/bin/ld) is GNU ld... yes
00:49:31 checking whether the g++-7 linker (/usr/bin/ld) supports shared libraries... yes
00:49:31 checking for g++-7 option to produce PIC... -fPIC -DPIC
00:49:31 checking if g++-7 PIC flag -fPIC -DPIC works... yes
00:49:31 checking if g++-7 static flag -static works... yes
00:49:31 checking if g++-7 supports -c -o file.o... yes
00:49:31 checking if g++-7 supports -c -o file.o... (cached) yes
00:49:31 checking whether the g++-7 linker (/usr/bin/ld) supports shared libraries... yes
00:49:31 checking dynamic linker characteristics... (cached) GNU/Linux ld.so
00:49:31 checking how to hardcode library paths into programs... immediate
00:49:31 checking for gcc... (cached) gcc-7
00:49:31 checking whether we are using the GNU C compiler... (cached) yes
00:49:31 checking whether gcc-7 accepts -g... (cached) yes
00:49:31 checking for gcc-7 option to accept ISO C89... (cached) none needed
00:49:31 checking whether gcc-7 understands -c and -o together... (cached) yes
00:49:31 checking dependency style of gcc-7... (cached) gcc3
00:49:31 checking dependency style of gcc-7... yes
00:49:31 checking if g++-7 supports -c -o file.o... gcc3
00:49:31 checking whether make sets $(MAKE)... (cached) yes
00:49:31 checking linux/rseq.h usability... yes
00:49:31 checking if g++-7 supports -c -o file.o... (cached) yes
00:49:31 checking whether the g++-7 linker (/usr/bin/ld) supports shared libraries... yes
00:49:31 checking dynamic linker characteristics... (cached) no
00:49:31 checking linux/rseq.h presence... GNU/Linux ld.so
00:49:31 checking how to hardcode library paths into programs... immediate
00:49:31 checking for gcc... (cached) gcc-7
00:49:31 no
00:49:31 checking for linux/rseq.h... no
00:49:31 checking for rseq_available in -lrseq... checking whether we are using the GNU C compiler... (cached) yes
00:49:31 checking whether gcc-7 accepts -g... (cached) yes
00:49:31 checking for gcc-7 option to accept ISO C89... (cached) none needed
00:49:31 checking whether gcc-7 understands -c and -o together... (cached) yes
00:49:31 checking dependency style of gcc-7... (cached) gcc3
00:49:31 checking dependency style of gcc-7... no
00:49:31 checking linux/io_uring.h usability... gcc3
00:49:31 checking whether make sets $(MAKE)... no
00:49:31 checking linux/io_uring.h presence... (cached) yes
00:49:31 checking linux/rseq.h usability... no
00:49:31 checking for linux/io_uring.h... no
00:49:31 checking for preadv2... no
00:49:31 checking linux/rseq.h presence... no
00:49:31 checking for linux/rseq.h... no
00:49:31 checking for rseq_available in -lrseq... no
00:49:31 checking for pwritev2... no
00:49:31 checking linux/io_uring.h usability... no
00:49:31 checking linux/io_uring.h presence... no
00:49:31 no
00:49:31 checking for linux/io_uring.h... no
00:49:31 checking for preadv2... checking that generated files are newer than configure... done
00:49:31 configure: creating ./config.status
00:49:31 no
00:49:31 checking for pwritev2... no
00:49:31 checking that generated files are newer than configure... done
00:49:31 configure: creating ./config.status
00:49:31 config.status: creating Makefile
00:49:31 config.status: creating src/Makefile
00:49:31 config.status: creating prelude/Makefile
00:49:31 config.status: creating src/concurrency/io/call.cfa
00:49:31 config.status: creating prelude/defines.hfa
00:49:31 config.status: executing depfiles commands
00:49:31 config.status: creating Makefile
00:49:31 config.status: executing libtool commands
00:49:31 config.status: creating src/Makefile
00:49:31 config.status: creating prelude/Makefile
00:49:31 config.status: creating src/concurrency/io/call.cfa
00:49:31 config.status: creating prelude/defines.hfa
00:49:31 config.status: executing depfiles commands
00:49:31 config.status: executing libtool commands
00:49:31 configure: WARNING: unrecognized options: --enable-new-ast
00:49:31 Cforall library configuraton completed. Type "make -j 8 install".
00:49:31 configure: WARNING: unrecognized options: --enable-new-ast
00:49:31 Cforall library configuraton completed. Type "make -j 8 install".
00:49:31 [Pipeline] }
00:49:31 [Pipeline] // dir
00:49:31 [Pipeline] }
00:49:31 [Pipeline] // stage
00:49:31 [Pipeline] echo
00:49:31  -------- Build : cfa-cpp -------- 
00:49:31 [Pipeline] stage
00:49:31 [Pipeline] { (Build : cfa-cpp)
00:49:31 [Pipeline] dir
00:49:31 Running in /var/lib/jenkins/workspace/Cforall_master@tmp
00:49:31 [Pipeline] {
00:49:31 [Pipeline] sh
00:49:31 + make -j 8 --no-print-directory -C driver
00:49:31   CXX      as.o
00:49:31   CXX      cfa.o
00:49:31   CXX      cc1.o
00:49:31   CXXLD    as
00:49:31   CXXLD    cc1
00:49:31   CXXLD    cfa
00:49:31 [Pipeline] sh
00:49:31 + make -j 8 --no-print-directory -C src
00:49:31   YACC     Parser/parser.cc
00:49:31 updating Parser/parser.output
00:49:31 updating Parser/parser.hh
00:49:31 make  all-am
00:49:31   CXX      CompilationState.o
00:49:31   CXX      main.o
00:49:31   CXX      CodeGen/Generate.o
00:49:31   CXX      CodeGen/FixNames.o
00:49:31   CXX      MakeLibCfa.o
00:49:31   CXX      Common/DebugMalloc.o
00:49:31   CXX      Concurrency/Waitfor.o
00:49:31   CXX      ControlStruct/ExceptTranslate.o
00:49:31   CXX      GenPoly/Box.o
00:49:31   CXX      GenPoly/FindFunction.o
00:49:31   CXX      GenPoly/InstantiateGeneric.o
00:49:31   CXX      GenPoly/ScrubTyVars.o
00:49:31   CXX      GenPoly/Specialize.o
00:49:31   CXX      InitTweak/FixGlobalInit.o
00:49:31   CXX      InitTweak/FixInit.o
00:49:31   CXX      InitTweak/FixInitNew.o
00:49:31   LEX      Parser/lex.cc
00:49:31   CXX      Parser/ParseNode.o
00:49:31   CXX      Parser/parser.o
00:49:31   CXX      Parser/parserutility.o
00:49:31   CXX      Parser/StatementNode.o
00:49:31   CXX      Parser/TypeData.o
00:49:31   CXX      Parser/TypedefTable.o
00:49:31   CXX      ResolvExpr/AlternativePrinter.o
00:49:31   CXX      Virtual/ExpandCasts.o
00:49:31   CXX      SymTab/demangler.o
00:49:31   CXX      AST/AssertAcyclic.o
00:49:31   CXX      AST/Attribute.o
00:49:31   CXX      AST/Convert.o
00:49:31   CXX      AST/Decl.o
00:49:31   CXX      AST/DeclReplacer.o
00:49:31   CXX      AST/Expr.o
00:49:31   CXX      AST/GenericSubstitution.o
00:49:31   CXX      AST/Init.o
00:49:31   CXX      AST/LinkageSpec.o
00:49:31   CXX      AST/Node.o
00:49:31   CXX      AST/Pass.o
00:49:31   CXX      AST/Print.o
00:49:31   CXX      AST/Stmt.o
00:49:31   CXX      AST/SymbolTable.o
00:49:31   CXX      AST/Type.o
00:49:31   CXX      AST/TypeEnvironment.o
00:49:31   CXX      AST/TypeSubstitution.o
00:49:31   CXX      CodeGen/CodeGenerator.o
00:49:31   CXX      CodeGen/FixMain.o
00:49:31   CXX      CodeGen/GenType.o
00:49:31   CXX      CodeGen/LinkOnce.o
00:49:31   CXX      CodeGen/OperatorTable.o
00:49:31   CXX      Concurrency/Keywords.o
00:49:31   CXX      Common/Assert.o
00:49:31   CXX      Common/CodeLocationTools.o
00:49:31   CXX      Common/Eval.o
00:49:31   CXX      Common/Examine.o
00:49:31   CXX      Common/PassVisitor.o
00:49:31   CXX      Common/SemanticError.o
00:49:31   CXX      Common/Stats/Counter.o
00:49:31   CXX      Common/Stats/Heap.o
00:49:31   CXX      Common/Stats/ResolveTime.o
00:49:31   CXX      Common/Stats/Stats.o
00:49:31   CXX      Common/Stats/Time.o
00:49:31   CXX      Common/UniqueName.o
00:49:31   CXX      ControlStruct/ForExprMutator.o
00:49:31   CXX      ControlStruct/LabelFixer.o
00:49:31   CXX      ControlStruct/LabelGenerator.o
00:49:31   CXX      ControlStruct/MLEMutator.o
00:49:31   CXX      ControlStruct/Mutate.o
00:49:31   CXX      GenPoly/GenPoly.o
00:49:31   CXX      GenPoly/Lvalue.o
00:49:31 /var/lib/jenkins/workspace/Cforall_master/src/GenPoly/GenPoly.cc:66:8: warning: ‘bool GenPoly::{anonymous}::hasPolyParams(const std::vector<ast::ptr_base<ast::Expr, (ast::Node::ref_type)0> >&, const TyVarMap&, const ast::TypeSubstitution*)’ defined but not used [-Wunused-function]
00:49:31    bool hasPolyParams( const std::vector<ast::ptr<ast::Expr>> & params, const TyVarMap & tyVars, const ast::TypeSubstitution * env) {
00:49:31         ^~~~~~~~~~~~~
00:49:31   CXX      InitTweak/GenInit.o
00:49:31   CXX      InitTweak/InitTweak.o
00:49:31   CXX      ResolvExpr/AdjustExprType.o
00:49:31   CXX      ResolvExpr/Alternative.o
00:49:31   CXX      ResolvExpr/AlternativeFinder.o
00:49:31   CXX      ResolvExpr/Candidate.o
00:49:31   CXX      ResolvExpr/CandidateFinder.o
00:49:31   CXX      ResolvExpr/CastCost.o
00:49:31 In file included from /var/lib/jenkins/workspace/Cforall_master/src/ResolvExpr/CastCost.cc:22:0:
00:49:31 /var/lib/jenkins/workspace/Cforall_master/src/ResolvExpr/ConversionCost.h:79:2: warning: #warning when the old ConversionCost is removed, get ride of the _new suffix. [-Wcpp]
00:49:31  #warning when the old ConversionCost is removed, get ride of the _new suffix.
00:49:31   ^~~~~~~
00:49:31 /var/lib/jenkins/workspace/Cforall_master/src/ResolvExpr/CastCost.cc:186:3: warning: #warning For overload resolution between the two versions. [-Wcpp]
00:49:31   #warning For overload resolution between the two versions.
00:49:31    ^~~~~~~
00:49:31 /var/lib/jenkins/workspace/Cforall_master/src/ResolvExpr/CastCost.cc:236:4: warning: #warning cast on ptrsCastable artifact of having two functions, remove when port done [-Wcpp]
00:49:31    #warning cast on ptrsCastable artifact of having two functions, remove when port done
00:49:31     ^~~~~~~
00:49:31 /var/lib/jenkins/workspace/Cforall_master/src/ResolvExpr/CastCost.cc:240:4: warning: #warning cast on castCost artifact of having two functions, remove when port done [-Wcpp]
00:49:31    #warning cast on castCost artifact of having two functions, remove when port done
00:49:31     ^~~~~~~
00:49:31   CXX      ResolvExpr/CommonType.o
00:49:31 /var/lib/jenkins/workspace/Cforall_master/src/ResolvExpr/CommonType.cc:682:6: warning: #warning remove casts when `commonTypes` moved to new AST [-Wcpp]
00:49:31      #warning remove casts when `commonTypes` moved to new AST
00:49:31       ^~~~~~~
00:49:31 /var/lib/jenkins/workspace/Cforall_master/src/ResolvExpr/CommonType.cc:697:6: warning: #warning remove casts when `commonTypes` moved to new AST [-Wcpp]
00:49:31      #warning remove casts when `commonTypes` moved to new AST
00:49:31       ^~~~~~~
00:49:31   CXX      ResolvExpr/ConversionCost.o
00:49:31 In file included from /var/lib/jenkins/workspace/Cforall_master/src/ResolvExpr/ConversionCost.cc:16:0:
00:49:31 /var/lib/jenkins/workspace/Cforall_master/src/ResolvExpr/ConversionCost.h:79:2: warning: #warning when the old ConversionCost is removed, get ride of the _new suffix. [-Wcpp]
00:49:31  #warning when the old ConversionCost is removed, get ride of the _new suffix.
00:49:31   ^~~~~~~
00:49:31 /var/lib/jenkins/workspace/Cforall_master/src/ResolvExpr/ConversionCost.cc:484:4: warning: #warning For overload resolution between the two versions. [-Wcpp]
00:49:31   # warning For overload resolution between the two versions.
00:49:31     ^~~~~~~
00:49:31   CXX      ResolvExpr/CurrentObject.o
00:49:31   CXX      ResolvExpr/ExplodedActual.o
00:49:31   CXX      ResolvExpr/ExplodedArg.o
00:49:31   CXX      ResolvExpr/FindOpenVars.o
00:49:31   CXX      ResolvExpr/Occurs.o
00:49:31   CXX      ResolvExpr/PolyCost.o
00:49:31   CXX      ResolvExpr/PtrsAssignable.o
00:49:31   CXX      ResolvExpr/PtrsCastable.o
00:49:31   CXX      ResolvExpr/RenameVars.o
00:49:31   CXX      ResolvExpr/ResolveAssertions.o
00:49:31   CXX      ResolvExpr/Resolver.o
00:49:31   CXX      ResolvExpr/ResolveTypeof.o
00:49:31   CXX      ResolvExpr/SatisfyAssertions.o
00:49:31   CXX      ResolvExpr/SpecCost.o
00:49:31 /var/lib/jenkins/workspace/Cforall_master/src/ResolvExpr/SpecCost.cc:133:4: warning: #warning Should use a standard maybe_accept [-Wcpp]
00:49:31    #warning Should use a standard maybe_accept
00:49:31     ^~~~~~~
00:49:31   CXX      ResolvExpr/TypeEnvironment.o
00:49:31   CXX      ResolvExpr/Unify.o
00:49:31   CXX      SymTab/Autogen.o
00:49:31   CXX      SymTab/FixFunction.o
00:49:31   CXX      SymTab/Indexer.o
00:49:31   CXX      SymTab/Mangler.o
00:49:31   CXX      SymTab/ManglerCommon.o
00:49:31   CXX      SymTab/Validate.o
00:49:31 /var/lib/jenkins/workspace/Cforall_master/src/SymTab/Validate.cc:1461:7: warning: ‘void SymTab::{anonymous}::expandAssertions(const ast::TraitInstType*, std::vector<ast::ptr_base<ast::DeclWithType, (ast::Node::ref_type)0> >&)’ defined but not used [-Wunused-function]
00:49:31   void expandAssertions(
00:49:31        ^~~~~~~~~~~~~~~~
00:49:31   CXX      SymTab/Demangle.o
00:49:31   CXX      SynTree/AddressExpr.o
00:49:31   CXX      SynTree/AggregateDecl.o
00:49:31   CXX      SynTree/ApplicationExpr.o
00:49:31   CXX      SynTree/ArrayType.o
00:49:31   CXX      SynTree/Attribute.o
00:49:31   CXX      SynTree/AttrType.o
00:49:31   CXX      SynTree/BasicType.o
00:49:31   CXX      SynTree/CommaExpr.o
00:49:31   CXX      SynTree/CompoundStmt.o
00:49:31   CXX      SynTree/Constant.o
00:49:31   CXX      SynTree/Declaration.o
00:49:31   CXX      SynTree/DeclarationWithType.o
00:49:31   CXX      SynTree/DeclReplacer.o
00:49:31   CXX      SynTree/DeclStmt.o
00:49:31   CXX      SynTree/Expression.o
00:49:31   CXX      SynTree/FunctionDecl.o
00:49:31   CXX      SynTree/FunctionType.o
00:49:31   CXX      SynTree/Initializer.o
00:49:31   CXX      SynTree/LinkageSpec.o
00:49:31   CXX      SynTree/NamedTypeDecl.o
00:49:31   CXX      SynTree/ObjectDecl.o
00:49:31   CXX      SynTree/PointerType.o
00:49:31   CXX      SynTree/ReferenceToType.o
00:49:31   CXX      SynTree/ReferenceType.o
00:49:31 /var/lib/jenkins/workspace/Cforall_master/src/SynTree/ReferenceToType.cc: In member function ‘virtual void TypeInstType::print(std::ostream&, Indenter) const’:
00:49:31 /var/lib/jenkins/workspace/Cforall_master/src/SynTree/ReferenceToType.cc:209:15: warning: unused variable ‘name_’ [-Wunused-variable]
00:49:31   const auto & name_ = get_name();
00:49:31                ^~~~~
00:49:31   CXX      SynTree/Statement.o
00:49:31   CXX      SynTree/TupleExpr.o
00:49:31   CXX      SynTree/TupleType.o
00:49:31   CXX      SynTree/Type.o
00:49:31   CXX      SynTree/TypeDecl.o
00:49:31   CXX      SynTree/TypeExpr.o
00:49:31   CXX      SynTree/TypeofType.o
00:49:31   CXX      SynTree/TypeSubstitution.o
00:49:31   CXX      SynTree/VarArgsType.o
00:49:31   CXX      SynTree/VoidType.o
00:49:31   CXX      SynTree/ZeroOneType.o
00:49:31   CXX      Tuples/Explode.o
00:49:31   CXX      Tuples/TupleAssignment.o
00:49:31   CXX      Tuples/TupleExpansion.o
00:49:31   CXX      Tuples/Tuples.o
00:49:31   CXX      Validate/HandleAttributes.o
00:49:31   CXX      Validate/FindSpecialDecls.o
00:49:31   CXX      Virtual/Tables.o
00:49:31   CXX      CodeTools/DeclStats.o
00:49:31   CXX      CodeTools/ResolvProtoDump.o
00:49:31   CXX      CodeTools/TrackLoc.o
00:49:31   CXX      Parser/DeclarationNode.o
00:49:31   CXX      Parser/ExpressionNode.o
00:49:31   CXX      Parser/InitializerNode.o
00:49:31   CXX      Parser/lex.o
00:49:31   CXXLD    ../driver/cfa-cpp
00:49:31   AR       libdemangle.a
00:49:31   CXXLD    demangler
00:49:31 [Pipeline] }
00:49:31 [Pipeline] // dir
00:49:31 [Pipeline] }
00:49:31 [Pipeline] // stage
00:49:31 [Pipeline] echo
00:49:31  -------- Build : libcfa(debug) -------- 
00:49:31 [Pipeline] stage
00:49:31 [Pipeline] { (Build : libcfa(debug))
00:49:31 [Pipeline] dir
00:49:31 Running in /var/lib/jenkins/workspace/Cforall_master@tmp
00:49:31 [Pipeline] {
00:49:31 [Pipeline] sh
00:49:31 + make -j 8 --no-print-directory -C libcfa/x86-debug
00:49:31 Making all in prelude
00:49:31 (CDPATH="${ZSH_VERSION+.}:" && cd /var/lib/jenkins/workspace/Cforall_master/libcfa && /bin/bash /var/lib/jenkins/workspace/Cforall_master/libcfa/automake/missing autoheader)
00:49:31 rm -f stamp-h1
00:49:31 touch /var/lib/jenkins/workspace/Cforall_master/libcfa/prelude/defines.hfa.in
00:49:31 cd .. && /bin/bash ./config.status prelude/defines.hfa
00:49:31 config.status: creating prelude/defines.hfa
00:49:31 config.status: prelude/defines.hfa is unchanged
00:49:31 make  all-am
00:49:31   GEN      gcc-builtins.c
00:49:31   GEN      builtins.cf
00:49:31   GEN      prelude.cfa
00:49:31   GEN      extras.cf
00:49:31   GEN      extras.cf
00:49:31   GEN      gcc-builtins.cf
00:49:31   GEN      bootloader.c
00:49:31 Making all in src
00:49:31   CFA      heap.lo
00:49:31   CFA      iostream.lo
00:49:31   CFA      common.lo
00:49:31   CFA      parseargs.lo
00:49:31   CFA      fstream.lo
00:49:31   CFA      limits.lo
00:49:31   CFA      iterator.lo
00:49:31   CFA      memory.lo
00:49:31   CFA      rational.lo
00:49:31   CFA      stdlib.lo
00:49:31   CFA      strstream.lo
00:49:31   CFA      time.lo
00:49:31   CFA      assert.lo
00:49:31   CFA      bits/debug.lo
00:49:31   CC       exception.lo
00:49:31   CFA      interpose.lo
00:49:31   CFA      startup.lo
00:49:31   CC       virtual.lo
00:49:31   GEN      prelude.lo
00:49:31   CPPAS    concurrency/CtxSwitch-x86.lo
00:49:31   CC       concurrency/invoke.lo
00:49:31   CFA      concurrency/io.lo
00:49:31   CFA      concurrency/preemption.lo
00:49:31   CFA      concurrency/ready_queue.lo
00:49:31   CFA      concurrency/stats.lo
00:49:31   CFA      bits/weakso_locks.lo
00:49:31   CFA      containers/maybe.lo
00:49:31   CFA      containers/pair.lo
00:49:31   CFA      containers/result.lo
00:49:31   CFA      containers/vector.lo
00:49:31   CFA      device/cpu.lo
00:49:31   CFA      concurrency/alarm.lo
00:49:31   CFA      concurrency/coroutine.lo
00:49:31   CFA      concurrency/exception.lo
00:49:31   CFA      concurrency/kernel.lo
00:49:31   CFA      concurrency/locks.lo
00:49:31   CFA      concurrency/monitor.lo
00:49:31   CFA      concurrency/mutex.lo
00:49:31   CFA      concurrency/thread.lo
00:49:31   CFA      concurrency/clib/cfathread.lo
00:49:31   CFA      concurrency/io/setup.lo
00:49:31   CFA      concurrency/io/call.lo
00:49:31   CFA      concurrency/kernel/startup.lo
00:49:31   CCLD     libcfa.la
00:49:31   CCLD     libcfathread.la
00:49:31 make[1]: Nothing to be done for 'all-am'.
00:49:31 [Pipeline] }
00:49:31 [Pipeline] // dir
00:49:31 [Pipeline] }
00:49:31 [Pipeline] // stage
00:49:31 [Pipeline] echo
00:49:31  -------- Build : libcfa(nodebug) -------- 
00:49:31 [Pipeline] stage
00:49:31 [Pipeline] { (Build : libcfa(nodebug))
00:49:31 [Pipeline] dir
00:49:31 Running in /var/lib/jenkins/workspace/Cforall_master@tmp
00:49:31 [Pipeline] {
00:49:31 [Pipeline] sh
00:49:31 + make -j 8 --no-print-directory -C libcfa/x86-nodebug
00:49:31 Making all in prelude
00:49:31 cd .. && /bin/bash ./config.status prelude/defines.hfa
00:49:31 config.status: creating prelude/defines.hfa
00:49:31 config.status: prelude/defines.hfa is unchanged
00:49:31 make  all-am
00:49:31   GEN      gcc-builtins.c
00:49:31   GEN      prelude.cfa
00:49:31   GEN      builtins.cf
00:49:31   GEN      extras.cf
00:49:31   GEN      extras.cf
00:49:31   GEN      gcc-builtins.cf
00:49:31   GEN      bootloader.c
00:49:31 Making all in src
00:49:31   CFA      common.lo
00:49:31   CFA      fstream.lo
00:49:31   CFA      limits.lo
00:49:31   CFA      heap.lo
00:49:31   CFA      iostream.lo
00:49:31   CFA      memory.lo
00:49:31   CFA      iterator.lo
00:49:31   CFA      parseargs.lo
00:49:31   CFA      rational.lo
00:49:31   CFA      stdlib.lo
00:49:31   CFA      strstream.lo
00:49:31   CFA      time.lo
00:49:31   CFA      assert.lo
00:49:31 /var/lib/jenkins/workspace/Cforall_master/libcfa/src/stdlib.cfa: In function ‘_X4anewQ1_0_1_1__X12_constructorFv_BD0BT0__FPBD0_jBT0__1’:
00:49:31 /var/lib/jenkins/workspace/Cforall_master/libcfa/src/stdlib.hfa:154:97: warning: ‘_X4_srcS6S_fill_Y12__T_generic___1._X1cc_1’ is used uninitialized in this function [-Wuninitialized]
00:49:31   struct S_fill   { char tag; char c; size_t size; T * at; char t[50]; };
00:49:31                                                                ~~~~~~~~~~                        ^       
00:49:31 /var/lib/jenkins/workspace/Cforall_master/libcfa/src/stdlib.hfa:154:100: warning: ‘_X4_srcS6S_fill_Y12__T_generic___1._X4sizej_1’ is used uninitialized in this function [-Wuninitialized]
00:49:31   struct S_fill   { char tag; char c; size_t size; T * at; char t[50]; };
00:49:31                                                                   ~~~~~~~                           ^          
00:49:31 /var/lib/jenkins/workspace/Cforall_master/libcfa/src/stdlib.hfa:154:130: warning: ‘_X4_srcS6S_fill_Y12__T_generic___1._X2atPY12__T_generic__1’ is used uninitialized in this function [-Wuninitialized]
00:49:31   struct S_fill   { char tag; char c; size_t size; T * at; char t[50]; };
00:49:31                                                                                                                                   ^                       
00:49:31   CFA      bits/debug.lo
00:49:31   CC       exception.lo
00:49:31   CFA      interpose.lo
00:49:31   CFA      startup.lo
00:49:31   CC       virtual.lo
00:49:31   GEN      prelude.lo
00:49:31   CPPAS    concurrency/CtxSwitch-x86.lo
00:49:31   CC       concurrency/invoke.lo
00:49:31   CFA      concurrency/io.lo
00:49:31   CFA      concurrency/preemption.lo
00:49:31   CFA      concurrency/ready_queue.lo
00:49:31   CFA      concurrency/stats.lo
00:49:31   CFA      bits/weakso_locks.lo
00:49:31   CFA      containers/maybe.lo
00:49:31   CFA      containers/pair.lo
00:49:31   CFA      containers/result.lo
00:49:31   CFA      containers/vector.lo
00:49:31   CFA      device/cpu.lo
00:49:31   CFA      concurrency/alarm.lo
00:49:31   CFA      concurrency/coroutine.lo
00:49:31   CFA      concurrency/exception.lo
00:49:31   CFA      concurrency/kernel.lo
00:49:31   CFA      concurrency/locks.lo
00:49:31   CFA      concurrency/monitor.lo
00:49:31   CFA      concurrency/mutex.lo
00:49:31   CFA      concurrency/thread.lo
00:49:31 /var/lib/jenkins/workspace/Cforall_master/libcfa/src/stdlib.hfa: In function ‘_X5allocQ1_0_1_1__X15alloc_internal$FPBD0_PvPBD0jjS6S_fill_BD0_BT0__FPBD0_jBT0__1.isra.14.constprop’:
00:49:31 /var/lib/jenkins/workspace/Cforall_master/libcfa/src/stdlib.hfa:154:97: warning: ‘_X4_srcS6S_fill_Y12__T_generic___1._X1cc_1’ is used uninitialized in this function [-Wuninitialized]
00:49:31   struct S_fill   { char tag; char c; size_t size; T * at; char t[50]; };
00:49:31                                                                ~~~~~~~~~~                        ^       
00:49:31 /var/lib/jenkins/workspace/Cforall_master/libcfa/src/stdlib.hfa:154:100: warning: ‘_X4_srcS6S_fill_Y12__T_generic___1._X4sizej_1’ is used uninitialized in this function [-Wuninitialized]
00:49:31   struct S_fill   { char tag; char c; size_t size; T * at; char t[50]; };
00:49:31                                                                   ~~~~~~~                           ^          
00:49:31 /var/lib/jenkins/workspace/Cforall_master/libcfa/src/stdlib.hfa:154:130: warning: ‘_X4_srcS6S_fill_Y12__T_generic___1._X2atPY12__T_generic__1’ is used uninitialized in this function [-Wuninitialized]
00:49:31   struct S_fill   { char tag; char c; size_t size; T * at; char t[50]; };
00:49:31                                                                                                                                   ^                       
00:49:31 /var/lib/jenkins/workspace/Cforall_master/libcfa/src/stdlib.hfa: In function ‘_X5allocQ1_0_1_1__X15alloc_internal$FPBD0_PvPBD0jjS6S_fill_BD0_BT0__FPBD0_jBT0__1.isra.14.constprop’:
00:49:31 /var/lib/jenkins/workspace/Cforall_master/libcfa/src/stdlib.hfa:154:97: warning: ‘_X4_srcS6S_fill_Y12__T_generic___1._X1cc_1’ is used uninitialized in this function [-Wuninitialized]
00:49:31   struct S_fill   { char tag; char c; size_t size; T * at; char t[50]; };
00:49:31                                                                ~~~~~~~~~~                        ^       
00:49:31 /var/lib/jenkins/workspace/Cforall_master/libcfa/src/stdlib.hfa:154:100: warning: ‘_X4_srcS6S_fill_Y12__T_generic___1._X4sizej_1’ is used uninitialized in this function [-Wuninitialized]
00:49:31   struct S_fill   { char tag; char c; size_t size; T * at; char t[50]; };
00:49:31                                                                   ~~~~~~~                           ^          
00:49:31 /var/lib/jenkins/workspace/Cforall_master/libcfa/src/stdlib.hfa:154:130: warning: ‘_X4_srcS6S_fill_Y12__T_generic___1._X2atPY12__T_generic__1’ is used uninitialized in this function [-Wuninitialized]
00:49:31   struct S_fill   { char tag; char c; size_t size; T * at; char t[50]; };
00:49:31                                                                                                                                   ^                       
00:49:31   CFA      concurrency/clib/cfathread.lo
00:49:31   CFA      concurrency/io/setup.lo
00:49:31   CFA      concurrency/io/call.lo
00:49:31   CFA      concurrency/kernel/startup.lo
00:49:31   CCLD     libcfa.la
00:49:31 /var/lib/jenkins/workspace/Cforall_master/libcfa/src/concurrency/clib/cfathread.cfa: In function ‘cfathread_cluster_add_worker’:
00:49:31 /var/lib/jenkins/workspace/Cforall_master/libcfa/src/stdlib.hfa:154:97: warning: ‘_X4_srcS6S_fill_Y12__T_generic___1._X1cc_1’ may be used uninitialized in this function [-Wmaybe-uninitialized]
00:49:31   struct S_fill   { char tag; char c; size_t size; T * at; char t[50]; };
00:49:31                                                                ~~~~~~~~~~                        ^       
00:49:31 /var/lib/jenkins/workspace/Cforall_master/libcfa/src/stdlib.hfa:154:100: warning: ‘_X4_srcS6S_fill_Y12__T_generic___1._X4sizej_1’ may be used uninitialized in this function [-Wmaybe-uninitialized]
00:49:31   struct S_fill   { char tag; char c; size_t size; T * at; char t[50]; };
00:49:31                                                                   ~~~~~~~                           ^          
00:49:31 /var/lib/jenkins/workspace/Cforall_master/libcfa/src/stdlib.hfa:154:130: warning: ‘_X4_srcS6S_fill_Y12__T_generic___1._X2atPY12__T_generic__1’ may be used uninitialized in this function [-Wmaybe-uninitialized]
00:49:31   struct S_fill   { char tag; char c; size_t size; T * at; char t[50]; };
00:49:31                                                                                                                                   ^                       
00:49:31   CCLD     libcfathread.la
00:49:31 make[1]: Nothing to be done for 'all-am'.
00:49:31 [Pipeline] }
00:49:31 [Pipeline] // dir
00:49:31 [Pipeline] }
00:49:31 [Pipeline] // stage
00:49:31 [Pipeline] echo
00:49:31  -------- Build : install -------- 
00:49:31 [Pipeline] stage
00:49:31 [Pipeline] { (Build : install)
00:49:31 [Pipeline] dir
00:49:31 Running in /var/lib/jenkins/workspace/Cforall_master@tmp
00:49:31 [Pipeline] {
00:49:31 [Pipeline] sh
00:49:31 + make -j 8 --no-print-directory install
00:49:31 Making install in driver
00:49:31 make  install-exec-hook
00:49:31  /bin/mkdir -p '/var/lib/jenkins/workspace/Cforall_master@tmp/lib/cfa/'
00:49:31   /bin/bash ../libtool   --mode=install /usr/bin/install -c as cc1 '/var/lib/jenkins/workspace/Cforall_master@tmp/lib/cfa/'
00:49:31   /usr/bin/install -c cfa '/var/lib/jenkins/workspace/Cforall_master@tmp/bin//cfa'
00:49:31 libtool: install: /usr/bin/install -c as /var/lib/jenkins/workspace/Cforall_master@tmp/lib/cfa/as
00:49:31 libtool: install: /usr/bin/install -c cc1 /var/lib/jenkins/workspace/Cforall_master@tmp/lib/cfa/cc1
00:49:31 Making install in src
00:49:31 make  install-am
00:49:31 make[3]: Nothing to be done for 'install-exec-am'.
00:49:31  /bin/mkdir -p '/var/lib/jenkins/workspace/Cforall_master@tmp/lib/cfa/'
00:49:31   /bin/bash ../libtool   --mode=install /usr/bin/install -c ../driver/cfa-cpp demangler '/var/lib/jenkins/workspace/Cforall_master@tmp/lib/cfa/'
00:49:31 libtool: install: /usr/bin/install -c ../driver/cfa-cpp /var/lib/jenkins/workspace/Cforall_master@tmp/lib/cfa/cfa-cpp
00:49:31 libtool: install: /usr/bin/install -c demangler /var/lib/jenkins/workspace/Cforall_master@tmp/lib/cfa/demangler
00:49:31 Making install in .
00:49:31 (CDPATH="${ZSH_VERSION+.}:" && cd /var/lib/jenkins/workspace/Cforall_master && /bin/bash /var/lib/jenkins/workspace/Cforall_master/automake/missing autoheader)
00:49:31 rm -f stamp-h1
00:49:31 touch /var/lib/jenkins/workspace/Cforall_master/src/config.h.in
00:49:31 cd . && /bin/bash ./config.status config.h
00:49:31 config.status: creating config.h
00:49:31 config.status: config.h is unchanged
00:49:31 make[2]: Nothing to be done for 'install-exec-am'.
00:49:31  /bin/mkdir -p '/var/lib/jenkins/workspace/Cforall_master@tmp/share/man/man1'
00:49:31  /usr/bin/install -c -m 644 /var/lib/jenkins/workspace/Cforall_master/doc/man/cfa.1 '/var/lib/jenkins/workspace/Cforall_master@tmp/share/man/man1'
00:49:31 Making install in libcfa/x86-debug
00:49:31 Making install in prelude
00:49:31 make[3]: Nothing to be done for 'install-exec-am'.
00:49:31  /bin/mkdir -p '/var/lib/jenkins/workspace/Cforall_master@tmp/lib/cfa/x86-debug/'
00:49:31  /usr/bin/install -c -m 644 gcc-builtins.cf builtins.cf extras.cf prelude.cfa bootloader.c defines.hfa '/var/lib/jenkins/workspace/Cforall_master@tmp/lib/cfa/x86-debug/'
00:49:31 Making install in src
00:49:31  /bin/mkdir -p '/var/lib/jenkins/workspace/Cforall_master@tmp/lib/cfa/x86-debug/'
00:49:31  /bin/bash ../libtool   --mode=install /usr/bin/install -c   libcfa.la libcfathread.la '/var/lib/jenkins/workspace/Cforall_master@tmp/lib/cfa/x86-debug/'
00:49:31  /bin/mkdir -p '/var/lib/jenkins/workspace/Cforall_master@tmp/include/cfa/'
00:49:31  /bin/mkdir -p '/var/lib/jenkins/workspace/Cforall_master@tmp/include/cfa//stdhdr/sys'
00:49:31  /usr/bin/install -c -m 644  /var/lib/jenkins/workspace/Cforall_master/libcfa/src/stdhdr/sys/time.h /var/lib/jenkins/workspace/Cforall_master/libcfa/src/stdhdr/sys/socket.h /var/lib/jenkins/workspace/Cforall_master/libcfa/src/stdhdr/sys/mman.h '/var/lib/jenkins/workspace/Cforall_master@tmp/include/cfa//stdhdr/sys'
00:49:31  /bin/mkdir -p '/var/lib/jenkins/workspace/Cforall_master@tmp/include/cfa//containers'
00:49:31  /usr/bin/install -c -m 644  /var/lib/jenkins/workspace/Cforall_master/libcfa/src/containers/maybe.hfa /var/lib/jenkins/workspace/Cforall_master/libcfa/src/containers/pair.hfa /var/lib/jenkins/workspace/Cforall_master/libcfa/src/containers/result.hfa /var/lib/jenkins/workspace/Cforall_master/libcfa/src/containers/vector.hfa /var/lib/jenkins/workspace/Cforall_master/libcfa/src/containers/array.hfa /var/lib/jenkins/workspace/Cforall_master/libcfa/src/containers/list.hfa /var/lib/jenkins/workspace/Cforall_master/libcfa/src/containers/queueLockFree.hfa /var/lib/jenkins/workspace/Cforall_master/libcfa/src/containers/stackLockFree.hfa '/var/lib/jenkins/workspace/Cforall_master@tmp/include/cfa//containers'
00:49:31 libtool: install: /usr/bin/install -c .libs/libcfa.so.1.0.0 /var/lib/jenkins/workspace/Cforall_master@tmp/lib/cfa/x86-debug/libcfa.so.1.0.0
00:49:31  /bin/mkdir -p '/var/lib/jenkins/workspace/Cforall_master@tmp/include/cfa//concurrency/kernel'
00:49:31  /usr/bin/install -c -m 644  /var/lib/jenkins/workspace/Cforall_master/libcfa/src/concurrency/kernel/fwd.hfa '/var/lib/jenkins/workspace/Cforall_master@tmp/include/cfa//concurrency/kernel'
00:49:31  /usr/bin/install -c -m 644  /var/lib/jenkins/workspace/Cforall_master/libcfa/src/common.hfa /var/lib/jenkins/workspace/Cforall_master/libcfa/src/fstream.hfa /var/lib/jenkins/workspace/Cforall_master/libcfa/src/heap.hfa /var/lib/jenkins/workspace/Cforall_master/libcfa/src/iostream.hfa /var/lib/jenkins/workspace/Cforall_master/libcfa/src/iterator.hfa /var/lib/jenkins/workspace/Cforall_master/libcfa/src/limits.hfa /var/lib/jenkins/workspace/Cforall_master/libcfa/src/memory.hfa /var/lib/jenkins/workspace/Cforall_master/libcfa/src/parseargs.hfa /var/lib/jenkins/workspace/Cforall_master/libcfa/src/rational.hfa /var/lib/jenkins/workspace/Cforall_master/libcfa/src/stdlib.hfa /var/lib/jenkins/workspace/Cforall_master/libcfa/src/strstream.hfa /var/lib/jenkins/workspace/Cforall_master/libcfa/src/time.hfa /var/lib/jenkins/workspace/Cforall_master/libcfa/src/bitmanip.hfa /var/lib/jenkins/workspace/Cforall_master/libcfa/src/clock.hfa /var/lib/jenkins/workspace/Cforall_master/libcfa/src/exception.hfa /var/lib/jenkins/workspace/Cforall_master/libcfa/src/exception.h /var/lib/jenkins/workspace/Cforall_master/libcfa/src/gmp.hfa /var/lib/jenkins/workspace/Cforall_master/libcfa/src/math.hfa /var/lib/jenkins/workspace/Cforall_master/libcfa/src/time_t.hfa '/var/lib/jenkins/workspace/Cforall_master@tmp/include/cfa//.'
00:49:31  /bin/mkdir -p '/var/lib/jenkins/workspace/Cforall_master@tmp/include/cfa//concurrency'
00:49:31  /usr/bin/install -c -m 644  /var/lib/jenkins/workspace/Cforall_master/libcfa/src/concurrency/iofwd.hfa /var/lib/jenkins/workspace/Cforall_master/libcfa/src/concurrency/alarm.hfa /var/lib/jenkins/workspace/Cforall_master/libcfa/src/concurrency/coroutine.hfa /var/lib/jenkins/workspace/Cforall_master/libcfa/src/concurrency/exception.hfa /var/lib/jenkins/workspace/Cforall_master/libcfa/src/concurrency/kernel.hfa /var/lib/jenkins/workspace/Cforall_master/libcfa/src/concurrency/locks.hfa /var/lib/jenkins/workspace/Cforall_master/libcfa/src/concurrency/monitor.hfa /var/lib/jenkins/workspace/Cforall_master/libcfa/src/concurrency/mutex.hfa /var/lib/jenkins/workspace/Cforall_master/libcfa/src/concurrency/thread.hfa /var/lib/jenkins/workspace/Cforall_master/libcfa/src/concurrency/invoke.h /var/lib/jenkins/workspace/Cforall_master/libcfa/src/concurrency/future.hfa '/var/lib/jenkins/workspace/Cforall_master@tmp/include/cfa//concurrency'
00:49:31  /bin/mkdir -p '/var/lib/jenkins/workspace/Cforall_master@tmp/include/cfa//concurrency/clib'
00:49:31  /usr/bin/install -c -m 644  /var/lib/jenkins/workspace/Cforall_master/libcfa/src/concurrency/clib/cfathread.h '/var/lib/jenkins/workspace/Cforall_master@tmp/include/cfa//concurrency/clib'
00:49:31  /bin/mkdir -p '/var/lib/jenkins/workspace/Cforall_master@tmp/include/cfa//device'
00:49:31  /usr/bin/install -c -m 644  /var/lib/jenkins/workspace/Cforall_master/libcfa/src/device/cpu.hfa '/var/lib/jenkins/workspace/Cforall_master@tmp/include/cfa//device'
00:49:31  /bin/mkdir -p '/var/lib/jenkins/workspace/Cforall_master@tmp/include/cfa//stdhdr/libltdl'
00:49:31  /usr/bin/install -c -m 644  /var/lib/jenkins/workspace/Cforall_master/libcfa/src/stdhdr/libltdl/lt_dlloader.h '/var/lib/jenkins/workspace/Cforall_master@tmp/include/cfa//stdhdr/libltdl'
00:49:31  /bin/mkdir -p '/var/lib/jenkins/workspace/Cforall_master@tmp/include/cfa//vec'
00:49:31  /usr/bin/install -c -m 644  /var/lib/jenkins/workspace/Cforall_master/libcfa/src/vec/vec.hfa /var/lib/jenkins/workspace/Cforall_master/libcfa/src/vec/vec2.hfa /var/lib/jenkins/workspace/Cforall_master/libcfa/src/vec/vec3.hfa /var/lib/jenkins/workspace/Cforall_master/libcfa/src/vec/vec4.hfa '/var/lib/jenkins/workspace/Cforall_master@tmp/include/cfa//vec'
00:49:31  /bin/mkdir -p '/var/lib/jenkins/workspace/Cforall_master@tmp/include/cfa//bits'
00:49:31  /usr/bin/install -c -m 644  /var/lib/jenkins/workspace/Cforall_master/libcfa/src/bits/weakso_locks.hfa /var/lib/jenkins/workspace/Cforall_master/libcfa/src/bits/align.hfa /var/lib/jenkins/workspace/Cforall_master/libcfa/src/bits/containers.hfa /var/lib/jenkins/workspace/Cforall_master/libcfa/src/bits/debug.hfa /var/lib/jenkins/workspace/Cforall_master/libcfa/src/bits/defs.hfa /var/lib/jenkins/workspace/Cforall_master/libcfa/src/bits/locks.hfa /var/lib/jenkins/workspace/Cforall_master/libcfa/src/bits/collection.hfa /var/lib/jenkins/workspace/Cforall_master/libcfa/src/bits/stack.hfa /var/lib/jenkins/workspace/Cforall_master/libcfa/src/bits/queue.hfa /var/lib/jenkins/workspace/Cforall_master/libcfa/src/bits/sequence.hfa /var/lib/jenkins/workspace/Cforall_master/libcfa/src/bits/random.hfa '/var/lib/jenkins/workspace/Cforall_master@tmp/include/cfa//bits'
00:49:31  /bin/mkdir -p '/var/lib/jenkins/workspace/Cforall_master@tmp/include/cfa//stdhdr'
00:49:31  /usr/bin/install -c -m 644  /var/lib/jenkins/workspace/Cforall_master/libcfa/src/stdhdr/errno.h /var/lib/jenkins/workspace/Cforall_master/libcfa/src/stdhdr/stdbool.h /var/lib/jenkins/workspace/Cforall_master/libcfa/src/stdhdr/setjmp.h /var/lib/jenkins/workspace/Cforall_master/libcfa/src/stdhdr/stdlib.h /var/lib/jenkins/workspace/Cforall_master/libcfa/src/stdhdr/signal.h /var/lib/jenkins/workspace/Cforall_master/libcfa/src/stdhdr/uchar.h /var/lib/jenkins/workspace/Cforall_master/libcfa/src/stdhdr/float.h /var/lib/jenkins/workspace/Cforall_master/libcfa/src/stdhdr/time.h /var/lib/jenkins/workspace/Cforall_master/libcfa/src/stdhdr/stddef.h /var/lib/jenkins/workspace/Cforall_master/libcfa/src/stdhdr/assert.h /var/lib/jenkins/workspace/Cforall_master/libcfa/src/stdhdr/pthread.h /var/lib/jenkins/workspace/Cforall_master/libcfa/src/stdhdr/math.h /var/lib/jenkins/workspace/Cforall_master/libcfa/src/stdhdr/gmp.h /var/lib/jenkins/workspace/Cforall_master/libcfa/src/stdhdr/ctype.h /var/lib/jenkins/workspace/Cforall_master/libcfa/src/stdhdr/stdnoreturn.h /var/lib/jenkins/workspace/Cforall_master/libcfa/src/stdhdr/tgmath.h /var/lib/jenkins/workspace/Cforall_master/libcfa/src/stdhdr/threads.h /var/lib/jenkins/workspace/Cforall_master/libcfa/src/stdhdr/wctype.h /var/lib/jenkins/workspace/Cforall_master/libcfa/src/stdhdr/string.h /var/lib/jenkins/workspace/Cforall_master/libcfa/src/stdhdr/fenv.h /var/lib/jenkins/workspace/Cforall_master/libcfa/src/stdhdr/unistd.h /var/lib/jenkins/workspace/Cforall_master/libcfa/src/stdhdr/stdarg.h /var/lib/jenkins/workspace/Cforall_master/libcfa/src/stdhdr/stdint.h /var/lib/jenkins/workspace/Cforall_master/libcfa/src/stdhdr/stdio.h /var/lib/jenkins/workspace/Cforall_master/libcfa/src/stdhdr/iso646.h /var/lib/jenkins/workspace/Cforall_master/libcfa/src/stdhdr/wchar.h /var/lib/jenkins/workspace/Cforall_master/libcfa/src/stdhdr/malloc.h /var/lib/jenkins/workspace/Cforall_master/libcfa/src/stdhdr/stdatomic.h /var/lib/jenkins/workspace/Cforall_master/libcfa/src/stdhdr/complex.h /var/lib/jenkins/workspace/Cforall_master/libcfa/src/stdhdr/locale.h /var/lib/jenkins/workspace/Cforall_master/libcfa/src/stdhdr/limits.h /var/lib/jenkins/workspace/Cforall_master/libcfa/src/stdhdr/inttypes.h /var/lib/jenkins/workspace/Cforall_master/libcfa/src/stdhdr/stdalign.h /var/lib/jenkins/workspace/Cforall_master/libcfa/src/stdhdr/unwind.h '/var/lib/jenkins/workspace/Cforall_master@tmp/include/cfa//stdhdr'
00:49:31 libtool: install: (cd /var/lib/jenkins/workspace/Cforall_master@tmp/lib/cfa/x86-debug && { ln -s -f libcfa.so.1.0.0 libcfa.so.1 || { rm -f libcfa.so.1 && ln -s libcfa.so.1.0.0 libcfa.so.1; }; })
00:49:31 libtool: install: (cd /var/lib/jenkins/workspace/Cforall_master@tmp/lib/cfa/x86-debug && { ln -s -f libcfa.so.1.0.0 libcfa.so || { rm -f libcfa.so && ln -s libcfa.so.1.0.0 libcfa.so; }; })
00:49:31 libtool: install: /usr/bin/install -c .libs/libcfa.lai /var/lib/jenkins/workspace/Cforall_master@tmp/lib/cfa/x86-debug/libcfa.la
00:49:31 libtool: install: /usr/bin/install -c .libs/libcfathread.so.1.0.0 /var/lib/jenkins/workspace/Cforall_master@tmp/lib/cfa/x86-debug/libcfathread.so.1.0.0
00:49:31 libtool: install: (cd /var/lib/jenkins/workspace/Cforall_master@tmp/lib/cfa/x86-debug && { ln -s -f libcfathread.so.1.0.0 libcfathread.so.1 || { rm -f libcfathread.so.1 && ln -s libcfathread.so.1.0.0 libcfathread.so.1; }; })
00:49:31 libtool: install: (cd /var/lib/jenkins/workspace/Cforall_master@tmp/lib/cfa/x86-debug && { ln -s -f libcfathread.so.1.0.0 libcfathread.so || { rm -f libcfathread.so && ln -s libcfathread.so.1.0.0 libcfathread.so; }; })
00:49:31 libtool: install: /usr/bin/install -c .libs/libcfathread.lai /var/lib/jenkins/workspace/Cforall_master@tmp/lib/cfa/x86-debug/libcfathread.la
00:49:31 libtool: warning: remember to run 'libtool --finish /var/lib/jenkins/workspace/Cforall_master@tmp/lib/cfa/x86-debug/'
00:49:31 make[3]: Nothing to be done for 'install-exec-am'.
00:49:31 make[3]: Nothing to be done for 'install-data-am'.
00:49:31 Making install in libcfa/x86-nodebug
00:49:31 Making install in prelude
00:49:31 make[3]: Nothing to be done for 'install-exec-am'.
00:49:31  /bin/mkdir -p '/var/lib/jenkins/workspace/Cforall_master@tmp/lib/cfa/x86-nodebug/'
00:49:31  /usr/bin/install -c -m 644 gcc-builtins.cf builtins.cf extras.cf prelude.cfa bootloader.c defines.hfa '/var/lib/jenkins/workspace/Cforall_master@tmp/lib/cfa/x86-nodebug/'
00:49:31 Making install in src
00:49:31  /bin/mkdir -p '/var/lib/jenkins/workspace/Cforall_master@tmp/lib/cfa/x86-nodebug/'
00:49:31  /bin/bash ../libtool   --mode=install /usr/bin/install -c   libcfa.la libcfathread.la '/var/lib/jenkins/workspace/Cforall_master@tmp/lib/cfa/x86-nodebug/'
00:49:31  /bin/mkdir -p '/var/lib/jenkins/workspace/Cforall_master@tmp/include/cfa/'
00:49:31  /bin/mkdir -p '/var/lib/jenkins/workspace/Cforall_master@tmp/include/cfa//stdhdr/sys'
00:49:31  /usr/bin/install -c -m 644  /var/lib/jenkins/workspace/Cforall_master/libcfa/src/stdhdr/sys/time.h /var/lib/jenkins/workspace/Cforall_master/libcfa/src/stdhdr/sys/socket.h /var/lib/jenkins/workspace/Cforall_master/libcfa/src/stdhdr/sys/mman.h '/var/lib/jenkins/workspace/Cforall_master@tmp/include/cfa//stdhdr/sys'
00:49:31  /bin/mkdir -p '/var/lib/jenkins/workspace/Cforall_master@tmp/include/cfa//containers'
00:49:31  /usr/bin/install -c -m 644  /var/lib/jenkins/workspace/Cforall_master/libcfa/src/containers/maybe.hfa /var/lib/jenkins/workspace/Cforall_master/libcfa/src/containers/pair.hfa /var/lib/jenkins/workspace/Cforall_master/libcfa/src/containers/result.hfa /var/lib/jenkins/workspace/Cforall_master/libcfa/src/containers/vector.hfa /var/lib/jenkins/workspace/Cforall_master/libcfa/src/containers/array.hfa /var/lib/jenkins/workspace/Cforall_master/libcfa/src/containers/list.hfa /var/lib/jenkins/workspace/Cforall_master/libcfa/src/containers/queueLockFree.hfa /var/lib/jenkins/workspace/Cforall_master/libcfa/src/containers/stackLockFree.hfa '/var/lib/jenkins/workspace/Cforall_master@tmp/include/cfa//containers'
00:49:31 libtool: install: /usr/bin/install -c .libs/libcfa.so.1.0.0 /var/lib/jenkins/workspace/Cforall_master@tmp/lib/cfa/x86-nodebug/libcfa.so.1.0.0
00:49:31  /bin/mkdir -p '/var/lib/jenkins/workspace/Cforall_master@tmp/include/cfa//concurrency/kernel'
00:49:31  /usr/bin/install -c -m 644  /var/lib/jenkins/workspace/Cforall_master/libcfa/src/concurrency/kernel/fwd.hfa '/var/lib/jenkins/workspace/Cforall_master@tmp/include/cfa//concurrency/kernel'
00:49:31  /usr/bin/install -c -m 644  /var/lib/jenkins/workspace/Cforall_master/libcfa/src/common.hfa /var/lib/jenkins/workspace/Cforall_master/libcfa/src/fstream.hfa /var/lib/jenkins/workspace/Cforall_master/libcfa/src/heap.hfa /var/lib/jenkins/workspace/Cforall_master/libcfa/src/iostream.hfa /var/lib/jenkins/workspace/Cforall_master/libcfa/src/iterator.hfa /var/lib/jenkins/workspace/Cforall_master/libcfa/src/limits.hfa /var/lib/jenkins/workspace/Cforall_master/libcfa/src/memory.hfa /var/lib/jenkins/workspace/Cforall_master/libcfa/src/parseargs.hfa /var/lib/jenkins/workspace/Cforall_master/libcfa/src/rational.hfa /var/lib/jenkins/workspace/Cforall_master/libcfa/src/stdlib.hfa /var/lib/jenkins/workspace/Cforall_master/libcfa/src/strstream.hfa /var/lib/jenkins/workspace/Cforall_master/libcfa/src/time.hfa /var/lib/jenkins/workspace/Cforall_master/libcfa/src/bitmanip.hfa /var/lib/jenkins/workspace/Cforall_master/libcfa/src/clock.hfa /var/lib/jenkins/workspace/Cforall_master/libcfa/src/exception.hfa /var/lib/jenkins/workspace/Cforall_master/libcfa/src/exception.h /var/lib/jenkins/workspace/Cforall_master/libcfa/src/gmp.hfa /var/lib/jenkins/workspace/Cforall_master/libcfa/src/math.hfa /var/lib/jenkins/workspace/Cforall_master/libcfa/src/time_t.hfa '/var/lib/jenkins/workspace/Cforall_master@tmp/include/cfa//.'
00:49:31  /bin/mkdir -p '/var/lib/jenkins/workspace/Cforall_master@tmp/include/cfa//concurrency'
00:49:31  /usr/bin/install -c -m 644  /var/lib/jenkins/workspace/Cforall_master/libcfa/src/concurrency/iofwd.hfa /var/lib/jenkins/workspace/Cforall_master/libcfa/src/concurrency/alarm.hfa /var/lib/jenkins/workspace/Cforall_master/libcfa/src/concurrency/coroutine.hfa /var/lib/jenkins/workspace/Cforall_master/libcfa/src/concurrency/exception.hfa /var/lib/jenkins/workspace/Cforall_master/libcfa/src/concurrency/kernel.hfa /var/lib/jenkins/workspace/Cforall_master/libcfa/src/concurrency/locks.hfa /var/lib/jenkins/workspace/Cforall_master/libcfa/src/concurrency/monitor.hfa /var/lib/jenkins/workspace/Cforall_master/libcfa/src/concurrency/mutex.hfa /var/lib/jenkins/workspace/Cforall_master/libcfa/src/concurrency/thread.hfa /var/lib/jenkins/workspace/Cforall_master/libcfa/src/concurrency/invoke.h /var/lib/jenkins/workspace/Cforall_master/libcfa/src/concurrency/future.hfa '/var/lib/jenkins/workspace/Cforall_master@tmp/include/cfa//concurrency'
00:49:31  /bin/mkdir -p '/var/lib/jenkins/workspace/Cforall_master@tmp/include/cfa//concurrency/clib'
00:49:31  /usr/bin/install -c -m 644  /var/lib/jenkins/workspace/Cforall_master/libcfa/src/concurrency/clib/cfathread.h '/var/lib/jenkins/workspace/Cforall_master@tmp/include/cfa//concurrency/clib'
00:49:31  /bin/mkdir -p '/var/lib/jenkins/workspace/Cforall_master@tmp/include/cfa//device'
00:49:31  /usr/bin/install -c -m 644  /var/lib/jenkins/workspace/Cforall_master/libcfa/src/device/cpu.hfa '/var/lib/jenkins/workspace/Cforall_master@tmp/include/cfa//device'
00:49:31  /bin/mkdir -p '/var/lib/jenkins/workspace/Cforall_master@tmp/include/cfa//stdhdr/libltdl'
00:49:31  /usr/bin/install -c -m 644  /var/lib/jenkins/workspace/Cforall_master/libcfa/src/stdhdr/libltdl/lt_dlloader.h '/var/lib/jenkins/workspace/Cforall_master@tmp/include/cfa//stdhdr/libltdl'
00:49:31  /bin/mkdir -p '/var/lib/jenkins/workspace/Cforall_master@tmp/include/cfa//vec'
00:49:31  /usr/bin/install -c -m 644  /var/lib/jenkins/workspace/Cforall_master/libcfa/src/vec/vec.hfa /var/lib/jenkins/workspace/Cforall_master/libcfa/src/vec/vec2.hfa /var/lib/jenkins/workspace/Cforall_master/libcfa/src/vec/vec3.hfa /var/lib/jenkins/workspace/Cforall_master/libcfa/src/vec/vec4.hfa '/var/lib/jenkins/workspace/Cforall_master@tmp/include/cfa//vec'
00:49:31  /bin/mkdir -p '/var/lib/jenkins/workspace/Cforall_master@tmp/include/cfa//bits'
00:49:31  /usr/bin/install -c -m 644  /var/lib/jenkins/workspace/Cforall_master/libcfa/src/bits/weakso_locks.hfa /var/lib/jenkins/workspace/Cforall_master/libcfa/src/bits/align.hfa /var/lib/jenkins/workspace/Cforall_master/libcfa/src/bits/containers.hfa /var/lib/jenkins/workspace/Cforall_master/libcfa/src/bits/debug.hfa /var/lib/jenkins/workspace/Cforall_master/libcfa/src/bits/defs.hfa /var/lib/jenkins/workspace/Cforall_master/libcfa/src/bits/locks.hfa /var/lib/jenkins/workspace/Cforall_master/libcfa/src/bits/collection.hfa /var/lib/jenkins/workspace/Cforall_master/libcfa/src/bits/stack.hfa /var/lib/jenkins/workspace/Cforall_master/libcfa/src/bits/queue.hfa /var/lib/jenkins/workspace/Cforall_master/libcfa/src/bits/sequence.hfa /var/lib/jenkins/workspace/Cforall_master/libcfa/src/bits/random.hfa '/var/lib/jenkins/workspace/Cforall_master@tmp/include/cfa//bits'
00:49:31  /bin/mkdir -p '/var/lib/jenkins/workspace/Cforall_master@tmp/include/cfa//stdhdr'
00:49:31  /usr/bin/install -c -m 644  /var/lib/jenkins/workspace/Cforall_master/libcfa/src/stdhdr/errno.h /var/lib/jenkins/workspace/Cforall_master/libcfa/src/stdhdr/stdbool.h /var/lib/jenkins/workspace/Cforall_master/libcfa/src/stdhdr/setjmp.h /var/lib/jenkins/workspace/Cforall_master/libcfa/src/stdhdr/stdlib.h /var/lib/jenkins/workspace/Cforall_master/libcfa/src/stdhdr/signal.h /var/lib/jenkins/workspace/Cforall_master/libcfa/src/stdhdr/uchar.h /var/lib/jenkins/workspace/Cforall_master/libcfa/src/stdhdr/float.h /var/lib/jenkins/workspace/Cforall_master/libcfa/src/stdhdr/time.h /var/lib/jenkins/workspace/Cforall_master/libcfa/src/stdhdr/stddef.h /var/lib/jenkins/workspace/Cforall_master/libcfa/src/stdhdr/assert.h /var/lib/jenkins/workspace/Cforall_master/libcfa/src/stdhdr/pthread.h /var/lib/jenkins/workspace/Cforall_master/libcfa/src/stdhdr/math.h /var/lib/jenkins/workspace/Cforall_master/libcfa/src/stdhdr/gmp.h /var/lib/jenkins/workspace/Cforall_master/libcfa/src/stdhdr/ctype.h /var/lib/jenkins/workspace/Cforall_master/libcfa/src/stdhdr/stdnoreturn.h /var/lib/jenkins/workspace/Cforall_master/libcfa/src/stdhdr/tgmath.h /var/lib/jenkins/workspace/Cforall_master/libcfa/src/stdhdr/threads.h /var/lib/jenkins/workspace/Cforall_master/libcfa/src/stdhdr/wctype.h /var/lib/jenkins/workspace/Cforall_master/libcfa/src/stdhdr/string.h /var/lib/jenkins/workspace/Cforall_master/libcfa/src/stdhdr/fenv.h /var/lib/jenkins/workspace/Cforall_master/libcfa/src/stdhdr/unistd.h /var/lib/jenkins/workspace/Cforall_master/libcfa/src/stdhdr/stdarg.h /var/lib/jenkins/workspace/Cforall_master/libcfa/src/stdhdr/stdint.h /var/lib/jenkins/workspace/Cforall_master/libcfa/src/stdhdr/stdio.h /var/lib/jenkins/workspace/Cforall_master/libcfa/src/stdhdr/iso646.h /var/lib/jenkins/workspace/Cforall_master/libcfa/src/stdhdr/wchar.h /var/lib/jenkins/workspace/Cforall_master/libcfa/src/stdhdr/malloc.h /var/lib/jenkins/workspace/Cforall_master/libcfa/src/stdhdr/stdatomic.h /var/lib/jenkins/workspace/Cforall_master/libcfa/src/stdhdr/complex.h /var/lib/jenkins/workspace/Cforall_master/libcfa/src/stdhdr/locale.h /var/lib/jenkins/workspace/Cforall_master/libcfa/src/stdhdr/limits.h /var/lib/jenkins/workspace/Cforall_master/libcfa/src/stdhdr/inttypes.h /var/lib/jenkins/workspace/Cforall_master/libcfa/src/stdhdr/stdalign.h /var/lib/jenkins/workspace/Cforall_master/libcfa/src/stdhdr/unwind.h '/var/lib/jenkins/workspace/Cforall_master@tmp/include/cfa//stdhdr'
00:49:31 libtool: install: (cd /var/lib/jenkins/workspace/Cforall_master@tmp/lib/cfa/x86-nodebug && { ln -s -f libcfa.so.1.0.0 libcfa.so.1 || { rm -f libcfa.so.1 && ln -s libcfa.so.1.0.0 libcfa.so.1; }; })
00:49:31 libtool: install: (cd /var/lib/jenkins/workspace/Cforall_master@tmp/lib/cfa/x86-nodebug && { ln -s -f libcfa.so.1.0.0 libcfa.so || { rm -f libcfa.so && ln -s libcfa.so.1.0.0 libcfa.so; }; })
00:49:31 libtool: install: /usr/bin/install -c .libs/libcfa.lai /var/lib/jenkins/workspace/Cforall_master@tmp/lib/cfa/x86-nodebug/libcfa.la
00:49:31 libtool: install: /usr/bin/install -c .libs/libcfathread.so.1.0.0 /var/lib/jenkins/workspace/Cforall_master@tmp/lib/cfa/x86-nodebug/libcfathread.so.1.0.0
00:49:31 libtool: install: (cd /var/lib/jenkins/workspace/Cforall_master@tmp/lib/cfa/x86-nodebug && { ln -s -f libcfathread.so.1.0.0 libcfathread.so.1 || { rm -f libcfathread.so.1 && ln -s libcfathread.so.1.0.0 libcfathread.so.1; }; })
00:49:31 libtool: install: (cd /var/lib/jenkins/workspace/Cforall_master@tmp/lib/cfa/x86-nodebug && { ln -s -f libcfathread.so.1.0.0 libcfathread.so || { rm -f libcfathread.so && ln -s libcfathread.so.1.0.0 libcfathread.so; }; })
00:49:31 libtool: install: /usr/bin/install -c .libs/libcfathread.lai /var/lib/jenkins/workspace/Cforall_master@tmp/lib/cfa/x86-nodebug/libcfathread.la
00:49:31 libtool: warning: remember to run 'libtool --finish /var/lib/jenkins/workspace/Cforall_master@tmp/lib/cfa/x86-nodebug/'
00:49:31 make[3]: Nothing to be done for 'install-exec-am'.
00:49:31 make[3]: Nothing to be done for 'install-data-am'.
00:49:31 [Pipeline] }
00:49:31 [Pipeline] // dir
00:49:31 [Pipeline] }
00:49:31 [Pipeline] // stage
00:49:31 [Pipeline] sh
00:49:31 + free -h
00:49:31               total        used        free      shared  buff/cache   available
00:49:31 Mem:            15G        210M         12G         12M        2.8G         14G
00:49:31 Swap:           15G          0B         15G
00:49:31 [Pipeline] sh
00:49:31 + ulimit -a
00:49:31 time(seconds)        unlimited
00:49:31 file(blocks)         unlimited
00:49:31 data(kbytes)         unlimited
00:49:31 stack(kbytes)        8192
00:49:31 coredump(blocks)     0
00:49:31 memory(kbytes)       unlimited
00:49:31 locked memory(kbytes) 64
00:49:31 process              126672
00:49:31 nofiles              1048576
00:49:31 vmemory(kbytes)      unlimited
00:49:31 locks                unlimited
00:49:31 rtprio               0
00:49:31 [Pipeline] echo
00:49:31  -------- Test: short -------- 
00:49:31 [Pipeline] stage
00:49:31 [Pipeline] { (Test: short)
00:49:31 [Pipeline] }
00:49:31 [Pipeline] // stage
00:49:31 [Pipeline] echo
00:49:31  -------- Test: full -------- 
00:49:31 [Pipeline] stage
00:49:31 [Pipeline] { (Test: full)
00:49:31 [Pipeline] dir
00:49:31 Running in /var/lib/jenkins/workspace/Cforall_master@tmp
00:49:31 [Pipeline] {
00:49:31 [Pipeline] sh
00:49:31 + make --no-print-directory -C tests timeouts=--timeout=600 --global-timeout=14400 all-tests debug=yes archiveerrors=/var/lib/jenkins/workspace/Cforall_master@tmp/tests/crashes/full-debug
00:49:31 Running 211 tests on 6 cores (Default AST (new):x86 - debug)
00:49:31        	alloc-ERROR                           PASSED     C 0:05.331 - R n/a
00:49:31        	array                                 PASSED     C 0:12.924 - R 0:00.003
00:49:31        	builtins/sync                         PASSED     C 0:04.863 - R 0:00.004
00:49:31        	array-container/array-basic           PASSED     C 0:18.970 - R 0:00.018
00:49:31        	castError                             PASSED     C 0:00.360 - R n/a
00:49:31        	cast                                  PASSED     C 0:13.258 - R 0:00.002
00:49:31        	avl_test                              PASSED     C 0:43.144 - R 0:00.035
00:49:31        	collections/multi_list                PASSED     C 0:59.013 - R 0:00.019
00:49:31        	alloc                                 PASSED     C 1:32.101 - R 0:00.018
00:49:31        	collections/queue                     PASSED     C 1:09.965 - R 0:00.035
00:49:31        	collections/atomic_mpsc               PASSED     C 1:51.727 - R 0:06.345
00:49:31        	alloc2                                PASSED     C 2:17.900 - R 0:00.035
00:49:31        	concurrent/clib_tls                   PASSED     C 0:21.692 - R 0:00.066
00:49:31        	collections/stack                     PASSED     C 1:08.180 - R 0:00.018
00:49:31        	collections/sequence                  PASSED     C 1:11.269 - R 0:00.018
00:49:31        	concurrent/clib                       PASSED     C 0:30.685 - R 0:00.117
00:49:31        	complex                               PASSED     C 0:56.973 - R 0:00.034
00:49:31        	concurrent/cluster                    PASSED     C 1:08.312 - R 0:00.117
00:49:31        	array-container/array-md-sbscr-cases  FAILED with code 1    C 4:05.468 - R n/a
00:49:31 		expected :
00:49:31 		1	done
00:49:31 		got :
00:49:31 		1	*CFA assertion error* "inferParam != appExpr->inferParams.end()" from program "cfa-cpp" in "void GenPoly::{anonymous}::Pass1::addInferredParams(ApplicationExpr*, FunctionType*, std::__cxx11::list<Expression*>::iterator&, const TyVarMap&)" at line 801 in file "/var/lib/jenkins/workspace/Cforall_master/src/GenPoly/Box.cc": addInferredParams missing inferred parameter: enq_: extern pointer to function
00:49:31 		2	... with parameters
00:49:31 		3	  __param_0: C instance of struct tag with body 1
00:49:31 		4	  __param_1: C instance of struct tag with body 1
00:49:31 		5	  __param_2: C instance of struct tag with body 1
00:49:31 		6	  __param_3: C instance of struct tag with body 1
00:49:31 		7	... returning
00:49:31 		8	  __retval_0: C instance of struct tag with body 1
00:49:31 		9	 in: Application of
00:49:31 		10	  Variable Expression: enq_: static inline forall
00:49:31 		11	    Nq: sized data type
00:49:31 		12	    Sq: sized data type
00:49:31 		13	    N: sized data type
00:49:31 		14	    S: sized data type
00:49:31 		15	    recq: data type
00:49:31 		16	    recr: data type
00:49:31 		17	    Tbase: data type
00:49:31 		18	    ... with assertions
00:49:31 		19	      enq_: pointer to function
00:49:31 		20	      ... with parameters
00:49:31 		21	        __param_0: C instance of struct tag with body 1
00:49:31 		22	        __param_1: C instance of struct tag with body 1
00:49:31 		23	        __param_2: C instance of struct tag with body 1
00:49:31 		24	        __param_3: C instance of struct tag with body 1
00:49:31 		25	      ... returning
00:49:31 		26	        __retval_0: C instance of struct tag with body 1
00:49:31 		27	
00:49:31 		28	
00:49:31 		29	    function
00:49:31 		30	  ... with parameters
00:49:31 		31	    instance of struct tag with body 1
00:49:31 		32	    instance of struct tag with body 1
00:49:31 		33	    instance of struct tag with body 1
00:49:31 		34	    instance of struct tag with body 1
00:49:31 		35	  ... returning
00:49:31 		36	    _retval_enq_: instance of struct tag with body 1
00:49:31 		37	    ... with attributes:
00:49:31 		38	      Attribute with name: unused
00:49:31 		39	
00:49:31 		40	
00:49:31 		41	  with resolved type:
00:49:31 		42	    pointer to forall
00:49:31 		43	      [unbound]:sized data type
00:49:31 		44	      [unbound]:sized data type
00:49:31 		45	      [unbound]:sized data type
00:49:31 		46	      [unbound]:sized data type
00:49:31 		47	      [unbound]:data type
00:49:31 		48	      [unbound]:data type
00:49:31 		49	      [unbound]:data type
00:49:31 		50	      ... with assertions
00:49:31 		51	        enq_: extern pointer to function
00:49:31 		52	        ... with parameters
00:49:31 		53	          __param_0: C instance of struct tag with body 1
00:49:31 		54	          __param_1: C instance of struct tag with body 1
00:49:31 		55	          __param_2: C instance of struct tag with body 1
00:49:31 		56	          __param_3: C instance of struct tag with body 1
00:49:31 		57	        ... returning
00:49:31 		58	          __retval_0: C instance of struct tag with body 1
00:49:31 		59	
00:49:31 		60	
00:49:31 		61	      function
00:49:31 		62	    ... with parameters
00:49:31 		63	      __param_0: C instance of struct tag with body 1
00:49:31 		64	      __param_1: C instance of struct tag with body 1
00:49:31 		65	      __param_2: C instance of struct tag with body 1
00:49:31 		66	      __param_3: C instance of struct tag with body 1
00:49:31 		67	    ... returning
00:49:31 		68	      __retval_0: C instance of struct tag with body 1
00:49:31 		69	
00:49:31 		70	... to arguments
00:49:31 		71	  Sizeof Expression on: instance of type Nz (not function type)
00:49:31 		72	  with resolved type:
00:49:31 		73	    unsigned long int
00:49:31 		74	  Alignof Expression on: instance of type Nz (not function type)
00:49:31 		75	  with resolved type:
00:49:31 		76	    unsigned long int
00:49:31 		77	  Sizeof Expression on: float
00:49:31 		78	  with resolved type:
00:49:31 		79	    unsigned long int
00:49:31 		80	  Alignof Expression on: float
00:49:31 		81	  with resolved type:
00:49:31 		82	    unsigned long int
00:49:31 		83	  Sizeof Expression on: instance of type Ny (not function type)
00:49:31 		84	  with resolved type:
00:49:31 		85	    unsigned long int
00:49:31 		86	  Alignof Expression on: instance of type Ny (not function type)
00:49:31 		87	  with resolved type:
00:49:31 		88	    unsigned long int
00:49:31 		89	  Sizeof Expression on: instance of struct arpk with body 1
00:49:31 		90	    ... with parameters
00:49:31 		91	      instance of type Nz (not function type)
00:49:31 		92	      float
00:49:31 		93	      float
00:49:31 		94	      float
00:49:31 		95	
00:49:31 		96	  with resolved type:
00:49:31 		97	    unsigned long int
00:49:31 		98	  Alignof Expression on: instance of struct arpk with body 1
00:49:31 		99	    ... with parameters
00:49:31 		100	      instance of type Nz (not function type)
00:49:31 		101	      float
00:49:31 		102	      float
00:49:31 		103	      float
00:49:31 		104	
00:49:31 		105	  with resolved type:
00:49:31 		106	    unsigned long int
00:49:31 		107	  Variable Expression: _ppp0: instance of struct tag with body 1
00:49:31 		108	  with resolved type:
00:49:31 		109	    instance of struct tag with body 1
00:49:31 		110	  Variable Expression: _ppp1: instance of struct tag with body 1
00:49:31 		111	  with resolved type:
00:49:31 		112	    instance of struct tag with body 1
00:49:31 		113	  Variable Expression: _ppp2: instance of struct tag with body 1
00:49:31 		114	  with resolved type:
00:49:31 		115	    instance of struct tag with body 1
00:49:31 		116	  Variable Expression: _ppp3: instance of struct tag with body 1
00:49:31 		117	  with resolved type:
00:49:31 		118	    instance of struct tag with body 1
00:49:31 		119	
00:49:31 		120	with resolved type:
00:49:31 		121	  instance of struct tag with body 1
00:49:31 		122	... with environment:
00:49:31 		123	  Types:
00:49:31 		124	    _11569_363_recr -> instance of struct arpk with body 1
00:49:31 		125	      ... with parameters
00:49:31 		126	        instance of type Nz (not function type)
00:49:31 		127	        float
00:49:31 		128	        float
00:49:31 		129	        float
00:49:31 		130	
00:49:31 		131	    _11569_359_Sq -> float
00:49:31 		132	    _11569_358_Nq -> instance of type Nz (not function type)
00:49:31 		133	    _11569_360_N -> instance of type Ny (not function type)
00:49:31 		134	    _11569_364_Tbase -> float
00:49:31 		135	    _11569_361_S -> instance of struct arpk with body 1
00:49:31 		136	      ... with parameters
00:49:31 		137	        instance of type Nz (not function type)
00:49:31 		138	        float
00:49:31 		139	        float
00:49:31 		140	        float
00:49:31 		141	
00:49:31 		142	    _11569_362_recq -> float
00:49:31 		143	  Non-types:
00:49:31 		144	
00:49:31 		145	Stack back trace for: /var/lib/jenkins/workspace/Cforall_master@tmp/driver/cfa-cpp
00:49:31 		146	(0) /var/lib/jenkins/workspace/Cforall_master@tmp/driver/cfa-cpp() [0x87c65be]
00:49:31 		147	(1) /var/lib/jenkins/workspace/Cforall_master@tmp/driver/cfa-cpp() [0x892048b]
00:49:31 		148	(2) /var/lib/jenkins/workspace/Cforall_master@tmp/driver/cfa-cpp() [0x889de76]
00:49:31 		149	(3) /var/lib/jenkins/workspace/Cforall_master@tmp/driver/cfa-cpp() [0x889def3]
00:49:31 		150	(4) /var/lib/jenkins/workspace/Cforall_master@tmp/driver/cfa-cpp() [0x88ab539]
00:49:31 		151	(5) /var/lib/jenkins/workspace/Cforall_master@tmp/driver/cfa-cpp() [0x8908e4f]
00:49:31 		152	(6) /var/lib/jenkins/workspace/Cforall_master@tmp/driver/cfa-cpp() [0x8909265]
00:49:31 		153	(7) /var/lib/jenkins/workspace/Cforall_master@tmp/driver/cfa-cpp() [0x8909a22]
00:49:31 		154	(8) /var/lib/jenkins/workspace/Cforall_master@tmp/driver/cfa-cpp() [0x88ab1eb]
00:49:31 		155	(9) /var/lib/jenkins/workspace/Cforall_master@tmp/driver/cfa-cpp() [0x8908e4f]
00:49:31 		156	(10) /var/lib/jenkins/workspace/Cforall_master@tmp/driver/cfa-cpp() [0x8909265]
00:49:31 		157	(11) /var/lib/jenkins/workspace/Cforall_master@tmp/driver/cfa-cpp() [0x8909a22]
00:49:31 		158	(12) /var/lib/jenkins/workspace/Cforall_master@tmp/driver/cfa-cpp() [0x88ab1eb]
00:49:31 		159	(13) /var/lib/jenkins/workspace/Cforall_master@tmp/driver/cfa-cpp() [0x8908e4f]
00:49:31 		160	(14) /var/lib/jenkins/workspace/Cforall_master@tmp/driver/cfa-cpp() [0x8909265]
00:49:31 		161	(15) /var/lib/jenkins/workspace/Cforall_master@tmp/driver/cfa-cpp() [0x8909a22]
00:49:31 		162	(16) /var/lib/jenkins/workspace/Cforall_master@tmp/driver/cfa-cpp() [0x88ab1eb]
00:49:31 		163	(17) /var/lib/jenkins/workspace/Cforall_master@tmp/driver/cfa-cpp() [0x8908e4f]
00:49:31 		164	(18) /var/lib/jenkins/workspace/Cforall_master@tmp/driver/cfa-cpp() [0x8909265]
00:49:31 		165	(19) /var/lib/jenkins/workspace/Cforall_master@tmp/driver/cfa-cpp() [0x8908e4f]
00:49:31 		166	(20) /var/lib/jenkins/workspace/Cforall_master@tmp/driver/cfa-cpp() [0x8909265]
00:49:31 		167	(21) /var/lib/jenkins/workspace/Cforall_master@tmp/driver/cfa-cpp() [0x8909a22]
00:49:31 		168	(22) /var/lib/jenkins/workspace/Cforall_master@tmp/driver/cfa-cpp : GenPoly::box(std::__cxx11::list<Declaration*, std::allocator<Declaration*> >&)+0x7d8 [0x88fe358]
00:49:31 		169	(23) /var/lib/jenkins/workspace/Cforall_master@tmp/driver/cfa-cpp : main(/*unknown*/)+0x1262 [0x84913a2]
00:49:31 		170	CC1 Translator error: stage 2, child failed 6
00:49:31 
00:49:31        	concurrent/coroutineYield             PASSED     C 1:32.021 - R 0:00.619
00:49:31        	concurrent/examples/datingService     PASSED     C 1:19.938 - R 0:00.065
00:49:31        	concurrent/examples/gortn             PASSED     C 0:31.101 - R 0:00.082
00:49:31        	concurrent/examples/boundedBufferEXT  PASSED     C 1:31.486 - R 0:11.649
00:49:31        	concurrent/examples/matrixSum         PASSED     C 0:21.108 - R 0:00.033
00:49:31        	concurrent/examples/boundedBufferINT  PASSED     C 1:26.942 - R 0:11.994
00:49:31        	concurrent/futures/abandon            PASSED     C 0:47.605 - R 0:00.117
00:49:31        	concurrent/keywordErrors              PASSED     C 0:00.317 - R n/a
00:49:31        	concurrent/futures/basic              PASSED     C 0:47.908 - R 0:00.116
00:49:31        	concurrent/futures/typed              PASSED     C 0:42.661 - R 0:00.117
00:49:31        	concurrent/futures/multi              PASSED     C 0:45.013 - R 0:00.065
00:49:31        	concurrent/examples/quickSort         PASSED     C 1:09.167 - R 0:00.035
00:49:31        	concurrent/join                       PASSED     C 0:56.190 - R 0:00.035
00:49:31        	concurrent/park/contention            PASSED     C 0:38.313 - R 0:00.117
00:49:31        	concurrent/preempt                    PASSED     C 0:31.409 - R 0:15.038
00:49:31        	concurrent/park/start_parked          PASSED     C 0:58.131 - R 0:00.066
00:49:31        	concurrent/monitor                    PASSED     C 0:51.338 - R 0:30.563
00:49:31        	concurrent/park/force_preempt         PASSED     C 1:42.146 - R 0:00.317
00:49:31        	concurrent/multi-monitor              PASSED     C 1:31.987 - R 0:35.882
00:49:31        	concurrent/signal/block               PASSED     C 2:28.795 - R 0:02.226
00:49:31        	concurrent/semaphore                  PASSED     C 2:59.560 - R 0:00.034
00:49:31        	concurrent/signal/disjoint            PASSED     C 2:47.399 - R 0:03.431
00:49:31        	concurrent/signal/wait                PASSED     C 2:54.063 - R 0:00.318
00:49:31        	concurrent/sleep                      PASSED     C 2:29.946 - R 0:01.172
00:49:31        	concurrent/spinaphore                 PASSED     C 2:15.890 - R 0:00.670
00:49:31        	concurrent/thread                     PASSED     C 1:20.028 - R 0:00.034
00:49:31        	concurrent/suspend_then               PASSED     C 1:26.718 - R 0:00.419
00:49:31        	concurrent/waitfor/else               PASSED     C 0:51.234 - R 0:00.034
00:49:31        	const-init                            PASSED     C 0:01.496 - R 0:00.035
00:49:31        	concurrent/waitfor/dtor               PASSED     C 1:05.484 - R 0:02.026
00:49:31        	concurrent/waitfor/barge              PASSED     C 1:04.070 - R 0:15.242
00:49:31        	copyfile                              PASSED     C 0:38.422 - R 0:00.017
00:49:31        	coroutine/fibonacci                   PASSED     C 0:50.193 - R 0:00.167
00:49:31        	coroutine/devicedriver                PASSED     C 0:54.235 - R 0:00.034
00:49:31        	concurrent/waitfor/statment           PASSED     C 1:15.583 - R 0:00.066
00:49:31        	concurrent/waitfor/recurse            PASSED     C 1:16.984 - R 0:35.944
00:49:31        	concurrent/waitfor/when               PASSED     C 1:18.011 - R 0:24.489
00:49:31        	coroutine/fmtLines                    PASSED     C 0:57.239 - R 0:00.033
00:49:31        	counter                               PASSED     C 0:01.498 - R 0:00.019
00:49:31        	designations                          PASSED     C 0:03.803 - R 0:00.017
00:49:31        	coroutine/runningTotal                PASSED     C 0:35.955 - R 0:00.034
00:49:31        	coroutine/raii                        PASSED     C 0:37.939 - R 0:00.035
00:49:31        	errors/declaration                    PASSED     C 0:00.093 - R n/a
00:49:31        	errors/scope                          PASSED     C 0:00.134 - R n/a
00:49:31        	errors/signature                      PASSED     C 0:00.097 - R n/a
00:49:31        	coroutine/pingpong                    PASSED     C 0:41.042 - R 0:00.035
00:49:31        	enum                                  PASSED     C 0:09.113 - R 0:00.018
00:49:31        	exceptions/conditional                PASSED     C 0:04.834 - R 0:00.018
00:49:31        	coroutine/prodcons                    PASSED     C 0:54.778 - R 0:00.034
00:49:31        	exceptions/data-except                PASSED     C 0:03.151 - R 0:00.019
00:49:31        	exceptions/defaults                   PASSED     C 0:06.579 - R 0:00.065
00:49:31        	device/cpu                            PASSED     C 0:34.351 - R 0:00.017
00:49:31        	exceptions/cancel/coroutine           PASSED     C 0:24.925 - R 0:00.034
00:49:31        	exceptions/finally-error              PASSED     C 0:00.229 - R n/a
00:49:31        	exceptions/conditional-threads        PASSED     C 0:12.067 - R 0:00.033
00:49:31        	div                                   PASSED     C 0:32.465 - R 0:00.034
00:49:31        	exceptions/cancel/thread              PASSED     C 0:26.367 - R 0:00.034
00:49:31        	exceptions/finally                    PASSED     C 0:06.260 - R 0:00.020
00:49:31        	exceptions/interact                   PASSED     C 0:06.275 - R 0:00.018
00:49:31        	exceptions/resume                     PASSED     C 0:05.066 - R 0:00.034
00:49:31        	exceptions/polymorphic                PASSED     C 0:05.980 - R 0:00.018
00:49:31        	exceptions/trash                      PASSED     C 0:09.365 - R 0:00.035
00:49:31        	exceptions/type-check                 PASSED     C 0:00.211 - R n/a
00:49:31        	exceptions/terminate                  PASSED     C 0:11.822 - R 0:00.018
00:49:31        	exceptions/finally-threads            PASSED     C 0:19.364 - R 0:00.035
00:49:31        	exceptions/defaults-threads           PASSED     C 0:21.594 - R 0:00.035
00:49:31        	expression                            PASSED     C 0:10.513 - R 0:00.002
00:49:31        	exceptions/virtual-poly               PASSED     C 0:11.593 - R 0:00.018
00:49:31        	exceptions/resume-threads             PASSED     C 0:26.432 - R 0:00.035
00:49:31        	exceptions/virtual-cast               PASSED     C 0:18.535 - R 0:00.018
00:49:31        	exceptions/terminate-threads          PASSED     C 0:30.620 - R 0:00.035
00:49:31        	forall                                PASSED     C 0:15.199 - R 0:00.004
00:49:31        	fallthrough                           PASSED     C 0:39.068 - R 0:00.035
00:49:31        	generator/fmtLines                    PASSED     C 0:27.682 - R 0:00.018
00:49:31        	genericUnion                          PASSED     C 0:04.896 - R 0:00.018
00:49:31        	generator/fibonacci                   PASSED     C 0:29.937 - R 0:00.018
00:49:31        	global-monomorph                      PASSED     C 0:09.304 - R 0:00.018
00:49:31        	fstream_test                          PASSED     C 0:44.616 - R 0:00.018
00:49:31        	generator/suspend_then                PASSED     C 0:29.572 - R 0:00.117
00:49:31        	function-operator                     PASSED     C 0:45.936 - R 0:00.017
00:49:31        	identFuncDeclarator                   PASSED     C 0:06.255 - R 0:00.004
00:49:31        	identParamDeclarator                  PASSED     C 0:06.114 - R 0:00.017
00:49:31        	hello                                 PASSED     C 0:15.625 - R 0:00.018
00:49:31        	include/vector-containers             PASSED     C 0:11.374 - R 0:00.018
00:49:31        	identity                              PASSED     C 0:28.738 - R 0:00.018
00:49:31        	ifwhileCtl                            PASSED     C 0:48.075 - R 0:00.035
00:49:31        	heap                                  PASSED     C 0:34.481 - R 0:26.745
00:49:31        	include/vector-sequence               PASSED     C 0:22.996 - R 0:00.018
00:49:31        	init1-ERROR                           PASSED     C 0:00.373 - R n/a
00:49:31        	include/stdincludes                   PASSED     C 0:54.482 - R 0:00.002
00:49:31        	init1                                 PASSED     C 0:09.191 - R 0:00.001
00:49:31        	include/vector-fstream                PASSED     C 0:54.557 - R 0:00.019
00:49:31        	labelledExit                          PASSED     C 0:01.159 - R 0:00.003
00:49:31        	limits                                PASSED     C 0:06.515 - R 0:00.004
00:49:31        	linking/exception-nothreads           PASSED     C 0:10.240 - R 0:00.019
00:49:31        	io/manipulatorsOutput4                PASSED     C 0:45.267 - R 0:00.033
00:49:31        	io/io                                 PASSED     C 0:54.443 - R 0:00.017
00:49:31        	linking/exception-withthreads         PASSED     C 0:16.380 - R 0:00.035
00:49:31        	io/io-acquire                         PASSED     C 0:56.181 - R 0:00.066
00:49:31        	io/many_read                          PASSED     C 0:52.637 - R 0:00.067
00:49:31        	linking/nostdlib                      PASSED     C 0:10.496 - R 0:00.017
00:49:31        	linkonce                              PASSED     C 0:10.004 - R 0:00.018
00:49:31        	linking/weakso_nothd                  PASSED     C 0:30.043 - R 0:00.018
00:49:31        	linking/io-acquire                    PASSED     C 0:32.893 - R 0:00.035
00:49:31        	include/includes                      PASSED     C 2:12.853 - R 0:00.002
00:49:31        	linking/nothreads                     PASSED     C 0:32.643 - R 0:00.018
00:49:31        	maybe                                 PASSED     C 0:16.258 - R 0:00.017
00:49:31        	loopctrl                              PASSED     C 0:29.836 - R 0:00.018
00:49:31        	nested-types                          PASSED     C 0:03.569 - R 0:00.003
00:49:31        	nested-types-ERR1                     PASSED     C 0:00.096 - R n/a
00:49:31        	literals                              PASSED     C 0:33.800 - R 0:00.018
00:49:31        	nested-types-ERR2                     PASSED     C 0:00.173 - R n/a
00:49:31        	linking/withthreads                   PASSED     C 0:58.863 - R 0:00.035
00:49:31        	malloc                                PASSED     C 0:35.440 - R 0:00.018
00:49:31        	numericConstants                      PASSED     C 0:03.268 - R 0:00.003
00:49:31        	operators                             PASSED     C 0:03.424 - R 0:00.035
00:49:31        	poly-d-cycle                          PASSED     C 0:03.984 - R 0:00.017
00:49:31        	poly-o-cycle                          PASSED     C 0:03.487 - R 0:00.033
00:49:31        	quasiKeyword                          PASSED     C 0:01.174 - R 0:00.001
00:49:31        	poly-selection                        PASSED     C 0:02.432 - R 0:00.016
00:49:31        	minmax                                PASSED     C 0:24.193 - R 0:00.019
00:49:31        	raii/ctor-autogen-ERR1                PASSED     C 0:00.466 - R n/a
00:49:31        	list/dlist-insert-remove              PASSED     C 1:00.117 - R 0:00.034
00:49:31        	raii/dtor-early-exit-ERR1             PASSED     C 0:04.710 - R n/a
00:49:31        	raii/ctor-autogen                     PASSED     C 0:14.465 - R 0:00.018
00:49:31        	raii/boxed-types                      PASSED     C 0:15.777 - R 0:00.034
00:49:31        	quotedKeyword                         PASSED     C 0:15.869 - R 0:00.017
00:49:31        	polymorphism                          PASSED     C 0:18.558 - R 0:00.017
00:49:31        	raii/memberCtors-ERR1                 PASSED     C 0:00.472 - R n/a
00:49:31        	raii/dtor-early-exit-ERR2             PASSED     C 0:05.016 - R n/a
00:49:31        	raii/memberCtors                      PASSED     C 0:10.905 - R 0:00.018
00:49:31        	raii/init_once                        PASSED     C 0:11.280 - R 0:00.035
00:49:31        	raii/dtor-early-exit                  PASSED     C 0:24.842 - R 0:00.018
00:49:31        	result                                PASSED     C 0:14.454 - R 0:00.017
00:49:31        	raii/globals                          PASSED     C 0:26.912 - R 0:00.117
00:49:31        	smart-pointers                        PASSED     C 0:06.221 - R 0:00.019
00:49:31        	simpleGenericTriple                   PASSED     C 0:06.867 - R 0:00.020
00:49:31        	references                            PASSED     C 0:30.538 - R 0:00.017
00:49:31        	shortCircuit                          PASSED     C 0:25.079 - R 0:00.035
00:49:31        	switch                                PASSED     C 0:06.035 - R 0:00.001
00:49:31        	searchsort                            PASSED     C 0:40.036 - R 0:00.018
00:49:31        	sum                                   PASSED     C 0:25.750 - R 0:00.017
00:49:31        	strstream                             PASSED     C 0:25.856 - R 0:00.018
00:49:31        	rational                              PASSED     C 1:01.520 - R 0:00.017
00:49:31        	tuple/tupleCast                       PASSED     C 0:04.859 - R 0:00.018
00:49:31        	tuple/tupleFunction                   PASSED     C 0:04.785 - R 0:00.017
00:49:31        	swap                                  PASSED     C 0:31.679 - R 0:00.019
00:49:31        	tuple/tupleAssign                     PASSED     C 0:14.431 - R 0:00.117
00:49:31        	typedefRedef-ERR1                     PASSED     C 0:00.102 - R n/a
00:49:31        	time                                  PASSED     C 0:23.219 - R 0:00.018
00:49:31        	typedefRedef                          PASSED     C 0:01.806 - R 0:00.003
00:49:31        	typeof                                PASSED     C 0:02.119 - R 0:00.035
00:49:31        	tuple/tupleMember                     PASSED     C 0:05.504 - R 0:00.019
00:49:31        	tuple/tuplePolymorphism               PASSED     C 0:07.617 - R 0:00.017
00:49:31        	tuple/tupleVariadic                   PASSED     C 0:20.228 - R 0:00.017
00:49:31        	variableDeclarator                    PASSED     C 0:08.010 - R 0:00.001
00:49:31        	userLiterals                          PASSED     C 0:40.579 - R 0:00.018
00:49:31        	unified_locking/timeout_lock          PASSED     C 1:17.911 - R 0:01.123
00:49:31        	vector                                PASSED     C 1:10.093 - R 0:00.050
00:49:31        	unified_locking/mcs                   PASSED     C 1:21.155 - R 0:13.289
00:49:31        	vector_math/vec2_double               PASSED     C 0:52.680 - R 0:00.016
00:49:31        	unified_locking/fast                  PASSED     C 1:37.688 - R 0:00.115
00:49:31        	unified_locking/locks                 PASSED     C 1:23.009 - R 0:15.444
00:49:31        	vector_math/vec2_uint                 PASSED     C 0:46.049 - R 0:00.018
00:49:31        	vector_math/vec2_float                PASSED     C 1:09.851 - R 0:00.017
00:49:31        	voidPtr                               PASSED     C 0:01.525 - R 0:00.017
00:49:31        	warnings/self-assignment              PASSED     C 0:08.528 - R 0:00.004
00:49:31        	KRfunctions                           PASSED     C 0:00.580 - R 0:00.003
00:49:31        	vector_math/vec3_int                  PASSED     C 1:06.410 - R 0:00.018
00:49:31        	vector_math/vec2_int                  PASSED     C 1:11.605 - R 0:00.018
00:49:31        	vector_math/vec4_float                PASSED     C 1:07.747 - R 0:00.018
00:49:31        	vector_math/vec3_float                PASSED     C 1:10.048 - R 0:00.018
00:49:31        	attributes                            PASSED     C 0:05.080 - R 0:00.072
00:49:31        	abs                                   PASSED     C 0:38.804 - R 0:00.017
00:49:31        	ato                                   PASSED     C 0:38.394 - R 0:00.018
00:49:31        	errors/completeType                   PASSED     C 0:00.370 - R n/a
00:49:31        	declarationSpecifier                  PASSED     C 0:02.387 - R 0:00.002
00:49:31        	functions                             PASSED     C 0:00.695 - R 0:00.012
00:49:31        	extension                             PASSED     C 0:00.759 - R 0:00.011
00:49:31        	gccExtensions                         PASSED     C 0:00.623 - R 0:00.001
00:49:31        	bitmanip3                             PASSED     C 0:32.716 - R 0:00.067
00:49:31        	bitmanip2                             PASSED     C 0:50.304 - R 0:01.524
00:49:31        	vector_math/vec4_int                  PASSED     C 1:20.527 - R 0:00.035
00:49:31        	bitmanip1                             PASSED     C 0:53.719 - R 0:02.681
00:49:31        	meta/archVast                         PASSED     C 0:00.364 - R n/a
00:49:31        	io/manipulatorsInput                  PASSED     C 0:47.229 - R 0:00.016
00:49:31        	io/manipulatorsOutput2                PASSED     C 0:59.930 - R 0:00.035
00:49:31        	random                                PASSED     C 0:43.972 - R 0:00.035
00:49:31        	math                                  PASSED     C 1:00.973 - R 0:00.034
00:49:31        	io/manipulatorsOutput1                PASSED     C 1:24.111 - R 0:00.035
00:49:31        	mathX                                 PASSED     C 1:32.194 - R 0:06.903
00:49:31        	vector_math/vec2_ldouble              PASSED     C 1:41.115 - R 0:00.017
00:49:31 Tests took 24:08.128
00:49:31 Makefile:861: recipe for target 'all-tests' failed
00:49:31 make: *** [all-tests] Error 1
00:49:31 [Pipeline] }
00:49:31 [Pipeline] // dir
00:49:31 [Pipeline] }
00:49:31 [Pipeline] // stage
00:49:31 [Pipeline] echo
00:49:31 Archiving core dumps
00:49:31 [Pipeline] dir
00:49:31 Running in /var/lib/jenkins/workspace/Cforall_master@tmp
00:49:31 [Pipeline] {
00:49:31 [Pipeline] fileExists
00:49:31 [Pipeline] }
00:49:31 [Pipeline] // dir
00:49:31 [Pipeline] }
00:49:31 [Pipeline] // wrap
00:49:31 [Pipeline] }
00:49:31 [Pipeline] // node
00:49:31 [Pipeline] echo
00:49:31 hudson.AbortException: script returned exit code 2
00:49:31 [Pipeline] node
00:49:31 Running on Brokk 5 in /var/lib/jenkins/workspace/Cforall_master
00:49:31 [Pipeline] {
00:49:31 [Pipeline] echo
00:49:31 Notifying users of result
00:49:31 [Pipeline] echo
00:49:31 Reusing previously constructed message
00:49:31 [Pipeline] echo
00:49:31 Would send email to: cforall@lists.uwaterloo.ca
00:49:31 [Pipeline] echo
00:49:31 With title: [cforall git][BUILD# 15446 - FAILURE] - branch master
00:49:31 [Pipeline] echo
00:49:31 Content: 
00:49:31 <p>This is an automated email from the Jenkins build machine. It was
00:49:31 			generated because of a git hooks/post-receive script following
00:49:31 			a ref change which was pushed to the C∀ repository.</p>
00:49:31 
00:49:31 			<p>- Status --------------------------------------------------------------</p>
00:49:31 
00:49:31 			<p>BUILD# 15446 - FAILURE</p>
00:49:31 			<p>Check console output at https://cforall.uwaterloo.ca/jenkins/job/Cforall/job/master/15446/ to view the results.</p>
00:49:31 			
00:49:31 <p>- Changes -------------------------------------------------------------</p>
00:49:31 
00:49:31 <pre>
00:49:31 The branch master has been updated.
00:49:31       from  02f4eb8677a64f5dfecc2133d01badd254fc0793 (commit)
00:49:31 </pre>
00:49:31 
00:49:31 <p>- Log -----------------------------------------------------------------</p>
00:49:31 
00:49:31 <pre>
00:49:31 
00:49:31 </pre>
00:49:31 
00:49:31 <p>-----------------------------------------------------------------------</p>
00:49:31 <pre>
00:49:31 Summary of changes:
00:49:31 
00:49:31 </pre>
00:49:31 
00:49:31 [Pipeline] }
00:49:31 [Pipeline] // node
00:49:31 [Pipeline] echo
00:49:31 Build Completed
00:49:31 [Pipeline] End of Pipeline
00:49:31 ERROR: script returned exit code 2
00:49:31 Finished: FAILURE
[Pipeline] error
[Pipeline] }
00:49:31 Failed in branch gcc_7_x86_new
[Pipeline] // parallel
[Pipeline] }
[Pipeline] // stage
[Pipeline] }
[Pipeline] // wrap
[Pipeline] echo
error caught
[Pipeline] node
Running on Brokk 4 in /var/lib/jenkins/workspace/Cforall_Full_Build
[Pipeline] {
[Pipeline] echo
notifying users
[Pipeline] emailext
Sending email to: cforall@lists.uwaterloo.ca
[Pipeline] }
[Pipeline] // node
[Pipeline] }
[Pipeline] // node
[Pipeline] End of Pipeline
ERROR: FAILURE
Finished: FAILURE