Console Output

Skipping 470 KB.. Full Log
00:49:31 		64	      __param_1: C instance of struct tag with body 1
00:49:31 		65	      __param_2: C instance of struct tag with body 1
00:49:31 		66	      __param_3: C instance of struct tag with body 1
00:49:31 		67	    ... returning
00:49:31 		68	      __retval_0: C instance of struct tag with body 1
00:49:31 		69	
00:49:31 		70	... to arguments
00:49:31 		71	  Sizeof Expression on: instance of type Nz (not function type)
00:49:31 		72	  with resolved type:
00:49:31 		73	    unsigned long int
00:49:31 		74	  Alignof Expression on: instance of type Nz (not function type)
00:49:31 		75	  with resolved type:
00:49:31 		76	    unsigned long int
00:49:31 		77	  Sizeof Expression on: float
00:49:31 		78	  with resolved type:
00:49:31 		79	    unsigned long int
00:49:31 		80	  Alignof Expression on: float
00:49:31 		81	  with resolved type:
00:49:31 		82	    unsigned long int
00:49:31 		83	  Sizeof Expression on: instance of type Ny (not function type)
00:49:31 		84	  with resolved type:
00:49:31 		85	    unsigned long int
00:49:31 		86	  Alignof Expression on: instance of type Ny (not function type)
00:49:31 		87	  with resolved type:
00:49:31 		88	    unsigned long int
00:49:31 		89	  Sizeof Expression on: instance of struct arpk with body 1
00:49:31 		90	    ... with parameters
00:49:31 		91	      instance of type Nz (not function type)
00:49:31 		92	      float
00:49:31 		93	      float
00:49:31 		94	      float
00:49:31 		95	
00:49:31 		96	  with resolved type:
00:49:31 		97	    unsigned long int
00:49:31 		98	  Alignof Expression on: instance of struct arpk with body 1
00:49:31 		99	    ... with parameters
00:49:31 		100	      instance of type Nz (not function type)
00:49:31 		101	      float
00:49:31 		102	      float
00:49:31 		103	      float
00:49:31 		104	
00:49:31 		105	  with resolved type:
00:49:31 		106	    unsigned long int
00:49:31 		107	  Variable Expression: _ppp0: instance of struct tag with body 1
00:49:31 		108	  with resolved type:
00:49:31 		109	    instance of struct tag with body 1
00:49:31 		110	  Variable Expression: _ppp1: instance of struct tag with body 1
00:49:31 		111	  with resolved type:
00:49:31 		112	    instance of struct tag with body 1
00:49:31 		113	  Variable Expression: _ppp2: instance of struct tag with body 1
00:49:31 		114	  with resolved type:
00:49:31 		115	    instance of struct tag with body 1
00:49:31 		116	  Variable Expression: _ppp3: instance of struct tag with body 1
00:49:31 		117	  with resolved type:
00:49:31 		118	    instance of struct tag with body 1
00:49:31 		119	
00:49:31 		120	with resolved type:
00:49:31 		121	  instance of struct tag with body 1
00:49:31 		122	... with environment:
00:49:31 		123	  Types:
00:49:31 		124	    _11569_363_recr -> instance of struct arpk with body 1
00:49:31 		125	      ... with parameters
00:49:31 		126	        instance of type Nz (not function type)
00:49:31 		127	        float
00:49:31 		128	        float
00:49:31 		129	        float
00:49:31 		130	
00:49:31 		131	    _11569_359_Sq -> float
00:49:31 		132	    _11569_358_Nq -> instance of type Nz (not function type)
00:49:31 		133	    _11569_360_N -> instance of type Ny (not function type)
00:49:31 		134	    _11569_364_Tbase -> float
00:49:31 		135	    _11569_361_S -> instance of struct arpk with body 1
00:49:31 		136	      ... with parameters
00:49:31 		137	        instance of type Nz (not function type)
00:49:31 		138	        float
00:49:31 		139	        float
00:49:31 		140	        float
00:49:31 		141	
00:49:31 		142	    _11569_362_recq -> float
00:49:31 		143	  Non-types:
00:49:31 		144	
00:49:31 		145	Stack back trace for: /var/lib/jenkins/workspace/Cforall_master@tmp/driver/cfa-cpp
00:49:31 		146	(0) /var/lib/jenkins/workspace/Cforall_master@tmp/driver/cfa-cpp() [0x87c65be]
00:49:31 		147	(1) /var/lib/jenkins/workspace/Cforall_master@tmp/driver/cfa-cpp() [0x892048b]
00:49:31 		148	(2) /var/lib/jenkins/workspace/Cforall_master@tmp/driver/cfa-cpp() [0x889de76]
00:49:31 		149	(3) /var/lib/jenkins/workspace/Cforall_master@tmp/driver/cfa-cpp() [0x889def3]
00:49:31 		150	(4) /var/lib/jenkins/workspace/Cforall_master@tmp/driver/cfa-cpp() [0x88ab539]
00:49:31 		151	(5) /var/lib/jenkins/workspace/Cforall_master@tmp/driver/cfa-cpp() [0x8908e4f]
00:49:31 		152	(6) /var/lib/jenkins/workspace/Cforall_master@tmp/driver/cfa-cpp() [0x8909265]
00:49:31 		153	(7) /var/lib/jenkins/workspace/Cforall_master@tmp/driver/cfa-cpp() [0x8909a22]
00:49:31 		154	(8) /var/lib/jenkins/workspace/Cforall_master@tmp/driver/cfa-cpp() [0x88ab1eb]
00:49:31 		155	(9) /var/lib/jenkins/workspace/Cforall_master@tmp/driver/cfa-cpp() [0x8908e4f]
00:49:31 		156	(10) /var/lib/jenkins/workspace/Cforall_master@tmp/driver/cfa-cpp() [0x8909265]
00:49:31 		157	(11) /var/lib/jenkins/workspace/Cforall_master@tmp/driver/cfa-cpp() [0x8909a22]
00:49:31 		158	(12) /var/lib/jenkins/workspace/Cforall_master@tmp/driver/cfa-cpp() [0x88ab1eb]
00:49:31 		159	(13) /var/lib/jenkins/workspace/Cforall_master@tmp/driver/cfa-cpp() [0x8908e4f]
00:49:31 		160	(14) /var/lib/jenkins/workspace/Cforall_master@tmp/driver/cfa-cpp() [0x8909265]
00:49:31 		161	(15) /var/lib/jenkins/workspace/Cforall_master@tmp/driver/cfa-cpp() [0x8909a22]
00:49:31 		162	(16) /var/lib/jenkins/workspace/Cforall_master@tmp/driver/cfa-cpp() [0x88ab1eb]
00:49:31 		163	(17) /var/lib/jenkins/workspace/Cforall_master@tmp/driver/cfa-cpp() [0x8908e4f]
00:49:31 		164	(18) /var/lib/jenkins/workspace/Cforall_master@tmp/driver/cfa-cpp() [0x8909265]
00:49:31 		165	(19) /var/lib/jenkins/workspace/Cforall_master@tmp/driver/cfa-cpp() [0x8908e4f]
00:49:31 		166	(20) /var/lib/jenkins/workspace/Cforall_master@tmp/driver/cfa-cpp() [0x8909265]
00:49:31 		167	(21) /var/lib/jenkins/workspace/Cforall_master@tmp/driver/cfa-cpp() [0x8909a22]
00:49:31 		168	(22) /var/lib/jenkins/workspace/Cforall_master@tmp/driver/cfa-cpp : GenPoly::box(std::__cxx11::list<Declaration*, std::allocator<Declaration*> >&)+0x7d8 [0x88fe358]
00:49:31 		169	(23) /var/lib/jenkins/workspace/Cforall_master@tmp/driver/cfa-cpp : main(/*unknown*/)+0x1262 [0x84913a2]
00:49:31 		170	CC1 Translator error: stage 2, child failed 6
00:49:31 
00:49:31        	concurrent/coroutineYield             PASSED     C 1:32.021 - R 0:00.619
00:49:31        	concurrent/examples/datingService     PASSED     C 1:19.938 - R 0:00.065
00:49:31        	concurrent/examples/gortn             PASSED     C 0:31.101 - R 0:00.082
00:49:31        	concurrent/examples/boundedBufferEXT  PASSED     C 1:31.486 - R 0:11.649
00:49:31        	concurrent/examples/matrixSum         PASSED     C 0:21.108 - R 0:00.033
00:49:31        	concurrent/examples/boundedBufferINT  PASSED     C 1:26.942 - R 0:11.994
00:49:31        	concurrent/futures/abandon            PASSED     C 0:47.605 - R 0:00.117
00:49:31        	concurrent/keywordErrors              PASSED     C 0:00.317 - R n/a
00:49:31        	concurrent/futures/basic              PASSED     C 0:47.908 - R 0:00.116
00:49:31        	concurrent/futures/typed              PASSED     C 0:42.661 - R 0:00.117
00:49:31        	concurrent/futures/multi              PASSED     C 0:45.013 - R 0:00.065
00:49:31        	concurrent/examples/quickSort         PASSED     C 1:09.167 - R 0:00.035
00:49:31        	concurrent/join                       PASSED     C 0:56.190 - R 0:00.035
00:49:31        	concurrent/park/contention            PASSED     C 0:38.313 - R 0:00.117
00:49:31        	concurrent/preempt                    PASSED     C 0:31.409 - R 0:15.038
00:49:31        	concurrent/park/start_parked          PASSED     C 0:58.131 - R 0:00.066
00:49:31        	concurrent/monitor                    PASSED     C 0:51.338 - R 0:30.563
00:49:31        	concurrent/park/force_preempt         PASSED     C 1:42.146 - R 0:00.317
00:49:31        	concurrent/multi-monitor              PASSED     C 1:31.987 - R 0:35.882
00:49:31        	concurrent/signal/block               PASSED     C 2:28.795 - R 0:02.226
00:49:31        	concurrent/semaphore                  PASSED     C 2:59.560 - R 0:00.034
00:49:31        	concurrent/signal/disjoint            PASSED     C 2:47.399 - R 0:03.431
00:49:31        	concurrent/signal/wait                PASSED     C 2:54.063 - R 0:00.318
00:49:31        	concurrent/sleep                      PASSED     C 2:29.946 - R 0:01.172
00:49:31        	concurrent/spinaphore                 PASSED     C 2:15.890 - R 0:00.670
00:49:31        	concurrent/thread                     PASSED     C 1:20.028 - R 0:00.034
00:49:31        	concurrent/suspend_then               PASSED     C 1:26.718 - R 0:00.419
00:49:31        	concurrent/waitfor/else               PASSED     C 0:51.234 - R 0:00.034
00:49:31        	const-init                            PASSED     C 0:01.496 - R 0:00.035
00:49:31        	concurrent/waitfor/dtor               PASSED     C 1:05.484 - R 0:02.026
00:49:31        	concurrent/waitfor/barge              PASSED     C 1:04.070 - R 0:15.242
00:49:31        	copyfile                              PASSED     C 0:38.422 - R 0:00.017
00:49:31        	coroutine/fibonacci                   PASSED     C 0:50.193 - R 0:00.167
00:49:31        	coroutine/devicedriver                PASSED     C 0:54.235 - R 0:00.034
00:49:31        	concurrent/waitfor/statment           PASSED     C 1:15.583 - R 0:00.066
00:49:31        	concurrent/waitfor/recurse            PASSED     C 1:16.984 - R 0:35.944
00:49:31        	concurrent/waitfor/when               PASSED     C 1:18.011 - R 0:24.489
00:49:31        	coroutine/fmtLines                    PASSED     C 0:57.239 - R 0:00.033
00:49:31        	counter                               PASSED     C 0:01.498 - R 0:00.019
00:49:31        	designations                          PASSED     C 0:03.803 - R 0:00.017
00:49:31        	coroutine/runningTotal                PASSED     C 0:35.955 - R 0:00.034
00:49:31        	coroutine/raii                        PASSED     C 0:37.939 - R 0:00.035
00:49:31        	errors/declaration                    PASSED     C 0:00.093 - R n/a
00:49:31        	errors/scope                          PASSED     C 0:00.134 - R n/a
00:49:31        	errors/signature                      PASSED     C 0:00.097 - R n/a
00:49:31        	coroutine/pingpong                    PASSED     C 0:41.042 - R 0:00.035
00:49:31        	enum                                  PASSED     C 0:09.113 - R 0:00.018
00:49:31        	exceptions/conditional                PASSED     C 0:04.834 - R 0:00.018
00:49:31        	coroutine/prodcons                    PASSED     C 0:54.778 - R 0:00.034
00:49:31        	exceptions/data-except                PASSED     C 0:03.151 - R 0:00.019
00:49:31        	exceptions/defaults                   PASSED     C 0:06.579 - R 0:00.065
00:49:31        	device/cpu                            PASSED     C 0:34.351 - R 0:00.017
00:49:31        	exceptions/cancel/coroutine           PASSED     C 0:24.925 - R 0:00.034
00:49:31        	exceptions/finally-error              PASSED     C 0:00.229 - R n/a
00:49:31        	exceptions/conditional-threads        PASSED     C 0:12.067 - R 0:00.033
00:49:31        	div                                   PASSED     C 0:32.465 - R 0:00.034
00:49:31        	exceptions/cancel/thread              PASSED     C 0:26.367 - R 0:00.034
00:49:31        	exceptions/finally                    PASSED     C 0:06.260 - R 0:00.020
00:49:31        	exceptions/interact                   PASSED     C 0:06.275 - R 0:00.018
00:49:31        	exceptions/resume                     PASSED     C 0:05.066 - R 0:00.034
00:49:31        	exceptions/polymorphic                PASSED     C 0:05.980 - R 0:00.018
00:49:31        	exceptions/trash                      PASSED     C 0:09.365 - R 0:00.035
00:49:31        	exceptions/type-check                 PASSED     C 0:00.211 - R n/a
00:49:31        	exceptions/terminate                  PASSED     C 0:11.822 - R 0:00.018
00:49:31        	exceptions/finally-threads            PASSED     C 0:19.364 - R 0:00.035
00:49:31        	exceptions/defaults-threads           PASSED     C 0:21.594 - R 0:00.035
00:49:31        	expression                            PASSED     C 0:10.513 - R 0:00.002
00:49:31        	exceptions/virtual-poly               PASSED     C 0:11.593 - R 0:00.018
00:49:31        	exceptions/resume-threads             PASSED     C 0:26.432 - R 0:00.035
00:49:31        	exceptions/virtual-cast               PASSED     C 0:18.535 - R 0:00.018
00:49:31        	exceptions/terminate-threads          PASSED     C 0:30.620 - R 0:00.035
00:49:31        	forall                                PASSED     C 0:15.199 - R 0:00.004
00:49:31        	fallthrough                           PASSED     C 0:39.068 - R 0:00.035
00:49:31        	generator/fmtLines                    PASSED     C 0:27.682 - R 0:00.018
00:49:31        	genericUnion                          PASSED     C 0:04.896 - R 0:00.018
00:49:31        	generator/fibonacci                   PASSED     C 0:29.937 - R 0:00.018
00:49:31        	global-monomorph                      PASSED     C 0:09.304 - R 0:00.018
00:49:31        	fstream_test                          PASSED     C 0:44.616 - R 0:00.018
00:49:31        	generator/suspend_then                PASSED     C 0:29.572 - R 0:00.117
00:49:31        	function-operator                     PASSED     C 0:45.936 - R 0:00.017
00:49:31        	identFuncDeclarator                   PASSED     C 0:06.255 - R 0:00.004
00:49:31        	identParamDeclarator                  PASSED     C 0:06.114 - R 0:00.017
00:49:31        	hello                                 PASSED     C 0:15.625 - R 0:00.018
00:49:31        	include/vector-containers             PASSED     C 0:11.374 - R 0:00.018
00:49:31        	identity                              PASSED     C 0:28.738 - R 0:00.018
00:49:31        	ifwhileCtl                            PASSED     C 0:48.075 - R 0:00.035
00:49:31        	heap                                  PASSED     C 0:34.481 - R 0:26.745
00:49:31        	include/vector-sequence               PASSED     C 0:22.996 - R 0:00.018
00:49:31        	init1-ERROR                           PASSED     C 0:00.373 - R n/a
00:49:31        	include/stdincludes                   PASSED     C 0:54.482 - R 0:00.002
00:49:31        	init1                                 PASSED     C 0:09.191 - R 0:00.001
00:49:31        	include/vector-fstream                PASSED     C 0:54.557 - R 0:00.019
00:49:31        	labelledExit                          PASSED     C 0:01.159 - R 0:00.003
00:49:31        	limits                                PASSED     C 0:06.515 - R 0:00.004
00:49:31        	linking/exception-nothreads           PASSED     C 0:10.240 - R 0:00.019
00:49:31        	io/manipulatorsOutput4                PASSED     C 0:45.267 - R 0:00.033
00:49:31        	io/io                                 PASSED     C 0:54.443 - R 0:00.017
00:49:31        	linking/exception-withthreads         PASSED     C 0:16.380 - R 0:00.035
00:49:31        	io/io-acquire                         PASSED     C 0:56.181 - R 0:00.066
00:49:31        	io/many_read                          PASSED     C 0:52.637 - R 0:00.067
00:49:31        	linking/nostdlib                      PASSED     C 0:10.496 - R 0:00.017
00:49:31        	linkonce                              PASSED     C 0:10.004 - R 0:00.018
00:49:31        	linking/weakso_nothd                  PASSED     C 0:30.043 - R 0:00.018
00:49:31        	linking/io-acquire                    PASSED     C 0:32.893 - R 0:00.035
00:49:31        	include/includes                      PASSED     C 2:12.853 - R 0:00.002
00:49:31        	linking/nothreads                     PASSED     C 0:32.643 - R 0:00.018
00:49:31        	maybe                                 PASSED     C 0:16.258 - R 0:00.017
00:49:31        	loopctrl                              PASSED     C 0:29.836 - R 0:00.018
00:49:31        	nested-types                          PASSED     C 0:03.569 - R 0:00.003
00:49:31        	nested-types-ERR1                     PASSED     C 0:00.096 - R n/a
00:49:31        	literals                              PASSED     C 0:33.800 - R 0:00.018
00:49:31        	nested-types-ERR2                     PASSED     C 0:00.173 - R n/a
00:49:31        	linking/withthreads                   PASSED     C 0:58.863 - R 0:00.035
00:49:31        	malloc                                PASSED     C 0:35.440 - R 0:00.018
00:49:31        	numericConstants                      PASSED     C 0:03.268 - R 0:00.003
00:49:31        	operators                             PASSED     C 0:03.424 - R 0:00.035
00:49:31        	poly-d-cycle                          PASSED     C 0:03.984 - R 0:00.017
00:49:31        	poly-o-cycle                          PASSED     C 0:03.487 - R 0:00.033
00:49:31        	quasiKeyword                          PASSED     C 0:01.174 - R 0:00.001
00:49:31        	poly-selection                        PASSED     C 0:02.432 - R 0:00.016
00:49:31        	minmax                                PASSED     C 0:24.193 - R 0:00.019
00:49:31        	raii/ctor-autogen-ERR1                PASSED     C 0:00.466 - R n/a
00:49:31        	list/dlist-insert-remove              PASSED     C 1:00.117 - R 0:00.034
00:49:31        	raii/dtor-early-exit-ERR1             PASSED     C 0:04.710 - R n/a
00:49:31        	raii/ctor-autogen                     PASSED     C 0:14.465 - R 0:00.018
00:49:31        	raii/boxed-types                      PASSED     C 0:15.777 - R 0:00.034
00:49:31        	quotedKeyword                         PASSED     C 0:15.869 - R 0:00.017
00:49:31        	polymorphism                          PASSED     C 0:18.558 - R 0:00.017
00:49:31        	raii/memberCtors-ERR1                 PASSED     C 0:00.472 - R n/a
00:49:31        	raii/dtor-early-exit-ERR2             PASSED     C 0:05.016 - R n/a
00:49:31        	raii/memberCtors                      PASSED     C 0:10.905 - R 0:00.018
00:49:31        	raii/init_once                        PASSED     C 0:11.280 - R 0:00.035
00:49:31        	raii/dtor-early-exit                  PASSED     C 0:24.842 - R 0:00.018
00:49:31        	result                                PASSED     C 0:14.454 - R 0:00.017
00:49:31        	raii/globals                          PASSED     C 0:26.912 - R 0:00.117
00:49:31        	smart-pointers                        PASSED     C 0:06.221 - R 0:00.019
00:49:31        	simpleGenericTriple                   PASSED     C 0:06.867 - R 0:00.020
00:49:31        	references                            PASSED     C 0:30.538 - R 0:00.017
00:49:31        	shortCircuit                          PASSED     C 0:25.079 - R 0:00.035
00:49:31        	switch                                PASSED     C 0:06.035 - R 0:00.001
00:49:31        	searchsort                            PASSED     C 0:40.036 - R 0:00.018
00:49:31        	sum                                   PASSED     C 0:25.750 - R 0:00.017
00:49:31        	strstream                             PASSED     C 0:25.856 - R 0:00.018
00:49:31        	rational                              PASSED     C 1:01.520 - R 0:00.017
00:49:31        	tuple/tupleCast                       PASSED     C 0:04.859 - R 0:00.018
00:49:31        	tuple/tupleFunction                   PASSED     C 0:04.785 - R 0:00.017
00:49:31        	swap                                  PASSED     C 0:31.679 - R 0:00.019
00:49:31        	tuple/tupleAssign                     PASSED     C 0:14.431 - R 0:00.117
00:49:31        	typedefRedef-ERR1                     PASSED     C 0:00.102 - R n/a
00:49:31        	time                                  PASSED     C 0:23.219 - R 0:00.018
00:49:31        	typedefRedef                          PASSED     C 0:01.806 - R 0:00.003
00:49:31        	typeof                                PASSED     C 0:02.119 - R 0:00.035
00:49:31        	tuple/tupleMember                     PASSED     C 0:05.504 - R 0:00.019
00:49:31        	tuple/tuplePolymorphism               PASSED     C 0:07.617 - R 0:00.017
00:49:31        	tuple/tupleVariadic                   PASSED     C 0:20.228 - R 0:00.017
00:49:31        	variableDeclarator                    PASSED     C 0:08.010 - R 0:00.001
00:49:31        	userLiterals                          PASSED     C 0:40.579 - R 0:00.018
00:49:31        	unified_locking/timeout_lock          PASSED     C 1:17.911 - R 0:01.123
00:49:31        	vector                                PASSED     C 1:10.093 - R 0:00.050
00:49:31        	unified_locking/mcs                   PASSED     C 1:21.155 - R 0:13.289
00:49:31        	vector_math/vec2_double               PASSED     C 0:52.680 - R 0:00.016
00:49:31        	unified_locking/fast                  PASSED     C 1:37.688 - R 0:00.115
00:49:31        	unified_locking/locks                 PASSED     C 1:23.009 - R 0:15.444
00:49:31        	vector_math/vec2_uint                 PASSED     C 0:46.049 - R 0:00.018
00:49:31        	vector_math/vec2_float                PASSED     C 1:09.851 - R 0:00.017
00:49:31        	voidPtr                               PASSED     C 0:01.525 - R 0:00.017
00:49:31        	warnings/self-assignment              PASSED     C 0:08.528 - R 0:00.004
00:49:31        	KRfunctions                           PASSED     C 0:00.580 - R 0:00.003
00:49:31        	vector_math/vec3_int                  PASSED     C 1:06.410 - R 0:00.018
00:49:31        	vector_math/vec2_int                  PASSED     C 1:11.605 - R 0:00.018
00:49:31        	vector_math/vec4_float                PASSED     C 1:07.747 - R 0:00.018
00:49:31        	vector_math/vec3_float                PASSED     C 1:10.048 - R 0:00.018
00:49:31        	attributes                            PASSED     C 0:05.080 - R 0:00.072
00:49:31        	abs                                   PASSED     C 0:38.804 - R 0:00.017
00:49:31        	ato                                   PASSED     C 0:38.394 - R 0:00.018
00:49:31        	errors/completeType                   PASSED     C 0:00.370 - R n/a
00:49:31        	declarationSpecifier                  PASSED     C 0:02.387 - R 0:00.002
00:49:31        	functions                             PASSED     C 0:00.695 - R 0:00.012
00:49:31        	extension                             PASSED     C 0:00.759 - R 0:00.011
00:49:31        	gccExtensions                         PASSED     C 0:00.623 - R 0:00.001
00:49:31        	bitmanip3                             PASSED     C 0:32.716 - R 0:00.067
00:49:31        	bitmanip2                             PASSED     C 0:50.304 - R 0:01.524
00:49:31        	vector_math/vec4_int                  PASSED     C 1:20.527 - R 0:00.035
00:49:31        	bitmanip1                             PASSED     C 0:53.719 - R 0:02.681
00:49:31        	meta/archVast                         PASSED     C 0:00.364 - R n/a
00:49:31        	io/manipulatorsInput                  PASSED     C 0:47.229 - R 0:00.016
00:49:31        	io/manipulatorsOutput2                PASSED     C 0:59.930 - R 0:00.035
00:49:31        	random                                PASSED     C 0:43.972 - R 0:00.035
00:49:31        	math                                  PASSED     C 1:00.973 - R 0:00.034
00:49:31        	io/manipulatorsOutput1                PASSED     C 1:24.111 - R 0:00.035
00:49:31        	mathX                                 PASSED     C 1:32.194 - R 0:06.903
00:49:31        	vector_math/vec2_ldouble              PASSED     C 1:41.115 - R 0:00.017
00:49:31 Tests took 24:08.128
00:49:31 Makefile:861: recipe for target 'all-tests' failed
00:49:31 make: *** [all-tests] Error 1
00:49:31 [Pipeline] }
00:49:31 [Pipeline] // dir
00:49:31 [Pipeline] }
00:49:31 [Pipeline] // stage
00:49:31 [Pipeline] echo
00:49:31 Archiving core dumps
00:49:31 [Pipeline] dir
00:49:31 Running in /var/lib/jenkins/workspace/Cforall_master@tmp
00:49:31 [Pipeline] {
00:49:31 [Pipeline] fileExists
00:49:31 [Pipeline] }
00:49:31 [Pipeline] // dir
00:49:31 [Pipeline] }
00:49:31 [Pipeline] // wrap
00:49:31 [Pipeline] }
00:49:31 [Pipeline] // node
00:49:31 [Pipeline] echo
00:49:31 hudson.AbortException: script returned exit code 2
00:49:31 [Pipeline] node
00:49:31 Running on Brokk 5 in /var/lib/jenkins/workspace/Cforall_master
00:49:31 [Pipeline] {
00:49:31 [Pipeline] echo
00:49:31 Notifying users of result
00:49:31 [Pipeline] echo
00:49:31 Reusing previously constructed message
00:49:31 [Pipeline] echo
00:49:31 Would send email to: cforall@lists.uwaterloo.ca
00:49:31 [Pipeline] echo
00:49:31 With title: [cforall git][BUILD# 15446 - FAILURE] - branch master
00:49:31 [Pipeline] echo
00:49:31 Content: 
00:49:31 <p>This is an automated email from the Jenkins build machine. It was
00:49:31 			generated because of a git hooks/post-receive script following
00:49:31 			a ref change which was pushed to the C∀ repository.</p>
00:49:31 
00:49:31 			<p>- Status --------------------------------------------------------------</p>
00:49:31 
00:49:31 			<p>BUILD# 15446 - FAILURE</p>
00:49:31 			<p>Check console output at https://cforall.uwaterloo.ca/jenkins/job/Cforall/job/master/15446/ to view the results.</p>
00:49:31 			
00:49:31 <p>- Changes -------------------------------------------------------------</p>
00:49:31 
00:49:31 <pre>
00:49:31 The branch master has been updated.
00:49:31       from  02f4eb8677a64f5dfecc2133d01badd254fc0793 (commit)
00:49:31 </pre>
00:49:31 
00:49:31 <p>- Log -----------------------------------------------------------------</p>
00:49:31 
00:49:31 <pre>
00:49:31 
00:49:31 </pre>
00:49:31 
00:49:31 <p>-----------------------------------------------------------------------</p>
00:49:31 <pre>
00:49:31 Summary of changes:
00:49:31 
00:49:31 </pre>
00:49:31 
00:49:31 [Pipeline] }
00:49:31 [Pipeline] // node
00:49:31 [Pipeline] echo
00:49:31 Build Completed
00:49:31 [Pipeline] End of Pipeline
00:49:31 ERROR: script returned exit code 2
00:49:31 Finished: FAILURE
[Pipeline] error
[Pipeline] }
00:49:31 Failed in branch gcc_7_x86_new
[Pipeline] // parallel
[Pipeline] }
[Pipeline] // stage
[Pipeline] }
[Pipeline] // wrap
[Pipeline] echo
error caught
[Pipeline] node
Running on Brokk 4 in /var/lib/jenkins/workspace/Cforall_Full_Build
[Pipeline] {
[Pipeline] echo
notifying users
[Pipeline] emailext
Sending email to: cforall@lists.uwaterloo.ca
[Pipeline] }
[Pipeline] // node
[Pipeline] }
[Pipeline] // node
[Pipeline] End of Pipeline
ERROR: FAILURE
Finished: FAILURE