FailedConsole Output

23:22:40 + make VERSION=1.0.0.1846 distcheck -j 8
23:22:40 make  dist-gzip am__post_remove_distdir='@:'
23:22:40 make[1]: Entering directory '/var/lib/jenkins/workspace/Cforall_Distribute_Ref@tmp'
23:22:40 make  distdir-am
23:22:40 make[2]: Entering directory '/var/lib/jenkins/workspace/Cforall_Distribute_Ref@tmp'
23:22:40 if test -d "cfa-cc-1.0.0.1846"; then find "cfa-cc-1.0.0.1846" -type d ! -perm -200 -exec chmod u+w {} ';' && rm -rf "cfa-cc-1.0.0.1846" || { sleep 5 && rm -rf "cfa-cc-1.0.0.1846"; }; else :; fi
23:22:40 test -d "cfa-cc-1.0.0.1846" || mkdir "cfa-cc-1.0.0.1846"
23:22:40  (cd driver && make  top_distdir=../cfa-cc-1.0.0.1846 distdir=../cfa-cc-1.0.0.1846/driver \
23:22:40      am__remove_distdir=: am__skip_length_check=: am__skip_mode_fix=: distdir)
23:22:40 make[3]: Entering directory '/var/lib/jenkins/workspace/Cforall_Distribute_Ref@tmp/driver'
23:22:40 make  distdir-am
23:22:40 make[4]: Entering directory '/var/lib/jenkins/workspace/Cforall_Distribute_Ref@tmp/driver'
23:22:40 make[4]: Leaving directory '/var/lib/jenkins/workspace/Cforall_Distribute_Ref@tmp/driver'
23:22:40 make[3]: Leaving directory '/var/lib/jenkins/workspace/Cforall_Distribute_Ref@tmp/driver'
23:22:40  (cd src && make  top_distdir=../cfa-cc-1.0.0.1846 distdir=../cfa-cc-1.0.0.1846/src \
23:22:40      am__remove_distdir=: am__skip_length_check=: am__skip_mode_fix=: distdir)
23:22:40 make[3]: Entering directory '/var/lib/jenkins/workspace/Cforall_Distribute_Ref@tmp/src'
23:22:40 make  distdir-am
23:22:40 make[4]: Entering directory '/var/lib/jenkins/workspace/Cforall_Distribute_Ref@tmp/src'
23:22:40 make[4]: Leaving directory '/var/lib/jenkins/workspace/Cforall_Distribute_Ref@tmp/src'
23:22:40 make[3]: Leaving directory '/var/lib/jenkins/workspace/Cforall_Distribute_Ref@tmp/src'
23:22:40  (cd libcfa && make  top_distdir=../cfa-cc-1.0.0.1846 distdir=../cfa-cc-1.0.0.1846/libcfa \
23:22:40      am__remove_distdir=: am__skip_length_check=: am__skip_mode_fix=: distdir)
23:22:40 make[3]: Entering directory '/var/lib/jenkins/workspace/Cforall_Distribute_Ref@tmp/libcfa'
23:22:40 Distributing libcfa from 'libcfa/x64-nodebug'
23:22:40 make -C /var/lib/jenkins/workspace/Cforall_Distribute_Ref@tmp/libcfa/x64-nodebug distdir \
23:22:40 top_distdir=../cfa-cc-1.0.0.1846 \
23:22:40 distdir=../../cfa-cc-1.0.0.1846/libcfa \
23:22:40 am__remove_distdir=$(am__remove_distdir) \
23:22:40 am__skip_length_check=: \
23:22:40 am__skip_mode_fix=:
23:22:40 /bin/bash: am__remove_distdir: command not found
23:22:40 make[4]: Entering directory '/var/lib/jenkins/workspace/Cforall_Distribute_Ref@tmp/libcfa/x64-nodebug'
23:22:40 make  distdir-am
23:22:40 make[5]: Entering directory '/var/lib/jenkins/workspace/Cforall_Distribute_Ref@tmp/libcfa/x64-nodebug'
23:22:40 test -d "../../cfa-cc-1.0.0.1846/libcfa" || mkdir "../../cfa-cc-1.0.0.1846/libcfa"
23:22:40  (cd prelude && make  top_distdir=../../cfa-cc-1.0.0.1846 distdir=../../../cfa-cc-1.0.0.1846/libcfa/prelude \
23:22:40      am__remove_distdir=: am__skip_length_check=: am__skip_mode_fix=: distdir)
23:22:40 make[6]: Entering directory '/var/lib/jenkins/workspace/Cforall_Distribute_Ref@tmp/libcfa/x64-nodebug/prelude'
23:22:40 make  distdir-am
23:22:40 make[7]: Entering directory '/var/lib/jenkins/workspace/Cforall_Distribute_Ref@tmp/libcfa/x64-nodebug/prelude'
23:22:40 make[7]: Leaving directory '/var/lib/jenkins/workspace/Cforall_Distribute_Ref@tmp/libcfa/x64-nodebug/prelude'
23:22:40 make[6]: Leaving directory '/var/lib/jenkins/workspace/Cforall_Distribute_Ref@tmp/libcfa/x64-nodebug/prelude'
23:22:40  (cd src && make  top_distdir=../../cfa-cc-1.0.0.1846 distdir=../../../cfa-cc-1.0.0.1846/libcfa/src \
23:22:40      am__remove_distdir=: am__skip_length_check=: am__skip_mode_fix=: distdir)
23:22:40 make[6]: Entering directory '/var/lib/jenkins/workspace/Cforall_Distribute_Ref@tmp/libcfa/x64-nodebug/src'
23:22:40 make  distdir-am
23:22:40 make[7]: Entering directory '/var/lib/jenkins/workspace/Cforall_Distribute_Ref@tmp/libcfa/x64-nodebug/src'
23:22:41 make[7]: Leaving directory '/var/lib/jenkins/workspace/Cforall_Distribute_Ref@tmp/libcfa/x64-nodebug/src'
23:22:41 make[6]: Leaving directory '/var/lib/jenkins/workspace/Cforall_Distribute_Ref@tmp/libcfa/x64-nodebug/src'
23:22:41 test -n ":" \
23:22:41 || find "../../cfa-cc-1.0.0.1846/libcfa" -type d ! -perm -755 \
23:22:41 	-exec chmod u+rwx,go+rx {} \; -o \
23:22:41   ! -type d ! -perm -444 -links 1 -exec chmod a+r {} \; -o \
23:22:41   ! -type d ! -perm -400 -exec chmod a+r {} \; -o \
23:22:41   ! -type d ! -perm -444 -exec /bin/bash /var/lib/jenkins/workspace/Cforall_Distribute_Ref/libcfa/automake/install-sh -c -m a+r {} {} \; \
23:22:41 || chmod -R a+r "../../cfa-cc-1.0.0.1846/libcfa"
23:22:41 make[5]: Leaving directory '/var/lib/jenkins/workspace/Cforall_Distribute_Ref@tmp/libcfa/x64-nodebug'
23:22:41 make[4]: Leaving directory '/var/lib/jenkins/workspace/Cforall_Distribute_Ref@tmp/libcfa/x64-nodebug'
23:22:41 make[3]: Leaving directory '/var/lib/jenkins/workspace/Cforall_Distribute_Ref@tmp/libcfa'
23:22:41  (cd tests && make  top_distdir=../cfa-cc-1.0.0.1846 distdir=../cfa-cc-1.0.0.1846/tests \
23:22:41      am__remove_distdir=: am__skip_length_check=: am__skip_mode_fix=: distdir)
23:22:41 make[3]: Entering directory '/var/lib/jenkins/workspace/Cforall_Distribute_Ref@tmp/tests'
23:22:41 make  distdir-am
23:22:41 make[4]: Entering directory '/var/lib/jenkins/workspace/Cforall_Distribute_Ref@tmp/tests'
23:22:41 make  \
23:22:41   top_distdir="../cfa-cc-1.0.0.1846" distdir="../cfa-cc-1.0.0.1846/tests" \
23:22:41   dist-hook
23:22:41 make[5]: Entering directory '/var/lib/jenkins/workspace/Cforall_Distribute_Ref@tmp/tests'
23:22:41 echo "Gathering test files"
23:22:41 Gathering test files
23:22:41 for file in `python3 ./test.py --list-dist`; do \
23:22:41 	if test -f /var/lib/jenkins/workspace/Cforall_Distribute_Ref/tests/${file}; then \
23:22:41 		/usr/bin/mkdir -p $(dirname ../cfa-cc-1.0.0.1846/tests/${file}); \
23:22:41 		cp -df /var/lib/jenkins/workspace/Cforall_Distribute_Ref/tests/${file} ../cfa-cc-1.0.0.1846/tests/${file}; \
23:22:41 	fi; \
23:22:41 done
23:22:49 make[5]: Leaving directory '/var/lib/jenkins/workspace/Cforall_Distribute_Ref@tmp/tests'
23:22:49 make[4]: Leaving directory '/var/lib/jenkins/workspace/Cforall_Distribute_Ref@tmp/tests'
23:22:49 make[3]: Leaving directory '/var/lib/jenkins/workspace/Cforall_Distribute_Ref@tmp/tests'
23:22:49 test -n "" \
23:22:49 || find "cfa-cc-1.0.0.1846" -type d ! -perm -755 \
23:22:49 	-exec chmod u+rwx,go+rx {} \; -o \
23:22:49   ! -type d ! -perm -444 -links 1 -exec chmod a+r {} \; -o \
23:22:49   ! -type d ! -perm -400 -exec chmod a+r {} \; -o \
23:22:49   ! -type d ! -perm -444 -exec /bin/bash /var/lib/jenkins/workspace/Cforall_Distribute_Ref/automake/install-sh -c -m a+r {} {} \; \
23:22:49 || chmod -R a+r "cfa-cc-1.0.0.1846"
23:22:49 make[2]: Leaving directory '/var/lib/jenkins/workspace/Cforall_Distribute_Ref@tmp'
23:22:49 tardir=cfa-cc-1.0.0.1846 && ${TAR-tar} chof - "$tardir" | eval GZIP= gzip --best -c >cfa-cc-1.0.0.1846.tar.gz
23:22:49 make[1]: Leaving directory '/var/lib/jenkins/workspace/Cforall_Distribute_Ref@tmp'
23:22:49 if test -d "cfa-cc-1.0.0.1846"; then find "cfa-cc-1.0.0.1846" -type d ! -perm -200 -exec chmod u+w {} ';' && rm -rf "cfa-cc-1.0.0.1846" || { sleep 5 && rm -rf "cfa-cc-1.0.0.1846"; }; else :; fi
23:22:49 case 'cfa-cc-1.0.0.1846.tar.gz' in \
23:22:49 *.tar.gz*) \
23:22:49   eval GZIP= gzip --best -dc cfa-cc-1.0.0.1846.tar.gz | ${TAR-tar} xf - ;;\
23:22:49 *.tar.bz2*) \
23:22:49   bzip2 -dc cfa-cc-1.0.0.1846.tar.bz2 | ${TAR-tar} xf - ;;\
23:22:49 *.tar.lz*) \
23:22:49   lzip -dc cfa-cc-1.0.0.1846.tar.lz | ${TAR-tar} xf - ;;\
23:22:49 *.tar.xz*) \
23:22:49   xz -dc cfa-cc-1.0.0.1846.tar.xz | ${TAR-tar} xf - ;;\
23:22:49 *.tar.Z*) \
23:22:49   uncompress -c cfa-cc-1.0.0.1846.tar.Z | ${TAR-tar} xf - ;;\
23:22:49 *.shar.gz*) \
23:22:49   eval GZIP= gzip --best -dc cfa-cc-1.0.0.1846.shar.gz | unshar ;;\
23:22:49 *.zip*) \
23:22:49   unzip cfa-cc-1.0.0.1846.zip ;;\
23:22:49 esac
23:22:49 chmod -R a-w cfa-cc-1.0.0.1846
23:22:49 chmod u+w cfa-cc-1.0.0.1846
23:22:49 mkdir cfa-cc-1.0.0.1846/_build cfa-cc-1.0.0.1846/_build/sub cfa-cc-1.0.0.1846/_inst
23:22:49 chmod a-w cfa-cc-1.0.0.1846
23:22:49 test -d cfa-cc-1.0.0.1846/_build || exit 0; \
23:22:49 dc_install_base=`CDPATH="${ZSH_VERSION+.}:" && cd cfa-cc-1.0.0.1846/_inst && pwd | sed -e 's,^[^:\\/]:[\\/],/,'` \
23:22:49   && dc_destdir="${TMPDIR-/tmp}/am-dc-$$/" \
23:22:49   && am__cwd=`pwd` \
23:22:49   && CDPATH="${ZSH_VERSION+.}:" && cd cfa-cc-1.0.0.1846/_build/sub \
23:22:49   && ../../configure \
23:22:49      \
23:22:49      \
23:22:49     --srcdir=../.. --prefix="$dc_install_base" \
23:22:49   && make  \
23:22:49   && make  dvi \
23:22:49   && make  check \
23:22:49   && make  install \
23:22:49   && make  installcheck \
23:22:49   && make  uninstall \
23:22:49   && make  distuninstallcheck_dir="$dc_install_base" \
23:22:49         distuninstallcheck \
23:22:49   && chmod -R a-w "$dc_install_base" \
23:22:49   && ({ \
23:22:49        (cd ../.. && umask 077 && mkdir "$dc_destdir") \
23:22:49        && make  DESTDIR="$dc_destdir" install \
23:22:49        && make  DESTDIR="$dc_destdir" uninstall \
23:22:49        && make  DESTDIR="$dc_destdir" \
23:22:49             distuninstallcheck_dir="$dc_destdir" distuninstallcheck; \
23:22:49       } || { rm -rf "$dc_destdir"; exit 1; }) \
23:22:49   && rm -rf "$dc_destdir" \
23:22:49   && make  dist \
23:22:49   && rm -rf cfa-cc-1.0.0.1846.tar.gz \
23:22:49   && make  distcleancheck \
23:22:49   && cd "$am__cwd" \
23:22:49   || exit 1
23:22:49 checking whether make supports nested variables... yes
23:22:49 checking for a BSD-compatible install... /usr/bin/install -c
23:22:49 checking whether build environment is sane... yes
23:22:49 checking for a thread-safe mkdir -p... /usr/bin/mkdir -p
23:22:49 checking for gawk... gawk
23:22:49 checking whether make sets $(MAKE)... yes
23:22:50 checking build system type... x86_64-pc-linux-gnu
23:22:50 checking host system type... x86_64-pc-linux-gnu
23:22:50 checking for g++... g++
23:22:50 checking whether the C++ compiler works... yes
23:22:50 checking for C++ compiler default output file name... a.out
23:22:50 checking for suffix of executables... 
23:22:50 checking whether we are cross compiling... no
23:22:50 checking for suffix of object files... o
23:22:50 checking whether we are using the GNU C++ compiler... yes
23:22:50 checking whether g++ accepts -g... yes
23:22:50 checking whether make supports the include directive... yes (GNU style)
23:22:50 checking dependency style of g++... gcc3
23:22:50 checking for gcc... gcc
23:22:50 checking whether we are using the GNU C compiler... yes
23:22:50 checking whether gcc accepts -g... yes
23:22:51 checking for gcc option to accept ISO C89... none needed
23:22:51 checking whether gcc understands -c and -o together... yes
23:22:51 checking dependency style of gcc... gcc3
23:22:51 checking dependency style of gcc... gcc3
23:22:51 checking for bison... bison -y
23:22:51 checking for flex... flex
23:22:51 checking lex output file root... lex.yy
23:22:51 checking lex library... -lfl
23:22:51 checking whether yytext is a pointer... yes
23:22:51 checking how to print strings... printf
23:22:51 checking for a sed that does not truncate output... /usr/bin/sed
23:22:51 checking for grep that handles long lines and -e... /usr/bin/grep
23:22:51 checking for egrep... /usr/bin/grep -E
23:22:51 checking for fgrep... /usr/bin/grep -F
23:22:51 checking for ld used by gcc... /usr/bin/ld
23:22:51 checking if the linker (/usr/bin/ld) is GNU ld... yes
23:22:51 checking for BSD- or MS-compatible name lister (nm)... /usr/bin/nm -B
23:22:51 checking the name lister (/usr/bin/nm -B) interface... BSD nm
23:22:51 checking whether ln -s works... yes
23:22:51 checking the maximum length of command line arguments... 1572864
23:22:51 checking how to convert x86_64-pc-linux-gnu file names to x86_64-pc-linux-gnu format... func_convert_file_noop
23:22:51 checking how to convert x86_64-pc-linux-gnu file names to toolchain format... func_convert_file_noop
23:22:51 checking for /usr/bin/ld option to reload object files... -r
23:22:51 checking for objdump... objdump
23:22:51 checking how to recognize dependent libraries... pass_all
23:22:51 checking for dlltool... no
23:22:51 checking how to associate runtime and link libraries... printf %s\n
23:22:51 checking for ar... ar
23:22:51 checking for archiver @FILE support... @
23:22:51 checking for strip... strip
23:22:51 checking for ranlib... ranlib
23:22:51 checking command to parse /usr/bin/nm -B output from gcc object... ok
23:22:51 checking for sysroot... no
23:22:51 checking for a working dd... /usr/bin/dd
23:22:51 checking how to truncate binary pipes... /usr/bin/dd bs=4096 count=1
23:22:51 checking for mt... mt
23:22:51 checking if mt is a manifest tool... no
23:22:52 checking how to run the C preprocessor... gcc -E
23:22:52 checking for ANSI C header files... yes
23:22:52 checking for sys/types.h... yes
23:22:52 checking for sys/stat.h... yes
23:22:52 checking for stdlib.h... yes
23:22:52 checking for string.h... yes
23:22:52 checking for memory.h... yes
23:22:52 checking for strings.h... yes
23:22:52 checking for inttypes.h... yes
23:22:52 checking for stdint.h... yes
23:22:52 checking for unistd.h... yes
23:22:52 checking for dlfcn.h... yes
23:22:52 checking for objdir... .libs
23:22:52 checking if gcc supports -fno-rtti -fno-exceptions... no
23:22:52 checking for gcc option to produce PIC... -fPIC -DPIC
23:22:52 checking if gcc PIC flag -fPIC -DPIC works... yes
23:22:52 checking if gcc static flag -static works... yes
23:22:53 checking if gcc supports -c -o file.o... yes
23:22:53 checking if gcc supports -c -o file.o... (cached) yes
23:22:53 checking whether the gcc linker (/usr/bin/ld -m elf_x86_64) supports shared libraries... yes
23:22:53 checking whether -lc should be explicitly linked in... no
23:22:53 checking dynamic linker characteristics... GNU/Linux ld.so
23:22:53 checking how to hardcode library paths into programs... immediate
23:22:53 checking whether stripping libraries is possible... yes
23:22:53 checking if libtool supports shared libraries... yes
23:22:53 checking whether to build shared libraries... yes
23:22:53 checking whether to build static libraries... yes
23:22:53 checking how to run the C++ preprocessor... g++ -E
23:22:53 checking for ld used by g++... /usr/bin/ld -m elf_x86_64
23:22:53 checking if the linker (/usr/bin/ld -m elf_x86_64) is GNU ld... yes
23:22:53 checking whether the g++ linker (/usr/bin/ld -m elf_x86_64) supports shared libraries... yes
23:22:53 checking for g++ option to produce PIC... -fPIC -DPIC
23:22:53 checking if g++ PIC flag -fPIC -DPIC works... yes
23:22:53 checking if g++ static flag -static works... yes
23:22:53 checking if g++ supports -c -o file.o... yes
23:22:53 checking if g++ supports -c -o file.o... (cached) yes
23:22:53 checking whether the g++ linker (/usr/bin/ld -m elf_x86_64) supports shared libraries... yes
23:22:53 checking dynamic linker characteristics... (cached) GNU/Linux ld.so
23:22:53 checking how to hardcode library paths into programs... immediate
23:22:53 checking for Fibre::yield in -lfibre... no
23:22:53 checking for ProfilingIsEnabledForAllThreads in -lprofiler... yes
23:22:53 checking for malloc in -ltcmalloc... yes
23:22:53 checking libintl.h usability... yes
23:22:53 checking libintl.h presence... yes
23:22:53 checking for libintl.h... yes
23:22:53 checking malloc.h usability... yes
23:22:54 checking malloc.h presence... yes
23:22:54 checking for malloc.h... yes
23:22:54 checking for unistd.h... (cached) yes
23:22:54 checking for _Float32... yes
23:22:54 checking whether C compiler accepts -Wcast-function-type... yes
23:22:54 checking that generated files are newer than configure... done
23:22:54 configure: creating ./config.status
23:22:55 config.status: creating Makefile
23:22:55 config.status: creating driver/Makefile
23:22:55 config.status: creating src/Makefile
23:22:55 config.status: creating libcfa/Makefile
23:22:55 config.status: creating tests/Makefile
23:22:55 config.status: creating tests/config.py
23:22:55 config.status: creating config.h
23:22:55 config.status: linking ../../tests/test.py to tests/test.py
23:22:55 config.status: executing depfiles commands
23:22:55 config.status: executing libtool commands
23:22:55 Cforall configuraton completed. Type "make -j 8 install".
23:22:55 make[1]: Entering directory '/var/lib/jenkins/workspace/Cforall_Distribute_Ref@tmp/cfa-cc-1.0.0.1846/_build/sub'
23:22:55 make  all-recursive
23:22:55 make[2]: Entering directory '/var/lib/jenkins/workspace/Cforall_Distribute_Ref@tmp/cfa-cc-1.0.0.1846/_build/sub'
23:22:55 Making all in driver
23:22:55 make[3]: Entering directory '/var/lib/jenkins/workspace/Cforall_Distribute_Ref@tmp/cfa-cc-1.0.0.1846/_build/sub/driver'
23:22:55   CXX      as.o
23:22:55   CXX      cc1.o
23:22:55   CXX      cfa.o
23:22:56   CXXLD    as
23:22:57   CXXLD    cc1
23:22:57   CXXLD    cfa
23:22:57 make[3]: Leaving directory '/var/lib/jenkins/workspace/Cforall_Distribute_Ref@tmp/cfa-cc-1.0.0.1846/_build/sub/driver'
23:22:57 Making all in src
23:22:57 make[3]: Entering directory '/var/lib/jenkins/workspace/Cforall_Distribute_Ref@tmp/cfa-cc-1.0.0.1846/_build/sub/src'
23:22:57 make  all-am
23:22:57 make[4]: Entering directory '/var/lib/jenkins/workspace/Cforall_Distribute_Ref@tmp/cfa-cc-1.0.0.1846/_build/sub/src'
23:22:57   CXX      main.o
23:22:57   CXX      CompilationState.o
23:22:57   CXX      MakeLibCfa.o
23:22:57   CXX      MakeLibCfaNew.o
23:22:57   CXX      SymTab/demangler.o
23:22:57   CXX      SymTab/Demangle.o
23:22:57   CXX      AST/AssertAcyclic.o
23:22:57   CXX      AST/Attribute.o
23:22:57   CXX      AST/Convert.o
23:22:58   CXX      AST/Decl.o
23:22:58   CXX      AST/DeclReplacer.o
23:23:02   CXX      AST/Expr.o
23:23:10   CXX      AST/GenericSubstitution.o
23:23:10   CXX      AST/Init.o
23:23:10   CXX      AST/LinkageSpec.o
23:23:11   CXX      AST/Node.o
23:23:13   CXX      AST/Pass.o
23:23:15   CXX      AST/Print.o
23:23:16   CXX      AST/Stmt.o
23:23:18   CXX      AST/SymbolTable.o
23:23:18   CXX      AST/Type.o
23:23:18   CXX      AST/TypeEnvironment.o
23:23:19   CXX      AST/TypeSubstitution.o
23:23:20   CXX      CodeGen/CodeGenerator.o
23:23:23   CXX      CodeGen/FixMain.o
23:23:24   CXX      CodeGen/GenType.o
23:23:25   CXX      CodeGen/LinkOnce.o
23:23:25   CXX      CodeGen/OperatorTable.o
23:23:26   CXX      CodeGen/Generate.o
23:23:29   CXX      CodeGen/FixNames.o
23:23:31   CXX      CodeTools/DeclStats.o
23:23:33   CXX      CodeTools/ResolvProtoDump.o
23:23:35   CXX      CodeTools/TrackLoc.o
23:23:37   CXX      Concurrency/Keywords.o
23:23:39   CXX      Concurrency/Waitfor.o
23:23:39   CXX      Common/Assert.o
23:23:40   CXX      Common/CodeLocationTools.o
23:23:45   CXX      Common/Eval.o
23:23:45   CXX      Common/Examine.o
23:23:45   CXX      Common/PassVisitor.o
23:23:46   CXX      Common/SemanticError.o
23:23:47   CXX      Common/Stats/Counter.o
23:23:47   CXX      Common/Stats/Heap.o
23:23:47   CXX      Common/Stats/ResolveTime.o
23:23:48   CXX      Common/Stats/Stats.o
23:23:48   CXX      Common/Stats/Time.o
23:23:49   CXX      Common/UniqueName.o
23:23:49   CXX      Common/DebugMalloc.o
23:23:49   CXX      ControlStruct/ExceptDecl.o
23:23:50   CXX      ControlStruct/ForExprMutator.o
23:23:50   CXX      ControlStruct/LabelFixer.o
23:23:51   CXX      ControlStruct/LabelGenerator.o
23:23:51   CXX      ControlStruct/MLEMutator.o
23:23:52   CXX      ControlStruct/Mutate.o
23:23:58   CXX      ControlStruct/ExceptTranslate.o
23:24:01   CXX      GenPoly/Box.o
23:24:02   CXX      GenPoly/FindFunction.o
23:24:02   CXX      GenPoly/GenPoly.o
23:24:02   CXX      GenPoly/InstantiateGeneric.o
23:24:03   CXX      GenPoly/Lvalue.o
23:24:04 ../../../src/GenPoly/GenPoly.cc:67:130: warning: ‘ununsed’ attribute directive ignored [-Wattributes]
23:24:04    67 |   bool hasPolyParams( const std::vector<ast::ptr<ast::Expr>> & params, const TyVarMap & tyVars, const ast::TypeSubstitution * env) {
23:24:04       |                                                                                                                                  ^
23:24:06 ../../../src/GenPoly/GenPoly.cc:67:8: warning: ‘bool GenPoly::{anonymous}::hasPolyParams(const std::vector<ast::ptr_base<ast::Expr, ast::Node::ref_type::strong> >&, const TyVarMap&, const ast::TypeSubstitution*)’ defined but not used [-Wunused-function]
23:24:06    67 |   bool hasPolyParams( const std::vector<ast::ptr<ast::Expr>> & params, const TyVarMap & tyVars, const ast::TypeSubstitution * env) {
23:24:06       |        ^~~~~~~~~~~~~
23:24:08   CXX      GenPoly/ScrubTyVars.o
23:24:10   CXX      GenPoly/Specialize.o
23:24:18   CXX      InitTweak/FixGlobalInit.o
23:24:23   CXX      InitTweak/FixInit.o
23:24:28   CXX      InitTweak/GenInit.o
23:24:28   CXX      InitTweak/InitTweak.o
23:24:30   CXX      InitTweak/FixInitNew.o
23:24:43   CXX      Parser/DeclarationNode.o
23:24:43   CXX      Parser/ExpressionNode.o
23:24:45   CXX      Parser/InitializerNode.o
23:24:46   CXX      Parser/lex.o
23:24:47   CXX      Parser/ParseNode.o
23:24:49   CXX      Parser/parser.o
23:24:51   CXX      Parser/parserutility.o
23:24:52   CXX      Parser/StatementNode.o
23:24:54   CXX      Parser/TypeData.o
23:24:56   CXX      Parser/TypedefTable.o
23:24:58   CXX      ResolvExpr/AdjustExprType.o
23:24:58   CXX      ResolvExpr/Alternative.o
23:25:00   CXX      ResolvExpr/AlternativeFinder.o
23:25:01   CXX      ResolvExpr/Candidate.o
23:25:04   CXX      ResolvExpr/CandidateFinder.o
23:25:14   CXX      ResolvExpr/CastCost.o
23:25:14 In file included from ../../../src/ResolvExpr/CastCost.cc:22:
23:25:14 ../../../src/ResolvExpr/ConversionCost.h:79:2: warning: #warning when the old ConversionCost is removed, get ride of the _new suffix. [-Wcpp]
23:25:14    79 | #warning when the old ConversionCost is removed, get ride of the _new suffix.
23:25:14       |  ^~~~~~~
23:25:14 ../../../src/ResolvExpr/CastCost.cc:186:3: warning: #warning For overload resolution between the two versions. [-Wcpp]
23:25:14   186 |  #warning For overload resolution between the two versions.
23:25:14       |   ^~~~~~~
23:25:14 ../../../src/ResolvExpr/CastCost.cc:236:4: warning: #warning cast on ptrsCastable artifact of having two functions, remove when port done [-Wcpp]
23:25:14   236 |   #warning cast on ptrsCastable artifact of having two functions, remove when port done
23:25:14       |    ^~~~~~~
23:25:14 ../../../src/ResolvExpr/CastCost.cc:240:4: warning: #warning cast on castCost artifact of having two functions, remove when port done [-Wcpp]
23:25:14   240 |   #warning cast on castCost artifact of having two functions, remove when port done
23:25:14       |    ^~~~~~~
23:25:14   CXX      ResolvExpr/CommonType.o
23:25:14 ../../../src/ResolvExpr/CommonType.cc:682:6: warning: #warning remove casts when `commonTypes` moved to new AST [-Wcpp]
23:25:14   682 |     #warning remove casts when `commonTypes` moved to new AST
23:25:14       |      ^~~~~~~
23:25:14 ../../../src/ResolvExpr/CommonType.cc:697:6: warning: #warning remove casts when `commonTypes` moved to new AST [-Wcpp]
23:25:14   697 |     #warning remove casts when `commonTypes` moved to new AST
23:25:14       |      ^~~~~~~
23:25:23   CXX      ResolvExpr/ConversionCost.o
23:25:23 In file included from ../../../src/ResolvExpr/ConversionCost.cc:16:
23:25:23 ../../../src/ResolvExpr/ConversionCost.h:79:2: warning: #warning when the old ConversionCost is removed, get ride of the _new suffix. [-Wcpp]
23:25:23    79 | #warning when the old ConversionCost is removed, get ride of the _new suffix.
23:25:23       |  ^~~~~~~
23:25:23 ../../../src/ResolvExpr/ConversionCost.cc:484:4: warning: #warning For overload resolution between the two versions. [-Wcpp]
23:25:23   484 |  # warning For overload resolution between the two versions.
23:25:23       |    ^~~~~~~
23:25:28   CXX      ResolvExpr/CurrentObject.o
23:25:31   CXX      ResolvExpr/ExplodedActual.o
23:25:33   CXX      ResolvExpr/ExplodedArg.o
23:25:35   CXX      ResolvExpr/FindOpenVars.o
23:25:35   CXX      ResolvExpr/Occurs.o
23:25:38   CXX      ResolvExpr/PolyCost.o
23:25:40   CXX      ResolvExpr/PtrsAssignable.o
23:25:44   CXX      ResolvExpr/PtrsCastable.o
23:25:49   CXX      ResolvExpr/RenameVars.o
23:25:52   CXX      ResolvExpr/ResolveAssertions.o
23:25:57   CXX      ResolvExpr/Resolver.o
23:26:00   CXX      ResolvExpr/ResolveTypeof.o
23:26:01   CXX      ResolvExpr/SatisfyAssertions.o
23:26:02   CXX      ResolvExpr/SpecCost.o
23:26:02 ../../../src/ResolvExpr/SpecCost.cc:133:4: warning: #warning Should use a standard maybe_accept [-Wcpp]
23:26:02   133 |   #warning Should use a standard maybe_accept
23:26:02       |    ^~~~~~~
23:26:07   CXX      ResolvExpr/TypeEnvironment.o
23:26:09   CXX      ResolvExpr/Unify.o
23:26:12   CXX      ResolvExpr/AlternativePrinter.o
23:26:13   CXX      SymTab/Autogen.o
23:26:13   CXX      SymTab/FixFunction.o
23:26:14   CXX      SymTab/Indexer.o
23:26:24   CXX      SymTab/Mangler.o
23:26:27   CXX      SymTab/ManglerCommon.o
23:26:29   CXX      SymTab/Validate.o
23:26:29   CXX      SynTree/AddressExpr.o
23:26:29   CXX      SynTree/AggregateDecl.o
23:26:30   CXX      SynTree/ApplicationExpr.o
23:26:32   CXX      SynTree/ArrayType.o
23:26:32   CXX      SynTree/Attribute.o
23:26:33   CXX      SynTree/AttrType.o
23:26:33   CXX      SynTree/BasicType.o
23:26:34   CXX      SynTree/CommaExpr.o
23:26:34   CXX      SynTree/CompoundStmt.o
23:26:34   CXX      SynTree/Constant.o
23:26:35   CXX      SynTree/Declaration.o
23:26:35   CXX      SynTree/DeclarationWithType.o
23:26:36   CXX      SynTree/DeclReplacer.o
23:26:37   CXX      SynTree/DeclStmt.o
23:26:37   CXX      SynTree/Expression.o
23:26:38   CXX      SynTree/FunctionDecl.o
23:26:39   CXX      SynTree/FunctionType.o
23:26:40   CXX      SynTree/Initializer.o
23:26:42   CXX      SynTree/LinkageSpec.o
23:26:43   CXX      SynTree/NamedTypeDecl.o
23:26:43   CXX      SynTree/ObjectDecl.o
23:26:43   CXX      SynTree/PointerType.o
23:26:44   CXX      SynTree/ReferenceToType.o
23:26:44   CXX      SynTree/ReferenceType.o
23:26:44   CXX      SynTree/Statement.o
23:26:46   CXX      SynTree/TupleExpr.o
23:26:47   CXX      SynTree/TupleType.o
23:26:48   CXX      SynTree/Type.o
23:26:49   CXX      SynTree/TypeDecl.o
23:26:50   CXX      SynTree/TypeExpr.o
23:26:50   CXX      SynTree/TypeofType.o
23:26:50   CXX      SynTree/TypeSubstitution.o
23:26:50   CXX      SynTree/VarArgsType.o
23:26:51   CXX      SynTree/VoidType.o
23:26:51   CXX      SynTree/ZeroOneType.o
23:26:52   CXX      Tuples/Explode.o
23:26:52   CXX      Tuples/TupleAssignment.o
23:26:52   CXX      Tuples/TupleExpansion.o
23:26:52   CXX      Tuples/TupleExpansionNew.o
23:27:04   CXX      Tuples/Tuples.o
23:27:08   CXX      Validate/HandleAttributes.o
23:27:09   CXX      Validate/FindSpecialDecls.o
23:27:09   CXX      Virtual/ExpandCasts.o
23:27:15   CXX      Virtual/Tables.o
23:29:36   CXXLD    ../driver/cfa-cpp
23:29:36   AR       libdemangle.a
23:29:46   CXXLD    demangler
23:29:54 make[4]: Leaving directory '/var/lib/jenkins/workspace/Cforall_Distribute_Ref@tmp/cfa-cc-1.0.0.1846/_build/sub/src'
23:29:54 make[3]: Leaving directory '/var/lib/jenkins/workspace/Cforall_Distribute_Ref@tmp/cfa-cc-1.0.0.1846/_build/sub/src'
23:29:54 Making all in .
23:29:54 make[3]: Entering directory '/var/lib/jenkins/workspace/Cforall_Distribute_Ref@tmp/cfa-cc-1.0.0.1846/_build/sub'
23:29:54 libcfa/x64-debug/config.data
23:29:54 Configuring libcfa (/var/lib/jenkins/workspace/Cforall_Distribute_Ref@tmp/cfa-cc-1.0.0.1846/_build/sub/../../libcfa/configure) with ''--prefix=/var/lib/jenkins/workspace/Cforall_Distribute_Ref@tmp/cfa-cc-1.0.0.1846/_inst' DRIVER_DIR=/var/lib/jenkins/workspace/Cforall_Distribute_Ref@tmp/cfa-cc-1.0.0.1846/_build/sub/driver/ ARCHITECTURE=x64 CONFIGURATION=debug CFA_VERSION=1:0:0' from /var/lib/jenkins/workspace/Cforall_Distribute_Ref@tmp/cfa-cc-1.0.0.1846/_build/sub / libcfa/x64-debug/
23:29:54 libcfa/x64-nodebug/config.data
23:29:54 Configuring libcfa (/var/lib/jenkins/workspace/Cforall_Distribute_Ref@tmp/cfa-cc-1.0.0.1846/_build/sub/../../libcfa/configure) with ''--prefix=/var/lib/jenkins/workspace/Cforall_Distribute_Ref@tmp/cfa-cc-1.0.0.1846/_inst' DRIVER_DIR=/var/lib/jenkins/workspace/Cforall_Distribute_Ref@tmp/cfa-cc-1.0.0.1846/_build/sub/driver/ ARCHITECTURE=x64 CONFIGURATION=nodebug CFA_VERSION=1:0:0' from /var/lib/jenkins/workspace/Cforall_Distribute_Ref@tmp/cfa-cc-1.0.0.1846/_build/sub / libcfa/x64-nodebug/
23:29:54 checking whether make supports nested variables... checking whether make supports nested variables... yes
23:29:54 checking for a BSD-compatible install... yes
23:29:54 checking for a BSD-compatible install... /usr/bin/install -c
23:29:54 checking whether build environment is sane... /usr/bin/install -c
23:29:54 checking whether build environment is sane... yes
23:29:54 yes
23:29:54 checking for a thread-safe mkdir -p... checking for a thread-safe mkdir -p... /usr/bin/mkdir -p
23:29:54 checking for gawk... gawk
23:29:54 checking whether make sets $(MAKE)... /usr/bin/mkdir -p
23:29:54 checking for gawk... gawk
23:29:54 checking whether make sets $(MAKE)... yes
23:29:54 yes
23:29:54 checking for distributated build... no
23:29:54 checking for distributated build... no
23:29:54 checking build system type... checking build system type... x86_64-pc-linux-gnu
23:29:54 checking host system type... x86_64-pc-linux-gnu
23:29:54 checking how to print strings... x86_64-pc-linux-gnu
23:29:54 checking host system type... x86_64-pc-linux-gnu
23:29:54 checking how to print strings... printf
23:29:54 checking whether make supports the include directive... yes (GNU style)
23:29:54 checking for gcc... gcc
23:29:54 printf
23:29:54 checking whether make supports the include directive... yes (GNU style)
23:29:54 checking for gcc... gcc
23:29:54 checking whether the C compiler works... checking whether the C compiler works... yes
23:29:54 checking for C compiler default output file name... a.out
23:29:54 checking for suffix of executables... yes
23:29:54 checking for C compiler default output file name... a.out
23:29:54 checking for suffix of executables... 
23:29:54 checking whether we are cross compiling... 
23:29:54 checking whether we are cross compiling... no
23:29:54 checking for suffix of object files... no
23:29:54 checking for suffix of object files... o
23:29:54 checking whether we are using the GNU C compiler... o
23:29:54 checking whether we are using the GNU C compiler... yes
23:29:55 checking whether gcc accepts -g... yes
23:29:55 checking whether gcc accepts -g... yes
23:29:55 checking for gcc option to accept ISO C89... yes
23:29:55 checking for gcc option to accept ISO C89... none needed
23:29:55 checking whether gcc understands -c and -o together... none needed
23:29:55 checking whether gcc understands -c and -o together... yes
23:29:55 checking dependency style of gcc... yes
23:29:55 checking dependency style of gcc... gcc3
23:29:55 checking for a sed that does not truncate output... /usr/bin/sed
23:29:55 checking for grep that handles long lines and -e... /usr/bin/grep
23:29:55 checking for egrep... /usr/bin/grep -E
23:29:55 checking for fgrep... /usr/bin/grep -F
23:29:55 checking for ld used by gcc... /usr/bin/ld
23:29:55 checking if the linker (/usr/bin/ld) is GNU ld... gcc3
23:29:55 checking for a sed that does not truncate output... yes
23:29:55 checking for BSD- or MS-compatible name lister (nm)... /usr/bin/nm -B
23:29:55 /usr/bin/sed
23:29:55 checking the name lister (/usr/bin/nm -B) interface... checking for grep that handles long lines and -e... /usr/bin/grep
23:29:55 checking for egrep... /usr/bin/grep -E
23:29:55 checking for fgrep... /usr/bin/grep -F
23:29:55 checking for ld used by gcc... /usr/bin/ld
23:29:55 checking if the linker (/usr/bin/ld) is GNU ld... yes
23:29:55 checking for BSD- or MS-compatible name lister (nm)... /usr/bin/nm -B
23:29:55 checking the name lister (/usr/bin/nm -B) interface... BSD nm
23:29:55 checking whether ln -s works... yes
23:29:55 checking the maximum length of command line arguments... 1572864
23:29:55 checking how to convert x86_64-pc-linux-gnu file names to x86_64-pc-linux-gnu format... func_convert_file_noop
23:29:55 checking how to convert x86_64-pc-linux-gnu file names to toolchain format... func_convert_file_noop
23:29:55 checking for /usr/bin/ld option to reload object files... -r
23:29:55 checking for objdump... objdump
23:29:55 checking how to recognize dependent libraries... pass_all
23:29:55 checking for dlltool... no
23:29:55 checking how to associate runtime and link libraries... printf %s\n
23:29:55 checking for ar... ar
23:29:55 checking for archiver @FILE support... BSD nm
23:29:55 checking whether ln -s works... yes
23:29:55 checking the maximum length of command line arguments... 1572864
23:29:55 checking how to convert x86_64-pc-linux-gnu file names to x86_64-pc-linux-gnu format... func_convert_file_noop
23:29:55 checking how to convert x86_64-pc-linux-gnu file names to toolchain format... func_convert_file_noop
23:29:55 checking for /usr/bin/ld option to reload object files... -r
23:29:55 checking for objdump... objdump
23:29:55 checking how to recognize dependent libraries... pass_all
23:29:55 checking for dlltool... no
23:29:55 checking how to associate runtime and link libraries... printf %s\n
23:29:55 checking for ar... ar
23:29:55 checking for archiver @FILE support... @
23:29:55 checking for strip... strip
23:29:55 checking for ranlib... ranlib
23:29:55 checking command to parse /usr/bin/nm -B output from gcc object... @
23:29:55 checking for strip... strip
23:29:55 checking for ranlib... ranlib
23:29:55 checking command to parse /usr/bin/nm -B output from gcc object... ok
23:29:55 checking for sysroot... no
23:29:55 checking for a working dd... ok
23:29:55 /usr/bin/dd
23:29:55 checking how to truncate binary pipes... checking for sysroot... no
23:29:55 checking for a working dd... /usr/bin/dd bs=4096 count=1
23:29:55 /usr/bin/dd
23:29:55 checking how to truncate binary pipes... /usr/bin/dd bs=4096 count=1
23:29:55 checking for mt... mt
23:29:55 checking if mt is a manifest tool... no
23:29:55 checking for mt... mt
23:29:55 checking if mt is a manifest tool... checking how to run the C preprocessor... no
23:29:55 checking how to run the C preprocessor... gcc -E
23:29:55 gcc -E
23:29:55 checking for ANSI C header files... checking for ANSI C header files... yes
23:29:55 checking for sys/types.h... yes
23:29:55 checking for sys/types.h... yes
23:29:55 checking for sys/stat.h... yes
23:29:55 checking for sys/stat.h... yes
23:29:55 checking for stdlib.h... yes
23:29:56 checking for stdlib.h... yes
23:29:56 checking for string.h... yes
23:29:56 checking for string.h... yes
23:29:56 checking for memory.h... yes
23:29:56 checking for memory.h... yes
23:29:56 checking for strings.h... yes
23:29:56 checking for strings.h... yes
23:29:56 checking for inttypes.h... yes
23:29:56 checking for inttypes.h... yes
23:29:56 checking for stdint.h... yes
23:29:56 checking for stdint.h... yes
23:29:56 checking for unistd.h... yes
23:29:56 checking for unistd.h... yes
23:29:56 checking for dlfcn.h... yes
23:29:56 checking for dlfcn.h... yes
23:29:56 checking for objdir... .libs
23:29:56 yes
23:29:56 checking for objdir... .libs
23:29:56 checking if gcc supports -fno-rtti -fno-exceptions... checking if gcc supports -fno-rtti -fno-exceptions... no
23:29:56 checking for gcc option to produce PIC... -fPIC -DPIC
23:29:56 checking if gcc PIC flag -fPIC -DPIC works... no
23:29:56 checking for gcc option to produce PIC... -fPIC -DPIC
23:29:56 checking if gcc PIC flag -fPIC -DPIC works... yes
23:29:56 checking if gcc static flag -static works... yes
23:29:56 checking if gcc static flag -static works... yes
23:29:56 checking if gcc supports -c -o file.o... yes
23:29:56 checking if gcc supports -c -o file.o... yes
23:29:56 checking if gcc supports -c -o file.o... (cached) yes
23:29:56 checking whether the gcc linker (/usr/bin/ld -m elf_x86_64) supports shared libraries... yes
23:29:56 checking whether -lc should be explicitly linked in... yes
23:29:56 checking if gcc supports -c -o file.o... (cached) yes
23:29:56 checking whether the gcc linker (/usr/bin/ld -m elf_x86_64) supports shared libraries... yes
23:29:56 checking whether -lc should be explicitly linked in... no
23:29:56 checking dynamic linker characteristics... no
23:29:56 checking dynamic linker characteristics... GNU/Linux ld.so
23:29:56 checking how to hardcode library paths into programs... immediate
23:29:56 checking whether stripping libraries is possible... yes
23:29:56 checking if libtool supports shared libraries... yes
23:29:56 checking whether to build shared libraries... yes
23:29:56 checking whether to build static libraries... no
23:29:56 checking for g++... g++
23:29:56 GNU/Linux ld.so
23:29:56 checking how to hardcode library paths into programs... immediate
23:29:57 checking whether stripping libraries is possible... yes
23:29:57 checking if libtool supports shared libraries... yes
23:29:57 checking whether to build shared libraries... yes
23:29:57 checking whether to build static libraries... no
23:29:57 checking for g++... g++
23:29:57 checking whether we are using the GNU C++ compiler... checking whether we are using the GNU C++ compiler... yes
23:29:57 checking whether g++ accepts -g... yes
23:29:57 checking whether g++ accepts -g... yes
23:29:57 checking dependency style of g++... yes
23:29:57 checking dependency style of g++... gcc3
23:29:57 gcc3
23:29:57 checking how to run the C++ preprocessor... checking how to run the C++ preprocessor... g++ -E
23:29:57 g++ -E
23:29:57 checking for ld used by g++... /usr/bin/ld -m elf_x86_64
23:29:57 checking if the linker (/usr/bin/ld -m elf_x86_64) is GNU ld... checking for ld used by g++... yes
23:29:57 /usr/bin/ld -m elf_x86_64
23:29:57 checking if the linker (/usr/bin/ld -m elf_x86_64) is GNU ld... checking whether the g++ linker (/usr/bin/ld -m elf_x86_64) supports shared libraries... yes
23:29:57 yes
23:29:57 checking whether the g++ linker (/usr/bin/ld -m elf_x86_64) supports shared libraries... yes
23:29:57 checking for g++ option to produce PIC... -fPIC -DPIC
23:29:57 checking if g++ PIC flag -fPIC -DPIC works... checking for g++ option to produce PIC... -fPIC -DPIC
23:29:57 checking if g++ PIC flag -fPIC -DPIC works... yes
23:29:57 checking if g++ static flag -static works... yes
23:29:57 checking if g++ supports -c -o file.o... yes
23:29:57 checking if g++ static flag -static works... yes
23:29:57 checking if g++ supports -c -o file.o... (cached) yes
23:29:57 checking whether the g++ linker (/usr/bin/ld -m elf_x86_64) supports shared libraries... yes
23:29:57 checking dynamic linker characteristics... (cached) GNU/Linux ld.so
23:29:57 checking how to hardcode library paths into programs... immediate
23:29:57 checking for gcc... (cached) gcc
23:29:57 checking whether we are using the GNU C compiler... (cached) yes
23:29:57 checking whether gcc accepts -g... (cached) yes
23:29:57 checking for gcc option to accept ISO C89... (cached) none needed
23:29:57 checking whether gcc understands -c and -o together... (cached) yes
23:29:57 checking dependency style of gcc... (cached) gcc3
23:29:57 checking dependency style of gcc... yes
23:29:57 checking if g++ supports -c -o file.o... gcc3
23:29:57 checking whether make sets $(MAKE)... (cached) yes
23:29:57 checking linux/rseq.h usability... yes
23:29:57 checking if g++ supports -c -o file.o... (cached) yes
23:29:57 checking whether the g++ linker (/usr/bin/ld -m elf_x86_64) supports shared libraries... yes
23:29:57 checking dynamic linker characteristics... (cached) GNU/Linux ld.so
23:29:57 checking how to hardcode library paths into programs... immediate
23:29:57 checking for gcc... (cached) gcc
23:29:57 yes
23:29:57 checking linux/rseq.h presence... checking whether we are using the GNU C compiler... (cached) yes
23:29:57 checking whether gcc accepts -g... (cached) yes
23:29:57 checking for gcc option to accept ISO C89... (cached) none needed
23:29:57 checking whether gcc understands -c and -o together... (cached) yes
23:29:57 checking dependency style of gcc... (cached) gcc3
23:29:57 yes
23:29:57 checking for linux/rseq.h... checking dependency style of gcc... yes
23:29:57 checking for rseq_available in -lrseq... gcc3
23:29:57 checking whether make sets $(MAKE)... (cached) yes
23:29:57 checking linux/rseq.h usability... no
23:29:57 checking linux/io_uring.h usability... yes
23:29:57 checking linux/rseq.h presence... yes
23:29:57 checking linux/io_uring.h presence... yes
23:29:57 checking for linux/rseq.h... yes
23:29:57 checking for rseq_available in -lrseq... yes
23:29:57 checking for linux/io_uring.h... yes
23:29:57 checking liburing.h usability... yes
23:29:58 checking liburing.h presence... yes
23:29:58 checking for liburing.h... yes
23:29:58 checking for io_uring_get_probe in -luring... no
23:29:58 checking linux/io_uring.h usability... yes
23:29:58 checking whether IORING_OP_NOP is declared... yes
23:29:58 checking linux/io_uring.h presence... yes
23:29:58 yes
23:29:58 checking for linux/io_uring.h... yes
23:29:58 checking liburing.h usability... yes
23:29:58 checking liburing.h presence... checking whether IORING_OP_READV is declared... yes
23:29:58 checking for liburing.h... yes
23:29:58 checking for io_uring_get_probe in -luring... yes
23:29:58 yes
23:29:58 checking whether IORING_OP_NOP is declared... yes
23:29:58 checking whether IORING_OP_WRITEV is declared... yes
23:29:58 checking whether IORING_OP_READV is declared... yes
23:29:58 checking whether IORING_OP_FSYNC is declared... yes
23:29:58 checking whether IORING_OP_WRITEV is declared... checking whether IORING_OP_READ_FIXED is declared... yes
23:29:58 yes
23:29:58 checking whether IORING_OP_FSYNC is declared... checking whether IORING_OP_WRITE_FIXED is declared... yes
23:29:58 yes
23:29:58 checking whether IORING_OP_READ_FIXED is declared... checking whether IORING_OP_POLL_ADD is declared... yes
23:29:58 yes
23:29:58 checking whether IORING_OP_WRITE_FIXED is declared... checking whether IORING_OP_POLL_REMOVE is declared... yes
23:29:58 yes
23:29:59 checking whether IORING_OP_POLL_ADD is declared... checking whether IORING_OP_SYNC_FILE_RANGE is declared... yes
23:29:59 yes
23:29:59 checking whether IORING_OP_POLL_REMOVE is declared... checking whether IORING_OP_SENDMSG is declared... yes
23:29:59 yes
23:29:59 checking whether IORING_OP_SYNC_FILE_RANGE is declared... checking whether IORING_OP_RECVMSG is declared... yes
23:29:59 yes
23:29:59 checking whether IORING_OP_SENDMSG is declared... checking whether IORING_OP_TIMEOUT is declared... yes
23:29:59 yes
23:30:00 checking whether IORING_OP_RECVMSG is declared... checking whether IORING_OP_TIMEOUT_REMOVE is declared... yes
23:30:00 yes
23:30:00 checking whether IORING_OP_ACCEPT is declared... checking whether IORING_OP_TIMEOUT is declared... yes
23:30:01 checking whether IORING_OP_ASYNC_CANCEL is declared... yes
23:30:01 yes
23:30:02 checking whether IORING_OP_LINK_TIMEOUT is declared... yes
23:30:03 checking whether IORING_OP_TIMEOUT_REMOVE is declared... yes
23:30:04 checking whether IORING_OP_CONNECT is declared... yes
23:30:04 checking whether IORING_OP_ACCEPT is declared... yes
23:30:04 checking whether IORING_OP_FALLOCATE is declared... yes
23:30:04 checking whether IORING_OP_ASYNC_CANCEL is declared... checking whether IORING_OP_OPENAT is declared... yes
23:30:04 yes
23:30:05 checking whether IORING_OP_LINK_TIMEOUT is declared... yes
23:30:05 checking whether IORING_OP_CLOSE is declared... yes
23:30:05 checking whether IORING_OP_CONNECT is declared... yes
23:30:05 checking whether IORING_OP_FILES_UPDATE is declared... yes
23:30:05 checking whether IORING_OP_FALLOCATE is declared... yes
23:30:05 checking whether IORING_OP_STATX is declared... yes
23:30:05 checking whether IORING_OP_OPENAT is declared... checking whether IORING_OP_READ is declared... yes
23:30:05 yes
23:30:05 checking whether IORING_OP_CLOSE is declared... checking whether IORING_OP_WRITE is declared... yes
23:30:05 yes
23:30:05 checking whether IORING_OP_FILES_UPDATE is declared... checking whether IORING_OP_FADVISE is declared... yes
23:30:05 yes
23:30:05 checking whether IORING_OP_STATX is declared... yes
23:30:05 checking whether IORING_OP_MADVISE is declared... checking whether IORING_OP_READ is declared... yes
23:30:05 yes
23:30:05 checking whether IORING_OP_SEND is declared... yes
23:30:05 checking whether IORING_OP_WRITE is declared... yes
23:30:05 checking whether IORING_OP_RECV is declared... checking whether IORING_OP_FADVISE is declared... yes
23:30:05 yes
23:30:06 checking whether IORING_OP_OPENAT2 is declared... checking whether IORING_OP_MADVISE is declared... yes
23:30:06 yes
23:30:06 checking whether IORING_OP_EPOLL_CTL is declared... checking whether IORING_OP_SEND is declared... yes
23:30:06 yes
23:30:06 checking whether IORING_OP_SPLICE is declared... checking whether IORING_OP_RECV is declared... yes
23:30:06 yes
23:30:06 checking whether IORING_OP_PROVIDE_BUFFERS is declared... checking whether IORING_OP_OPENAT2 is declared... yes
23:30:06 yes
23:30:06 checking whether IORING_OP_REMOVE_BUFFER is declared... checking whether IORING_OP_EPOLL_CTL is declared... yes
23:30:06 no
23:30:06 checking whether IORING_OP_TEE is declared... no
23:30:06 checking whether IORING_OP_SPLICE is declared... checking whether IOSQE_FIXED_FILE is declared... yes
23:30:06 yes
23:30:06 checking whether IOSQE_IO_DRAIN is declared... yes
23:30:06 checking whether IOSQE_IO_LINK is declared... checking whether IORING_OP_PROVIDE_BUFFERS is declared... yes
23:30:06 checking whether IOSQE_IO_HARDLINK is declared... yes
23:30:06 yes
23:30:06 checking whether IOSQE_ASYNC is declared... yes
23:30:06 checking whether IOSQE_BUFFER_SELECT is declared... checking whether IORING_OP_REMOVE_BUFFER is declared... yes
23:30:06 checking whether SPLICE_F_FD_IN_FIXED is declared... no
23:30:06 checking whether IORING_OP_TEE is declared... yes
23:30:06 checking whether IORING_SETUP_ATTACH_WQ is declared... no
23:30:06 checking whether IOSQE_FIXED_FILE is declared... yes
23:30:07 checking for preadv2... yes
23:30:07 checking whether IOSQE_IO_DRAIN is declared... yes
23:30:07 checking whether IOSQE_IO_LINK is declared... yes
23:30:07 checking for pwritev2... yes
23:30:07 checking whether IOSQE_IO_HARDLINK is declared... yes
23:30:07 yes
23:30:07 checking whether IOSQE_ASYNC is declared... checking that generated files are newer than configure... done
23:30:07 configure: creating ./config.status
23:30:07 yes
23:30:07 checking whether IOSQE_BUFFER_SELECT is declared... yes
23:30:07 checking whether SPLICE_F_FD_IN_FIXED is declared... yes
23:30:07 checking whether IORING_SETUP_ATTACH_WQ is declared... yes
23:30:07 checking for preadv2... yes
23:30:07 checking for pwritev2... yes
23:30:07 checking that generated files are newer than configure... done
23:30:07 configure: creating ./config.status
23:30:08 config.status: creating Makefile
23:30:08 config.status: creating src/Makefile
23:30:08 config.status: creating prelude/Makefile
23:30:08 config.status: creating src/concurrency/io/call.cfa
23:30:08 config.status: creating prelude/defines.hfa
23:30:08 config.status: executing depfiles commands
23:30:08 config.status: executing libtool commands
23:30:08 Cforall library configuraton completed. Type "make -j 8 install".
23:30:08 config.status: creating Makefile
23:30:08 config.status: creating src/Makefile
23:30:08 config.status: creating prelude/Makefile
23:30:08 config.status: creating src/concurrency/io/call.cfa
23:30:08 config.status: creating prelude/defines.hfa
23:30:08 config.status: executing depfiles commands
23:30:08 config.status: executing libtool commands
23:30:08 Cforall library configuraton completed. Type "make -j 8 install".
23:30:08 make[3]: Leaving directory '/var/lib/jenkins/workspace/Cforall_Distribute_Ref@tmp/cfa-cc-1.0.0.1846/_build/sub'
23:30:08 Making all in libcfa/x64-debug
23:30:08 make[3]: Entering directory '/var/lib/jenkins/workspace/Cforall_Distribute_Ref@tmp/cfa-cc-1.0.0.1846/_build/sub/libcfa/x64-debug'
23:30:08 Making all in prelude
23:30:08 make[4]: Entering directory '/var/lib/jenkins/workspace/Cforall_Distribute_Ref@tmp/cfa-cc-1.0.0.1846/_build/sub/libcfa/x64-debug/prelude'
23:30:08 mkdir .deps
23:30:08 touch .deps/builtins.Po
23:30:08 make  all-am
23:30:08 make[5]: Entering directory '/var/lib/jenkins/workspace/Cforall_Distribute_Ref@tmp/cfa-cc-1.0.0.1846/_build/sub/libcfa/x64-debug/prelude'
23:30:08   GEN      gcc-builtins.c
23:30:08   GEN      builtins.cf
23:30:08   GEN      extras.cf
23:30:08   GEN      prelude.cfa
23:30:09   GEN      extras.cf
23:30:09   GEN      gcc-builtins.cf
23:30:11   GEN      bootloader.c
23:30:11 make[5]: Leaving directory '/var/lib/jenkins/workspace/Cforall_Distribute_Ref@tmp/cfa-cc-1.0.0.1846/_build/sub/libcfa/x64-debug/prelude'
23:30:11 make[4]: Leaving directory '/var/lib/jenkins/workspace/Cforall_Distribute_Ref@tmp/cfa-cc-1.0.0.1846/_build/sub/libcfa/x64-debug/prelude'
23:30:11 Making all in src
23:30:11 make[4]: Entering directory '/var/lib/jenkins/workspace/Cforall_Distribute_Ref@tmp/cfa-cc-1.0.0.1846/_build/sub/libcfa/x64-debug/src'
23:30:11   CFA      common.lo
23:30:11   CFA      fstream.lo
23:30:11   CFA      heap.lo
23:30:11   CFA      iostream.lo
23:30:11   CFA      iterator.lo
23:30:11   CFA      limits.lo
23:30:11   CFA      parseargs.lo
23:30:11   CFA      memory.lo
23:30:12   CFA      parseconfig.lo
23:30:12   CFA      rational.lo
23:30:12   CFA      stdlib.lo
23:30:12   CFA      strstream.lo
23:30:14   CFA      time.lo
23:30:14   CFA      assert.lo
23:30:16   CFA      bits/debug.lo
23:30:16   CC       exception.lo
23:30:16   CFA      interpose.lo
23:30:16   CFA      startup.lo
23:30:17   CC       virtual.lo
23:30:17   GEN      prelude.lo
23:30:18   CPPAS    concurrency/CtxSwitch-x64.lo
23:30:18   CC       concurrency/invoke.lo
23:30:18   CFA      concurrency/io.lo
23:30:18   CFA      concurrency/preemption.lo
23:30:19   CFA      concurrency/ready_queue.lo
23:30:19   CFA      concurrency/stats.lo
23:30:19   CFA      bits/weakso_locks.lo
23:30:20   CFA      containers/maybe.lo
23:30:20   CFA      containers/pair.lo
23:30:21   CFA      containers/result.lo
23:30:21   CFA      containers/string.lo
23:30:22   CFA      containers/string_res.lo
23:30:23   CFA      containers/vector.lo
23:30:23   CFA      device/cpu.lo
23:30:25   CFA      concurrency/alarm.lo
23:30:26   CFA      concurrency/coroutine.lo
23:30:28   CFA      concurrency/exception.lo
23:30:28   CFA      concurrency/kernel.lo
23:30:28   CFA      concurrency/locks.lo
23:30:29   CFA      concurrency/monitor.lo
23:30:29   CFA      concurrency/mutex.lo
23:30:30   CFA      concurrency/thread.lo
23:30:30   CFA      concurrency/clib/cfathread.lo
23:30:32   CFA      concurrency/io/setup.lo
23:30:35   CFA      concurrency/io/call.lo
23:30:37   CFA      concurrency/kernel/startup.lo
23:30:38   CCLD     libcfa.la
23:30:43 /usr/include/x86_64-linux-gnu/sys/epoll.h: In function ‘_X12_constructorFv_S11epoll_event_autogen___1’:
23:30:43 /usr/include/x86_64-linux-gnu/sys/epoll.h:86:62: warning: taking address of packed member of ‘struct epoll_event’ may result in an unaligned pointer value [-Waddress-of-packed-member]
23:30:43    86 |   epoll_data_t data; /* User data variable */
23:30:43       |                                                              ^                                
23:30:43 /usr/include/x86_64-linux-gnu/sys/epoll.h: In function ‘_X12_constructorFv_S11epoll_eventS11epoll_event_autogen___1’:
23:30:43 /usr/include/x86_64-linux-gnu/sys/epoll.h:86:75: warning: taking address of packed member of ‘struct epoll_event’ may result in an unaligned pointer value [-Waddress-of-packed-member]
23:30:43    86 |   epoll_data_t data; /* User data variable */
23:30:43       |                                                                           ^                                
23:30:43 /usr/include/x86_64-linux-gnu/sys/epoll.h: In function ‘_X11_destructorFv_S11epoll_event_autogen___1’:
23:30:43 /usr/include/x86_64-linux-gnu/sys/epoll.h:86:61: warning: taking address of packed member of ‘struct epoll_event’ may result in an unaligned pointer value [-Waddress-of-packed-member]
23:30:43    86 |   epoll_data_t data; /* User data variable */
23:30:43       |                                                             ^                                
23:30:43 /usr/include/x86_64-linux-gnu/sys/epoll.h: In function ‘_X16_operator_assignFS11epoll_event_S11epoll_eventS11epoll_event_autogen___1’:
23:30:43 /usr/include/x86_64-linux-gnu/sys/epoll.h:86:123: warning: taking address of packed member of ‘struct epoll_event’ may result in an unaligned pointer value [-Waddress-of-packed-member]
23:30:43    86 |   epoll_data_t data; /* User data variable */
23:30:43       |                                                                                                                           ^                                
23:30:43 /usr/include/x86_64-linux-gnu/sys/epoll.h: In function ‘_X12_constructorFv_S11epoll_eventj_autogen___1’:
23:30:43 /usr/include/x86_64-linux-gnu/sys/epoll.h:86:62: warning: taking address of packed member of ‘struct epoll_event’ may result in an unaligned pointer value [-Waddress-of-packed-member]
23:30:43    86 |   epoll_data_t data; /* User data variable */
23:30:43       |                                                              ^                                
23:30:43 /usr/include/x86_64-linux-gnu/sys/epoll.h: In function ‘_X12_constructorFv_S11epoll_eventjU10epoll_data_autogen___1’:
23:30:43 /usr/include/x86_64-linux-gnu/sys/epoll.h:86:75: warning: taking address of packed member of ‘struct epoll_event’ may result in an unaligned pointer value [-Waddress-of-packed-member]
23:30:43    86 |   epoll_data_t data; /* User data variable */
23:30:43       |                                                                           ^                                
23:30:44 /usr/include/x86_64-linux-gnu/bits/socket.h: In function ‘_X16_operator_assignFS7cmsghdr_S7cmsghdrS7cmsghdr_autogen___1’:
23:30:44 /usr/include/x86_64-linux-gnu/bits/socket.h:285:44: note: the ABI of passing struct with a flexible array member has changed in GCC 4.4
23:30:44   285 |     __extension__ unsigned char __cmsg_data __flexarr; /* Ancillary data.  */
23:30:44       |                                            ^~~~~~~
23:30:44 /usr/include/x86_64-linux-gnu/bits/socket.h: In function ‘_X16_operator_assignFS7cmsghdr_S7cmsghdrS7cmsghdr_autogen___1’:
23:30:44 /usr/include/x86_64-linux-gnu/bits/socket.h:285:44: note: the ABI of passing struct with a flexible array member has changed in GCC 4.4
23:30:44   285 |     __extension__ unsigned char __cmsg_data __flexarr; /* Ancillary data.  */
23:30:44       |                                            ^~~~~~~
23:30:49   CCLD     libcfathread.la
23:30:49 make[4]: Leaving directory '/var/lib/jenkins/workspace/Cforall_Distribute_Ref@tmp/cfa-cc-1.0.0.1846/_build/sub/libcfa/x64-debug/src'
23:30:49 make[4]: Entering directory '/var/lib/jenkins/workspace/Cforall_Distribute_Ref@tmp/cfa-cc-1.0.0.1846/_build/sub/libcfa/x64-debug'
23:30:49 make[4]: Nothing to be done for 'all-am'.
23:30:49 make[4]: Leaving directory '/var/lib/jenkins/workspace/Cforall_Distribute_Ref@tmp/cfa-cc-1.0.0.1846/_build/sub/libcfa/x64-debug'
23:30:49 make[3]: Leaving directory '/var/lib/jenkins/workspace/Cforall_Distribute_Ref@tmp/cfa-cc-1.0.0.1846/_build/sub/libcfa/x64-debug'
23:30:49 Making all in libcfa/x64-nodebug
23:30:49 make[3]: Entering directory '/var/lib/jenkins/workspace/Cforall_Distribute_Ref@tmp/cfa-cc-1.0.0.1846/_build/sub/libcfa/x64-nodebug'
23:30:49 Making all in prelude
23:30:49 make[4]: Entering directory '/var/lib/jenkins/workspace/Cforall_Distribute_Ref@tmp/cfa-cc-1.0.0.1846/_build/sub/libcfa/x64-nodebug/prelude'
23:30:49 mkdir .deps
23:30:49 touch .deps/builtins.Po
23:30:49 make  all-am
23:30:49 make[5]: Entering directory '/var/lib/jenkins/workspace/Cforall_Distribute_Ref@tmp/cfa-cc-1.0.0.1846/_build/sub/libcfa/x64-nodebug/prelude'
23:30:49   GEN      gcc-builtins.c
23:30:49   GEN      builtins.cf
23:30:49   GEN      extras.cf
23:30:49   GEN      prelude.cfa
23:30:49   GEN      extras.cf
23:30:49   GEN      gcc-builtins.cf
23:30:51   GEN      bootloader.c
23:30:51 make[5]: Leaving directory '/var/lib/jenkins/workspace/Cforall_Distribute_Ref@tmp/cfa-cc-1.0.0.1846/_build/sub/libcfa/x64-nodebug/prelude'
23:30:51 make[4]: Leaving directory '/var/lib/jenkins/workspace/Cforall_Distribute_Ref@tmp/cfa-cc-1.0.0.1846/_build/sub/libcfa/x64-nodebug/prelude'
23:30:51 Making all in src
23:30:51 make[4]: Entering directory '/var/lib/jenkins/workspace/Cforall_Distribute_Ref@tmp/cfa-cc-1.0.0.1846/_build/sub/libcfa/x64-nodebug/src'
23:30:51   CFA      common.lo
23:30:51   CFA      fstream.lo
23:30:51   CFA      heap.lo
23:30:51   CFA      iostream.lo
23:30:51   CFA      iterator.lo
23:30:51   CFA      limits.lo
23:30:51   CFA      parseargs.lo
23:30:51   CFA      memory.lo
23:30:52   CFA      parseconfig.lo
23:30:52   CFA      rational.lo
23:30:53   CFA      stdlib.lo
23:30:53   CFA      strstream.lo
23:30:55   CFA      time.lo
23:30:55 /var/lib/jenkins/workspace/Cforall_Distribute_Ref@tmp/cfa-cc-1.0.0.1846/_build/sub/../../libcfa/src/stdlib.cfa: In function ‘_X4anewQ1_0_1_1__X12_constructorFv_BD0BT0__FPBD0_mBT0__1’:
23:30:55 /var/lib/jenkins/workspace/Cforall_Distribute_Ref@tmp/cfa-cc-1.0.0.1846/_build/sub/../../libcfa/src/stdlib.hfa:154:97: warning: ‘_X4_srcS6S_fill_Y12__T_generic___1._X1cc_1’ is used uninitialized in this function [-Wuninitialized]
23:30:55   154 |  struct S_fill   { char tag; char c; size_t size; T * at; char t[50]; };
23:30:55       |                                                               ~~~~~~~~~~                        ^       
23:30:55 /var/lib/jenkins/workspace/Cforall_Distribute_Ref@tmp/cfa-cc-1.0.0.1846/_build/sub/../../libcfa/src/stdlib.hfa:154:100: warning: ‘_X4_srcS6S_fill_Y12__T_generic___1._X4sizem_1’ is used uninitialized in this function [-Wuninitialized]
23:30:55   154 |  struct S_fill   { char tag; char c; size_t size; T * at; char t[50]; };
23:30:55       |                                                                  ~~~~~~~                           ^          
23:30:55 /var/lib/jenkins/workspace/Cforall_Distribute_Ref@tmp/cfa-cc-1.0.0.1846/_build/sub/../../libcfa/src/stdlib.hfa:154:130: warning: ‘_X4_srcS6S_fill_Y12__T_generic___1._X2atPY12__T_generic__1’ is used uninitialized in this function [-Wuninitialized]
23:30:55   154 |  struct S_fill   { char tag; char c; size_t size; T * at; char t[50]; };
23:30:55       |                                                                                                                                  ^                       
23:30:55   CFA      assert.lo
23:30:57   CFA      bits/debug.lo
23:30:57   CC       exception.lo
23:30:57   CFA      interpose.lo
23:30:58   CFA      startup.lo
23:30:58   CC       virtual.lo
23:30:58   GEN      prelude.lo
23:30:59 /var/lib/jenkins/workspace/Cforall_Distribute_Ref@tmp/cfa-cc-1.0.0.1846/_build/sub/../../libcfa/src/parseconfig.cfa: In function ‘_X12_constructorFv_S13Parse_FailurePcPc__1’:
23:30:59 /var/lib/jenkins/workspace/Cforall_Distribute_Ref@tmp/cfa-cc-1.0.0.1846/_build/sub/../../libcfa/src/stdlib.hfa:154:97: warning: ‘_X4_srcS6S_fill_Y12__T_generic___1._X1cc_1’ is used uninitialized in this function [-Wuninitialized]
23:30:59   154 |  struct S_fill   { char tag; char c; size_t size; T * at; char t[50]; };
23:30:59       |                                                               ~~~~~~~~~~                        ^       
23:30:59 /var/lib/jenkins/workspace/Cforall_Distribute_Ref@tmp/cfa-cc-1.0.0.1846/_build/sub/../../libcfa/src/stdlib.hfa:154:100: warning: ‘_X4_srcS6S_fill_Y12__T_generic___1._X4sizem_1’ is used uninitialized in this function [-Wuninitialized]
23:30:59   154 |  struct S_fill   { char tag; char c; size_t size; T * at; char t[50]; };
23:30:59       |                                                                  ~~~~~~~                           ^          
23:30:59 /var/lib/jenkins/workspace/Cforall_Distribute_Ref@tmp/cfa-cc-1.0.0.1846/_build/sub/../../libcfa/src/stdlib.hfa:154:130: warning: ‘_X4_srcS6S_fill_Y12__T_generic___1._X2atPY12__T_generic__1’ is used uninitialized in this function [-Wuninitialized]
23:30:59   154 |  struct S_fill   { char tag; char c; size_t size; T * at; char t[50]; };
23:30:59       |                                                                                                                                  ^                       
23:30:59 /var/lib/jenkins/workspace/Cforall_Distribute_Ref@tmp/cfa-cc-1.0.0.1846/_build/sub/../../libcfa/src/parseconfig.cfa: In function ‘_X12_constructorFv_S18Validation_FailurePcPc__1’:
23:30:59 /var/lib/jenkins/workspace/Cforall_Distribute_Ref@tmp/cfa-cc-1.0.0.1846/_build/sub/../../libcfa/src/stdlib.hfa:154:97: warning: ‘_X4_srcS6S_fill_Y12__T_generic___1._X1cc_1’ is used uninitialized in this function [-Wuninitialized]
23:30:59   154 |  struct S_fill   { char tag; char c; size_t size; T * at; char t[50]; };
23:30:59       |                                                               ~~~~~~~~~~                        ^       
23:30:59 /var/lib/jenkins/workspace/Cforall_Distribute_Ref@tmp/cfa-cc-1.0.0.1846/_build/sub/../../libcfa/src/stdlib.hfa:154:100: warning: ‘_X4_srcS6S_fill_Y12__T_generic___1._X4sizem_1’ is used uninitialized in this function [-Wuninitialized]
23:30:59   154 |  struct S_fill   { char tag; char c; size_t size; T * at; char t[50]; };
23:30:59       |                                                                  ~~~~~~~                           ^          
23:30:59 /var/lib/jenkins/workspace/Cforall_Distribute_Ref@tmp/cfa-cc-1.0.0.1846/_build/sub/../../libcfa/src/stdlib.hfa:154:130: warning: ‘_X4_srcS6S_fill_Y12__T_generic___1._X2atPY12__T_generic__1’ is used uninitialized in this function [-Wuninitialized]
23:30:59   154 |  struct S_fill   { char tag; char c; size_t size; T * at; char t[50]; };
23:30:59       |                                                                                                                                  ^                       
23:30:59 /var/lib/jenkins/workspace/Cforall_Distribute_Ref@tmp/cfa-cc-1.0.0.1846/_build/sub/../../libcfa/src/parseconfig.cfa: In function ‘_X12_constructorFv_S7KVPairsm__1’:
23:30:59 /var/lib/jenkins/workspace/Cforall_Distribute_Ref@tmp/cfa-cc-1.0.0.1846/_build/sub/../../libcfa/src/stdlib.hfa:154:97: warning: ‘_X4_srcS6S_fill_Y12__T_generic___1._X1cc_1’ is used uninitialized in this function [-Wuninitialized]
23:30:59   154 |  struct S_fill   { char tag; char c; size_t size; T * at; char t[50]; };
23:30:59       |                                                               ~~~~~~~~~~                        ^       
23:30:59 /var/lib/jenkins/workspace/Cforall_Distribute_Ref@tmp/cfa-cc-1.0.0.1846/_build/sub/../../libcfa/src/stdlib.hfa:154:100: warning: ‘_X4_srcS6S_fill_Y12__T_generic___1._X4sizem_1’ is used uninitialized in this function [-Wuninitialized]
23:30:59   154 |  struct S_fill   { char tag; char c; size_t size; T * at; char t[50]; };
23:30:59       |                                                                  ~~~~~~~                           ^          
23:30:59 /var/lib/jenkins/workspace/Cforall_Distribute_Ref@tmp/cfa-cc-1.0.0.1846/_build/sub/../../libcfa/src/stdlib.hfa:154:130: warning: ‘_X4_srcS6S_fill_Y12__T_generic___1._X2atPY12__T_generic__1’ is used uninitialized in this function [-Wuninitialized]
23:30:59   154 |  struct S_fill   { char tag; char c; size_t size; T * at; char t[50]; };
23:30:59       |                                                                                                                                  ^                       
23:30:59 /var/lib/jenkins/workspace/Cforall_Distribute_Ref@tmp/cfa-cc-1.0.0.1846/_build/sub/../../libcfa/src/parseconfig.cfa: In function ‘_X11add_kv_pairFv_S7KVPairsPcPc__1’:
23:30:59 /var/lib/jenkins/workspace/Cforall_Distribute_Ref@tmp/cfa-cc-1.0.0.1846/_build/sub/../../libcfa/src/stdlib.hfa:154:97: warning: ‘_X4_srcS6S_fill_Y12__T_generic___1._X1cc_1’ may be used uninitialized in this function [-Wmaybe-uninitialized]
23:30:59   154 |  struct S_fill   { char tag; char c; size_t size; T * at; char t[50]; };
23:30:59       |                                                               ~~~~~~~~~~                        ^       
23:30:59 /var/lib/jenkins/workspace/Cforall_Distribute_Ref@tmp/cfa-cc-1.0.0.1846/_build/sub/../../libcfa/src/stdlib.hfa:154:100: warning: ‘_X4_srcS6S_fill_Y12__T_generic___1._X4sizem_1’ may be used uninitialized in this function [-Wmaybe-uninitialized]
23:30:59   154 |  struct S_fill   { char tag; char c; size_t size; T * at; char t[50]; };
23:30:59       |                                                                  ~~~~~~~                           ^          
23:30:59 /var/lib/jenkins/workspace/Cforall_Distribute_Ref@tmp/cfa-cc-1.0.0.1846/_build/sub/../../libcfa/src/stdlib.hfa:154:130: warning: ‘_X4_srcS6S_fill_Y12__T_generic___1._X2atPY12__T_generic__1’ may be used uninitialized in this function [-Wmaybe-uninitialized]
23:30:59   154 |  struct S_fill   { char tag; char c; size_t size; T * at; char t[50]; };
23:30:59       |                                                                                                                                  ^                       
23:30:59 /var/lib/jenkins/workspace/Cforall_Distribute_Ref@tmp/cfa-cc-1.0.0.1846/_build/sub/../../libcfa/src/stdlib.hfa:154:97: warning: ‘_X4_srcS6S_fill_Y12__T_generic___1._X1cc_1’ may be used uninitialized in this function [-Wmaybe-uninitialized]
23:30:59   154 |  struct S_fill   { char tag; char c; size_t size; T * at; char t[50]; };
23:30:59       |                                                               ~~~~~~~~~~                        ^       
23:30:59 /var/lib/jenkins/workspace/Cforall_Distribute_Ref@tmp/cfa-cc-1.0.0.1846/_build/sub/../../libcfa/src/stdlib.hfa:154:100: warning: ‘_X4_srcS6S_fill_Y12__T_generic___1._X4sizem_1’ may be used uninitialized in this function [-Wmaybe-uninitialized]
23:30:59   154 |  struct S_fill   { char tag; char c; size_t size; T * at; char t[50]; };
23:30:59       |                                                                  ~~~~~~~                           ^          
23:30:59 /var/lib/jenkins/workspace/Cforall_Distribute_Ref@tmp/cfa-cc-1.0.0.1846/_build/sub/../../libcfa/src/stdlib.hfa:154:130: warning: ‘_X4_srcS6S_fill_Y12__T_generic___1._X2atPY12__T_generic__1’ may be used uninitialized in this function [-Wmaybe-uninitialized]
23:30:59   154 |  struct S_fill   { char tag; char c; size_t size; T * at; char t[50]; };
23:30:59       |                                                                                                                                  ^                       
23:30:59   CPPAS    concurrency/CtxSwitch-x64.lo
23:31:00   CC       concurrency/invoke.lo
23:31:00   CFA      concurrency/io.lo
23:31:00   CFA      concurrency/preemption.lo
23:31:00   CFA      concurrency/ready_queue.lo
23:31:00   CFA      concurrency/stats.lo
23:31:01   CFA      bits/weakso_locks.lo
23:31:02   CFA      containers/maybe.lo
23:31:02   CFA      containers/pair.lo
23:31:03   CFA      containers/result.lo
23:31:03   CFA      containers/string.lo
23:31:04   CFA      containers/string_res.lo
23:31:04   CFA      containers/vector.lo
23:31:06   CFA      device/cpu.lo
23:31:07   CFA      concurrency/alarm.lo
23:31:09 /var/lib/jenkins/workspace/Cforall_Distribute_Ref@tmp/cfa-cc-1.0.0.1846/_build/sub/../../libcfa/src/concurrency/ready_queue.cfa: In function ‘_X16ready_queue_growFv_PS7cluster__1’:
23:31:09 /var/lib/jenkins/workspace/Cforall_Distribute_Ref@tmp/cfa-cc-1.0.0.1846/_build/sub/../../libcfa/src/stdlib.hfa:154:97: warning: ‘_X4_srcS6S_fill_Y12__T_generic___1._X1cc_1’ is used uninitialized in this function [-Wuninitialized]
23:31:09   154 |  struct S_fill   { char tag; char c; size_t size; T * at; char t[50]; };
23:31:09       |                                                               ~~~~~~~~~~                        ^       
23:31:09 /var/lib/jenkins/workspace/Cforall_Distribute_Ref@tmp/cfa-cc-1.0.0.1846/_build/sub/../../libcfa/src/stdlib.hfa:154:100: warning: ‘_X4_srcS6S_fill_Y12__T_generic___1._X4sizem_1’ is used uninitialized in this function [-Wuninitialized]
23:31:09   154 |  struct S_fill   { char tag; char c; size_t size; T * at; char t[50]; };
23:31:09       |                                                                  ~~~~~~~                           ^          
23:31:09 /var/lib/jenkins/workspace/Cforall_Distribute_Ref@tmp/cfa-cc-1.0.0.1846/_build/sub/../../libcfa/src/stdlib.hfa:154:130: warning: ‘_X4_srcS6S_fill_Y12__T_generic___1._X2atPY12__T_generic__1’ is used uninitialized in this function [-Wuninitialized]
23:31:09   154 |  struct S_fill   { char tag; char c; size_t size; T * at; char t[50]; };
23:31:09       |                                                                                                                                  ^                       
23:31:09   CFA      concurrency/coroutine.lo
23:31:10   CFA      concurrency/exception.lo
23:31:10   CFA      concurrency/kernel.lo
23:31:11   CFA      concurrency/locks.lo
23:31:11   CFA      concurrency/monitor.lo
23:31:11   CFA      concurrency/mutex.lo
23:31:12   CFA      concurrency/thread.lo
23:31:13   CFA      concurrency/clib/cfathread.lo
23:31:13   CFA      concurrency/io/setup.lo
23:31:19   CFA      concurrency/io/call.lo
23:31:19   CFA      concurrency/kernel/startup.lo
23:31:20   CCLD     libcfa.la
23:31:25 /usr/include/x86_64-linux-gnu/sys/epoll.h: In function ‘_X12_constructorFv_S11epoll_event_autogen___1’:
23:31:25 /usr/include/x86_64-linux-gnu/sys/epoll.h:86:62: warning: taking address of packed member of ‘struct epoll_event’ may result in an unaligned pointer value [-Waddress-of-packed-member]
23:31:25    86 |   epoll_data_t data; /* User data variable */
23:31:25       |                                                              ^                                
23:31:25 /usr/include/x86_64-linux-gnu/sys/epoll.h: In function ‘_X12_constructorFv_S11epoll_eventS11epoll_event_autogen___1’:
23:31:25 /usr/include/x86_64-linux-gnu/sys/epoll.h:86:75: warning: taking address of packed member of ‘struct epoll_event’ may result in an unaligned pointer value [-Waddress-of-packed-member]
23:31:25    86 |   epoll_data_t data; /* User data variable */
23:31:25       |                                                                           ^                                
23:31:25 /usr/include/x86_64-linux-gnu/sys/epoll.h: In function ‘_X11_destructorFv_S11epoll_event_autogen___1’:
23:31:25 /usr/include/x86_64-linux-gnu/sys/epoll.h:86:61: warning: taking address of packed member of ‘struct epoll_event’ may result in an unaligned pointer value [-Waddress-of-packed-member]
23:31:25    86 |   epoll_data_t data; /* User data variable */
23:31:25       |                                                             ^                                
23:31:25 /usr/include/x86_64-linux-gnu/sys/epoll.h: In function ‘_X16_operator_assignFS11epoll_event_S11epoll_eventS11epoll_event_autogen___1’:
23:31:25 /usr/include/x86_64-linux-gnu/sys/epoll.h:86:123: warning: taking address of packed member of ‘struct epoll_event’ may result in an unaligned pointer value [-Waddress-of-packed-member]
23:31:25    86 |   epoll_data_t data; /* User data variable */
23:31:25       |                                                                                                                           ^                                
23:31:25 /usr/include/x86_64-linux-gnu/sys/epoll.h: In function ‘_X12_constructorFv_S11epoll_eventj_autogen___1’:
23:31:25 /usr/include/x86_64-linux-gnu/sys/epoll.h:86:62: warning: taking address of packed member of ‘struct epoll_event’ may result in an unaligned pointer value [-Waddress-of-packed-member]
23:31:25    86 |   epoll_data_t data; /* User data variable */
23:31:25       |                                                              ^                                
23:31:25 /usr/include/x86_64-linux-gnu/sys/epoll.h: In function ‘_X12_constructorFv_S11epoll_eventjU10epoll_data_autogen___1’:
23:31:25 /usr/include/x86_64-linux-gnu/sys/epoll.h:86:75: warning: taking address of packed member of ‘struct epoll_event’ may result in an unaligned pointer value [-Waddress-of-packed-member]
23:31:25    86 |   epoll_data_t data; /* User data variable */
23:31:25       |                                                                           ^                                
23:31:25 /var/lib/jenkins/workspace/Cforall_Distribute_Ref@tmp/cfa-cc-1.0.0.1846/_build/sub/../../libcfa/src/concurrency/io/setup.cfa: In function ‘_X16__io_uring_setupFv_S11$io_contextKS17io_context_paramsi__1.isra.0’:
23:31:25 /var/lib/jenkins/workspace/Cforall_Distribute_Ref@tmp/cfa-cc-1.0.0.1846/_build/sub/../../libcfa/src/stdlib.hfa:154:97: warning: ‘_X4_srcS6S_fill_Y12__T_generic___1._X1cc_1’ may be used uninitialized in this function [-Wmaybe-uninitialized]
23:31:25   154 |  struct S_fill   { char tag; char c; size_t size; T * at; char t[50]; };
23:31:25       |                                                               ~~~~~~~~~~                        ^       
23:31:25 /var/lib/jenkins/workspace/Cforall_Distribute_Ref@tmp/cfa-cc-1.0.0.1846/_build/sub/../../libcfa/src/stdlib.hfa:154:100: warning: ‘_X4_srcS6S_fill_Y12__T_generic___1._X4sizem_1’ may be used uninitialized in this function [-Wmaybe-uninitialized]
23:31:25   154 |  struct S_fill   { char tag; char c; size_t size; T * at; char t[50]; };
23:31:25       |                                                                  ~~~~~~~                           ^          
23:31:25 /var/lib/jenkins/workspace/Cforall_Distribute_Ref@tmp/cfa-cc-1.0.0.1846/_build/sub/../../libcfa/src/stdlib.hfa:154:130: warning: ‘_X4_srcS6S_fill_Y12__T_generic___1._X2atPY12__T_generic__1’ may be used uninitialized in this function [-Wmaybe-uninitialized]
23:31:25   154 |  struct S_fill   { char tag; char c; size_t size; T * at; char t[50]; };
23:31:25       |                                                                                                                                  ^                       
23:31:25 /var/lib/jenkins/workspace/Cforall_Distribute_Ref@tmp/cfa-cc-1.0.0.1846/_build/sub/../../libcfa/src/concurrency/io/setup.cfa: In function ‘_X14__cfa_io_startFv_PS9processor__1’:
23:31:25 /var/lib/jenkins/workspace/Cforall_Distribute_Ref@tmp/cfa-cc-1.0.0.1846/_build/sub/../../libcfa/src/stdlib.hfa:154:97: warning: ‘_X4_srcS6S_fill_Y12__T_generic___1._X1cc_1’ is used uninitialized in this function [-Wuninitialized]
23:31:25   154 |  struct S_fill   { char tag; char c; size_t size; T * at; char t[50]; };
23:31:25       |                                                               ~~~~~~~~~~                        ^       
23:31:25 /var/lib/jenkins/workspace/Cforall_Distribute_Ref@tmp/cfa-cc-1.0.0.1846/_build/sub/../../libcfa/src/stdlib.hfa:154:100: warning: ‘_X4_srcS6S_fill_Y12__T_generic___1._X4sizem_1’ is used uninitialized in this function [-Wuninitialized]
23:31:25   154 |  struct S_fill   { char tag; char c; size_t size; T * at; char t[50]; };
23:31:25       |                                                                  ~~~~~~~                           ^          
23:31:25 /var/lib/jenkins/workspace/Cforall_Distribute_Ref@tmp/cfa-cc-1.0.0.1846/_build/sub/../../libcfa/src/stdlib.hfa:154:130: warning: ‘_X4_srcS6S_fill_Y12__T_generic___1._X2atPY12__T_generic__1’ is used uninitialized in this function [-Wuninitialized]
23:31:25   154 |  struct S_fill   { char tag; char c; size_t size; T * at; char t[50]; };
23:31:25       |                                                                                                                                  ^                       
23:31:27 /usr/include/x86_64-linux-gnu/bits/socket.h: In function ‘_X16_operator_assignFS7cmsghdr_S7cmsghdrS7cmsghdr_autogen___1’:
23:31:27 /usr/include/x86_64-linux-gnu/bits/socket.h:285:44: note: the ABI of passing struct with a flexible array member has changed in GCC 4.4
23:31:27   285 |     __extension__ unsigned char __cmsg_data __flexarr; /* Ancillary data.  */
23:31:27       |                                            ^~~~~~~
23:31:27 /var/lib/jenkins/workspace/Cforall_Distribute_Ref@tmp/cfa-cc-1.0.0.1846/_build/sub/../../libcfa/src/concurrency/clib/cfathread.cfa: In function ‘cfathread_cluster_add_worker’:
23:31:27 /var/lib/jenkins/workspace/Cforall_Distribute_Ref@tmp/cfa-cc-1.0.0.1846/_build/sub/../../libcfa/src/stdlib.hfa:154:97: warning: ‘_X4_srcS6S_fill_Y12__T_generic___1._X1cc_1’ may be used uninitialized in this function [-Wmaybe-uninitialized]
23:31:27   154 |  struct S_fill   { char tag; char c; size_t size; T * at; char t[50]; };
23:31:27       |                                                               ~~~~~~~~~~                        ^       
23:31:27 /var/lib/jenkins/workspace/Cforall_Distribute_Ref@tmp/cfa-cc-1.0.0.1846/_build/sub/../../libcfa/src/stdlib.hfa:154:100: warning: ‘_X4_srcS6S_fill_Y12__T_generic___1._X4sizem_1’ may be used uninitialized in this function [-Wmaybe-uninitialized]
23:31:27   154 |  struct S_fill   { char tag; char c; size_t size; T * at; char t[50]; };
23:31:27       |                                                                  ~~~~~~~                           ^          
23:31:27 /var/lib/jenkins/workspace/Cforall_Distribute_Ref@tmp/cfa-cc-1.0.0.1846/_build/sub/../../libcfa/src/stdlib.hfa:154:130: warning: ‘_X4_srcS6S_fill_Y12__T_generic___1._X2atPY12__T_generic__1’ may be used uninitialized in this function [-Wmaybe-uninitialized]
23:31:27   154 |  struct S_fill   { char tag; char c; size_t size; T * at; char t[50]; };
23:31:27       |                                                                                                                                  ^                       
23:31:27 /usr/include/x86_64-linux-gnu/bits/socket.h: In function ‘_X16_operator_assignFS7cmsghdr_S7cmsghdrS7cmsghdr_autogen___1’:
23:31:27 /usr/include/x86_64-linux-gnu/bits/socket.h:285:44: note: the ABI of passing struct with a flexible array member has changed in GCC 4.4
23:31:27   285 |     __extension__ unsigned char __cmsg_data __flexarr; /* Ancillary data.  */
23:31:27       |                                            ^~~~~~~
23:31:31   CCLD     libcfathread.la
23:31:31 make[4]: Leaving directory '/var/lib/jenkins/workspace/Cforall_Distribute_Ref@tmp/cfa-cc-1.0.0.1846/_build/sub/libcfa/x64-nodebug/src'
23:31:31 make[4]: Entering directory '/var/lib/jenkins/workspace/Cforall_Distribute_Ref@tmp/cfa-cc-1.0.0.1846/_build/sub/libcfa/x64-nodebug'
23:31:31 make[4]: Nothing to be done for 'all-am'.
23:31:31 make[4]: Leaving directory '/var/lib/jenkins/workspace/Cforall_Distribute_Ref@tmp/cfa-cc-1.0.0.1846/_build/sub/libcfa/x64-nodebug'
23:31:31 make[3]: Leaving directory '/var/lib/jenkins/workspace/Cforall_Distribute_Ref@tmp/cfa-cc-1.0.0.1846/_build/sub/libcfa/x64-nodebug'
23:31:31 make[2]: Leaving directory '/var/lib/jenkins/workspace/Cforall_Distribute_Ref@tmp/cfa-cc-1.0.0.1846/_build/sub'
23:31:31 make[1]: Leaving directory '/var/lib/jenkins/workspace/Cforall_Distribute_Ref@tmp/cfa-cc-1.0.0.1846/_build/sub'
23:31:31 make[1]: Entering directory '/var/lib/jenkins/workspace/Cforall_Distribute_Ref@tmp/cfa-cc-1.0.0.1846/_build/sub'
23:31:31 Making dvi in driver
23:31:31 make[2]: Entering directory '/var/lib/jenkins/workspace/Cforall_Distribute_Ref@tmp/cfa-cc-1.0.0.1846/_build/sub/driver'
23:31:31 make[2]: Nothing to be done for 'dvi'.
23:31:31 make[2]: Leaving directory '/var/lib/jenkins/workspace/Cforall_Distribute_Ref@tmp/cfa-cc-1.0.0.1846/_build/sub/driver'
23:31:31 Making dvi in src
23:31:31 make[2]: Entering directory '/var/lib/jenkins/workspace/Cforall_Distribute_Ref@tmp/cfa-cc-1.0.0.1846/_build/sub/src'
23:31:31 make[2]: Nothing to be done for 'dvi'.
23:31:31 make[2]: Leaving directory '/var/lib/jenkins/workspace/Cforall_Distribute_Ref@tmp/cfa-cc-1.0.0.1846/_build/sub/src'
23:31:31 Making dvi in .
23:31:31 make[2]: Entering directory '/var/lib/jenkins/workspace/Cforall_Distribute_Ref@tmp/cfa-cc-1.0.0.1846/_build/sub'
23:31:31 make[2]: Nothing to be done for 'dvi-am'.
23:31:31 make[2]: Leaving directory '/var/lib/jenkins/workspace/Cforall_Distribute_Ref@tmp/cfa-cc-1.0.0.1846/_build/sub'
23:31:31 Making dvi in libcfa/x64-debug
23:31:31 make[2]: Entering directory '/var/lib/jenkins/workspace/Cforall_Distribute_Ref@tmp/cfa-cc-1.0.0.1846/_build/sub/libcfa/x64-debug'
23:31:31 Making dvi in prelude
23:31:31 make[3]: Entering directory '/var/lib/jenkins/workspace/Cforall_Distribute_Ref@tmp/cfa-cc-1.0.0.1846/_build/sub/libcfa/x64-debug/prelude'
23:31:31 make[3]: Nothing to be done for 'dvi'.
23:31:31 make[3]: Leaving directory '/var/lib/jenkins/workspace/Cforall_Distribute_Ref@tmp/cfa-cc-1.0.0.1846/_build/sub/libcfa/x64-debug/prelude'
23:31:31 Making dvi in src
23:31:31 make[3]: Entering directory '/var/lib/jenkins/workspace/Cforall_Distribute_Ref@tmp/cfa-cc-1.0.0.1846/_build/sub/libcfa/x64-debug/src'
23:31:31 make[3]: Nothing to be done for 'dvi'.
23:31:31 make[3]: Leaving directory '/var/lib/jenkins/workspace/Cforall_Distribute_Ref@tmp/cfa-cc-1.0.0.1846/_build/sub/libcfa/x64-debug/src'
23:31:31 make[3]: Entering directory '/var/lib/jenkins/workspace/Cforall_Distribute_Ref@tmp/cfa-cc-1.0.0.1846/_build/sub/libcfa/x64-debug'
23:31:31 make[3]: Nothing to be done for 'dvi-am'.
23:31:31 make[3]: Leaving directory '/var/lib/jenkins/workspace/Cforall_Distribute_Ref@tmp/cfa-cc-1.0.0.1846/_build/sub/libcfa/x64-debug'
23:31:31 make[2]: Leaving directory '/var/lib/jenkins/workspace/Cforall_Distribute_Ref@tmp/cfa-cc-1.0.0.1846/_build/sub/libcfa/x64-debug'
23:31:31 Making dvi in libcfa/x64-nodebug
23:31:31 make[2]: Entering directory '/var/lib/jenkins/workspace/Cforall_Distribute_Ref@tmp/cfa-cc-1.0.0.1846/_build/sub/libcfa/x64-nodebug'
23:31:31 Making dvi in prelude
23:31:31 make[3]: Entering directory '/var/lib/jenkins/workspace/Cforall_Distribute_Ref@tmp/cfa-cc-1.0.0.1846/_build/sub/libcfa/x64-nodebug/prelude'
23:31:31 make[3]: Nothing to be done for 'dvi'.
23:31:31 make[3]: Leaving directory '/var/lib/jenkins/workspace/Cforall_Distribute_Ref@tmp/cfa-cc-1.0.0.1846/_build/sub/libcfa/x64-nodebug/prelude'
23:31:31 Making dvi in src
23:31:31 make[3]: Entering directory '/var/lib/jenkins/workspace/Cforall_Distribute_Ref@tmp/cfa-cc-1.0.0.1846/_build/sub/libcfa/x64-nodebug/src'
23:31:31 make[3]: Nothing to be done for 'dvi'.
23:31:31 make[3]: Leaving directory '/var/lib/jenkins/workspace/Cforall_Distribute_Ref@tmp/cfa-cc-1.0.0.1846/_build/sub/libcfa/x64-nodebug/src'
23:31:31 make[3]: Entering directory '/var/lib/jenkins/workspace/Cforall_Distribute_Ref@tmp/cfa-cc-1.0.0.1846/_build/sub/libcfa/x64-nodebug'
23:31:31 make[3]: Nothing to be done for 'dvi-am'.
23:31:31 make[3]: Leaving directory '/var/lib/jenkins/workspace/Cforall_Distribute_Ref@tmp/cfa-cc-1.0.0.1846/_build/sub/libcfa/x64-nodebug'
23:31:31 make[2]: Leaving directory '/var/lib/jenkins/workspace/Cforall_Distribute_Ref@tmp/cfa-cc-1.0.0.1846/_build/sub/libcfa/x64-nodebug'
23:31:31 make[1]: Leaving directory '/var/lib/jenkins/workspace/Cforall_Distribute_Ref@tmp/cfa-cc-1.0.0.1846/_build/sub'
23:31:31 make[1]: Entering directory '/var/lib/jenkins/workspace/Cforall_Distribute_Ref@tmp/cfa-cc-1.0.0.1846/_build/sub'
23:31:31 Making check in driver
23:31:31 make[2]: Entering directory '/var/lib/jenkins/workspace/Cforall_Distribute_Ref@tmp/cfa-cc-1.0.0.1846/_build/sub/driver'
23:31:31 make[2]: Nothing to be done for 'check'.
23:31:31 make[2]: Leaving directory '/var/lib/jenkins/workspace/Cforall_Distribute_Ref@tmp/cfa-cc-1.0.0.1846/_build/sub/driver'
23:31:31 Making check in src
23:31:31 make[2]: Entering directory '/var/lib/jenkins/workspace/Cforall_Distribute_Ref@tmp/cfa-cc-1.0.0.1846/_build/sub/src'
23:31:31 make  check-am
23:31:31 make[3]: Entering directory '/var/lib/jenkins/workspace/Cforall_Distribute_Ref@tmp/cfa-cc-1.0.0.1846/_build/sub/src'
23:31:31 make[3]: Nothing to be done for 'check-am'.
23:31:31 make[3]: Leaving directory '/var/lib/jenkins/workspace/Cforall_Distribute_Ref@tmp/cfa-cc-1.0.0.1846/_build/sub/src'
23:31:31 make[2]: Leaving directory '/var/lib/jenkins/workspace/Cforall_Distribute_Ref@tmp/cfa-cc-1.0.0.1846/_build/sub/src'
23:31:31 Making check in .
23:31:31 make[2]: Entering directory '/var/lib/jenkins/workspace/Cforall_Distribute_Ref@tmp/cfa-cc-1.0.0.1846/_build/sub'
23:31:31 make[2]: Leaving directory '/var/lib/jenkins/workspace/Cforall_Distribute_Ref@tmp/cfa-cc-1.0.0.1846/_build/sub'
23:31:31 Making check in libcfa/x64-debug
23:31:31 make[2]: Entering directory '/var/lib/jenkins/workspace/Cforall_Distribute_Ref@tmp/cfa-cc-1.0.0.1846/_build/sub/libcfa/x64-debug'
23:31:31 Making check in prelude
23:31:31 make[3]: Entering directory '/var/lib/jenkins/workspace/Cforall_Distribute_Ref@tmp/cfa-cc-1.0.0.1846/_build/sub/libcfa/x64-debug/prelude'
23:31:31 make[3]: Leaving directory '/var/lib/jenkins/workspace/Cforall_Distribute_Ref@tmp/cfa-cc-1.0.0.1846/_build/sub/libcfa/x64-debug/prelude'
23:31:31 Making check in src
23:31:31 make[3]: Entering directory '/var/lib/jenkins/workspace/Cforall_Distribute_Ref@tmp/cfa-cc-1.0.0.1846/_build/sub/libcfa/x64-debug/src'
23:31:32 make[3]: Nothing to be done for 'check'.
23:31:32 make[3]: Leaving directory '/var/lib/jenkins/workspace/Cforall_Distribute_Ref@tmp/cfa-cc-1.0.0.1846/_build/sub/libcfa/x64-debug/src'
23:31:32 make[3]: Entering directory '/var/lib/jenkins/workspace/Cforall_Distribute_Ref@tmp/cfa-cc-1.0.0.1846/_build/sub/libcfa/x64-debug'
23:31:32 make[3]: Nothing to be done for 'check-am'.
23:31:32 make[3]: Leaving directory '/var/lib/jenkins/workspace/Cforall_Distribute_Ref@tmp/cfa-cc-1.0.0.1846/_build/sub/libcfa/x64-debug'
23:31:32 make[2]: Leaving directory '/var/lib/jenkins/workspace/Cforall_Distribute_Ref@tmp/cfa-cc-1.0.0.1846/_build/sub/libcfa/x64-debug'
23:31:32 Making check in libcfa/x64-nodebug
23:31:32 make[2]: Entering directory '/var/lib/jenkins/workspace/Cforall_Distribute_Ref@tmp/cfa-cc-1.0.0.1846/_build/sub/libcfa/x64-nodebug'
23:31:32 Making check in prelude
23:31:32 make[3]: Entering directory '/var/lib/jenkins/workspace/Cforall_Distribute_Ref@tmp/cfa-cc-1.0.0.1846/_build/sub/libcfa/x64-nodebug/prelude'
23:31:32 make[3]: Leaving directory '/var/lib/jenkins/workspace/Cforall_Distribute_Ref@tmp/cfa-cc-1.0.0.1846/_build/sub/libcfa/x64-nodebug/prelude'
23:31:32 Making check in src
23:31:32 make[3]: Entering directory '/var/lib/jenkins/workspace/Cforall_Distribute_Ref@tmp/cfa-cc-1.0.0.1846/_build/sub/libcfa/x64-nodebug/src'
23:31:32 make[3]: Nothing to be done for 'check'.
23:31:32 make[3]: Leaving directory '/var/lib/jenkins/workspace/Cforall_Distribute_Ref@tmp/cfa-cc-1.0.0.1846/_build/sub/libcfa/x64-nodebug/src'
23:31:32 make[3]: Entering directory '/var/lib/jenkins/workspace/Cforall_Distribute_Ref@tmp/cfa-cc-1.0.0.1846/_build/sub/libcfa/x64-nodebug'
23:31:32 make[3]: Nothing to be done for 'check-am'.
23:31:32 make[3]: Leaving directory '/var/lib/jenkins/workspace/Cforall_Distribute_Ref@tmp/cfa-cc-1.0.0.1846/_build/sub/libcfa/x64-nodebug'
23:31:32 make[2]: Leaving directory '/var/lib/jenkins/workspace/Cforall_Distribute_Ref@tmp/cfa-cc-1.0.0.1846/_build/sub/libcfa/x64-nodebug'
23:31:32 make -C tests all-tests installed=no debug=yes
23:31:32 make[2]: Entering directory '/var/lib/jenkins/workspace/Cforall_Distribute_Ref@tmp/cfa-cc-1.0.0.1846/_build/sub/tests'
23:31:32 Running 222 tests on 7 cores (Default AST (new):x64 - debug)
23:33:09        	array-container/language-dim-mismatch      PASSED     C 0:00.105 - R n/a
23:33:09        	array                                      PASSED     C 0:00.453 - R 0:00.001
23:33:09        	builtins/sync                              PASSED     C 0:00.606 - R 0:00.001
23:33:09        	cast                                       PASSED     C 0:00.477 - R 0:00.001
23:33:09        	castError                                  PASSED     C 0:00.246 - R n/a
23:33:09        	array-container/array-basic                PASSED     C 0:01.303 - R 0:00.017
23:33:09        	avl_test                                   PASSED     C 0:01.940 - R 0:00.016
23:33:09        	alloc-ERROR                                PASSED     C 0:03.519 - R n/a
23:33:09        	alloc                                      PASSED     C 0:07.111 - R 0:00.016
23:33:09        	collections/multi_list                     PASSED     C 0:06.348 - R 0:00.016
23:33:09        	alloc2                                     PASSED     C 0:08.560 - R 0:00.016
23:33:09        	collections/vector-err-pass-perm-it-byval  PASSED     C 0:01.199 - R n/a
23:33:09        	collections/vector-demo                    PASSED     C 0:02.653 - R 0:00.016
23:33:09        	collections/stack                          PASSED     C 0:06.900 - R 0:00.016
23:33:09        	collections/vector-err-retn-perm-it-byval  PASSED     C 0:00.977 - R n/a
23:33:09        	collections/queue                          PASSED     C 0:09.894 - R 0:00.008
23:33:09        	collections/sequence                       PASSED     C 0:10.045 - R 0:00.008
23:33:09        	collections/atomic_mpsc                    PASSED     C 0:08.340 - R 0:03.622
23:33:09        	concurrent/clib                            PASSED     C 0:02.888 - R 0:00.165
23:33:09        	concurrent/clib_tls                        PASSED     C 0:02.759 - R 0:00.164
23:33:09        	collections/string-api-coverage            PASSED     C 0:07.351 - R 0:00.016
23:33:09        	complex                                    PASSED     C 0:04.789 - R 0:00.016
23:33:09        	concurrent/cluster                         PASSED     C 0:06.142 - R 0:00.115
23:33:09        	concurrent/coroutineYield                  PASSED     C 0:08.587 - R 0:00.115
23:33:09        	concurrent/examples/datingService          PASSED     C 0:08.427 - R 0:00.114
23:33:09        	concurrent/examples/gortn                  PASSED     C 0:08.478 - R 0:00.064
23:33:09        	concurrent/examples/matrixSum              PASSED     C 0:08.143 - R 0:00.114
23:33:09        	concurrent/examples/quickSort              PASSED     C 0:08.654 - R 0:00.064
23:33:09        	concurrent/futures/abandon                 PASSED     C 0:06.614 - R 0:00.165
23:33:09        	concurrent/keywordErrors                   PASSED     C 0:00.133 - R n/a
23:33:09        	concurrent/examples/boundedBufferINT       PASSED     C 0:08.583 - R 0:05.826
23:33:09        	concurrent/examples/boundedBufferEXT       PASSED     C 0:08.698 - R 0:06.577
23:33:09        	concurrent/futures/basic                   PASSED     C 0:06.300 - R 0:00.164
23:33:09        	concurrent/futures/typed                   PASSED     C 0:06.588 - R 0:00.165
23:33:09        	concurrent/futures/multi                   PASSED     C 0:07.458 - R 0:00.165
23:33:09        	concurrent/join                            PASSED     C 0:08.587 - R 0:00.115
23:33:09        	concurrent/park/contention                 PASSED     C 0:06.401 - R 0:00.215
23:33:09        	concurrent/mutexstmt/monitors              PASSED     C 0:07.020 - R 0:02.871
23:33:09        	concurrent/park/force_preempt              PASSED     C 0:09.331 - R 0:00.378
23:33:09        	concurrent/park/start_parked               PASSED     C 0:06.529 - R 0:00.178
23:33:09        	concurrent/mutexstmt/locks                 PASSED     C 0:08.403 - R 0:06.168
23:33:09        	concurrent/semaphore                       PASSED     C 0:09.809 - R 0:00.064
23:33:09        	concurrent/signal/wait                     PASSED     C 0:08.507 - R 0:00.214
23:33:09        	concurrent/signal/block                    PASSED     C 0:09.607 - R 0:01.467
23:33:09        	concurrent/signal/disjoint                 PASSED     C 0:08.759 - R 0:01.917
23:33:09        	concurrent/monitor                         PASSED     C 0:08.903 - R 0:19.823
23:33:09        	concurrent/preempt                         PASSED     C 0:06.553 - R 0:14.939
23:33:09        	concurrent/sleep                           PASSED     C 0:08.475 - R 0:01.216
23:33:09        	concurrent/multi-monitor                   PASSED     C 0:08.639 - R 0:21.752
23:33:09        	concurrent/suspend_then                    PASSED     C 0:08.548 - R 0:00.114
23:33:09        	concurrent/spinaphore                      PASSED     C 0:09.348 - R 0:00.415
23:33:09        	concurrent/thread                          PASSED     C 0:09.254 - R 0:00.115
23:33:09        	const-init                                 PASSED     C 0:00.676 - R 0:00.016
23:33:09        	concurrent/waitfor/barge                   PASSED     C 0:08.422 - R 0:00.265
23:33:09        	concurrent/waitfor/else                    PASSED     C 0:06.932 - R 0:00.115
23:33:09        	concurrent/waitfor/dtor                    PASSED     C 0:08.224 - R 0:01.218
23:33:09        	copyfile                                   PASSED     C 0:05.049 - R 0:00.016
23:33:09        	concurrent/waitfor/recurse                 PASSED     C 0:08.569 - R 0:00.966
23:33:09        	concurrent/waitfor/statment                PASSED     C 0:09.448 - R 0:00.114
23:33:09        	concurrent/waitfor/when                    PASSED     C 0:08.917 - R 0:00.215
23:33:09        	coroutine/devicedriver                     PASSED     C 0:05.774 - R 0:00.064
23:33:09        	coroutine/fibonacci                        PASSED     C 0:05.528 - R 0:00.064
23:33:09        	designations                               PASSED     C 0:00.623 - R 0:00.016
23:33:09        	coroutine/fmtLines                         PASSED     C 0:05.702 - R 0:00.115
23:33:09        	coroutine/pingpong                         PASSED     C 0:05.714 - R 0:00.064
23:33:09        	enum                                       PASSED     C 0:00.507 - R 0:00.016
23:33:09        	errors/declaration                         PASSED     C 0:00.059 - R n/a
23:33:09        	errors/scope                               PASSED     C 0:00.102 - R n/a
23:33:09        	errors/signature                           PASSED     C 0:00.066 - R n/a
23:33:09        	coroutine/prodcons                         PASSED     C 0:06.842 - R 0:00.114
23:33:09        	coroutine/raii                             PASSED     C 0:05.732 - R 0:00.064
23:33:09        	counter                                    PASSED     C 0:04.659 - R 0:00.016
23:33:09        	coroutine/runningTotal                     PASSED     C 0:05.661 - R 0:00.064
23:33:09        	exceptions/conditional                     PASSED     C 0:00.590 - R 0:00.016
23:33:09        	exceptions/data-except                     PASSED     C 0:00.581 - R 0:00.016
23:33:09        	exceptions/defaults                        PASSED     C 0:00.933 - R 0:00.016
23:33:09        	exceptions/finally                         PASSED     C 0:00.624 - R 0:00.016
23:33:09        	exceptions/finally-error                   PASSED     C 0:00.134 - R n/a
23:33:09        	exceptions/cancel/coroutine                PASSED     C 0:03.834 - R 0:00.065
23:33:09        	device/cpu                                 PASSED     C 0:06.804 - R 0:00.016
23:33:09        	exceptions/interact                        PASSED     C 0:00.718 - R 0:00.016
23:33:09        	div                                        PASSED     C 0:05.836 - R 0:00.016
23:33:09        	exceptions/polymorphic                     PASSED     C 0:00.824 - R 0:00.016
23:33:09        	exceptions/conditional-threads             PASSED     C 0:03.826 - R 0:00.065
23:33:09        	exceptions/resume                          PASSED     C 0:00.760 - R 0:00.016
23:33:09        	exceptions/terminate                       PASSED     C 0:00.793 - R 0:00.016
23:33:09        	exceptions/type-check                      PASSED     C 0:00.134 - R n/a
23:33:09        	exceptions/trash                           PASSED     C 0:00.630 - R 0:00.016
23:33:09        	exceptions/cancel/thread                   PASSED     C 0:06.102 - R 0:00.064
23:33:09        	exceptions/virtual-poly                    PASSED     C 0:00.690 - R 0:00.016
23:33:09        	exceptions/defaults-threads                PASSED     C 0:04.193 - R 0:00.064
23:33:09        	expression                                 PASSED     C 0:00.482 - R 0:00.001
23:33:09        	exceptions/virtual-cast                    PASSED     C 0:01.469 - R 0:00.016
23:33:09        	forall                                     PASSED     C 0:00.899 - R 0:00.001
23:33:09        	exceptions/finally-threads                 PASSED     C 0:03.844 - R 0:00.114
23:33:35        	exceptions/resume-threads                  PASSED     C 0:03.981 - R 0:00.064
23:33:35        	exceptions/terminate-threads               PASSED     C 0:04.113 - R 0:00.064
23:33:35        	genericUnion                               PASSED     C 0:00.578 - R 0:00.016
23:33:35        	global-monomorph                           PASSED     C 0:00.567 - R 0:00.016
23:33:35        	fallthrough                                PASSED     C 0:05.199 - R 0:00.016
23:33:35        	fstream_test                               PASSED     C 0:04.882 - R 0:00.016
23:33:35        	generator/fibonacci                        PASSED     C 0:04.657 - R 0:00.016
23:33:35        	generator/fmtLines                         PASSED     C 0:04.651 - R 0:00.016
23:33:35        	identFuncDeclarator                        PASSED     C 0:00.462 - R 0:00.001
23:33:35        	identParamDeclarator                       PASSED     C 0:00.516 - R 0:00.016
23:33:35        	generator/suspend_then                     PASSED     C 0:04.579 - R 0:00.016
23:33:35        	function-operator                          PASSED     C 0:06.103 - R 0:00.016
23:33:35        	include/vector-containers                  PASSED     C 0:02.443 - R 0:00.016
23:33:35        	hello                                      PASSED     C 0:04.660 - R 0:00.016
23:33:35        	ifwhileCtl                                 PASSED     C 0:04.709 - R 0:00.016
23:33:35        	identity                                   PASSED     C 0:05.005 - R 0:00.016
23:33:35        	init1-ERROR                                PASSED     C 0:00.242 - R n/a
23:33:35        	include/vector-sequence                    PASSED     C 0:00.999 - R 0:00.016
23:33:35        	init1                                      PASSED     C 0:00.597 - R 0:00.001
23:33:35        	include/stdincludes                        PASSED     C 0:05.364 - R 0:00.001
23:33:35        	include/vector-fstream                     PASSED     C 0:04.677 - R 0:00.016
23:33:35        	labelledExit                               PASSED     C 0:00.483 - R 0:00.001
23:33:35        	limits                                     PASSED     C 0:00.492 - R 0:00.001
23:33:35        	linking/exception-nothreads                PASSED     C 0:01.444 - R 0:00.016
23:33:35        	io/manipulatorsOutput4                     PASSED     C 0:07.546 - R 0:00.016
23:33:35        	io/io-acquire                              PASSED     C 0:09.370 - R 0:00.164
23:33:35        	linking/nostdlib                           PASSED     C 0:00.526 - R 0:00.016
23:33:35        	linking/exception-withthreads              PASSED     C 0:04.789 - R 0:00.064
23:33:35        	include/includes                           PASSED     C 0:16.023 - R 0:00.001
23:33:35        	io/many_read                               PASSED     C 0:10.321 - R 0:00.117
23:33:35        	linkonce                                   PASSED     C 0:00.595 - R 0:00.016
23:33:35        	io/io                                      PASSED     C 0:13.205 - R 0:00.016
23:33:35        	linking/io-acquire                         PASSED     C 0:05.923 - R 0:00.016
23:33:35        	heap                                       PASSED     C 0:06.886 - R 0:15.294
23:33:35        	linking/nothreads                          PASSED     C 0:05.821 - R 0:00.016
23:33:35        	linking/weakso_nothd                       PASSED     C 0:05.632 - R 0:00.016
23:33:35        	maybe                                      PASSED     C 0:00.739 - R 0:00.016
23:33:35        	nested-types                               PASSED     C 0:00.480 - R 0:00.001
23:33:35        	nested-types-ERR1                          PASSED     C 0:00.065 - R n/a
23:33:35        	nested-types-ERR2                          PASSED     C 0:00.072 - R n/a
23:33:35        	numericConstants                           PASSED     C 0:00.461 - R 0:00.001
23:33:35        	literals                                   PASSED     C 0:04.989 - R 0:00.016
23:33:35        	operators                                  PASSED     C 0:00.537 - R 0:00.016
23:33:35        	poly-d-cycle                               PASSED     C 0:00.587 - R 0:00.016
23:33:35        	poly-o-cycle                               PASSED     C 0:00.538 - R 0:00.016
23:33:35        	linking/withthreads                        PASSED     C 0:08.352 - R 0:00.115
23:33:35        	poly-selection                             PASSED     C 0:00.525 - R 0:00.016
23:33:35        	loopctrl                                   PASSED     C 0:06.774 - R 0:00.016
23:33:35        	quasiKeyword                               PASSED     C 0:00.495 - R 0:00.001
23:33:35        	malloc                                     PASSED     C 0:06.022 - R 0:00.016
23:33:35        	raii/ctor-autogen                          PASSED     C 0:01.055 - R 0:00.016
23:33:35        	list/dlist-insert-remove                   PASSED     C 0:10.089 - R 0:00.016
23:33:35        	raii/ctor-autogen-ERR1                     PASSED     C 0:00.294 - R n/a
23:33:35        	minmax                                     PASSED     C 0:07.483 - R 0:00.016
23:33:35        	polymorphism                               PASSED     C 0:04.874 - R 0:00.016
23:33:35        	quotedKeyword                              PASSED     C 0:04.613 - R 0:00.016
23:33:35        	raii/boxed-types                           PASSED     C 0:04.804 - R 0:00.016
23:33:35        	raii/init_once                             PASSED     C 0:00.656 - R 0:00.016
23:33:35        	raii/memberCtors                           PASSED     C 0:00.594 - R 0:00.016
23:33:35        	raii/dtor-early-exit-ERR1                  PASSED     C 0:03.583 - R n/a
23:33:35        	raii/memberCtors-ERR1                      PASSED     C 0:00.316 - R n/a
23:33:35        	raii/dtor-early-exit-ERR2                  PASSED     C 0:03.540 - R n/a
23:33:35        	result                                     PASSED     C 0:00.971 - R 0:00.016
23:33:35        	parseconfig                                FAILED with code -6    C 0:07.195 - R 0:00.465
23:33:35 Different types of destination addresses
23:33:35 Cforall Runtime error (UNIX pid:88367) Segment fault at memory location 0x20.
23:33:35 Possible cause is reading outside the address space or writing to a protected area within the address space with an invalid pointer or subscript.
23:33:35 Stack back trace for: /var/lib/jenkins/workspace/Cforall_Distribute_Ref@tmp/cfa-cc-1.0.0.1846/_build/sub/libcfa/x64-debug/src/.libs/libcfa.so.1
23:33:35 (0) /lib/x86_64-linux-gnu/libc.so.6 :  + 0x46210  [0x7ffab3a68210]
23:33:35 (1) /var/lib/jenkins/workspace/Cforall_Distribute_Ref@tmp/cfa-cc-1.0.0.1846/_build/sub/libcfa/x64-debug/src/.libs/libcfa.so.1 :  + 0xdcefb  [0x7ffab3e6defb]
23:33:35 (2) /var/lib/jenkins/workspace/Cforall_Distribute_Ref@tmp/cfa-cc-1.0.0.1846/_build/sub/libcfa/x64-debug/src/.libs/libcfa.so.1 :  + 0xdd0a2  [0x7ffab3e6e0a2]
23:33:35 (3) /var/lib/jenkins/workspace/Cforall_Distribute_Ref@tmp/cfa-cc-1.0.0.1846/_build/sub/libcfa/x64-debug/src/.libs/libcfa.so.1 :  + 0xdd169  [0x7ffab3e6e169]
23:33:35 (4) /var/lib/jenkins/workspace/Cforall_Distribute_Ref@tmp/cfa-cc-1.0.0.1846/_build/sub/libcfa/x64-debug/src/.libs/libcfa.so.1 : __cfaehm_throw_terminate + 0x2c  [0x7ffab3e6e1d6]
23:33:35 (5) /var/lib/jenkins/workspace/Cforall_Distribute_Ref@tmp/cfa-cc-1.0.0.1846/_build/sub/libcfa/x64-debug/src/.libs/libcfa.so.1 :  + 0x6ec83  [0x7ffab3dffc83]
23:33:35 (6) /var/lib/jenkins/workspace/Cforall_Distribute_Ref@tmp/cfa-cc-1.0.0.1846/_build/sub/libcfa/x64-debug/src/.libs/libcfa.so.1 :  + 0x73fc3  [0x7ffab3e04fc3]
23:33:35 (7) /var/lib/jenkins/workspace/Cforall_Distribute_Ref@tmp/cfa-cc-1.0.0.1846/_build/sub/libcfa/x64-debug/src/.libs/libcfa.so.1 : __cfaehm_try_terminate + 0x54  [0x7ffab3e6e545]
23:33:35 (8) /var/lib/jenkins/workspace/Cforall_Distribute_Ref@tmp/cfa-cc-1.0.0.1846/_build/sub/libcfa/x64-debug/src/.libs/libcfa.so.1 : _X27parse_tabular_config_formatFPS7KVPairs_PKcm__1 + 0x285  [0x7ffab3e04b71]
23:33:35 (9) /var/lib/jenkins/workspace/Cforall_Distribute_Ref@tmp/cfa-cc-1.0.0.1846/_build/sub/libcfa/x64-debug/src/.libs/libcfa.so.1 : _X12parse_configFv_PKcPS12config_entrymFPS7KVPairs_PKcm___1 + 0x274  [0x7ffab3e0530d]
23:33:35 (10) /var/lib/jenkins/workspace/Cforall_Distribute_Ref@tmp/cfa-cc-1.0.0.1846/_build/sub/tests/parseconfig : _X4mainFi___1 + 0x93b  [0x5624dbb2b7da]
23:33:35 [New LWP 88367]
23:33:35 [Thread debugging using libthread_db enabled]
23:33:35 Using host libthread_db library "/lib/x86_64-linux-gnu/libthread_db.so.1".
23:33:35 Core was generated by `/var/lib/jenkins/workspace/Cforall_Distribute_Ref@tmp/cfa-cc-1.0.0.1846/_build/'.
23:33:35 Program terminated with signal SIGABRT, Aborted.
23:33:35 #0  __GI_raise (sig=sig@entry=6) at ../sysdeps/unix/sysv/linux/raise.c:50
23:33:35 50	../sysdeps/unix/sysv/linux/raise.c: No such file or directory.
23:33:35 -----
23:33:35 #0  __GI_raise (sig=sig@entry=6) at ../sysdeps/unix/sysv/linux/raise.c:50
23:33:35 #1  0x00007ffab3a47859 in __GI_abort () at abort.c:79
23:33:35 #2  0x00007ffab3e6f030 in _X7__abortFv_bPKcY17__builtin_va_list__1 (_X11signalAbortb_1=true, _X3fmtPKc_1=0x7ffab3e86758 "Application interrupted by signal: %s.\n", _X4argsY17__builtin_va_list_1=0x7ffab3eccae0 <stack+61520>) at /var/lib/jenkins/workspace/Cforall_Distribute_Ref@tmp/cfa-cc-1.0.0.1846/_build/sub/../../libcfa/src/interpose.cfa:241
23:33:35 #3  0x00007ffab3e6f2c6 in _X5abortFv_bPKc__1 (_X11signalAbortb_1=true, _X3fmtPKc_1=0x7ffab3e86758 "Application interrupted by signal: %s.\n") at /var/lib/jenkins/workspace/Cforall_Distribute_Ref@tmp/cfa-cc-1.0.0.1846/_build/sub/../../libcfa/src/interpose.cfa:279
23:33:35 #4  0x00007ffab3e6f47b in _X15sigHandler_termFv_iPS13__anonymous17PS10ucontext_t__1 (_X3sigi_1=6, _X3sfpPS13__anonymous17_1=0x7ffab3eccd30 <stack+62112>, _X3cxtPS10ucontext_t_1=0x7ffab3eccc00 <stack+61808>) at /var/lib/jenkins/workspace/Cforall_Distribute_Ref@tmp/cfa-cc-1.0.0.1846/_build/sub/../../libcfa/src/interpose.cfa:315
23:33:35 #5  <signal handler called>
23:33:35 #6  __GI_raise (sig=sig@entry=6) at ../sysdeps/unix/sysv/linux/raise.c:50
23:33:35 #7  0x00007ffab3a47859 in __GI_abort () at abort.c:79
23:33:35 #8  0x00007ffab3e6f153 in _X7__abortFv_bPKcY17__builtin_va_list__1 (_X11signalAbortb_1=true, _X3fmtPKc_1=0x7ffab3e865c0 "%s at memory location %p.\nPossible cause is reading outside the address space or writing to a protected area within the address space with an invalid pointer or subscript.\n", _X4argsY17__builtin_va_list_1=0x7ffab3ecd460 <stack+63952>) at /var/lib/jenkins/workspace/Cforall_Distribute_Ref@tmp/cfa-cc-1.0.0.1846/_build/sub/../../libcfa/src/interpose.cfa:264
23:33:35 #9  0x00007ffab3e6f2c6 in _X5abortFv_bPKc__1 (_X11signalAbortb_1=true, _X3fmtPKc_1=0x7ffab3e865c0 "%s at memory location %p.\nPossible cause is reading outside the address space or writing to a protected area within the address space with an invalid pointer or subscript.\n") at /var/lib/jenkins/workspace/Cforall_Distribute_Ref@tmp/cfa-cc-1.0.0.1846/_build/sub/../../libcfa/src/interpose.cfa:279
23:33:35 #10 0x00007ffab3e6f345 in _X15sigHandler_segvFv_iPS13__anonymous17PS10ucontext_t__1 (_X3sigi_1=11, _X3sfpPS13__anonymous17_1=0x7ffab3ecd6b0 <stack+64544>, _X3cxtPS10ucontext_t_1=0x7ffab3ecd580 <stack+64240>) at /var/lib/jenkins/workspace/Cforall_Distribute_Ref@tmp/cfa-cc-1.0.0.1846/_build/sub/../../libcfa/src/interpose.cfa:290
23:33:35 #11 <signal handler called>
23:33:35 #12 0x00007ffab3e6defb in __cfaehm_delete_exception (except=0x5624dd9b10b0) at /var/lib/jenkins/workspace/Cforall_Distribute_Ref@tmp/cfa-cc-1.0.0.1846/_build/sub/../../libcfa/src/exception.c:162
23:33:35 #13 0x00007ffab3e6e0a2 in __cfaehm_cleanup_default (except=0x7ffccb6b8170) at /var/lib/jenkins/workspace/Cforall_Distribute_Ref@tmp/cfa-cc-1.0.0.1846/_build/sub/../../libcfa/src/exception.c:233
23:33:35 #14 0x00007ffab3e6e169 in __cfaehm_begin_unwind (defaultHandler=0x7ffccb6b8220) at /var/lib/jenkins/workspace/Cforall_Distribute_Ref@tmp/cfa-cc-1.0.0.1846/_build/sub/../../libcfa/src/exception.c:274
23:33:35 #15 0x00007ffab3e6e1d6 in __cfaehm_throw_terminate (val=0x5624dd9b1040, defaultHandler=0x7ffccb6b8220) at /var/lib/jenkins/workspace/Cforall_Distribute_Ref@tmp/cfa-cc-1.0.0.1846/_build/sub/../../libcfa/src/exception.c:282
23:33:35 #16 0x00007ffab3dffc83 in _X6$throwQ2_0_0_1__X25defaultTerminationHandlerFv_BD0__Fv_BD0__1 (_X25defaultTerminationHandlerFv_Y7exceptT__1=0x7ffccb6b8220, _X6exceptY7exceptT_1=0x5624dd9b1040) at prelude.cfa:80
23:33:35 #17 0x00007ffab3e04fc3 in catch (__handler_index=1, __exception_inst=0x5624dd9b1040) at /var/lib/jenkins/workspace/Cforall_Distribute_Ref@tmp/cfa-cc-1.0.0.1846/_build/sub/../../libcfa/src/parseconfig.cfa:146
23:33:35 #18 0x00007ffab3e6e545 in __cfaehm_try_terminate (try_block=0x7ffccb6b83a8, catch_block=0x7ffccb6b838c, match_block=0x7ffccb6b8370) at /var/lib/jenkins/workspace/Cforall_Distribute_Ref@tmp/cfa-cc-1.0.0.1846/_build/sub/../../libcfa/src/exception.c:521
23:33:35 #19 0x00007ffab3e04b71 in _X27parse_tabular_config_formatFPS7KVPairs_PKcm__1 (_X11config_filePKc_1=0x5624dbb300c8 "/var/lib/jenkins/workspace/Cforall_Distribute_Ref@tmp/cfa-cc-1.0.0.1846/tests/.in/parseconfig-all.txt", _X11num_entriesm_1=11) at /var/lib/jenkins/workspace/Cforall_Distribute_Ref@tmp/cfa-cc-1.0.0.1846/_build/sub/../../libcfa/src/parseconfig.cfa:121
23:33:35 #20 0x00007ffab3e0530d in _X12parse_configFv_PKcPS12config_entrymFPS7KVPairs_PKcm___1 (_X11config_filePKc_1=0x5624dbb300c8 "/var/lib/jenkins/workspace/Cforall_Distribute_Ref@tmp/cfa-cc-1.0.0.1846/tests/.in/parseconfig-all.txt", _X7entriesPS12config_entry_1=0x7ffccb6b86d0, _X11num_entriesm_1=11, _X6parserFPS7KVPairs_PKcm__1=0x7ffab3e048ec <_X27parse_tabular_config_formatFPS7KVPairs_PKcm__1>) at /var/lib/jenkins/workspace/Cforall_Distribute_Ref@tmp/cfa-cc-1.0.0.1846/_build/sub/../../libcfa/src/parseconfig.cfa:159
23:33:35 #21 0x00005624dbb2b7da in _X4mainFi___1 () at parseconfig.cfa:52
23:33:35 #22 0x00005624dbb2ef76 in invoke_main (argc=1, argv=0x7ffccb6b8db8, envp=0x7ffccb6b8dc8) at parseconfig.cfa:23
23:33:35 #23 0x00005624dbb2efc3 in main (_X4argci_1=1, _X4argvPPc_1=0x7ffccb6b8db8, _X4envpPPc_1=0x7ffccb6b8dc8) at parseconfig.cfa:44
23:33:35 -----
23:33:35   Id   Target Id                         Frame 
23:33:35 * 1    Thread 0x7ffab39fa740 (LWP 88367) __GI_raise (sig=sig@entry=6) at ../sysdeps/unix/sysv/linux/raise.c:50
23:33:35 
23:33:35        	simpleGenericTriple                        PASSED     C 0:00.663 - R 0:00.016
23:33:35        	raii/dtor-early-exit                       PASSED     C 0:06.156 - R 0:00.016
23:34:43        	smart-pointers                             PASSED     C 0:00.698 - R 0:00.016
23:34:43        	raii/globals                               PASSED     C 0:04.871 - R 0:00.016
23:34:43        	references                                 PASSED     C 0:05.372 - R 0:00.016
23:34:43        	shortCircuit                               PASSED     C 0:04.631 - R 0:00.016
23:34:43        	switch                                     PASSED     C 0:00.454 - R 0:00.001
23:34:43        	strstream                                  PASSED     C 0:04.982 - R 0:00.016
23:34:43        	tuple/tupleCast                            PASSED     C 0:00.537 - R 0:00.016
23:34:43        	searchsort                                 PASSED     C 0:07.421 - R 0:00.016
23:34:43        	tuple/tupleFunction                        PASSED     C 0:00.609 - R 0:00.016
23:34:43        	tuple/tupleMember                          PASSED     C 0:00.559 - R 0:00.016
23:34:43        	tuple/tuplePolymorphism                    PASSED     C 0:00.770 - R 0:00.016
23:34:43        	typedefRedef                               PASSED     C 0:00.452 - R 0:00.001
23:34:43        	sum                                        PASSED     C 0:06.959 - R 0:00.016
23:34:43        	typedefRedef-ERR1                          PASSED     C 0:00.066 - R n/a
23:34:43        	typeof                                     PASSED     C 0:00.518 - R 0:00.016
23:34:43        	tuple/tupleVariadic                        PASSED     C 0:01.536 - R 0:00.016
23:34:43        	swap                                       PASSED     C 0:07.250 - R 0:00.016
23:34:43        	tuple/tupleAssign                          PASSED     C 0:06.030 - R 0:00.016
23:34:43        	time                                       PASSED     C 0:06.293 - R 0:00.016
23:34:43        	rational                                   PASSED     C 0:15.608 - R 0:00.016
23:34:43        	variableDeclarator                         PASSED     C 0:00.472 - R 0:00.001
23:34:43        	userLiterals                               PASSED     C 0:05.228 - R 0:00.016
23:34:43        	unified_locking/fast                       PASSED     C 0:09.313 - R 0:00.114
23:34:43        	unified_locking/lin_backoff                PASSED     C 0:09.233 - R 0:00.165
23:34:43        	unified_locking/timeout_lock               PASSED     C 0:07.433 - R 0:01.116
23:34:43        	vector                                     PASSED     C 0:07.092 - R 0:00.016
23:34:43        	vector_math/vec2_double                    PASSED     C 0:06.471 - R 0:00.016
23:34:43        	unified_locking/mcs                        PASSED     C 0:09.065 - R 0:06.176
23:34:43        	vector_math/vec2_uint                      PASSED     C 0:06.366 - R 0:00.016
23:34:43        	vector_math/vec2_float                     PASSED     C 0:11.263 - R 0:00.016
23:34:43        	voidPtr                                    PASSED     C 0:00.507 - R 0:00.016
23:34:43        	vector_math/vec2_int                       PASSED     C 0:11.605 - R 0:00.016
23:34:43        	warnings/self-assignment                   PASSED     C 0:00.461 - R 0:00.001
23:34:43        	KRfunctions                                PASSED     C 0:00.396 - R 0:00.001
23:34:43        	vector_math/vec3_int                       PASSED     C 0:09.928 - R 0:00.016
23:34:43        	vector_math/vec3_float                     PASSED     C 0:12.034 - R 0:00.016
23:34:43        	attributes                                 PASSED     C 0:00.484 - R 0:00.001
23:34:43        	vector_math/vec4_float                     PASSED     C 0:11.654 - R 0:00.016
23:34:43        	vector_math/vec4_int                       PASSED     C 0:10.660 - R 0:00.016
23:34:43        	abs                                        PASSED     C 0:06.447 - R 0:00.016
23:34:43        	declarationSpecifier                       PASSED     C 0:00.505 - R 0:00.001
23:34:43        	errors/completeType                        PASSED     C 0:00.248 - R n/a
23:34:43        	extension                                  PASSED     C 0:00.449 - R 0:00.001
23:34:43        	unified_locking/locks                      PASSED     C 0:08.290 - R 0:20.558
23:34:43        	functions                                  PASSED     C 0:00.401 - R 0:00.001
23:34:43        	ato                                        PASSED     C 0:06.057 - R 0:00.016
23:34:43        	gccExtensions                              PASSED     C 0:00.411 - R 0:00.001
23:34:43        	array-container/array-md-sbscr-cases       PASSED     C 0:08.587 - R 0:00.016
23:34:43        	bitmanip1                                  PASSED     C 0:09.959 - R 0:00.016
23:34:43        	io/manipulatorsInput                       PASSED     C 0:06.749 - R 0:00.016
23:34:43        	gmp                                        PASSED     C 0:06.945 - R 0:00.016
23:34:43        	bitmanip2                                  PASSED     C 0:11.146 - R 0:00.016
23:34:43        	meta/archVast                              PASSED     C 0:00.239 - R n/a
23:34:43        	io/manipulatorsOutput2                     PASSED     C 0:08.555 - R 0:00.016
23:34:43        	io/manipulatorsOutput1                     PASSED     C 0:11.843 - R 0:00.016
23:34:43        	bitmanip3                                  PASSED     C 0:17.009 - R 0:00.016
23:34:43        	random                                     PASSED     C 0:05.744 - R 0:00.016
23:34:43        	vector_math/vec2_ldouble                   PASSED     C 0:06.569 - R 0:00.016
23:34:43        	io/manipulatorsOutput3                     PASSED     C 0:13.232 - R 0:00.033
23:34:43        	math                                       PASSED     C 0:12.920 - R 0:00.016
23:34:43        	mathX                                      PASSED     C 0:19.421 - R 0:00.033
23:34:43 Tests took  3:04.822
23:34:43 make[2]: *** [Makefile:880: all-tests] Error 1
23:34:43 make[2]: Leaving directory '/var/lib/jenkins/workspace/Cforall_Distribute_Ref@tmp/cfa-cc-1.0.0.1846/_build/sub/tests'
23:34:43 make[1]: *** [Makefile:951: check] Error 2
23:34:43 make[1]: Leaving directory '/var/lib/jenkins/workspace/Cforall_Distribute_Ref@tmp/cfa-cc-1.0.0.1846/_build/sub'
23:34:43 make: *** [Makefile:734: distcheck] Error 1