Console Output

Started by upstream project "Cforall_Full_Build" build number 1765
originally caused by:
 Started by timer
Running as Jenkins Build User
Obtained Jenkins/Distribute from git cforall@plg.uwaterloo.ca:software/cfa/cfa-cc
Running in Durability level: PERFORMANCE_OPTIMIZED
[Pipeline] Start of Pipeline
[Pipeline] node
Running on Brokk 6 in /var/lib/jenkins/workspace/Cforall_Distribute_Ref
[Pipeline] {
[Pipeline] wrap
[Pipeline] {
[Pipeline] properties
[Pipeline] checkout
23:18:26 The recommended git tool is: NONE
23:18:26 using credential git_key_aug20
23:18:26 Fetching changes from the remote Git repository
 > git rev-parse --resolve-git-dir /var/lib/jenkins/workspace/Cforall_Distribute_Ref/.git # timeout=10
 > git config remote.origin.url cforall@plg.uwaterloo.ca:software/cfa/cfa-cc # timeout=10
Fetching upstream changes from cforall@plg.uwaterloo.ca:software/cfa/cfa-cc
 > git --version # timeout=10
 > git --version # 'git version 2.25.1'
using GIT_SSH to set credentials SSH key used for git, ed25519 generated August 2020
 > git fetch --tags --force --progress -- cforall@plg.uwaterloo.ca:software/cfa/cfa-cc +refs/heads/*:refs/remotes/origin/* # timeout=10
23:18:27 Checking out Revision dcbfcbc5b3b9231d2f0ddc5dc07e9986e2843cd7 (refs/remotes/origin/master)
23:18:27 Commit message: "Merge branch 'master' of plg.uwaterloo.ca:software/cfa/cfa-cc"
[Pipeline] load
 > git rev-parse refs/remotes/origin/master^{commit} # timeout=10
 > git config core.sparsecheckout # timeout=10
 > git checkout -f dcbfcbc5b3b9231d2f0ddc5dc07e9986e2843cd7 # timeout=10
 > git rev-list --no-walk 381495789427d10a74449ea5dff50edf33656ba2 # timeout=10
[Pipeline] { (Jenkins/tools.groovy)
[Pipeline] }
[Pipeline] // load
[Pipeline] echo
23:18:28 Distributing git commit dcbfcbc5b3b9231d2f0ddc5dc07e9986e2843cd7
[Pipeline] }
[Pipeline] // wrap
[Pipeline] }
[Pipeline] // node
[Pipeline] node
Running on Brokk 6 in /var/lib/jenkins/workspace/Cforall_Distribute_Ref
[Pipeline] {
[Pipeline] wrap
[Pipeline] {
[Pipeline] pwd
[Pipeline] pwd
[Pipeline] echo
23:18:28  -------- Cleanup -------- 
[Pipeline] stage
[Pipeline] { (Cleanup)
[Pipeline] dir
23:18:28 Running in /var/lib/jenkins/workspace/Cforall_Distribute_Ref@tmp
[Pipeline] {
[Pipeline] deleteDir
[Pipeline] }
[Pipeline] // dir
[Pipeline] }
[Pipeline] // stage
[Pipeline] echo
23:18:28  -------- Checkout -------- 
[Pipeline] stage
[Pipeline] { (Checkout)
[Pipeline] echo
23:18:28 Checking out commit <dcbfcbc5b3b9231d2f0ddc5dc07e9986e2843cd7>
[Pipeline] checkout
23:18:28 The recommended git tool is: NONE
23:18:28 using credential git_key_aug20
23:18:28 Fetching changes from the remote Git repository
 > git rev-parse --resolve-git-dir /var/lib/jenkins/workspace/Cforall_Distribute_Ref/.git # timeout=10
 > git config remote.origin.url cforall@plg.uwaterloo.ca:software/cfa/cfa-cc # timeout=10
Fetching upstream changes from cforall@plg.uwaterloo.ca:software/cfa/cfa-cc
 > git --version # timeout=10
 > git --version # 'git version 2.25.1'
using GIT_SSH to set credentials SSH key used for git, ed25519 generated August 2020
 > git fetch --tags --force --progress -- cforall@plg.uwaterloo.ca:software/cfa/cfa-cc +refs/heads/*:refs/remotes/origin/* # timeout=10
23:18:29 Checking out Revision dcbfcbc5b3b9231d2f0ddc5dc07e9986e2843cd7 (detached)
23:18:29 Commit message: "Merge branch 'master' of plg.uwaterloo.ca:software/cfa/cfa-cc"
[Pipeline] echo
23:18:29 Constructing new git message
[Pipeline] sh
23:18:30 + git rev-list dcbfcbc5b3b9231d2f0ddc5dc07e9986e2843cd7..381495789427d10a74449ea5dff50edf33656ba2
[Pipeline] sh
23:18:30 + git cat-file -t dcbfcbc5b3b9231d2f0ddc5dc07e9986e2843cd7
[Pipeline] sh
 > git rev-parse dcbfcbc5b3b9231d2f0ddc5dc07e9986e2843cd7^{commit} # timeout=10
 > git config core.sparsecheckout # timeout=10
 > git checkout -f dcbfcbc5b3b9231d2f0ddc5dc07e9986e2843cd7 # timeout=10
23:18:30 + git rev-list --format=short dcbfcbc5b3b9231d2f0ddc5dc07e9986e2843cd7...381495789427d10a74449ea5dff50edf33656ba2
[Pipeline] sh
23:18:31 + git diff --stat --color 381495789427d10a74449ea5dff50edf33656ba2 dcbfcbc5b3b9231d2f0ddc5dc07e9986e2843cd7
[Pipeline] echo
23:18:31 
23:18:31 <p>- Changes -------------------------------------------------------------</p>
23:18:31 
23:18:31 <pre>
23:18:31 The branch null has been updated.
23:18:31       from  dcbfcbc5b3b9231d2f0ddc5dc07e9986e2843cd7 (commit)
23:18:31 </pre>
23:18:31 
23:18:31 <p>- Log -----------------------------------------------------------------</p>
23:18:31 
23:18:31 <pre>
23:18:31 commit dcbfcbc5b3b9231d2f0ddc5dc07e9986e2843cd7
23:18:31 Merge: 07b49700 572a02f5
23:18:31 Author: Thierry Delisle <tdelisle@uwaterloo.ca>
23:18:31 
23:18:31     Merge branch 'master' of plg.uwaterloo.ca:software/cfa/cfa-cc
23:18:31 
23:18:31 commit 07b49700154ba098670c49e4910b74c27f6f114a
23:18:31 Author: Thierry Delisle <tdelisle@uwaterloo.ca>
23:18:31 
23:18:31     Fix incorrect change that disabled all lists
23:18:31 
23:18:31 commit df7597e0e577b1353d3b59151ae805f0e71041c2
23:18:31 Author: Thierry Delisle <tdelisle@uwaterloo.ca>
23:18:31 
23:18:31     Fix the cpu-based ready to actually use cpu_info
23:18:31     rather then being a stupider work stealing approach.
23:18:31 
23:18:31 commit cf85f96e20bb883330a745c3e349efa48f6756e8
23:18:31 Author: Thierry Delisle <tdelisle@uwaterloo.ca>
23:18:31 
23:18:31     Cpu map now has aself pointer to figure out where between start and start + count each cpu belong.
23:18:31     Added way more testing to the device/cpu test.
23:18:31 
23:18:31 commit 572a02f5b5344913a38b98db07112eace8a6ec2c
23:18:31 Author: Peter A. Buhr <pabuhr@uwaterloo.ca>
23:18:31 
23:18:31     revert .expect file for array-md-sbscr-cases.txt to be architecture dependent arm64
23:18:31 
23:18:31 commit a38a9f892203729d51ebf945be10a5fb75598ad0
23:18:31 Author: Peter A. Buhr <pabuhr@uwaterloo.ca>
23:18:31 
23:18:31     revert .expect file for array-md-sbscr-cases.txt to be architecture dependent x64
23:18:31 
23:18:31 commit 26da2a0cd60120a51f1bf0c17c4568d032b41b25
23:18:31 Author: Peter A. Buhr <pabuhr@uwaterloo.ca>
23:18:31 
23:18:31     convert changes to latex and adjust macros slightly to build
23:18:31 
23:18:31 commit 12daa4357a10e875ac973c95a27189ab57b7d175
23:18:31 Author: Thierry Delisle <tdelisle@uwaterloo.ca>
23:18:31 
23:18:31     Added a define switch for using cpu workstealing.
23:18:31     Not Fully implemented.
23:18:31 
23:18:31 commit fde879b3d343755202ac61bdeddc27c27ddd1e9e
23:18:31 Author: Thierry Delisle <tdelisle@uwaterloo.ca>
23:18:31 
23:18:31     Fixed typo in startup.cfa without rseq support.
23:18:31 
23:18:31 commit 26d944cd79fd65abaf307272c04ea99b6cf7b681
23:18:31 Merge: f558b5f7 02f4eb86
23:18:31 Author: Thierry Delisle <tdelisle@uwaterloo.ca>
23:18:31 
23:18:31     Merge branch 'master' of plg.uwaterloo.ca:software/cfa/cfa-cc
23:18:31 
23:18:31 commit f558b5f776427c8e5d02d7affb6784f4bfc6082b
23:18:31 Author: Thierry Delisle <tdelisle@uwaterloo.ca>
23:18:31 
23:18:31     Implemented __kernel_getcpu from rseq and librseq.
23:18:31 
23:18:31 commit 02f4eb8677a64f5dfecc2133d01badd254fc0793
23:18:31 Author: Peter A. Buhr <pabuhr@uwaterloo.ca>
23:18:31 
23:18:31     simplify change for section .data attribute for global constructors
23:18:31 
23:18:31 commit 7e1cb7975a3692730c6ff342344e783504773766
23:18:31 Merge: 798a8b33 cb304ca4
23:18:31 Author: Thierry Delisle <tdelisle@uwaterloo.ca>
23:18:31 
23:18:31     Merge branch 'master' of plg.uwaterloo.ca:software/cfa/cfa-cc
23:18:31 
23:18:31 commit cb304ca4a4f0b5385962a0bc957fb46da37c2092
23:18:31 Merge: eef2a9b9 d96becd5
23:18:31 Author: Peter A. Buhr <pabuhr@uwaterloo.ca>
23:18:31 
23:18:31     Merge branch 'master' of plg.uwaterloo.ca:software/cfa/cfa-cc
23:18:31 
23:18:31 commit eef2a9b94353d79be8ff1c1ebde9898348a783b7
23:18:31 Author: Peter A. Buhr <pabuhr@uwaterloo.ca>
23:18:31 
23:18:31     change .expect file for array-md-sbscr-cases.txt to be architecture independent
23:18:31 
23:18:31 commit d96becd575e4fb0c0c85c5f9f0226196921e428f
23:18:31 Merge: d2698940 012cfc3b
23:18:31 Author: Peter A. Buhr <pabuhr@uwaterloo.ca>
23:18:31 
23:18:31     Merge branch 'master' of plg.uwaterloo.ca:software/cfa/cfa-cc
23:18:31 
23:18:31 commit d269894072838afc81b0ba004e68ee036e861678
23:18:31 Author: Peter A. Buhr <pabuhr@uwaterloo.ca>
23:18:31 
23:18:31     create .expect file for gmp test on ARM
23:18:31 
23:18:31 commit 1f2e957e50843a8f9ed93c8e42c84e191ca88856
23:18:31 Author: Peter A. Buhr <pabuhr@uwaterloo.ca>
23:18:31 
23:18:31     make section .data attribute for global constructors architecture specific for ARM and x86/x64
23:18:31 
23:18:31 commit 012cfc3b93dd76faa348924c2f96d52b5041ca9a
23:18:31 Merge: 32318deb 95958a81
23:18:31 Author: m3zulfiq <m3zulfiq@uwaterloo.ca>
23:18:31 
23:18:31     Merge branch 'master' of plg.uwaterloo.ca:software/cfa/cfa-cc
23:18:31 
23:18:31 commit 32318deb8d06b98437b9cfecdd25a6042f8d7927
23:18:31 Author: m3zulfiq <m3zulfiq@uwaterloo.ca>
23:18:31 
23:18:31     added benchmark descriptions
23:18:31 
23:18:31 commit 798a8b33d41aef379aeeb2830e27a51928291097
23:18:31 Author: Thierry Delisle <tdelisle@uwaterloo.ca>
23:18:31 
23:18:31     Attributes are now correctly visited when replacing typedefs
23:18:31 
23:18:31 commit 1d61b67ea8f4cd438d5223140d0a97fa7b097e8f
23:18:31 Author: Thierry Delisle <tdelisle@uwaterloo.ca>
23:18:31 
23:18:31     Added attribute case to typedef replacement test.
23:18:31 
23:18:31 commit 95958a814c13cbc06ba4e807c0e4ce23dfdba614
23:18:31 Author: Peter A. Buhr <pabuhr@uwaterloo.ca>
23:18:31 
23:18:31     create stdhdr/pthread.h so #include pthread.h does not require extern "C"
23:18:31 
23:18:31 commit ed39576155269c4d9c226be5d7e3a6ed3848fec6
23:18:31 Author: Henry Xue <y58xue@uwaterloo.ca>
23:18:31 
23:18:31     Workaround to get default exception handling on ARM working
23:18:31 </pre>
23:18:31 
23:18:31 <p>-----------------------------------------------------------------------</p>
23:18:31 <pre>
23:18:31 Summary of changes:
23:18:31 doc/theses/mubeen_zulfiqar_MMath/.gitignore        |   2 <span style="color: #00AA00;">+</span><span style="color: #AA0000;">-</span>
23:18:31  doc/theses/mubeen_zulfiqar_MMath/benchmarks.tex    | 206 <span style="color: #00AA00;">+++++++++</span><span style="color: #AA0000;">----</span>
23:18:31  doc/theses/mubeen_zulfiqar_MMath/uw-ethesis.tex    |   3 <span style="color: #00AA00;">+</span><span style="color: #AA0000;">-</span>
23:18:31  libcfa/src/concurrency/kernel.cfa                  |   4 <span style="color: #00AA00;">+</span><span style="color: #AA0000;">-</span>
23:18:31  libcfa/src/concurrency/kernel.hfa                  |   1 <span style="color: #00AA00;">+</span>
23:18:31  libcfa/src/concurrency/kernel/startup.cfa          |  94 <span style="color: #00AA00;">+++++</span><span style="color: #AA0000;">-</span>
23:18:31  libcfa/src/concurrency/kernel_private.hfa          |  10 <span style="color: #00AA00;">+</span><span style="color: #AA0000;">-</span>
23:18:31  libcfa/src/concurrency/ready_queue.cfa             | 335 <span style="color: #00AA00;">+++++++++++++++</span><span style="color: #AA0000;">------</span>
23:18:31  libcfa/src/device/cpu.cfa                          |  74 <span style="color: #00AA00;">+++</span><span style="color: #AA0000;">--</span>
23:18:31  libcfa/src/device/cpu.hfa                          |   1 <span style="color: #00AA00;">+</span>
23:18:31  libcfa/src/exception.c                             |   6 <span style="color: #00AA00;">+</span>
23:18:31  libcfa/src/stdhdr/pthread.h                        |  24 <span style="color: #00AA00;">++</span>
23:18:31  src/AST/Pass.impl.hpp                              |  22 <span style="color: #00AA00;">+</span><span style="color: #AA0000;">-</span>
23:18:31  src/Common/PassVisitor.impl.h                      |  14 <span style="color: #00AA00;">+</span><span style="color: #AA0000;">-</span>
23:18:31  src/InitTweak/InitTweak.cc                         |  22 <span style="color: #00AA00;">+</span><span style="color: #AA0000;">-</span>
23:18:31  src/SymTab/Validate.cc                             |   1 <span style="color: #00AA00;">+</span>
23:18:31  tests/.expect/gmp.arm64.txt                        | 279 <span style="color: #00AA00;">+++++++++++++++++</span>
23:18:31  tests/.expect/typedefRedef-ERR1.txt                |   4 <span style="color: #00AA00;">+</span><span style="color: #AA0000;">-</span>
23:18:31  tests/.expect/typedefRedef.txt                     |   2 <span style="color: #00AA00;">+</span><span style="color: #AA0000;">-</span>
23:18:31  .../.expect/array-md-sbscr-cases.arm64.txt         |   1 <span style="color: #00AA00;">+</span>
23:18:31  tests/device/cpu.cfa                               | 165 <span style="color: #00AA00;">++++++++++</span>
23:18:31  tests/typedefRedef.cfa                             |   6 <span style="color: #00AA00;">+</span>
23:18:31  22 files changed, 1069 insertions(+), 207 deletions(-)
23:18:31 </pre>
23:18:31 
[Pipeline] }
[Pipeline] // stage
[Pipeline] sh
23:18:31 + sed s/AC_INIT(\[cfa-cc\],\[\(.*\)\],\[cforall@plg.uwaterloo.ca\])/\1/;t;d /var/lib/jenkins/workspace/Cforall_Distribute_Ref/configure.ac
[Pipeline] echo
23:18:31 Package Version: 1.0.0
[Pipeline] echo
23:18:31 Build   Version: 1765
[Pipeline] echo
23:18:31 Long    Version: 1.0.0.1765
[Pipeline] echo
23:18:31  -------- Configure -------- 
[Pipeline] stage
[Pipeline] { (Configure)
[Pipeline] dir
23:18:31 Running in /var/lib/jenkins/workspace/Cforall_Distribute_Ref
[Pipeline] {
[Pipeline] sh
23:18:31 + ./autogen.sh
23:18:31 Running aclocal in root
23:18:33 Running libtoolize in root
23:18:34 Running autoconf in root
23:18:34 Running automake in root
23:18:35 Running aclocal in libcfa
23:18:37 Running libtoolize in libcfa
23:18:37 Running autoconf in libcfa
23:18:37 Running automake in libcfa
[Pipeline] }
[Pipeline] // dir
[Pipeline] dir
23:18:38 Running in /var/lib/jenkins/workspace/Cforall_Distribute_Ref@tmp
[Pipeline] {
[Pipeline] sh
23:18:38 + /var/lib/jenkins/workspace/Cforall_Distribute_Ref/configure CXX=g++-9 CC=gcc-9 AR=gcc-ar RANLIB=gcc-ranlib --quiet
[Pipeline] sh
23:18:47 + make -j 8 --no-print-directory configure-libcfa
23:18:47 libcfa/x64-debug/config.data
23:18:47 Configuring libcfa (/var/lib/jenkins/workspace/Cforall_Distribute_Ref/libcfa/configure) with ''CXX=g++-9' 'CC=gcc-9' 'AR=gcc-ar' 'RANLIB=gcc-ranlib' DRIVER_DIR=/var/lib/jenkins/workspace/Cforall_Distribute_Ref@tmp/driver/ ARCHITECTURE=x64 CONFIGURATION=debug CFA_VERSION=1:0:0' from /var/lib/jenkins/workspace/Cforall_Distribute_Ref@tmp / libcfa/x64-debug/
23:18:47 libcfa/x64-nodebug/config.data
23:18:47 Configuring libcfa (/var/lib/jenkins/workspace/Cforall_Distribute_Ref/libcfa/configure) with ''CXX=g++-9' 'CC=gcc-9' 'AR=gcc-ar' 'RANLIB=gcc-ranlib' DRIVER_DIR=/var/lib/jenkins/workspace/Cforall_Distribute_Ref@tmp/driver/ ARCHITECTURE=x64 CONFIGURATION=nodebug CFA_VERSION=1:0:0' from /var/lib/jenkins/workspace/Cforall_Distribute_Ref@tmp / libcfa/x64-nodebug/
23:18:47 checking whether make supports nested variables... checking whether make supports nested variables... yes
23:18:47 checking for a BSD-compatible install... yes
23:18:47 checking for a BSD-compatible install... /usr/bin/install -c
23:18:47 checking whether build environment is sane... /usr/bin/install -c
23:18:47 checking whether build environment is sane... yes
23:18:47 yes
23:18:47 checking for a thread-safe mkdir -p... checking for a thread-safe mkdir -p... /usr/bin/mkdir -p
23:18:47 checking for gawk... /usr/bin/mkdir -p
23:18:47 gawk
23:18:47 checking for gawk... checking whether make sets $(MAKE)... gawk
23:18:47 checking whether make sets $(MAKE)... yes
23:18:47 yes
23:18:47 checking for distributated build... no
23:18:47 checking for distributated build... no
23:18:47 checking build system type... checking build system type... x86_64-pc-linux-gnu
23:18:47 x86_64-pc-linux-gnu
23:18:47 checking host system type... checking host system type... x86_64-pc-linux-gnu
23:18:47 x86_64-pc-linux-gnu
23:18:47 checking how to print strings... checking how to print strings... printf
23:18:47 printf
23:18:47 checking whether make supports the include directive... checking whether make supports the include directive... yes (GNU style)
23:18:47 yes (GNU style)
23:18:47 checking for gcc... checking for gcc... gcc-9
23:18:47 gcc-9
23:18:47 checking whether the C compiler works... checking whether the C compiler works... yes
23:18:47 checking for C compiler default output file name... a.out
23:18:47 checking for suffix of executables... yes
23:18:47 checking for C compiler default output file name... a.out
23:18:47 checking for suffix of executables... 
23:18:47 checking whether we are cross compiling... 
23:18:47 checking whether we are cross compiling... no
23:18:47 checking for suffix of object files... no
23:18:47 checking for suffix of object files... o
23:18:47 checking whether we are using the GNU C compiler... yes
23:18:47 checking whether gcc-9 accepts -g... o
23:18:47 checking whether we are using the GNU C compiler... yes
23:18:47 checking for gcc-9 option to accept ISO C89... yes
23:18:47 checking whether gcc-9 accepts -g... yes
23:18:47 checking for gcc-9 option to accept ISO C89... none needed
23:18:47 checking whether gcc-9 understands -c and -o together... none needed
23:18:47 checking whether gcc-9 understands -c and -o together... yes
23:18:47 checking dependency style of gcc-9... yes
23:18:47 checking dependency style of gcc-9... gcc3
23:18:47 checking for a sed that does not truncate output... /usr/bin/sed
23:18:47 checking for grep that handles long lines and -e... /usr/bin/grep
23:18:47 checking for egrep... /usr/bin/grep -E
23:18:47 checking for fgrep... /usr/bin/grep -F
23:18:47 checking for ld used by gcc-9... gcc3
23:18:47 checking for a sed that does not truncate output... /usr/bin/ld
23:18:47 checking if the linker (/usr/bin/ld) is GNU ld... /usr/bin/sed
23:18:47 checking for grep that handles long lines and -e... yes
23:18:47 checking for BSD- or MS-compatible name lister (nm)... /usr/bin/grep
23:18:47 checking for egrep... /usr/bin/nm -B
23:18:47 checking the name lister (/usr/bin/nm -B) interface... /usr/bin/grep -E
23:18:47 checking for fgrep... /usr/bin/grep -F
23:18:48 checking for ld used by gcc-9... /usr/bin/ld
23:18:48 checking if the linker (/usr/bin/ld) is GNU ld... yes
23:18:48 checking for BSD- or MS-compatible name lister (nm)... /usr/bin/nm -B
23:18:48 checking the name lister (/usr/bin/nm -B) interface... BSD nm
23:18:48 checking whether ln -s works... yes
23:18:48 checking the maximum length of command line arguments... 1572864
23:18:48 checking how to convert x86_64-pc-linux-gnu file names to x86_64-pc-linux-gnu format... func_convert_file_noop
23:18:48 checking how to convert x86_64-pc-linux-gnu file names to toolchain format... func_convert_file_noop
23:18:48 checking for /usr/bin/ld option to reload object files... -r
23:18:48 checking for objdump... objdump
23:18:48 checking how to recognize dependent libraries... pass_all
23:18:48 checking for dlltool... no
23:18:48 checking how to associate runtime and link libraries... printf %s\n
23:18:48 checking for archiver @FILE support... BSD nm
23:18:48 checking whether ln -s works... yes
23:18:48 checking the maximum length of command line arguments... 1572864
23:18:48 checking how to convert x86_64-pc-linux-gnu file names to x86_64-pc-linux-gnu format... func_convert_file_noop
23:18:48 checking how to convert x86_64-pc-linux-gnu file names to toolchain format... func_convert_file_noop
23:18:48 checking for /usr/bin/ld option to reload object files... -r
23:18:48 checking for objdump... objdump
23:18:48 checking how to recognize dependent libraries... pass_all
23:18:48 checking for dlltool... no
23:18:48 checking how to associate runtime and link libraries... printf %s\n
23:18:48 checking for archiver @FILE support... @
23:18:48 checking for strip... strip
23:18:48 checking for ranlib... gcc-ranlib
23:18:48 checking command to parse /usr/bin/nm -B output from gcc-9 object... @
23:18:48 checking for strip... strip
23:18:48 checking for ranlib... gcc-ranlib
23:18:48 checking command to parse /usr/bin/nm -B output from gcc-9 object... ok
23:18:48 checking for sysroot... no
23:18:48 checking for a working dd... /usr/bin/dd
23:18:48 checking how to truncate binary pipes... /usr/bin/dd bs=4096 count=1
23:18:48 ok
23:18:48 checking for sysroot... no
23:18:48 checking for a working dd... /usr/bin/dd
23:18:48 checking how to truncate binary pipes... checking for mt... mt
23:18:48 checking if mt is a manifest tool... /usr/bin/dd bs=4096 count=1
23:18:48 no
23:18:48 checking how to run the C preprocessor... checking for mt... mt
23:18:48 checking if mt is a manifest tool... gcc-9 -E
23:18:48 no
23:18:48 checking how to run the C preprocessor... checking for ANSI C header files... gcc-9 -E
23:18:48 checking for ANSI C header files... yes
23:18:48 checking for sys/types.h... yes
23:18:48 checking for sys/types.h... yes
23:18:48 checking for sys/stat.h... yes
23:18:48 checking for sys/stat.h... yes
23:18:48 checking for stdlib.h... yes
23:18:48 checking for stdlib.h... yes
23:18:48 checking for string.h... yes
23:18:48 checking for string.h... yes
23:18:48 checking for memory.h... yes
23:18:48 checking for memory.h... yes
23:18:49 checking for strings.h... yes
23:18:49 checking for strings.h... yes
23:18:49 checking for inttypes.h... yes
23:18:49 checking for inttypes.h... yes
23:18:49 checking for stdint.h... yes
23:18:49 checking for stdint.h... yes
23:18:49 checking for unistd.h... yes
23:18:49 checking for unistd.h... yes
23:18:49 yes
23:18:49 checking for dlfcn.h... checking for dlfcn.h... yes
23:18:49 yes
23:18:49 checking for objdir... checking for objdir... .libs
23:18:49 .libs
23:18:49 checking if gcc-9 supports -fno-rtti -fno-exceptions... checking if gcc-9 supports -fno-rtti -fno-exceptions... no
23:18:49 checking for gcc-9 option to produce PIC... -fPIC -DPIC
23:18:49 checking if gcc-9 PIC flag -fPIC -DPIC works... no
23:18:49 checking for gcc-9 option to produce PIC... -fPIC -DPIC
23:18:49 checking if gcc-9 PIC flag -fPIC -DPIC works... yes
23:18:49 checking if gcc-9 static flag -static works... yes
23:18:49 checking if gcc-9 static flag -static works... yes
23:18:49 checking if gcc-9 supports -c -o file.o... yes
23:18:49 checking if gcc-9 supports -c -o file.o... yes
23:18:49 checking if gcc-9 supports -c -o file.o... (cached) yes
23:18:49 checking whether the gcc-9 linker (/usr/bin/ld -m elf_x86_64) supports shared libraries... yes
23:18:49 checking whether -lc should be explicitly linked in... yes
23:18:49 checking if gcc-9 supports -c -o file.o... (cached) yes
23:18:49 checking whether the gcc-9 linker (/usr/bin/ld -m elf_x86_64) supports shared libraries... yes
23:18:49 checking whether -lc should be explicitly linked in... no
23:18:49 checking dynamic linker characteristics... no
23:18:49 checking dynamic linker characteristics... GNU/Linux ld.so
23:18:49 checking how to hardcode library paths into programs... immediate
23:18:49 checking whether stripping libraries is possible... yes
23:18:49 checking if libtool supports shared libraries... yes
23:18:49 checking whether to build shared libraries... yes
23:18:49 checking whether to build static libraries... no
23:18:49 GNU/Linux ld.so
23:18:49 checking how to hardcode library paths into programs... immediate
23:18:49 checking whether stripping libraries is possible... yes
23:18:49 checking if libtool supports shared libraries... yes
23:18:49 checking whether to build shared libraries... yes
23:18:49 checking whether to build static libraries... no
23:18:49 checking whether we are using the GNU C++ compiler... checking whether we are using the GNU C++ compiler... yes
23:18:49 checking whether g++-9 accepts -g... yes
23:18:49 checking whether g++-9 accepts -g... yes
23:18:49 checking dependency style of g++-9... yes
23:18:50 checking dependency style of g++-9... gcc3
23:18:50 checking how to run the C++ preprocessor... gcc3
23:18:50 checking how to run the C++ preprocessor... g++-9 -E
23:18:50 g++-9 -E
23:18:50 checking for ld used by g++-9... /usr/bin/ld -m elf_x86_64
23:18:50 checking if the linker (/usr/bin/ld -m elf_x86_64) is GNU ld... yes
23:18:50 checking for ld used by g++-9... /usr/bin/ld -m elf_x86_64
23:18:50 checking if the linker (/usr/bin/ld -m elf_x86_64) is GNU ld... checking whether the g++-9 linker (/usr/bin/ld -m elf_x86_64) supports shared libraries... yes
23:18:50 yes
23:18:50 checking whether the g++-9 linker (/usr/bin/ld -m elf_x86_64) supports shared libraries... yes
23:18:50 checking for g++-9 option to produce PIC... -fPIC -DPIC
23:18:50 checking if g++-9 PIC flag -fPIC -DPIC works... checking for g++-9 option to produce PIC... -fPIC -DPIC
23:18:50 checking if g++-9 PIC flag -fPIC -DPIC works... yes
23:18:50 checking if g++-9 static flag -static works... yes
23:18:50 checking if g++-9 static flag -static works... yes
23:18:50 checking if g++-9 supports -c -o file.o... yes
23:18:50 checking if g++-9 supports -c -o file.o... yes
23:18:50 checking if g++-9 supports -c -o file.o... (cached) yes
23:18:50 checking whether the g++-9 linker (/usr/bin/ld -m elf_x86_64) supports shared libraries... yes
23:18:50 checking dynamic linker characteristics... (cached) yes
23:18:50 checking if g++-9 supports -c -o file.o... (cached) yes
23:18:50 checking whether the g++-9 linker (/usr/bin/ld -m elf_x86_64) supports shared libraries... yes
23:18:50 checking dynamic linker characteristics... (cached) GNU/Linux ld.so
23:18:50 checking how to hardcode library paths into programs... immediate
23:18:50 checking for gcc... (cached) gcc-9
23:18:50 GNU/Linux ld.so
23:18:50 checking how to hardcode library paths into programs... immediate
23:18:50 checking for gcc... (cached) gcc-9
23:18:50 checking whether we are using the GNU C compiler... (cached) yes
23:18:50 checking whether gcc-9 accepts -g... (cached) yes
23:18:50 checking for gcc-9 option to accept ISO C89... (cached) none needed
23:18:50 checking whether gcc-9 understands -c and -o together... (cached) yes
23:18:50 checking dependency style of gcc-9... checking whether we are using the GNU C compiler... (cached) (cached) yes
23:18:50 gcc3
23:18:50 checking whether gcc-9 accepts -g... (cached) checking dependency style of gcc-9... yes
23:18:50 checking for gcc-9 option to accept ISO C89... (cached) none needed
23:18:50 checking whether gcc-9 understands -c and -o together... (cached) yes
23:18:50 checking dependency style of gcc-9... (cached) gcc3
23:18:50 checking dependency style of gcc-9... gcc3
23:18:50 checking whether make sets $(MAKE)... gcc3
23:18:50 checking whether make sets $(MAKE)... (cached) yes
23:18:50 checking linux/rseq.h usability... (cached) yes
23:18:50 checking linux/rseq.h usability... yes
23:18:50 checking linux/rseq.h presence... yes
23:18:50 checking linux/rseq.h presence... yes
23:18:50 checking for linux/rseq.h... yes
23:18:50 checking for rseq_available in -lrseq... yes
23:18:50 checking for linux/rseq.h... yes
23:18:50 checking for rseq_available in -lrseq... no
23:18:50 no
23:18:51 checking linux/io_uring.h usability... checking linux/io_uring.h usability... yes
23:18:51 checking linux/io_uring.h presence... yes
23:18:51 checking linux/io_uring.h presence... yes
23:18:51 checking for linux/io_uring.h... yes
23:18:51 checking liburing.h usability... yes
23:18:51 checking for linux/io_uring.h... yes
23:18:51 checking liburing.h usability... yes
23:18:51 checking liburing.h presence... yes
23:18:51 checking liburing.h presence... yes
23:18:51 checking for liburing.h... yes
23:18:51 checking for io_uring_get_probe in -luring... yes
23:18:51 checking for liburing.h... yes
23:18:51 checking for io_uring_get_probe in -luring... yes
23:18:51 yes
23:18:51 checking whether IORING_OP_NOP is declared... checking whether IORING_OP_NOP is declared... yes
23:18:51 yes
23:18:51 checking whether IORING_OP_READV is declared... checking whether IORING_OP_READV is declared... yes
23:18:51 yes
23:18:51 checking whether IORING_OP_WRITEV is declared... checking whether IORING_OP_WRITEV is declared... yes
23:18:51 yes
23:18:51 checking whether IORING_OP_FSYNC is declared... checking whether IORING_OP_FSYNC is declared... yes
23:18:51 yes
23:18:52 checking whether IORING_OP_READ_FIXED is declared... checking whether IORING_OP_READ_FIXED is declared... yes
23:18:52 yes
23:18:52 checking whether IORING_OP_WRITE_FIXED is declared... checking whether IORING_OP_WRITE_FIXED is declared... yes
23:18:52 yes
23:18:52 checking whether IORING_OP_POLL_ADD is declared... checking whether IORING_OP_POLL_ADD is declared... yes
23:18:52 yes
23:18:52 checking whether IORING_OP_POLL_REMOVE is declared... checking whether IORING_OP_POLL_REMOVE is declared... yes
23:18:52 yes
23:18:52 checking whether IORING_OP_SYNC_FILE_RANGE is declared... checking whether IORING_OP_SYNC_FILE_RANGE is declared... yes
23:18:52 yes
23:18:52 checking whether IORING_OP_SENDMSG is declared... checking whether IORING_OP_SENDMSG is declared... yes
23:18:53 yes
23:18:53 checking whether IORING_OP_RECVMSG is declared... checking whether IORING_OP_RECVMSG is declared... yes
23:18:53 yes
23:18:53 checking whether IORING_OP_TIMEOUT is declared... checking whether IORING_OP_TIMEOUT is declared... yes
23:18:53 yes
23:18:53 checking whether IORING_OP_TIMEOUT_REMOVE is declared... checking whether IORING_OP_TIMEOUT_REMOVE is declared... yes
23:18:53 yes
23:18:53 checking whether IORING_OP_ACCEPT is declared... checking whether IORING_OP_ACCEPT is declared... yes
23:18:53 yes
23:18:53 checking whether IORING_OP_ASYNC_CANCEL is declared... checking whether IORING_OP_ASYNC_CANCEL is declared... yes
23:18:53 yes
23:18:54 checking whether IORING_OP_LINK_TIMEOUT is declared... checking whether IORING_OP_LINK_TIMEOUT is declared... yes
23:18:54 yes
23:18:54 checking whether IORING_OP_CONNECT is declared... checking whether IORING_OP_CONNECT is declared... yes
23:18:54 yes
23:18:54 checking whether IORING_OP_FALLOCATE is declared... checking whether IORING_OP_FALLOCATE is declared... yes
23:18:54 yes
23:18:54 checking whether IORING_OP_OPENAT is declared... checking whether IORING_OP_OPENAT is declared... yes
23:18:54 yes
23:18:54 checking whether IORING_OP_CLOSE is declared... checking whether IORING_OP_CLOSE is declared... yes
23:18:54 yes
23:18:54 checking whether IORING_OP_FILES_UPDATE is declared... checking whether IORING_OP_FILES_UPDATE is declared... yes
23:18:54 yes
23:18:55 checking whether IORING_OP_STATX is declared... checking whether IORING_OP_STATX is declared... yes
23:18:55 yes
23:18:55 checking whether IORING_OP_READ is declared... checking whether IORING_OP_READ is declared... yes
23:18:55 yes
23:18:55 checking whether IORING_OP_WRITE is declared... checking whether IORING_OP_WRITE is declared... yes
23:18:55 yes
23:18:55 checking whether IORING_OP_FADVISE is declared... checking whether IORING_OP_FADVISE is declared... yes
23:18:55 yes
23:18:55 checking whether IORING_OP_MADVISE is declared... checking whether IORING_OP_MADVISE is declared... yes
23:18:55 yes
23:18:55 checking whether IORING_OP_SEND is declared... checking whether IORING_OP_SEND is declared... yes
23:18:55 yes
23:18:56 checking whether IORING_OP_RECV is declared... yes
23:18:56 checking whether IORING_OP_RECV is declared... yes
23:18:56 checking whether IORING_OP_OPENAT2 is declared... checking whether IORING_OP_OPENAT2 is declared... yes
23:18:56 yes
23:18:57 checking whether IORING_OP_EPOLL_CTL is declared... yes
23:18:57 checking whether IORING_OP_EPOLL_CTL is declared... checking whether IORING_OP_SPLICE is declared... yes
23:18:57 yes
23:18:57 checking whether IORING_OP_SPLICE is declared... checking whether IORING_OP_PROVIDE_BUFFERS is declared... yes
23:18:57 yes
23:18:57 checking whether IORING_OP_PROVIDE_BUFFERS is declared... checking whether IORING_OP_REMOVE_BUFFER is declared... yes
23:18:57 no
23:18:57 checking whether IORING_OP_TEE is declared... checking whether IORING_OP_REMOVE_BUFFER is declared... no
23:18:57 checking whether IOSQE_FIXED_FILE is declared... no
23:18:57 yes
23:18:57 checking whether IORING_OP_TEE is declared... checking whether IOSQE_IO_DRAIN is declared... yes
23:18:57 no
23:18:57 checking whether IOSQE_IO_LINK is declared... checking whether IOSQE_FIXED_FILE is declared... yes
23:18:57 checking whether IOSQE_IO_HARDLINK is declared... yes
23:18:57 checking whether IOSQE_IO_DRAIN is declared... yes
23:18:57 checking whether IOSQE_ASYNC is declared... yes
23:18:58 checking whether IOSQE_IO_LINK is declared... yes
23:18:58 checking whether IOSQE_BUFFER_SELECT is declared... yes
23:18:58 checking whether IOSQE_IO_HARDLINK is declared... yes
23:18:58 checking whether SPLICE_F_FD_IN_FIXED is declared... yes
23:18:58 checking whether IOSQE_ASYNC is declared... yes
23:18:58 checking whether IORING_SETUP_ATTACH_WQ is declared... yes
23:18:58 checking whether IOSQE_BUFFER_SELECT is declared... yes
23:18:58 checking for preadv2... yes
23:18:58 checking whether SPLICE_F_FD_IN_FIXED is declared... yes
23:18:58 checking for pwritev2... yes
23:18:58 checking whether IORING_SETUP_ATTACH_WQ is declared... yes
23:18:58 yes
23:18:58 checking for preadv2... checking that generated files are newer than configure... done
23:18:58 configure: creating ./config.status
23:18:58 yes
23:18:58 checking for pwritev2... yes
23:18:58 checking that generated files are newer than configure... done
23:18:58 configure: creating ./config.status
23:18:59 config.status: creating Makefile
23:18:59 config.status: creating src/Makefile
23:18:59 config.status: creating prelude/Makefile
23:18:59 config.status: creating src/concurrency/io/call.cfa
23:18:59 config.status: creating prelude/defines.hfa
23:18:59 config.status: executing depfiles commands
23:18:59 config.status: executing libtool commands
23:18:59 Cforall library configuraton completed. Type "make -j 8 install".
23:18:59 config.status: creating Makefile
23:18:59 config.status: creating src/Makefile
23:18:59 config.status: creating prelude/Makefile
23:18:59 config.status: creating src/concurrency/io/call.cfa
23:18:59 config.status: creating prelude/defines.hfa
23:18:59 config.status: executing depfiles commands
23:18:59 config.status: executing libtool commands
23:18:59 Cforall library configuraton completed. Type "make -j 8 install".
[Pipeline] }
[Pipeline] // dir
[Pipeline] }
[Pipeline] // stage
[Pipeline] echo
23:18:59  -------- Package -------- 
[Pipeline] stage
[Pipeline] { (Package)
[Pipeline] dir
23:18:59 Running in /var/lib/jenkins/workspace/Cforall_Distribute_Ref@tmp
[Pipeline] {
[Pipeline] sh
23:19:00 + make VERSION=1.0.0.1765 dist
23:19:00 make  dist-gzip am__post_remove_distdir='@:'
23:19:00 make[1]: Entering directory '/var/lib/jenkins/workspace/Cforall_Distribute_Ref@tmp'
23:19:00 make  distdir-am
23:19:00 make[2]: Entering directory '/var/lib/jenkins/workspace/Cforall_Distribute_Ref@tmp'
23:19:00 if test -d "cfa-cc-1.0.0.1765"; then find "cfa-cc-1.0.0.1765" -type d ! -perm -200 -exec chmod u+w {} ';' && rm -rf "cfa-cc-1.0.0.1765" || { sleep 5 && rm -rf "cfa-cc-1.0.0.1765"; }; else :; fi
23:19:00 test -d "cfa-cc-1.0.0.1765" || mkdir "cfa-cc-1.0.0.1765"
23:19:00  (cd driver && make  top_distdir=../cfa-cc-1.0.0.1765 distdir=../cfa-cc-1.0.0.1765/driver \
23:19:00      am__remove_distdir=: am__skip_length_check=: am__skip_mode_fix=: distdir)
23:19:00 make[3]: Entering directory '/var/lib/jenkins/workspace/Cforall_Distribute_Ref@tmp/driver'
23:19:00 make  distdir-am
23:19:00 make[4]: Entering directory '/var/lib/jenkins/workspace/Cforall_Distribute_Ref@tmp/driver'
23:19:00 make[4]: Leaving directory '/var/lib/jenkins/workspace/Cforall_Distribute_Ref@tmp/driver'
23:19:00 make[3]: Leaving directory '/var/lib/jenkins/workspace/Cforall_Distribute_Ref@tmp/driver'
23:19:00  (cd src && make  top_distdir=../cfa-cc-1.0.0.1765 distdir=../cfa-cc-1.0.0.1765/src \
23:19:00      am__remove_distdir=: am__skip_length_check=: am__skip_mode_fix=: distdir)
23:19:00 make[3]: Entering directory '/var/lib/jenkins/workspace/Cforall_Distribute_Ref@tmp/src'
23:19:00   YACC     Parser/parser.cc
23:19:01 updating Parser/parser.output
23:19:01 updating Parser/parser.hh
23:19:01 make  distdir-am
23:19:01 make[4]: Entering directory '/var/lib/jenkins/workspace/Cforall_Distribute_Ref@tmp/src'
23:19:01   LEX      Parser/lex.cc
23:19:01 make[4]: Leaving directory '/var/lib/jenkins/workspace/Cforall_Distribute_Ref@tmp/src'
23:19:01 make[3]: Leaving directory '/var/lib/jenkins/workspace/Cforall_Distribute_Ref@tmp/src'
23:19:01  (cd libcfa && make  top_distdir=../cfa-cc-1.0.0.1765 distdir=../cfa-cc-1.0.0.1765/libcfa \
23:19:01      am__remove_distdir=: am__skip_length_check=: am__skip_mode_fix=: distdir)
23:19:01 make[3]: Entering directory '/var/lib/jenkins/workspace/Cforall_Distribute_Ref@tmp/libcfa'
23:19:01 Distributing libcfa from 'libcfa/x64-nodebug'
23:19:01 make -C /var/lib/jenkins/workspace/Cforall_Distribute_Ref@tmp/libcfa/x64-nodebug distdir \
23:19:01 top_distdir=../cfa-cc-1.0.0.1765 \
23:19:01 distdir=../../cfa-cc-1.0.0.1765/libcfa \
23:19:01 am__remove_distdir=$(am__remove_distdir) \
23:19:01 am__skip_length_check=: \
23:19:01 am__skip_mode_fix=:
23:19:01 /bin/bash: am__remove_distdir: command not found
23:19:01 make[4]: Entering directory '/var/lib/jenkins/workspace/Cforall_Distribute_Ref@tmp/libcfa/x64-nodebug'
23:19:01 make  distdir-am
23:19:01 make[5]: Entering directory '/var/lib/jenkins/workspace/Cforall_Distribute_Ref@tmp/libcfa/x64-nodebug'
23:19:01 test -d "../../cfa-cc-1.0.0.1765/libcfa" || mkdir "../../cfa-cc-1.0.0.1765/libcfa"
23:19:01  (cd prelude && make  top_distdir=../../cfa-cc-1.0.0.1765 distdir=../../../cfa-cc-1.0.0.1765/libcfa/prelude \
23:19:01      am__remove_distdir=: am__skip_length_check=: am__skip_mode_fix=: distdir)
23:19:01 make[6]: Entering directory '/var/lib/jenkins/workspace/Cforall_Distribute_Ref@tmp/libcfa/x64-nodebug/prelude'
23:19:01 mkdir .deps
23:19:01 touch .deps/builtins.Po
23:19:01 make  distdir-am
23:19:01 make[7]: Entering directory '/var/lib/jenkins/workspace/Cforall_Distribute_Ref@tmp/libcfa/x64-nodebug/prelude'
23:19:01 make[7]: Leaving directory '/var/lib/jenkins/workspace/Cforall_Distribute_Ref@tmp/libcfa/x64-nodebug/prelude'
23:19:01 make[6]: Leaving directory '/var/lib/jenkins/workspace/Cforall_Distribute_Ref@tmp/libcfa/x64-nodebug/prelude'
23:19:01  (cd src && make  top_distdir=../../cfa-cc-1.0.0.1765 distdir=../../../cfa-cc-1.0.0.1765/libcfa/src \
23:19:01      am__remove_distdir=: am__skip_length_check=: am__skip_mode_fix=: distdir)
23:19:01 make[6]: Entering directory '/var/lib/jenkins/workspace/Cforall_Distribute_Ref@tmp/libcfa/x64-nodebug/src'
23:19:01 make  distdir-am
23:19:01 make[7]: Entering directory '/var/lib/jenkins/workspace/Cforall_Distribute_Ref@tmp/libcfa/x64-nodebug/src'
23:19:02 make[7]: Leaving directory '/var/lib/jenkins/workspace/Cforall_Distribute_Ref@tmp/libcfa/x64-nodebug/src'
23:19:02 make[6]: Leaving directory '/var/lib/jenkins/workspace/Cforall_Distribute_Ref@tmp/libcfa/x64-nodebug/src'
23:19:02 test -n ":" \
23:19:02 || find "../../cfa-cc-1.0.0.1765/libcfa" -type d ! -perm -755 \
23:19:02 	-exec chmod u+rwx,go+rx {} \; -o \
23:19:02   ! -type d ! -perm -444 -links 1 -exec chmod a+r {} \; -o \
23:19:02   ! -type d ! -perm -400 -exec chmod a+r {} \; -o \
23:19:02   ! -type d ! -perm -444 -exec /bin/bash /var/lib/jenkins/workspace/Cforall_Distribute_Ref/libcfa/automake/install-sh -c -m a+r {} {} \; \
23:19:02 || chmod -R a+r "../../cfa-cc-1.0.0.1765/libcfa"
23:19:02 make[5]: Leaving directory '/var/lib/jenkins/workspace/Cforall_Distribute_Ref@tmp/libcfa/x64-nodebug'
23:19:02 make[4]: Leaving directory '/var/lib/jenkins/workspace/Cforall_Distribute_Ref@tmp/libcfa/x64-nodebug'
23:19:02 make[3]: Leaving directory '/var/lib/jenkins/workspace/Cforall_Distribute_Ref@tmp/libcfa'
23:19:02  (cd tests && make  top_distdir=../cfa-cc-1.0.0.1765 distdir=../cfa-cc-1.0.0.1765/tests \
23:19:02      am__remove_distdir=: am__skip_length_check=: am__skip_mode_fix=: distdir)
23:19:02 make[3]: Entering directory '/var/lib/jenkins/workspace/Cforall_Distribute_Ref@tmp/tests'
23:19:02 make  distdir-am
23:19:02 make[4]: Entering directory '/var/lib/jenkins/workspace/Cforall_Distribute_Ref@tmp/tests'
23:19:02 make  \
23:19:02   top_distdir="../cfa-cc-1.0.0.1765" distdir="../cfa-cc-1.0.0.1765/tests" \
23:19:02   dist-hook
23:19:02 make[5]: Entering directory '/var/lib/jenkins/workspace/Cforall_Distribute_Ref@tmp/tests'
23:19:02 echo "Gathering test files"
23:19:02 Gathering test files
23:19:02 for file in `python3 ./test.py --list-dist`; do \
23:19:02 	if test -f /var/lib/jenkins/workspace/Cforall_Distribute_Ref/tests/${file}; then \
23:19:02 		/usr/bin/mkdir -p $(dirname ../cfa-cc-1.0.0.1765/tests/${file}); \
23:19:02 		cp -df /var/lib/jenkins/workspace/Cforall_Distribute_Ref/tests/${file} ../cfa-cc-1.0.0.1765/tests/${file}; \
23:19:02 	fi; \
23:19:02 done
23:19:10 make[5]: Leaving directory '/var/lib/jenkins/workspace/Cforall_Distribute_Ref@tmp/tests'
23:19:10 make[4]: Leaving directory '/var/lib/jenkins/workspace/Cforall_Distribute_Ref@tmp/tests'
23:19:10 make[3]: Leaving directory '/var/lib/jenkins/workspace/Cforall_Distribute_Ref@tmp/tests'
23:19:10 test -n "" \
23:19:10 || find "cfa-cc-1.0.0.1765" -type d ! -perm -755 \
23:19:10 	-exec chmod u+rwx,go+rx {} \; -o \
23:19:10   ! -type d ! -perm -444 -links 1 -exec chmod a+r {} \; -o \
23:19:10   ! -type d ! -perm -400 -exec chmod a+r {} \; -o \
23:19:10   ! -type d ! -perm -444 -exec /bin/bash /var/lib/jenkins/workspace/Cforall_Distribute_Ref/automake/install-sh -c -m a+r {} {} \; \
23:19:10 || chmod -R a+r "cfa-cc-1.0.0.1765"
23:19:10 make[2]: Leaving directory '/var/lib/jenkins/workspace/Cforall_Distribute_Ref@tmp'
23:19:10 tardir=cfa-cc-1.0.0.1765 && ${TAR-tar} chof - "$tardir" | eval GZIP= gzip --best -c >cfa-cc-1.0.0.1765.tar.gz
23:19:10 make[1]: Leaving directory '/var/lib/jenkins/workspace/Cforall_Distribute_Ref@tmp'
23:19:10 if test -d "cfa-cc-1.0.0.1765"; then find "cfa-cc-1.0.0.1765" -type d ! -perm -200 -exec chmod u+w {} ';' && rm -rf "cfa-cc-1.0.0.1765" || { sleep 5 && rm -rf "cfa-cc-1.0.0.1765"; }; else :; fi
[Pipeline] }
[Pipeline] // dir
[Pipeline] }
[Pipeline] // stage
[Pipeline] echo
23:19:10  -------- Test -------- 
[Pipeline] stage
[Pipeline] { (Test)
[Pipeline] dir
23:19:10 Running in /var/lib/jenkins/workspace/Cforall_Distribute_Ref@tmp
[Pipeline] {
[Pipeline] sh
23:19:10 + make VERSION=1.0.0.1765 distcheck -j 8
23:19:10 make  dist-gzip am__post_remove_distdir='@:'
23:19:10 make[1]: Entering directory '/var/lib/jenkins/workspace/Cforall_Distribute_Ref@tmp'
23:19:10 make  distdir-am
23:19:10 make[2]: Entering directory '/var/lib/jenkins/workspace/Cforall_Distribute_Ref@tmp'
23:19:10 if test -d "cfa-cc-1.0.0.1765"; then find "cfa-cc-1.0.0.1765" -type d ! -perm -200 -exec chmod u+w {} ';' && rm -rf "cfa-cc-1.0.0.1765" || { sleep 5 && rm -rf "cfa-cc-1.0.0.1765"; }; else :; fi
23:19:10 test -d "cfa-cc-1.0.0.1765" || mkdir "cfa-cc-1.0.0.1765"
23:19:10  (cd driver && make  top_distdir=../cfa-cc-1.0.0.1765 distdir=../cfa-cc-1.0.0.1765/driver \
23:19:10      am__remove_distdir=: am__skip_length_check=: am__skip_mode_fix=: distdir)
23:19:10 make[3]: Entering directory '/var/lib/jenkins/workspace/Cforall_Distribute_Ref@tmp/driver'
23:19:10 make  distdir-am
23:19:10 make[4]: Entering directory '/var/lib/jenkins/workspace/Cforall_Distribute_Ref@tmp/driver'
23:19:10 make[4]: Leaving directory '/var/lib/jenkins/workspace/Cforall_Distribute_Ref@tmp/driver'
23:19:10 make[3]: Leaving directory '/var/lib/jenkins/workspace/Cforall_Distribute_Ref@tmp/driver'
23:19:10  (cd src && make  top_distdir=../cfa-cc-1.0.0.1765 distdir=../cfa-cc-1.0.0.1765/src \
23:19:10      am__remove_distdir=: am__skip_length_check=: am__skip_mode_fix=: distdir)
23:19:10 make[3]: Entering directory '/var/lib/jenkins/workspace/Cforall_Distribute_Ref@tmp/src'
23:19:10 make  distdir-am
23:19:10 make[4]: Entering directory '/var/lib/jenkins/workspace/Cforall_Distribute_Ref@tmp/src'
23:19:11 make[4]: Leaving directory '/var/lib/jenkins/workspace/Cforall_Distribute_Ref@tmp/src'
23:19:11 make[3]: Leaving directory '/var/lib/jenkins/workspace/Cforall_Distribute_Ref@tmp/src'
23:19:11  (cd libcfa && make  top_distdir=../cfa-cc-1.0.0.1765 distdir=../cfa-cc-1.0.0.1765/libcfa \
23:19:11      am__remove_distdir=: am__skip_length_check=: am__skip_mode_fix=: distdir)
23:19:11 make[3]: Entering directory '/var/lib/jenkins/workspace/Cforall_Distribute_Ref@tmp/libcfa'
23:19:11 Distributing libcfa from 'libcfa/x64-nodebug'
23:19:11 make -C /var/lib/jenkins/workspace/Cforall_Distribute_Ref@tmp/libcfa/x64-nodebug distdir \
23:19:11 top_distdir=../cfa-cc-1.0.0.1765 \
23:19:11 distdir=../../cfa-cc-1.0.0.1765/libcfa \
23:19:11 am__remove_distdir=$(am__remove_distdir) \
23:19:11 am__skip_length_check=: \
23:19:11 am__skip_mode_fix=:
23:19:11 /bin/bash: am__remove_distdir: command not found
23:19:11 make[4]: Entering directory '/var/lib/jenkins/workspace/Cforall_Distribute_Ref@tmp/libcfa/x64-nodebug'
23:19:11 make  distdir-am
23:19:11 make[5]: Entering directory '/var/lib/jenkins/workspace/Cforall_Distribute_Ref@tmp/libcfa/x64-nodebug'
23:19:11 test -d "../../cfa-cc-1.0.0.1765/libcfa" || mkdir "../../cfa-cc-1.0.0.1765/libcfa"
23:19:11  (cd prelude && make  top_distdir=../../cfa-cc-1.0.0.1765 distdir=../../../cfa-cc-1.0.0.1765/libcfa/prelude \
23:19:11      am__remove_distdir=: am__skip_length_check=: am__skip_mode_fix=: distdir)
23:19:11 make[6]: Entering directory '/var/lib/jenkins/workspace/Cforall_Distribute_Ref@tmp/libcfa/x64-nodebug/prelude'
23:19:11 make  distdir-am
23:19:11 make[7]: Entering directory '/var/lib/jenkins/workspace/Cforall_Distribute_Ref@tmp/libcfa/x64-nodebug/prelude'
23:19:11 make[7]: Leaving directory '/var/lib/jenkins/workspace/Cforall_Distribute_Ref@tmp/libcfa/x64-nodebug/prelude'
23:19:11 make[6]: Leaving directory '/var/lib/jenkins/workspace/Cforall_Distribute_Ref@tmp/libcfa/x64-nodebug/prelude'
23:19:11  (cd src && make  top_distdir=../../cfa-cc-1.0.0.1765 distdir=../../../cfa-cc-1.0.0.1765/libcfa/src \
23:19:11      am__remove_distdir=: am__skip_length_check=: am__skip_mode_fix=: distdir)
23:19:11 make[6]: Entering directory '/var/lib/jenkins/workspace/Cforall_Distribute_Ref@tmp/libcfa/x64-nodebug/src'
23:19:11 make  distdir-am
23:19:11 make[7]: Entering directory '/var/lib/jenkins/workspace/Cforall_Distribute_Ref@tmp/libcfa/x64-nodebug/src'
23:19:11 make[7]: Leaving directory '/var/lib/jenkins/workspace/Cforall_Distribute_Ref@tmp/libcfa/x64-nodebug/src'
23:19:11 make[6]: Leaving directory '/var/lib/jenkins/workspace/Cforall_Distribute_Ref@tmp/libcfa/x64-nodebug/src'
23:19:11 test -n ":" \
23:19:11 || find "../../cfa-cc-1.0.0.1765/libcfa" -type d ! -perm -755 \
23:19:11 	-exec chmod u+rwx,go+rx {} \; -o \
23:19:11   ! -type d ! -perm -444 -links 1 -exec chmod a+r {} \; -o \
23:19:11   ! -type d ! -perm -400 -exec chmod a+r {} \; -o \
23:19:11   ! -type d ! -perm -444 -exec /bin/bash /var/lib/jenkins/workspace/Cforall_Distribute_Ref/libcfa/automake/install-sh -c -m a+r {} {} \; \
23:19:11 || chmod -R a+r "../../cfa-cc-1.0.0.1765/libcfa"
23:19:11 make[5]: Leaving directory '/var/lib/jenkins/workspace/Cforall_Distribute_Ref@tmp/libcfa/x64-nodebug'
23:19:11 make[4]: Leaving directory '/var/lib/jenkins/workspace/Cforall_Distribute_Ref@tmp/libcfa/x64-nodebug'
23:19:11 make[3]: Leaving directory '/var/lib/jenkins/workspace/Cforall_Distribute_Ref@tmp/libcfa'
23:19:11  (cd tests && make  top_distdir=../cfa-cc-1.0.0.1765 distdir=../cfa-cc-1.0.0.1765/tests \
23:19:11      am__remove_distdir=: am__skip_length_check=: am__skip_mode_fix=: distdir)
23:19:11 make[3]: Entering directory '/var/lib/jenkins/workspace/Cforall_Distribute_Ref@tmp/tests'
23:19:11 make  distdir-am
23:19:11 make[4]: Entering directory '/var/lib/jenkins/workspace/Cforall_Distribute_Ref@tmp/tests'
23:19:11 make  \
23:19:11   top_distdir="../cfa-cc-1.0.0.1765" distdir="../cfa-cc-1.0.0.1765/tests" \
23:19:11   dist-hook
23:19:11 make[5]: Entering directory '/var/lib/jenkins/workspace/Cforall_Distribute_Ref@tmp/tests'
23:19:11 echo "Gathering test files"
23:19:11 Gathering test files
23:19:11 for file in `python3 ./test.py --list-dist`; do \
23:19:11 	if test -f /var/lib/jenkins/workspace/Cforall_Distribute_Ref/tests/${file}; then \
23:19:11 		/usr/bin/mkdir -p $(dirname ../cfa-cc-1.0.0.1765/tests/${file}); \
23:19:11 		cp -df /var/lib/jenkins/workspace/Cforall_Distribute_Ref/tests/${file} ../cfa-cc-1.0.0.1765/tests/${file}; \
23:19:11 	fi; \
23:19:11 done
23:19:20 make[5]: Leaving directory '/var/lib/jenkins/workspace/Cforall_Distribute_Ref@tmp/tests'
23:19:20 make[4]: Leaving directory '/var/lib/jenkins/workspace/Cforall_Distribute_Ref@tmp/tests'
23:19:20 make[3]: Leaving directory '/var/lib/jenkins/workspace/Cforall_Distribute_Ref@tmp/tests'
23:19:20 test -n "" \
23:19:20 || find "cfa-cc-1.0.0.1765" -type d ! -perm -755 \
23:19:20 	-exec chmod u+rwx,go+rx {} \; -o \
23:19:20   ! -type d ! -perm -444 -links 1 -exec chmod a+r {} \; -o \
23:19:20   ! -type d ! -perm -400 -exec chmod a+r {} \; -o \
23:19:20   ! -type d ! -perm -444 -exec /bin/bash /var/lib/jenkins/workspace/Cforall_Distribute_Ref/automake/install-sh -c -m a+r {} {} \; \
23:19:20 || chmod -R a+r "cfa-cc-1.0.0.1765"
23:19:20 make[2]: Leaving directory '/var/lib/jenkins/workspace/Cforall_Distribute_Ref@tmp'
23:19:20 tardir=cfa-cc-1.0.0.1765 && ${TAR-tar} chof - "$tardir" | eval GZIP= gzip --best -c >cfa-cc-1.0.0.1765.tar.gz
23:19:20 make[1]: Leaving directory '/var/lib/jenkins/workspace/Cforall_Distribute_Ref@tmp'
23:19:20 if test -d "cfa-cc-1.0.0.1765"; then find "cfa-cc-1.0.0.1765" -type d ! -perm -200 -exec chmod u+w {} ';' && rm -rf "cfa-cc-1.0.0.1765" || { sleep 5 && rm -rf "cfa-cc-1.0.0.1765"; }; else :; fi
23:19:20 case 'cfa-cc-1.0.0.1765.tar.gz' in \
23:19:20 *.tar.gz*) \
23:19:20   eval GZIP= gzip --best -dc cfa-cc-1.0.0.1765.tar.gz | ${TAR-tar} xf - ;;\
23:19:20 *.tar.bz2*) \
23:19:20   bzip2 -dc cfa-cc-1.0.0.1765.tar.bz2 | ${TAR-tar} xf - ;;\
23:19:20 *.tar.lz*) \
23:19:20   lzip -dc cfa-cc-1.0.0.1765.tar.lz | ${TAR-tar} xf - ;;\
23:19:20 *.tar.xz*) \
23:19:20   xz -dc cfa-cc-1.0.0.1765.tar.xz | ${TAR-tar} xf - ;;\
23:19:20 *.tar.Z*) \
23:19:20   uncompress -c cfa-cc-1.0.0.1765.tar.Z | ${TAR-tar} xf - ;;\
23:19:20 *.shar.gz*) \
23:19:20   eval GZIP= gzip --best -dc cfa-cc-1.0.0.1765.shar.gz | unshar ;;\
23:19:20 *.zip*) \
23:19:20   unzip cfa-cc-1.0.0.1765.zip ;;\
23:19:20 esac
23:19:20 chmod -R a-w cfa-cc-1.0.0.1765
23:19:20 chmod u+w cfa-cc-1.0.0.1765
23:19:20 mkdir cfa-cc-1.0.0.1765/_build cfa-cc-1.0.0.1765/_build/sub cfa-cc-1.0.0.1765/_inst
23:19:20 chmod a-w cfa-cc-1.0.0.1765
23:19:20 test -d cfa-cc-1.0.0.1765/_build || exit 0; \
23:19:20 dc_install_base=`CDPATH="${ZSH_VERSION+.}:" && cd cfa-cc-1.0.0.1765/_inst && pwd | sed -e 's,^[^:\\/]:[\\/],/,'` \
23:19:20   && dc_destdir="${TMPDIR-/tmp}/am-dc-$$/" \
23:19:20   && am__cwd=`pwd` \
23:19:20   && CDPATH="${ZSH_VERSION+.}:" && cd cfa-cc-1.0.0.1765/_build/sub \
23:19:20   && ../../configure \
23:19:20      \
23:19:20      \
23:19:20     --srcdir=../.. --prefix="$dc_install_base" \
23:19:20   && make  \
23:19:20   && make  dvi \
23:19:20   && make  check \
23:19:20   && make  install \
23:19:20   && make  installcheck \
23:19:20   && make  uninstall \
23:19:20   && make  distuninstallcheck_dir="$dc_install_base" \
23:19:20         distuninstallcheck \
23:19:20   && chmod -R a-w "$dc_install_base" \
23:19:20   && ({ \
23:19:20        (cd ../.. && umask 077 && mkdir "$dc_destdir") \
23:19:20        && make  DESTDIR="$dc_destdir" install \
23:19:20        && make  DESTDIR="$dc_destdir" uninstall \
23:19:20        && make  DESTDIR="$dc_destdir" \
23:19:20             distuninstallcheck_dir="$dc_destdir" distuninstallcheck; \
23:19:20       } || { rm -rf "$dc_destdir"; exit 1; }) \
23:19:20   && rm -rf "$dc_destdir" \
23:19:20   && make  dist \
23:19:20   && rm -rf cfa-cc-1.0.0.1765.tar.gz \
23:19:20   && make  distcleancheck \
23:19:20   && cd "$am__cwd" \
23:19:20   || exit 1
23:19:20 checking whether make supports nested variables... yes
23:19:20 checking for a BSD-compatible install... /usr/bin/install -c
23:19:20 checking whether build environment is sane... yes
23:19:20 checking for a thread-safe mkdir -p... /usr/bin/mkdir -p
23:19:20 checking for gawk... gawk
23:19:20 checking whether make sets $(MAKE)... yes
23:19:20 checking build system type... x86_64-pc-linux-gnu
23:19:20 checking host system type... x86_64-pc-linux-gnu
23:19:20 checking for g++... g++
23:19:20 checking whether the C++ compiler works... yes
23:19:20 checking for C++ compiler default output file name... a.out
23:19:20 checking for suffix of executables... 
23:19:20 checking whether we are cross compiling... no
23:19:20 checking for suffix of object files... o
23:19:20 checking whether we are using the GNU C++ compiler... yes
23:19:20 checking whether g++ accepts -g... yes
23:19:20 checking whether make supports the include directive... yes (GNU style)
23:19:20 checking dependency style of g++... gcc3
23:19:20 checking for gcc... gcc
23:19:20 checking whether we are using the GNU C compiler... yes
23:19:20 checking whether gcc accepts -g... yes
23:19:20 checking for gcc option to accept ISO C89... none needed
23:19:21 checking whether gcc understands -c and -o together... yes
23:19:21 checking dependency style of gcc... gcc3
23:19:21 checking dependency style of gcc... gcc3
23:19:21 checking for bison... bison -y
23:19:21 checking for flex... flex
23:19:21 checking lex output file root... lex.yy
23:19:21 checking lex library... -lfl
23:19:21 checking whether yytext is a pointer... yes
23:19:21 checking how to print strings... printf
23:19:21 checking for a sed that does not truncate output... /usr/bin/sed
23:19:21 checking for grep that handles long lines and -e... /usr/bin/grep
23:19:21 checking for egrep... /usr/bin/grep -E
23:19:21 checking for fgrep... /usr/bin/grep -F
23:19:21 checking for ld used by gcc... /usr/bin/ld
23:19:21 checking if the linker (/usr/bin/ld) is GNU ld... yes
23:19:21 checking for BSD- or MS-compatible name lister (nm)... /usr/bin/nm -B
23:19:21 checking the name lister (/usr/bin/nm -B) interface... BSD nm
23:19:21 checking whether ln -s works... yes
23:19:21 checking the maximum length of command line arguments... 1572864
23:19:21 checking how to convert x86_64-pc-linux-gnu file names to x86_64-pc-linux-gnu format... func_convert_file_noop
23:19:21 checking how to convert x86_64-pc-linux-gnu file names to toolchain format... func_convert_file_noop
23:19:21 checking for /usr/bin/ld option to reload object files... -r
23:19:21 checking for objdump... objdump
23:19:21 checking how to recognize dependent libraries... pass_all
23:19:21 checking for dlltool... no
23:19:21 checking how to associate runtime and link libraries... printf %s\n
23:19:21 checking for ar... ar
23:19:21 checking for archiver @FILE support... @
23:19:21 checking for strip... strip
23:19:21 checking for ranlib... ranlib
23:19:21 checking command to parse /usr/bin/nm -B output from gcc object... ok
23:19:21 checking for sysroot... no
23:19:21 checking for a working dd... /usr/bin/dd
23:19:21 checking how to truncate binary pipes... /usr/bin/dd bs=4096 count=1
23:19:22 checking for mt... mt
23:19:22 checking if mt is a manifest tool... no
23:19:22 checking how to run the C preprocessor... gcc -E
23:19:22 checking for ANSI C header files... yes
23:19:22 checking for sys/types.h... yes
23:19:22 checking for sys/stat.h... yes
23:19:22 checking for stdlib.h... yes
23:19:22 checking for string.h... yes
23:19:22 checking for memory.h... yes
23:19:22 checking for strings.h... yes
23:19:22 checking for inttypes.h... yes
23:19:22 checking for stdint.h... yes
23:19:22 checking for unistd.h... yes
23:19:22 checking for dlfcn.h... yes
23:19:22 checking for objdir... .libs
23:19:22 checking if gcc supports -fno-rtti -fno-exceptions... no
23:19:22 checking for gcc option to produce PIC... -fPIC -DPIC
23:19:22 checking if gcc PIC flag -fPIC -DPIC works... yes
23:19:22 checking if gcc static flag -static works... yes
23:19:22 checking if gcc supports -c -o file.o... yes
23:19:22 checking if gcc supports -c -o file.o... (cached) yes
23:19:22 checking whether the gcc linker (/usr/bin/ld -m elf_x86_64) supports shared libraries... yes
23:19:23 checking whether -lc should be explicitly linked in... no
23:19:23 checking dynamic linker characteristics... GNU/Linux ld.so
23:19:23 checking how to hardcode library paths into programs... immediate
23:19:23 checking whether stripping libraries is possible... yes
23:19:23 checking if libtool supports shared libraries... yes
23:19:23 checking whether to build shared libraries... yes
23:19:23 checking whether to build static libraries... yes
23:19:23 checking how to run the C++ preprocessor... g++ -E
23:19:23 checking for ld used by g++... /usr/bin/ld -m elf_x86_64
23:19:23 checking if the linker (/usr/bin/ld -m elf_x86_64) is GNU ld... yes
23:19:23 checking whether the g++ linker (/usr/bin/ld -m elf_x86_64) supports shared libraries... yes
23:19:23 checking for g++ option to produce PIC... -fPIC -DPIC
23:19:23 checking if g++ PIC flag -fPIC -DPIC works... yes
23:19:23 checking if g++ static flag -static works... yes
23:19:23 checking if g++ supports -c -o file.o... yes
23:19:23 checking if g++ supports -c -o file.o... (cached) yes
23:19:23 checking whether the g++ linker (/usr/bin/ld -m elf_x86_64) supports shared libraries... yes
23:19:23 checking dynamic linker characteristics... (cached) GNU/Linux ld.so
23:19:23 checking how to hardcode library paths into programs... immediate
23:19:23 checking for Fibre::yield in -lfibre... no
23:19:23 checking for ProfilingIsEnabledForAllThreads in -lprofiler... yes
23:19:23 checking for malloc in -ltcmalloc... yes
23:19:23 checking libintl.h usability... yes
23:19:23 checking libintl.h presence... yes
23:19:23 checking for libintl.h... yes
23:19:23 checking malloc.h usability... yes
23:19:24 checking malloc.h presence... yes
23:19:24 checking for malloc.h... yes
23:19:24 checking for unistd.h... (cached) yes
23:19:24 checking for _Float32... yes
23:19:24 checking whether C compiler accepts -Wcast-function-type... yes
23:19:24 checking that generated files are newer than configure... done
23:19:24 configure: creating ./config.status
23:19:25 config.status: creating Makefile
23:19:25 config.status: creating driver/Makefile
23:19:25 config.status: creating src/Makefile
23:19:25 config.status: creating libcfa/Makefile
23:19:25 config.status: creating tests/Makefile
23:19:25 config.status: creating tests/config.py
23:19:25 config.status: creating config.h
23:19:25 config.status: linking ../../tests/test.py to tests/test.py
23:19:25 config.status: executing depfiles commands
23:19:25 config.status: executing libtool commands
23:19:25 Cforall configuraton completed. Type "make -j 8 install".
23:19:25 make[1]: Entering directory '/var/lib/jenkins/workspace/Cforall_Distribute_Ref@tmp/cfa-cc-1.0.0.1765/_build/sub'
23:19:25 make  all-recursive
23:19:25 make[2]: Entering directory '/var/lib/jenkins/workspace/Cforall_Distribute_Ref@tmp/cfa-cc-1.0.0.1765/_build/sub'
23:19:25 Making all in driver
23:19:25 make[3]: Entering directory '/var/lib/jenkins/workspace/Cforall_Distribute_Ref@tmp/cfa-cc-1.0.0.1765/_build/sub/driver'
23:19:25   CXX      as.o
23:19:25   CXX      cc1.o
23:19:25   CXX      cfa.o
23:19:25   CXXLD    as
23:19:26   CXXLD    cc1
23:19:27   CXXLD    cfa
23:19:27 make[3]: Leaving directory '/var/lib/jenkins/workspace/Cforall_Distribute_Ref@tmp/cfa-cc-1.0.0.1765/_build/sub/driver'
23:19:27 Making all in src
23:19:27 make[3]: Entering directory '/var/lib/jenkins/workspace/Cforall_Distribute_Ref@tmp/cfa-cc-1.0.0.1765/_build/sub/src'
23:19:27 make  all-am
23:19:27 make[4]: Entering directory '/var/lib/jenkins/workspace/Cforall_Distribute_Ref@tmp/cfa-cc-1.0.0.1765/_build/sub/src'
23:19:27   CXX      main.o
23:19:27   CXX      CompilationState.o
23:19:27   CXX      MakeLibCfa.o
23:19:27   CXX      SymTab/demangler.o
23:19:27   CXX      SymTab/Demangle.o
23:19:27   CXX      AST/AssertAcyclic.o
23:19:27   CXX      AST/Attribute.o
23:19:27   CXX      AST/Convert.o
23:19:27   CXX      AST/Decl.o
23:19:28   CXX      AST/DeclReplacer.o
23:19:28   CXX      AST/Expr.o
23:19:30   CXX      AST/GenericSubstitution.o
23:19:40   CXX      AST/Init.o
23:19:40   CXX      AST/LinkageSpec.o
23:19:40   CXX      AST/Node.o
23:19:40   CXX      AST/Pass.o
23:19:42   CXX      AST/Print.o
23:19:44   CXX      AST/Stmt.o
23:19:46   CXX      AST/SymbolTable.o
23:19:46   CXX      AST/Type.o
23:19:47   CXX      AST/TypeEnvironment.o
23:19:47   CXX      AST/TypeSubstitution.o
23:19:47   CXX      CodeGen/CodeGenerator.o
23:19:49   CXX      CodeGen/FixMain.o
23:19:50   CXX      CodeGen/GenType.o
23:19:51   CXX      CodeGen/LinkOnce.o
23:19:51   CXX      CodeGen/OperatorTable.o
23:19:51   CXX      CodeGen/Generate.o
23:19:53   CXX      CodeGen/FixNames.o
23:19:57   CXX      CodeTools/DeclStats.o
23:20:01   CXX      CodeTools/ResolvProtoDump.o
23:20:02   CXX      CodeTools/TrackLoc.o
23:20:02   CXX      Concurrency/Keywords.o
23:20:05   CXX      Concurrency/Waitfor.o
23:20:07   CXX      Common/Assert.o
23:20:07   CXX      Common/CodeLocationTools.o
23:20:09   CXX      Common/Eval.o
23:20:09   CXX      Common/Examine.o
23:20:11   CXX      Common/PassVisitor.o
23:20:11   CXX      Common/SemanticError.o
23:20:12   CXX      Common/Stats/Counter.o
23:20:12   CXX      Common/Stats/Heap.o
23:20:13   CXX      Common/Stats/ResolveTime.o
23:20:13   CXX      Common/Stats/Stats.o
23:20:14   CXX      Common/Stats/Time.o
23:20:14   CXX      Common/UniqueName.o
23:20:15   CXX      Common/DebugMalloc.o
23:20:15   CXX      ControlStruct/ForExprMutator.o
23:20:15   CXX      ControlStruct/LabelFixer.o
23:20:15   CXX      ControlStruct/LabelGenerator.o
23:20:16   CXX      ControlStruct/MLEMutator.o
23:20:16   CXX      ControlStruct/Mutate.o
23:20:17   CXX      ControlStruct/ExceptTranslate.o
23:20:25   CXX      GenPoly/Box.o
23:20:26   CXX      GenPoly/FindFunction.o
23:20:27   CXX      GenPoly/GenPoly.o
23:20:30   CXX      GenPoly/InstantiateGeneric.o
23:20:30   CXX      GenPoly/Lvalue.o
23:20:31 ../../../src/GenPoly/GenPoly.cc:66:8: warning: ‘bool GenPoly::{anonymous}::hasPolyParams(const std::vector<ast::ptr_base<ast::Expr, ast::Node::ref_type::strong> >&, const TyVarMap&, const ast::TypeSubstitution*)’ defined but not used [-Wunused-function]
23:20:31    66 |   bool hasPolyParams( const std::vector<ast::ptr<ast::Expr>> & params, const TyVarMap & tyVars, const ast::TypeSubstitution * env) {
23:20:31       |        ^~~~~~~~~~~~~
23:20:32   CXX      GenPoly/ScrubTyVars.o
23:20:34   CXX      GenPoly/Specialize.o
23:20:34   CXX      InitTweak/FixGlobalInit.o
23:20:46   CXX      InitTweak/FixInit.o
23:20:53   CXX      InitTweak/GenInit.o
23:20:53   CXX      InitTweak/InitTweak.o
23:20:55   CXX      InitTweak/FixInitNew.o
23:21:00   CXX      Parser/DeclarationNode.o
23:21:04   CXX      Parser/ExpressionNode.o
23:21:08   CXX      Parser/InitializerNode.o
23:21:08   CXX      Parser/lex.o
23:21:09   CXX      Parser/ParseNode.o
23:21:11   CXX      Parser/parser.o
23:21:12   CXX      Parser/parserutility.o
23:21:14   CXX      Parser/StatementNode.o
23:21:17   CXX      Parser/TypeData.o
23:21:19   CXX      Parser/TypedefTable.o
23:21:21   CXX      ResolvExpr/AdjustExprType.o
23:21:21   CXX      ResolvExpr/Alternative.o
23:21:22   CXX      ResolvExpr/AlternativeFinder.o
23:21:25   CXX      ResolvExpr/Candidate.o
23:21:27   CXX      ResolvExpr/CandidateFinder.o
23:21:34   CXX      ResolvExpr/CastCost.o
23:21:34 In file included from ../../../src/ResolvExpr/CastCost.cc:22:
23:21:34 ../../../src/ResolvExpr/ConversionCost.h:79:2: warning: #warning when the old ConversionCost is removed, get ride of the _new suffix. [-Wcpp]
23:21:34    79 | #warning when the old ConversionCost is removed, get ride of the _new suffix.
23:21:34       |  ^~~~~~~
23:21:34 ../../../src/ResolvExpr/CastCost.cc:186:3: warning: #warning For overload resolution between the two versions. [-Wcpp]
23:21:34   186 |  #warning For overload resolution between the two versions.
23:21:34       |   ^~~~~~~
23:21:34 ../../../src/ResolvExpr/CastCost.cc:236:4: warning: #warning cast on ptrsCastable artifact of having two functions, remove when port done [-Wcpp]
23:21:34   236 |   #warning cast on ptrsCastable artifact of having two functions, remove when port done
23:21:34       |    ^~~~~~~
23:21:34 ../../../src/ResolvExpr/CastCost.cc:240:4: warning: #warning cast on castCost artifact of having two functions, remove when port done [-Wcpp]
23:21:34   240 |   #warning cast on castCost artifact of having two functions, remove when port done
23:21:34       |    ^~~~~~~
23:21:36   CXX      ResolvExpr/CommonType.o
23:21:36 ../../../src/ResolvExpr/CommonType.cc:682:6: warning: #warning remove casts when `commonTypes` moved to new AST [-Wcpp]
23:21:36   682 |     #warning remove casts when `commonTypes` moved to new AST
23:21:36       |      ^~~~~~~
23:21:36 ../../../src/ResolvExpr/CommonType.cc:697:6: warning: #warning remove casts when `commonTypes` moved to new AST [-Wcpp]
23:21:36   697 |     #warning remove casts when `commonTypes` moved to new AST
23:21:36       |      ^~~~~~~
23:21:46   CXX      ResolvExpr/ConversionCost.o
23:21:46 In file included from ../../../src/ResolvExpr/ConversionCost.cc:16:
23:21:46 ../../../src/ResolvExpr/ConversionCost.h:79:2: warning: #warning when the old ConversionCost is removed, get ride of the _new suffix. [-Wcpp]
23:21:46    79 | #warning when the old ConversionCost is removed, get ride of the _new suffix.
23:21:46       |  ^~~~~~~
23:21:46 ../../../src/ResolvExpr/ConversionCost.cc:484:4: warning: #warning For overload resolution between the two versions. [-Wcpp]
23:21:46   484 |  # warning For overload resolution between the two versions.
23:21:46       |    ^~~~~~~
23:21:49   CXX      ResolvExpr/CurrentObject.o
23:21:51   CXX      ResolvExpr/ExplodedActual.o
23:21:55   CXX      ResolvExpr/ExplodedArg.o
23:21:55   CXX      ResolvExpr/FindOpenVars.o
23:21:58   CXX      ResolvExpr/Occurs.o
23:21:59   CXX      ResolvExpr/PolyCost.o
23:22:03   CXX      ResolvExpr/PtrsAssignable.o
23:22:07   CXX      ResolvExpr/PtrsCastable.o
23:22:13   CXX      ResolvExpr/RenameVars.o
23:22:14   CXX      ResolvExpr/ResolveAssertions.o
23:22:17   CXX      ResolvExpr/Resolver.o
23:22:20   CXX      ResolvExpr/ResolveTypeof.o
23:22:23   CXX      ResolvExpr/SatisfyAssertions.o
23:22:24   CXX      ResolvExpr/SpecCost.o
23:22:24 ../../../src/ResolvExpr/SpecCost.cc:133:4: warning: #warning Should use a standard maybe_accept [-Wcpp]
23:22:24   133 |   #warning Should use a standard maybe_accept
23:22:24       |    ^~~~~~~
23:22:30   CXX      ResolvExpr/TypeEnvironment.o
23:22:32   CXX      ResolvExpr/Unify.o
23:22:33   CXX      ResolvExpr/AlternativePrinter.o
23:22:35   CXX      SymTab/Autogen.o
23:22:36   CXX      SymTab/FixFunction.o
23:22:37   CXX      SymTab/Indexer.o
23:22:47   CXX      SymTab/Mangler.o
23:22:49   CXX      SymTab/ManglerCommon.o
23:22:50   CXX      SymTab/Validate.o
23:22:50   CXX      SynTree/AddressExpr.o
23:22:51   CXX      SynTree/AggregateDecl.o
23:22:51   CXX      SynTree/ApplicationExpr.o
23:22:51   CXX      SynTree/ArrayType.o
23:22:53   CXX      SynTree/Attribute.o
23:22:53   CXX      SynTree/AttrType.o
23:22:54   CXX      SynTree/BasicType.o
23:22:54   CXX      SynTree/CommaExpr.o
23:22:55   CXX      SynTree/CompoundStmt.o
23:22:55   CXX      SynTree/Constant.o
23:22:56   CXX      SynTree/Declaration.o
23:22:57   CXX      SynTree/DeclarationWithType.o
23:22:57   CXX      SynTree/DeclReplacer.o
23:22:58   CXX      SynTree/DeclStmt.o
23:22:58   CXX      SynTree/Expression.o
23:22:59   CXX      SynTree/FunctionDecl.o
23:23:01   CXX      SynTree/FunctionType.o
23:23:02   CXX      SynTree/Initializer.o
23:23:03 ../../../src/SymTab/Validate.cc:1462:7: warning: ‘void SymTab::{anonymous}::expandAssertions(const ast::TraitInstType*, std::vector<ast::ptr_base<ast::DeclWithType, ast::Node::ref_type::strong> >&)’ defined but not used [-Wunused-function]
23:23:03  1462 |  void expandAssertions(
23:23:03       |       ^~~~~~~~~~~~~~~~
23:23:03   CXX      SynTree/LinkageSpec.o
23:23:04   CXX      SynTree/NamedTypeDecl.o
23:23:04   CXX      SynTree/ObjectDecl.o
23:23:05   CXX      SynTree/PointerType.o
23:23:05   CXX      SynTree/ReferenceToType.o
23:23:06   CXX      SynTree/ReferenceType.o
23:23:07   CXX      SynTree/Statement.o
23:23:07 ../../../src/SynTree/ReferenceToType.cc: In member function ‘virtual void TypeInstType::print(std::ostream&, Indenter) const’:
23:23:07 ../../../src/SynTree/ReferenceToType.cc:209:15: warning: unused variable ‘name_’ [-Wunused-variable]
23:23:07   209 |  const auto & name_ = get_name();
23:23:07       |               ^~~~~
23:23:07   CXX      SynTree/TupleExpr.o
23:23:08   CXX      SynTree/TupleType.o
23:23:10   CXX      SynTree/Type.o
23:23:10   CXX      SynTree/TypeDecl.o
23:23:11   CXX      SynTree/TypeExpr.o
23:23:11   CXX      SynTree/TypeofType.o
23:23:12   CXX      SynTree/TypeSubstitution.o
23:23:12   CXX      SynTree/VarArgsType.o
23:23:13   CXX      SynTree/VoidType.o
23:23:13   CXX      SynTree/ZeroOneType.o
23:23:13   CXX      Tuples/Explode.o
23:23:13   CXX      Tuples/TupleAssignment.o
23:23:13   CXX      Tuples/TupleExpansion.o
23:23:14   CXX      Tuples/Tuples.o
23:23:24   CXX      Validate/HandleAttributes.o
23:23:29   CXX      Validate/FindSpecialDecls.o
23:23:29   CXX      Virtual/ExpandCasts.o
23:23:33   CXX      Virtual/Tables.o
23:25:24   CXXLD    ../driver/cfa-cpp
23:25:24   AR       libdemangle.a
23:25:46   CXXLD    demangler
23:25:51 make[4]: Leaving directory '/var/lib/jenkins/workspace/Cforall_Distribute_Ref@tmp/cfa-cc-1.0.0.1765/_build/sub/src'
23:25:51 make[3]: Leaving directory '/var/lib/jenkins/workspace/Cforall_Distribute_Ref@tmp/cfa-cc-1.0.0.1765/_build/sub/src'
23:25:51 Making all in .
23:25:51 make[3]: Entering directory '/var/lib/jenkins/workspace/Cforall_Distribute_Ref@tmp/cfa-cc-1.0.0.1765/_build/sub'
23:25:51 libcfa/x64-debug/config.data
23:25:51 Configuring libcfa (/var/lib/jenkins/workspace/Cforall_Distribute_Ref@tmp/cfa-cc-1.0.0.1765/_build/sub/../../libcfa/configure) with ''--prefix=/var/lib/jenkins/workspace/Cforall_Distribute_Ref@tmp/cfa-cc-1.0.0.1765/_inst' DRIVER_DIR=/var/lib/jenkins/workspace/Cforall_Distribute_Ref@tmp/cfa-cc-1.0.0.1765/_build/sub/driver/ ARCHITECTURE=x64 CONFIGURATION=debug CFA_VERSION=1:0:0' from /var/lib/jenkins/workspace/Cforall_Distribute_Ref@tmp/cfa-cc-1.0.0.1765/_build/sub / libcfa/x64-debug/
23:25:51 libcfa/x64-nodebug/config.data
23:25:51 Configuring libcfa (/var/lib/jenkins/workspace/Cforall_Distribute_Ref@tmp/cfa-cc-1.0.0.1765/_build/sub/../../libcfa/configure) with ''--prefix=/var/lib/jenkins/workspace/Cforall_Distribute_Ref@tmp/cfa-cc-1.0.0.1765/_inst' DRIVER_DIR=/var/lib/jenkins/workspace/Cforall_Distribute_Ref@tmp/cfa-cc-1.0.0.1765/_build/sub/driver/ ARCHITECTURE=x64 CONFIGURATION=nodebug CFA_VERSION=1:0:0' from /var/lib/jenkins/workspace/Cforall_Distribute_Ref@tmp/cfa-cc-1.0.0.1765/_build/sub / libcfa/x64-nodebug/
23:25:52 checking whether make supports nested variables... checking whether make supports nested variables... yes
23:25:52 checking for a BSD-compatible install... yes
23:25:52 checking for a BSD-compatible install... /usr/bin/install -c
23:25:52 checking whether build environment is sane... /usr/bin/install -c
23:25:52 checking whether build environment is sane... yes
23:25:52 yes
23:25:52 checking for a thread-safe mkdir -p... checking for a thread-safe mkdir -p... /usr/bin/mkdir -p
23:25:52 checking for gawk... gawk
23:25:52 /usr/bin/mkdir -p
23:25:52 checking whether make sets $(MAKE)... checking for gawk... gawk
23:25:52 checking whether make sets $(MAKE)... yes
23:25:52 yes
23:25:52 checking for distributated build... no
23:25:52 checking for distributated build... no
23:25:52 checking build system type... checking build system type... x86_64-pc-linux-gnu
23:25:52 checking host system type... x86_64-pc-linux-gnu
23:25:52 checking how to print strings... printf
23:25:52 checking whether make supports the include directive... yes (GNU style)
23:25:52 checking for gcc... gcc
23:25:52 x86_64-pc-linux-gnu
23:25:52 checking host system type... x86_64-pc-linux-gnu
23:25:52 checking how to print strings... checking whether the C compiler works... printf
23:25:52 checking whether make supports the include directive... yes
23:25:52 checking for C compiler default output file name... a.out
23:25:52 checking for suffix of executables... yes (GNU style)
23:25:52 checking for gcc... gcc
23:25:52 checking whether the C compiler works... 
23:25:52 checking whether we are cross compiling... yes
23:25:52 checking for C compiler default output file name... a.out
23:25:52 checking for suffix of executables... no
23:25:52 checking for suffix of object files... 
23:25:52 checking whether we are cross compiling... o
23:25:52 checking whether we are using the GNU C compiler... no
23:25:52 checking for suffix of object files... yes
23:25:52 checking whether gcc accepts -g... o
23:25:52 checking whether we are using the GNU C compiler... yes
23:25:52 checking for gcc option to accept ISO C89... yes
23:25:52 checking whether gcc accepts -g... none needed
23:25:52 checking whether gcc understands -c and -o together... yes
23:25:52 checking for gcc option to accept ISO C89... yes
23:25:52 checking dependency style of gcc... none needed
23:25:52 checking whether gcc understands -c and -o together... gcc3
23:25:52 checking for a sed that does not truncate output... /usr/bin/sed
23:25:52 checking for grep that handles long lines and -e... /usr/bin/grep
23:25:52 checking for egrep... /usr/bin/grep -E
23:25:52 checking for fgrep... /usr/bin/grep -F
23:25:53 checking for ld used by gcc... /usr/bin/ld
23:25:53 checking if the linker (/usr/bin/ld) is GNU ld... yes
23:25:53 checking for BSD- or MS-compatible name lister (nm)... /usr/bin/nm -B
23:25:53 checking the name lister (/usr/bin/nm -B) interface... yes
23:25:53 checking dependency style of gcc... BSD nm
23:25:53 checking whether ln -s works... yes
23:25:53 checking the maximum length of command line arguments... 1572864
23:25:53 checking how to convert x86_64-pc-linux-gnu file names to x86_64-pc-linux-gnu format... func_convert_file_noop
23:25:53 checking how to convert x86_64-pc-linux-gnu file names to toolchain format... func_convert_file_noop
23:25:53 checking for /usr/bin/ld option to reload object files... -r
23:25:53 checking for objdump... objdump
23:25:53 checking how to recognize dependent libraries... pass_all
23:25:53 checking for dlltool... no
23:25:53 checking how to associate runtime and link libraries... printf %s\n
23:25:53 checking for ar... ar
23:25:53 checking for archiver @FILE support... gcc3
23:25:53 checking for a sed that does not truncate output... /usr/bin/sed
23:25:53 checking for grep that handles long lines and -e... /usr/bin/grep
23:25:53 checking for egrep... /usr/bin/grep -E
23:25:53 checking for fgrep... /usr/bin/grep -F
23:25:53 checking for ld used by gcc... /usr/bin/ld
23:25:53 checking if the linker (/usr/bin/ld) is GNU ld... yes
23:25:53 checking for BSD- or MS-compatible name lister (nm)... /usr/bin/nm -B
23:25:53 checking the name lister (/usr/bin/nm -B) interface... BSD nm
23:25:53 checking whether ln -s works... yes
23:25:53 checking the maximum length of command line arguments... @
23:25:53 checking for strip... strip
23:25:53 checking for ranlib... ranlib
23:25:53 checking command to parse /usr/bin/nm -B output from gcc object... 1572864
23:25:53 checking how to convert x86_64-pc-linux-gnu file names to x86_64-pc-linux-gnu format... func_convert_file_noop
23:25:53 checking how to convert x86_64-pc-linux-gnu file names to toolchain format... func_convert_file_noop
23:25:53 checking for /usr/bin/ld option to reload object files... -r
23:25:53 checking for objdump... objdump
23:25:53 checking how to recognize dependent libraries... pass_all
23:25:53 checking for dlltool... no
23:25:53 checking how to associate runtime and link libraries... printf %s\n
23:25:53 checking for ar... ar
23:25:53 checking for archiver @FILE support... @
23:25:53 checking for strip... strip
23:25:53 checking for ranlib... ranlib
23:25:53 checking command to parse /usr/bin/nm -B output from gcc object... ok
23:25:53 checking for sysroot... no
23:25:53 checking for a working dd... /usr/bin/dd
23:25:53 checking how to truncate binary pipes... /usr/bin/dd bs=4096 count=1
23:25:53 checking for mt... mt
23:25:53 checking if mt is a manifest tool... no
23:25:53 checking how to run the C preprocessor... ok
23:25:53 checking for sysroot... no
23:25:53 checking for a working dd... /usr/bin/dd
23:25:53 checking how to truncate binary pipes... gcc -E
23:25:53 /usr/bin/dd bs=4096 count=1
23:25:53 checking for mt... mt
23:25:53 checking if mt is a manifest tool... no
23:25:53 checking how to run the C preprocessor... checking for ANSI C header files... gcc -E
23:25:54 checking for ANSI C header files... yes
23:25:54 checking for sys/types.h... yes
23:25:55 checking for sys/types.h... yes
23:25:55 yes
23:25:55 checking for sys/stat.h... checking for sys/stat.h... yes
23:25:55 checking for stdlib.h... yes
23:25:55 checking for stdlib.h... yes
23:25:55 checking for string.h... yes
23:25:55 checking for string.h... yes
23:25:55 checking for memory.h... yes
23:25:55 checking for memory.h... yes
23:25:55 checking for strings.h... yes
23:25:55 checking for strings.h... yes
23:25:55 checking for inttypes.h... yes
23:25:55 checking for stdint.h... yes
23:25:55 checking for inttypes.h... yes
23:25:55 checking for unistd.h... yes
23:25:55 checking for stdint.h... yes
23:25:55 yes
23:25:55 checking for dlfcn.h... checking for unistd.h... yes
23:25:55 checking for objdir... .libs
23:25:55 yes
23:25:55 checking for dlfcn.h... yes
23:25:55 checking for objdir... .libs
23:25:55 checking if gcc supports -fno-rtti -fno-exceptions... no
23:25:55 checking for gcc option to produce PIC... -fPIC -DPIC
23:25:55 checking if gcc PIC flag -fPIC -DPIC works... checking if gcc supports -fno-rtti -fno-exceptions... yes
23:25:55 checking if gcc static flag -static works... no
23:25:55 checking for gcc option to produce PIC... -fPIC -DPIC
23:25:55 checking if gcc PIC flag -fPIC -DPIC works... yes
23:25:55 checking if gcc static flag -static works... yes
23:25:55 checking if gcc supports -c -o file.o... yes
23:25:55 checking if gcc supports -c -o file.o... (cached) yes
23:25:55 checking whether the gcc linker (/usr/bin/ld -m elf_x86_64) supports shared libraries... yes
23:25:55 checking whether -lc should be explicitly linked in... yes
23:25:55 checking if gcc supports -c -o file.o... no
23:25:55 checking dynamic linker characteristics... yes
23:25:55 checking if gcc supports -c -o file.o... (cached) yes
23:25:55 checking whether the gcc linker (/usr/bin/ld -m elf_x86_64) supports shared libraries... yes
23:25:55 checking whether -lc should be explicitly linked in... GNU/Linux ld.so
23:25:55 checking how to hardcode library paths into programs... immediate
23:25:55 checking whether stripping libraries is possible... no
23:25:55 checking dynamic linker characteristics... yes
23:25:55 checking if libtool supports shared libraries... yes
23:25:55 checking whether to build shared libraries... yes
23:25:55 checking whether to build static libraries... no
23:25:55 checking for g++... g++
23:25:56 checking whether we are using the GNU C++ compiler... yes
23:25:56 checking whether g++ accepts -g... GNU/Linux ld.so
23:25:56 checking how to hardcode library paths into programs... immediate
23:25:56 checking whether stripping libraries is possible... yes
23:25:56 checking if libtool supports shared libraries... yes
23:25:56 checking whether to build shared libraries... yes
23:25:56 checking whether to build static libraries... no
23:25:56 checking for g++... g++
23:25:56 yes
23:25:56 checking dependency style of g++... checking whether we are using the GNU C++ compiler... gcc3
23:25:56 checking how to run the C++ preprocessor... yes
23:25:56 checking whether g++ accepts -g... yes
23:25:56 checking dependency style of g++... g++ -E
23:25:56 gcc3
23:25:56 checking how to run the C++ preprocessor... g++ -E
23:25:56 checking for ld used by g++... /usr/bin/ld -m elf_x86_64
23:25:56 checking if the linker (/usr/bin/ld -m elf_x86_64) is GNU ld... yes
23:25:56 checking whether the g++ linker (/usr/bin/ld -m elf_x86_64) supports shared libraries... yes
23:25:56 checking for ld used by g++... /usr/bin/ld -m elf_x86_64
23:25:56 checking if the linker (/usr/bin/ld -m elf_x86_64) is GNU ld... yes
23:25:56 checking whether the g++ linker (/usr/bin/ld -m elf_x86_64) supports shared libraries... yes
23:25:56 checking for g++ option to produce PIC... -fPIC -DPIC
23:25:56 checking if g++ PIC flag -fPIC -DPIC works... checking for g++ option to produce PIC... -fPIC -DPIC
23:25:56 checking if g++ PIC flag -fPIC -DPIC works... yes
23:25:56 checking if g++ static flag -static works... yes
23:25:56 checking if g++ static flag -static works... yes
23:25:56 checking if g++ supports -c -o file.o... yes
23:25:56 checking if g++ supports -c -o file.o... yes
23:25:56 checking if g++ supports -c -o file.o... (cached) yes
23:25:56 checking whether the g++ linker (/usr/bin/ld -m elf_x86_64) supports shared libraries... yes
23:25:56 checking dynamic linker characteristics... (cached) GNU/Linux ld.so
23:25:56 checking how to hardcode library paths into programs... immediate
23:25:56 checking for gcc... (cached) gcc
23:25:57 checking whether we are using the GNU C compiler... (cached) yes
23:25:57 checking whether gcc accepts -g... (cached) yes
23:25:57 checking for gcc option to accept ISO C89... (cached) none needed
23:25:57 checking whether gcc understands -c and -o together... (cached) yes
23:25:57 yes
23:25:57 checking if g++ supports -c -o file.o... checking dependency style of gcc... (cached) yes
23:25:57 checking whether the g++ linker (/usr/bin/ld -m elf_x86_64) supports shared libraries... yes
23:25:57 (cached) checking dynamic linker characteristics... gcc3
23:25:57 (cached) checking dependency style of gcc... GNU/Linux ld.so
23:25:57 checking how to hardcode library paths into programs... immediate
23:25:57 checking for gcc... (cached) gcc
23:25:57 checking whether we are using the GNU C compiler... (cached) yes
23:25:57 checking whether gcc accepts -g... (cached) yes
23:25:57 checking for gcc option to accept ISO C89... (cached) none needed
23:25:57 checking whether gcc understands -c and -o together... (cached) yes
23:25:57 checking dependency style of gcc... (cached) gcc3
23:25:57 checking dependency style of gcc... gcc3
23:25:57 checking whether make sets $(MAKE)... (cached) yes
23:25:57 checking linux/rseq.h usability... yes
23:25:57 checking linux/rseq.h presence... gcc3
23:25:57 checking whether make sets $(MAKE)... (cached) yes
23:25:57 checking linux/rseq.h usability... yes
23:25:57 checking for linux/rseq.h... yes
23:25:57 checking for rseq_available in -lrseq... yes
23:25:57 checking linux/rseq.h presence... yes
23:25:57 checking for linux/rseq.h... yes
23:25:57 checking for rseq_available in -lrseq... no
23:25:57 checking linux/io_uring.h usability... yes
23:25:57 checking linux/io_uring.h presence... no
23:25:57 yes
23:25:57 checking for linux/io_uring.h... yes
23:25:57 checking liburing.h usability... checking linux/io_uring.h usability... yes
23:25:57 checking linux/io_uring.h presence... yes
23:25:57 checking liburing.h presence... yes
23:25:57 checking for linux/io_uring.h... yes
23:25:57 checking liburing.h usability... yes
23:25:57 checking for liburing.h... yes
23:25:57 checking for io_uring_get_probe in -luring... yes
23:25:57 checking whether IORING_OP_NOP is declared... yes
23:25:57 checking liburing.h presence... yes
23:25:57 checking for liburing.h... yes
23:25:57 checking for io_uring_get_probe in -luring... yes
23:25:57 yes
23:25:57 checking whether IORING_OP_NOP is declared... checking whether IORING_OP_READV is declared... yes
23:25:57 yes
23:25:57 checking whether IORING_OP_READV is declared... checking whether IORING_OP_WRITEV is declared... yes
23:25:57 yes
23:25:57 checking whether IORING_OP_WRITEV is declared... checking whether IORING_OP_FSYNC is declared... yes
23:25:57 yes
23:25:57 checking whether IORING_OP_FSYNC is declared... checking whether IORING_OP_READ_FIXED is declared... yes
23:25:57 yes
23:25:57 checking whether IORING_OP_READ_FIXED is declared... checking whether IORING_OP_WRITE_FIXED is declared... yes
23:25:57 yes
23:25:58 checking whether IORING_OP_WRITE_FIXED is declared... checking whether IORING_OP_POLL_ADD is declared... yes
23:25:58 yes
23:25:58 checking whether IORING_OP_POLL_ADD is declared... checking whether IORING_OP_POLL_REMOVE is declared... yes
23:25:58 yes
23:25:58 checking whether IORING_OP_POLL_REMOVE is declared... checking whether IORING_OP_SYNC_FILE_RANGE is declared... yes
23:25:58 yes
23:25:58 checking whether IORING_OP_SYNC_FILE_RANGE is declared... checking whether IORING_OP_SENDMSG is declared... yes
23:25:58 yes
23:25:58 checking whether IORING_OP_SENDMSG is declared... checking whether IORING_OP_RECVMSG is declared... yes
23:25:58 yes
23:25:58 checking whether IORING_OP_RECVMSG is declared... checking whether IORING_OP_TIMEOUT is declared... yes
23:25:58 yes
23:25:59 checking whether IORING_OP_TIMEOUT is declared... checking whether IORING_OP_TIMEOUT_REMOVE is declared... yes
23:25:59 yes
23:25:59 checking whether IORING_OP_TIMEOUT_REMOVE is declared... checking whether IORING_OP_ACCEPT is declared... yes
23:25:59 yes
23:25:59 checking whether IORING_OP_ACCEPT is declared... checking whether IORING_OP_ASYNC_CANCEL is declared... yes
23:25:59 yes
23:25:59 checking whether IORING_OP_ASYNC_CANCEL is declared... checking whether IORING_OP_LINK_TIMEOUT is declared... yes
23:25:59 yes
23:25:59 checking whether IORING_OP_LINK_TIMEOUT is declared... yes
23:25:59 checking whether IORING_OP_CONNECT is declared... checking whether IORING_OP_CONNECT is declared... yes
23:25:59 yes
23:26:00 checking whether IORING_OP_FALLOCATE is declared... checking whether IORING_OP_FALLOCATE is declared... yes
23:26:00 yes
23:26:02 checking whether IORING_OP_OPENAT is declared... checking whether IORING_OP_OPENAT is declared... yes
23:26:02 yes
23:26:03 checking whether IORING_OP_CLOSE is declared... yes
23:26:03 checking whether IORING_OP_CLOSE is declared... checking whether IORING_OP_FILES_UPDATE is declared... yes
23:26:03 yes
23:26:03 checking whether IORING_OP_FILES_UPDATE is declared... checking whether IORING_OP_STATX is declared... yes
23:26:04 yes
23:26:04 checking whether IORING_OP_READ is declared... yes
23:26:05 checking whether IORING_OP_STATX is declared... checking whether IORING_OP_WRITE is declared... yes
23:26:05 yes
23:26:05 checking whether IORING_OP_READ is declared... checking whether IORING_OP_FADVISE is declared... yes
23:26:05 yes
23:26:05 checking whether IORING_OP_WRITE is declared... checking whether IORING_OP_MADVISE is declared... yes
23:26:05 yes
23:26:05 checking whether IORING_OP_FADVISE is declared... checking whether IORING_OP_SEND is declared... yes
23:26:05 yes
23:26:05 checking whether IORING_OP_MADVISE is declared... checking whether IORING_OP_RECV is declared... yes
23:26:05 yes
23:26:05 checking whether IORING_OP_SEND is declared... checking whether IORING_OP_OPENAT2 is declared... yes
23:26:05 yes
23:26:05 checking whether IORING_OP_RECV is declared... checking whether IORING_OP_EPOLL_CTL is declared... yes
23:26:05 yes
23:26:05 checking whether IORING_OP_SPLICE is declared... checking whether IORING_OP_OPENAT2 is declared... yes
23:26:05 yes
23:26:05 checking whether IORING_OP_PROVIDE_BUFFERS is declared... checking whether IORING_OP_EPOLL_CTL is declared... yes
23:26:05 yes
23:26:05 checking whether IORING_OP_REMOVE_BUFFER is declared... checking whether IORING_OP_SPLICE is declared... yes
23:26:05 no
23:26:06 checking whether IORING_OP_TEE is declared... no
23:26:06 checking whether IOSQE_FIXED_FILE is declared... checking whether IORING_OP_PROVIDE_BUFFERS is declared... yes
23:26:06 checking whether IOSQE_IO_DRAIN is declared... yes
23:26:06 yes
23:26:06 checking whether IOSQE_IO_LINK is declared... checking whether IORING_OP_REMOVE_BUFFER is declared... yes
23:26:06 checking whether IOSQE_IO_HARDLINK is declared... no
23:26:06 checking whether IORING_OP_TEE is declared... yes
23:26:06 checking whether IOSQE_ASYNC is declared... no
23:26:06 checking whether IOSQE_FIXED_FILE is declared... yes
23:26:06 checking whether IOSQE_BUFFER_SELECT is declared... yes
23:26:06 checking whether IOSQE_IO_DRAIN is declared... yes
23:26:06 checking whether SPLICE_F_FD_IN_FIXED is declared... yes
23:26:06 checking whether IOSQE_IO_LINK is declared... yes
23:26:06 checking whether IORING_SETUP_ATTACH_WQ is declared... yes
23:26:06 checking whether IOSQE_IO_HARDLINK is declared... yes
23:26:06 checking for preadv2... yes
23:26:06 checking whether IOSQE_ASYNC is declared... yes
23:26:06 checking for pwritev2... yes
23:26:06 checking whether IOSQE_BUFFER_SELECT is declared... yes
23:26:06 yes
23:26:07 checking whether SPLICE_F_FD_IN_FIXED is declared... checking that generated files are newer than configure... done
23:26:07 configure: creating ./config.status
23:26:07 yes
23:26:07 checking whether IORING_SETUP_ATTACH_WQ is declared... yes
23:26:07 checking for preadv2... yes
23:26:07 checking for pwritev2... yes
23:26:07 checking that generated files are newer than configure... done
23:26:07 configure: creating ./config.status
23:26:07 config.status: creating Makefile
23:26:07 config.status: creating src/Makefile
23:26:07 config.status: creating prelude/Makefile
23:26:07 config.status: creating src/concurrency/io/call.cfa
23:26:07 config.status: creating prelude/defines.hfa
23:26:07 config.status: executing depfiles commands
23:26:07 config.status: executing libtool commands
23:26:07 Cforall library configuraton completed. Type "make -j 8 install".
23:26:07 config.status: creating Makefile
23:26:07 config.status: creating src/Makefile
23:26:07 config.status: creating prelude/Makefile
23:26:07 config.status: creating src/concurrency/io/call.cfa
23:26:08 config.status: creating prelude/defines.hfa
23:26:08 config.status: executing depfiles commands
23:26:08 config.status: executing libtool commands
23:26:08 Cforall library configuraton completed. Type "make -j 8 install".
23:26:08 make[3]: Leaving directory '/var/lib/jenkins/workspace/Cforall_Distribute_Ref@tmp/cfa-cc-1.0.0.1765/_build/sub'
23:26:08 Making all in libcfa/x64-debug
23:26:08 make[3]: Entering directory '/var/lib/jenkins/workspace/Cforall_Distribute_Ref@tmp/cfa-cc-1.0.0.1765/_build/sub/libcfa/x64-debug'
23:26:08 Making all in prelude
23:26:08 make[4]: Entering directory '/var/lib/jenkins/workspace/Cforall_Distribute_Ref@tmp/cfa-cc-1.0.0.1765/_build/sub/libcfa/x64-debug/prelude'
23:26:08 mkdir .deps
23:26:08 touch .deps/builtins.Po
23:26:08 make  all-am
23:26:08 make[5]: Entering directory '/var/lib/jenkins/workspace/Cforall_Distribute_Ref@tmp/cfa-cc-1.0.0.1765/_build/sub/libcfa/x64-debug/prelude'
23:26:08   GEN      gcc-builtins.c
23:26:08   GEN      builtins.cf
23:26:08   GEN      extras.cf
23:26:08   GEN      prelude.cfa
23:26:08   GEN      extras.cf
23:26:08   GEN      gcc-builtins.cf
23:26:10   GEN      bootloader.c
23:26:11 make[5]: Leaving directory '/var/lib/jenkins/workspace/Cforall_Distribute_Ref@tmp/cfa-cc-1.0.0.1765/_build/sub/libcfa/x64-debug/prelude'
23:26:11 make[4]: Leaving directory '/var/lib/jenkins/workspace/Cforall_Distribute_Ref@tmp/cfa-cc-1.0.0.1765/_build/sub/libcfa/x64-debug/prelude'
23:26:11 Making all in src
23:26:11 make[4]: Entering directory '/var/lib/jenkins/workspace/Cforall_Distribute_Ref@tmp/cfa-cc-1.0.0.1765/_build/sub/libcfa/x64-debug/src'
23:26:11   CFA      common.lo
23:26:11   CFA      fstream.lo
23:26:11   CFA      heap.lo
23:26:11   CFA      iostream.lo
23:26:11   CFA      iterator.lo
23:26:11   CFA      limits.lo
23:26:11   CFA      memory.lo
23:26:11   CFA      parseargs.lo
23:26:11   CFA      rational.lo
23:26:11   CFA      stdlib.lo
23:26:12   CFA      strstream.lo
23:26:12   CFA      time.lo
23:26:13   CFA      assert.lo
23:26:13   CFA      bits/debug.lo
23:26:15   CC       exception.lo
23:26:15   CFA      interpose.lo
23:26:15   CFA      startup.lo
23:26:15   CC       virtual.lo
23:26:15   GEN      prelude.lo
23:26:16   CPPAS    concurrency/CtxSwitch-x64.lo
23:26:16   CC       concurrency/invoke.lo
23:26:16   CFA      concurrency/io.lo
23:26:17   CFA      concurrency/preemption.lo
23:26:17   CFA      concurrency/ready_queue.lo
23:26:17   CFA      concurrency/stats.lo
23:26:17   CFA      bits/weakso_locks.lo
23:26:19   CFA      containers/maybe.lo
23:26:19   CFA      containers/pair.lo
23:26:19   CFA      containers/result.lo
23:26:19   CFA      containers/vector.lo
23:26:19   CFA      device/cpu.lo
23:26:21   CFA      concurrency/alarm.lo
23:26:22   CFA      concurrency/coroutine.lo
23:26:22   CFA      concurrency/exception.lo
23:26:25   CFA      concurrency/kernel.lo
23:26:25   CFA      concurrency/locks.lo
23:26:25   CFA      concurrency/monitor.lo
23:26:26   CFA      concurrency/mutex.lo
23:26:26   CFA      concurrency/thread.lo
23:26:26   CFA      concurrency/clib/cfathread.lo
23:26:28   CFA      concurrency/io/setup.lo
23:26:31   CFA      concurrency/io/call.lo
23:26:34   CFA      concurrency/kernel/startup.lo
23:26:34   CCLD     libcfa.la
23:26:41 /usr/include/x86_64-linux-gnu/sys/epoll.h: In function ‘_X12_constructorFv_S11epoll_event_autogen___1’:
23:26:41 /usr/include/x86_64-linux-gnu/sys/epoll.h:86:62: warning: taking address of packed member of ‘struct epoll_event’ may result in an unaligned pointer value [-Waddress-of-packed-member]
23:26:41    86 |   epoll_data_t data; /* User data variable */
23:26:41       |                                                              ^                                
23:26:41 /usr/include/x86_64-linux-gnu/sys/epoll.h: In function ‘_X12_constructorFv_S11epoll_eventS11epoll_event_autogen___1’:
23:26:41 /usr/include/x86_64-linux-gnu/sys/epoll.h:86:75: warning: taking address of packed member of ‘struct epoll_event’ may result in an unaligned pointer value [-Waddress-of-packed-member]
23:26:41    86 |   epoll_data_t data; /* User data variable */
23:26:41       |                                                                           ^                                
23:26:41 /usr/include/x86_64-linux-gnu/sys/epoll.h: In function ‘_X11_destructorFv_S11epoll_event_autogen___1’:
23:26:41 /usr/include/x86_64-linux-gnu/sys/epoll.h:86:61: warning: taking address of packed member of ‘struct epoll_event’ may result in an unaligned pointer value [-Waddress-of-packed-member]
23:26:41    86 |   epoll_data_t data; /* User data variable */
23:26:41       |                                                             ^                                
23:26:41 /usr/include/x86_64-linux-gnu/sys/epoll.h: In function ‘_X16_operator_assignFS11epoll_event_S11epoll_eventS11epoll_event_autogen___1’:
23:26:41 /usr/include/x86_64-linux-gnu/sys/epoll.h:86:123: warning: taking address of packed member of ‘struct epoll_event’ may result in an unaligned pointer value [-Waddress-of-packed-member]
23:26:41    86 |   epoll_data_t data; /* User data variable */
23:26:41       |                                                                                                                           ^                                
23:26:41 /usr/include/x86_64-linux-gnu/sys/epoll.h: In function ‘_X12_constructorFv_S11epoll_eventj_autogen___1’:
23:26:41 /usr/include/x86_64-linux-gnu/sys/epoll.h:86:62: warning: taking address of packed member of ‘struct epoll_event’ may result in an unaligned pointer value [-Waddress-of-packed-member]
23:26:41    86 |   epoll_data_t data; /* User data variable */
23:26:41       |                                                              ^                                
23:26:41 /usr/include/x86_64-linux-gnu/sys/epoll.h: In function ‘_X12_constructorFv_S11epoll_eventjU10epoll_data_autogen___1’:
23:26:41 /usr/include/x86_64-linux-gnu/sys/epoll.h:86:75: warning: taking address of packed member of ‘struct epoll_event’ may result in an unaligned pointer value [-Waddress-of-packed-member]
23:26:41    86 |   epoll_data_t data; /* User data variable */
23:26:41       |                                                                           ^                                
23:26:41 /usr/include/x86_64-linux-gnu/bits/socket.h: In function ‘_X16_operator_assignFS7cmsghdr_S7cmsghdrS7cmsghdr_autogen___1’:
23:26:41 /usr/include/x86_64-linux-gnu/bits/socket.h:285:44: note: the ABI of passing struct with a flexible array member has changed in GCC 4.4
23:26:41   285 |     __extension__ unsigned char __cmsg_data __flexarr; /* Ancillary data.  */
23:26:41       |                                            ^~~~~~~
23:26:41 /usr/include/x86_64-linux-gnu/bits/socket.h: In function ‘_X16_operator_assignFS7cmsghdr_S7cmsghdrS7cmsghdr_autogen___1’:
23:26:41 /usr/include/x86_64-linux-gnu/bits/socket.h:285:44: note: the ABI of passing struct with a flexible array member has changed in GCC 4.4
23:26:41   285 |     __extension__ unsigned char __cmsg_data __flexarr; /* Ancillary data.  */
23:26:41       |                                            ^~~~~~~
23:26:45   CCLD     libcfathread.la
23:26:45 make[4]: Leaving directory '/var/lib/jenkins/workspace/Cforall_Distribute_Ref@tmp/cfa-cc-1.0.0.1765/_build/sub/libcfa/x64-debug/src'
23:26:45 make[4]: Entering directory '/var/lib/jenkins/workspace/Cforall_Distribute_Ref@tmp/cfa-cc-1.0.0.1765/_build/sub/libcfa/x64-debug'
23:26:45 make[4]: Nothing to be done for 'all-am'.
23:26:45 make[4]: Leaving directory '/var/lib/jenkins/workspace/Cforall_Distribute_Ref@tmp/cfa-cc-1.0.0.1765/_build/sub/libcfa/x64-debug'
23:26:45 make[3]: Leaving directory '/var/lib/jenkins/workspace/Cforall_Distribute_Ref@tmp/cfa-cc-1.0.0.1765/_build/sub/libcfa/x64-debug'
23:26:45 Making all in libcfa/x64-nodebug
23:26:45 make[3]: Entering directory '/var/lib/jenkins/workspace/Cforall_Distribute_Ref@tmp/cfa-cc-1.0.0.1765/_build/sub/libcfa/x64-nodebug'
23:26:45 Making all in prelude
23:26:45 make[4]: Entering directory '/var/lib/jenkins/workspace/Cforall_Distribute_Ref@tmp/cfa-cc-1.0.0.1765/_build/sub/libcfa/x64-nodebug/prelude'
23:26:45 mkdir .deps
23:26:45 touch .deps/builtins.Po
23:26:45 make  all-am
23:26:45 make[5]: Entering directory '/var/lib/jenkins/workspace/Cforall_Distribute_Ref@tmp/cfa-cc-1.0.0.1765/_build/sub/libcfa/x64-nodebug/prelude'
23:26:45   GEN      gcc-builtins.c
23:26:45   GEN      builtins.cf
23:26:45   GEN      extras.cf
23:26:45   GEN      prelude.cfa
23:26:45   GEN      extras.cf
23:26:45   GEN      gcc-builtins.cf
23:26:47   GEN      bootloader.c
23:26:47 make[5]: Leaving directory '/var/lib/jenkins/workspace/Cforall_Distribute_Ref@tmp/cfa-cc-1.0.0.1765/_build/sub/libcfa/x64-nodebug/prelude'
23:26:47 make[4]: Leaving directory '/var/lib/jenkins/workspace/Cforall_Distribute_Ref@tmp/cfa-cc-1.0.0.1765/_build/sub/libcfa/x64-nodebug/prelude'
23:26:47 Making all in src
23:26:47 make[4]: Entering directory '/var/lib/jenkins/workspace/Cforall_Distribute_Ref@tmp/cfa-cc-1.0.0.1765/_build/sub/libcfa/x64-nodebug/src'
23:26:47   CFA      common.lo
23:26:47   CFA      fstream.lo
23:26:47   CFA      heap.lo
23:26:47   CFA      iostream.lo
23:26:47   CFA      iterator.lo
23:26:47   CFA      limits.lo
23:26:47   CFA      memory.lo
23:26:47   CFA      parseargs.lo
23:26:48   CFA      rational.lo
23:26:48   CFA      stdlib.lo
23:26:49   CFA      strstream.lo
23:26:49   CFA      time.lo
23:26:50   CFA      assert.lo
23:26:50 /var/lib/jenkins/workspace/Cforall_Distribute_Ref@tmp/cfa-cc-1.0.0.1765/_build/sub/../../libcfa/src/stdlib.cfa: In function ‘_X4anewQ1_0_1_1__X12_constructorFv_BD0BT0__FPBD0_mBT0__1’:
23:26:50 /var/lib/jenkins/workspace/Cforall_Distribute_Ref@tmp/cfa-cc-1.0.0.1765/_build/sub/../../libcfa/src/stdlib.hfa:154:97: warning: ‘_X4_srcS6S_fill_Y12__T_generic___1._X1cc_1’ is used uninitialized in this function [-Wuninitialized]
23:26:50   154 |  struct S_fill   { char tag; char c; size_t size; T * at; char t[50]; };
23:26:50       |                                                               ~~~~~~~~~~                        ^       
23:26:50 /var/lib/jenkins/workspace/Cforall_Distribute_Ref@tmp/cfa-cc-1.0.0.1765/_build/sub/../../libcfa/src/stdlib.hfa:154:100: warning: ‘_X4_srcS6S_fill_Y12__T_generic___1._X4sizem_1’ is used uninitialized in this function [-Wuninitialized]
23:26:50   154 |  struct S_fill   { char tag; char c; size_t size; T * at; char t[50]; };
23:26:50       |                                                                  ~~~~~~~                           ^          
23:26:50 /var/lib/jenkins/workspace/Cforall_Distribute_Ref@tmp/cfa-cc-1.0.0.1765/_build/sub/../../libcfa/src/stdlib.hfa:154:130: warning: ‘_X4_srcS6S_fill_Y12__T_generic___1._X2atPY12__T_generic__1’ is used uninitialized in this function [-Wuninitialized]
23:26:50   154 |  struct S_fill   { char tag; char c; size_t size; T * at; char t[50]; };
23:26:50       |                                                                                                                                  ^                       
23:26:51   CFA      bits/debug.lo
23:26:53   CC       exception.lo
23:26:53   CFA      interpose.lo
23:26:53   CFA      startup.lo
23:26:53   CC       virtual.lo
23:26:53   GEN      prelude.lo
23:26:54   CPPAS    concurrency/CtxSwitch-x64.lo
23:26:54   CC       concurrency/invoke.lo
23:26:54   CFA      concurrency/io.lo
23:26:54   CFA      concurrency/preemption.lo
23:26:54   CFA      concurrency/ready_queue.lo
23:26:54   CFA      concurrency/stats.lo
23:26:56   CFA      bits/weakso_locks.lo
23:26:57   CFA      containers/maybe.lo
23:26:58   CFA      containers/pair.lo
23:26:58   CFA      containers/result.lo
23:26:59   CFA      containers/vector.lo
23:26:59   CFA      device/cpu.lo
23:26:59   CFA      concurrency/alarm.lo
23:27:00   CFA      concurrency/coroutine.lo
23:27:01   CFA      concurrency/exception.lo
23:27:03 /var/lib/jenkins/workspace/Cforall_Distribute_Ref@tmp/cfa-cc-1.0.0.1765/_build/sub/../../libcfa/src/concurrency/ready_queue.cfa: In function ‘_X16ready_queue_growFv_PS7cluster__1’:
23:27:03 /var/lib/jenkins/workspace/Cforall_Distribute_Ref@tmp/cfa-cc-1.0.0.1765/_build/sub/../../libcfa/src/stdlib.hfa:154:97: warning: ‘_X4_srcS6S_fill_Y12__T_generic___1._X1cc_1’ is used uninitialized in this function [-Wuninitialized]
23:27:03   154 |  struct S_fill   { char tag; char c; size_t size; T * at; char t[50]; };
23:27:03       |                                                               ~~~~~~~~~~                        ^       
23:27:03 /var/lib/jenkins/workspace/Cforall_Distribute_Ref@tmp/cfa-cc-1.0.0.1765/_build/sub/../../libcfa/src/stdlib.hfa:154:100: warning: ‘_X4_srcS6S_fill_Y12__T_generic___1._X4sizem_1’ is used uninitialized in this function [-Wuninitialized]
23:27:03   154 |  struct S_fill   { char tag; char c; size_t size; T * at; char t[50]; };
23:27:03       |                                                                  ~~~~~~~                           ^          
23:27:03 /var/lib/jenkins/workspace/Cforall_Distribute_Ref@tmp/cfa-cc-1.0.0.1765/_build/sub/../../libcfa/src/stdlib.hfa:154:130: warning: ‘_X4_srcS6S_fill_Y12__T_generic___1._X2atPY12__T_generic__1’ is used uninitialized in this function [-Wuninitialized]
23:27:03   154 |  struct S_fill   { char tag; char c; size_t size; T * at; char t[50]; };
23:27:03       |                                                                                                                                  ^                       
23:27:03   CFA      concurrency/kernel.lo
23:27:04   CFA      concurrency/locks.lo
23:27:04   CFA      concurrency/monitor.lo
23:27:04   CFA      concurrency/mutex.lo
23:27:05   CFA      concurrency/thread.lo
23:27:05   CFA      concurrency/clib/cfathread.lo
23:27:06   CFA      concurrency/io/setup.lo
23:27:09   CFA      concurrency/io/call.lo
23:27:12   CFA      concurrency/kernel/startup.lo
23:27:12   CCLD     libcfa.la
23:27:18 /usr/include/x86_64-linux-gnu/sys/epoll.h: In function ‘_X12_constructorFv_S11epoll_event_autogen___1’:
23:27:18 /usr/include/x86_64-linux-gnu/sys/epoll.h:86:62: warning: taking address of packed member of ‘struct epoll_event’ may result in an unaligned pointer value [-Waddress-of-packed-member]
23:27:18    86 |   epoll_data_t data; /* User data variable */
23:27:18       |                                                              ^                                
23:27:18 /usr/include/x86_64-linux-gnu/sys/epoll.h: In function ‘_X12_constructorFv_S11epoll_eventS11epoll_event_autogen___1’:
23:27:18 /usr/include/x86_64-linux-gnu/sys/epoll.h:86:75: warning: taking address of packed member of ‘struct epoll_event’ may result in an unaligned pointer value [-Waddress-of-packed-member]
23:27:18    86 |   epoll_data_t data; /* User data variable */
23:27:18       |                                                                           ^                                
23:27:18 /usr/include/x86_64-linux-gnu/sys/epoll.h: In function ‘_X11_destructorFv_S11epoll_event_autogen___1’:
23:27:18 /usr/include/x86_64-linux-gnu/sys/epoll.h:86:61: warning: taking address of packed member of ‘struct epoll_event’ may result in an unaligned pointer value [-Waddress-of-packed-member]
23:27:18    86 |   epoll_data_t data; /* User data variable */
23:27:18       |                                                             ^                                
23:27:18 /usr/include/x86_64-linux-gnu/sys/epoll.h: In function ‘_X16_operator_assignFS11epoll_event_S11epoll_eventS11epoll_event_autogen___1’:
23:27:18 /usr/include/x86_64-linux-gnu/sys/epoll.h:86:123: warning: taking address of packed member of ‘struct epoll_event’ may result in an unaligned pointer value [-Waddress-of-packed-member]
23:27:18    86 |   epoll_data_t data; /* User data variable */
23:27:18       |                                                                                                                           ^                                
23:27:18 /usr/include/x86_64-linux-gnu/sys/epoll.h: In function ‘_X12_constructorFv_S11epoll_eventj_autogen___1’:
23:27:18 /usr/include/x86_64-linux-gnu/sys/epoll.h:86:62: warning: taking address of packed member of ‘struct epoll_event’ may result in an unaligned pointer value [-Waddress-of-packed-member]
23:27:18    86 |   epoll_data_t data; /* User data variable */
23:27:18       |                                                              ^                                
23:27:18 /usr/include/x86_64-linux-gnu/sys/epoll.h: In function ‘_X12_constructorFv_S11epoll_eventjU10epoll_data_autogen___1’:
23:27:18 /usr/include/x86_64-linux-gnu/sys/epoll.h:86:75: warning: taking address of packed member of ‘struct epoll_event’ may result in an unaligned pointer value [-Waddress-of-packed-member]
23:27:18    86 |   epoll_data_t data; /* User data variable */
23:27:18       |                                                                           ^                                
23:27:18 /var/lib/jenkins/workspace/Cforall_Distribute_Ref@tmp/cfa-cc-1.0.0.1765/_build/sub/../../libcfa/src/concurrency/io/setup.cfa: In function ‘_X16__io_uring_setupFv_S11$io_contextKS17io_context_paramsi__1.isra.0’:
23:27:18 /var/lib/jenkins/workspace/Cforall_Distribute_Ref@tmp/cfa-cc-1.0.0.1765/_build/sub/../../libcfa/src/stdlib.hfa:154:97: warning: ‘_X4_srcS6S_fill_Y12__T_generic___1._X1cc_1’ may be used uninitialized in this function [-Wmaybe-uninitialized]
23:27:18   154 |  struct S_fill   { char tag; char c; size_t size; T * at; char t[50]; };
23:27:18       |                                                               ~~~~~~~~~~                        ^       
23:27:18 /var/lib/jenkins/workspace/Cforall_Distribute_Ref@tmp/cfa-cc-1.0.0.1765/_build/sub/../../libcfa/src/stdlib.hfa:154:100: warning: ‘_X4_srcS6S_fill_Y12__T_generic___1._X4sizem_1’ may be used uninitialized in this function [-Wmaybe-uninitialized]
23:27:18   154 |  struct S_fill   { char tag; char c; size_t size; T * at; char t[50]; };
23:27:18       |                                                                  ~~~~~~~                           ^          
23:27:18 /var/lib/jenkins/workspace/Cforall_Distribute_Ref@tmp/cfa-cc-1.0.0.1765/_build/sub/../../libcfa/src/stdlib.hfa:154:130: warning: ‘_X4_srcS6S_fill_Y12__T_generic___1._X2atPY12__T_generic__1’ may be used uninitialized in this function [-Wmaybe-uninitialized]
23:27:18   154 |  struct S_fill   { char tag; char c; size_t size; T * at; char t[50]; };
23:27:18       |                                                                                                                                  ^                       
23:27:18 /var/lib/jenkins/workspace/Cforall_Distribute_Ref@tmp/cfa-cc-1.0.0.1765/_build/sub/../../libcfa/src/concurrency/io/setup.cfa: In function ‘_X14__cfa_io_startFv_PS9processor__1’:
23:27:18 /var/lib/jenkins/workspace/Cforall_Distribute_Ref@tmp/cfa-cc-1.0.0.1765/_build/sub/../../libcfa/src/stdlib.hfa:154:97: warning: ‘_X4_srcS6S_fill_Y12__T_generic___1._X1cc_1’ is used uninitialized in this function [-Wuninitialized]
23:27:18   154 |  struct S_fill   { char tag; char c; size_t size; T * at; char t[50]; };
23:27:18       |                                                               ~~~~~~~~~~                        ^       
23:27:18 /var/lib/jenkins/workspace/Cforall_Distribute_Ref@tmp/cfa-cc-1.0.0.1765/_build/sub/../../libcfa/src/stdlib.hfa:154:100: warning: ‘_X4_srcS6S_fill_Y12__T_generic___1._X4sizem_1’ is used uninitialized in this function [-Wuninitialized]
23:27:18   154 |  struct S_fill   { char tag; char c; size_t size; T * at; char t[50]; };
23:27:18       |                                                                  ~~~~~~~                           ^          
23:27:18 /var/lib/jenkins/workspace/Cforall_Distribute_Ref@tmp/cfa-cc-1.0.0.1765/_build/sub/../../libcfa/src/stdlib.hfa:154:130: warning: ‘_X4_srcS6S_fill_Y12__T_generic___1._X2atPY12__T_generic__1’ is used uninitialized in this function [-Wuninitialized]
23:27:18   154 |  struct S_fill   { char tag; char c; size_t size; T * at; char t[50]; };
23:27:18       |                                                                                                                                  ^                       
23:27:18 /usr/include/x86_64-linux-gnu/bits/socket.h: In function ‘_X16_operator_assignFS7cmsghdr_S7cmsghdrS7cmsghdr_autogen___1’:
23:27:18 /usr/include/x86_64-linux-gnu/bits/socket.h:285:44: note: the ABI of passing struct with a flexible array member has changed in GCC 4.4
23:27:18   285 |     __extension__ unsigned char __cmsg_data __flexarr; /* Ancillary data.  */
23:27:18       |                                            ^~~~~~~
23:27:19 /usr/include/x86_64-linux-gnu/bits/socket.h: In function ‘_X16_operator_assignFS7cmsghdr_S7cmsghdrS7cmsghdr_autogen___1’:
23:27:19 /usr/include/x86_64-linux-gnu/bits/socket.h:285:44: note: the ABI of passing struct with a flexible array member has changed in GCC 4.4
23:27:19   285 |     __extension__ unsigned char __cmsg_data __flexarr; /* Ancillary data.  */
23:27:19       |                                            ^~~~~~~
23:27:19 /var/lib/jenkins/workspace/Cforall_Distribute_Ref@tmp/cfa-cc-1.0.0.1765/_build/sub/../../libcfa/src/concurrency/clib/cfathread.cfa: In function ‘cfathread_cluster_add_worker’:
23:27:19 /var/lib/jenkins/workspace/Cforall_Distribute_Ref@tmp/cfa-cc-1.0.0.1765/_build/sub/../../libcfa/src/stdlib.hfa:154:97: warning: ‘_X4_srcS6S_fill_Y12__T_generic___1._X1cc_1’ may be used uninitialized in this function [-Wmaybe-uninitialized]
23:27:19   154 |  struct S_fill   { char tag; char c; size_t size; T * at; char t[50]; };
23:27:19       |                                                               ~~~~~~~~~~                        ^       
23:27:19 /var/lib/jenkins/workspace/Cforall_Distribute_Ref@tmp/cfa-cc-1.0.0.1765/_build/sub/../../libcfa/src/stdlib.hfa:154:100: warning: ‘_X4_srcS6S_fill_Y12__T_generic___1._X4sizem_1’ may be used uninitialized in this function [-Wmaybe-uninitialized]
23:27:19   154 |  struct S_fill   { char tag; char c; size_t size; T * at; char t[50]; };
23:27:19       |                                                                  ~~~~~~~                           ^          
23:27:19 /var/lib/jenkins/workspace/Cforall_Distribute_Ref@tmp/cfa-cc-1.0.0.1765/_build/sub/../../libcfa/src/stdlib.hfa:154:130: warning: ‘_X4_srcS6S_fill_Y12__T_generic___1._X2atPY12__T_generic__1’ may be used uninitialized in this function [-Wmaybe-uninitialized]
23:27:19   154 |  struct S_fill   { char tag; char c; size_t size; T * at; char t[50]; };
23:27:19       |                                                                                                                                  ^                       
23:27:23   CCLD     libcfathread.la
23:27:23 make[4]: Leaving directory '/var/lib/jenkins/workspace/Cforall_Distribute_Ref@tmp/cfa-cc-1.0.0.1765/_build/sub/libcfa/x64-nodebug/src'
23:27:23 make[4]: Entering directory '/var/lib/jenkins/workspace/Cforall_Distribute_Ref@tmp/cfa-cc-1.0.0.1765/_build/sub/libcfa/x64-nodebug'
23:27:23 make[4]: Nothing to be done for 'all-am'.
23:27:23 make[4]: Leaving directory '/var/lib/jenkins/workspace/Cforall_Distribute_Ref@tmp/cfa-cc-1.0.0.1765/_build/sub/libcfa/x64-nodebug'
23:27:23 make[3]: Leaving directory '/var/lib/jenkins/workspace/Cforall_Distribute_Ref@tmp/cfa-cc-1.0.0.1765/_build/sub/libcfa/x64-nodebug'
23:27:23 make[2]: Leaving directory '/var/lib/jenkins/workspace/Cforall_Distribute_Ref@tmp/cfa-cc-1.0.0.1765/_build/sub'
23:27:23 make[1]: Leaving directory '/var/lib/jenkins/workspace/Cforall_Distribute_Ref@tmp/cfa-cc-1.0.0.1765/_build/sub'
23:27:23 make[1]: Entering directory '/var/lib/jenkins/workspace/Cforall_Distribute_Ref@tmp/cfa-cc-1.0.0.1765/_build/sub'
23:27:23 Making dvi in driver
23:27:23 make[2]: Entering directory '/var/lib/jenkins/workspace/Cforall_Distribute_Ref@tmp/cfa-cc-1.0.0.1765/_build/sub/driver'
23:27:23 make[2]: Nothing to be done for 'dvi'.
23:27:23 make[2]: Leaving directory '/var/lib/jenkins/workspace/Cforall_Distribute_Ref@tmp/cfa-cc-1.0.0.1765/_build/sub/driver'
23:27:23 Making dvi in src
23:27:23 make[2]: Entering directory '/var/lib/jenkins/workspace/Cforall_Distribute_Ref@tmp/cfa-cc-1.0.0.1765/_build/sub/src'
23:27:23 make[2]: Nothing to be done for 'dvi'.
23:27:23 make[2]: Leaving directory '/var/lib/jenkins/workspace/Cforall_Distribute_Ref@tmp/cfa-cc-1.0.0.1765/_build/sub/src'
23:27:23 Making dvi in .
23:27:23 make[2]: Entering directory '/var/lib/jenkins/workspace/Cforall_Distribute_Ref@tmp/cfa-cc-1.0.0.1765/_build/sub'
23:27:23 make[2]: Nothing to be done for 'dvi-am'.
23:27:23 make[2]: Leaving directory '/var/lib/jenkins/workspace/Cforall_Distribute_Ref@tmp/cfa-cc-1.0.0.1765/_build/sub'
23:27:23 Making dvi in libcfa/x64-debug
23:27:23 make[2]: Entering directory '/var/lib/jenkins/workspace/Cforall_Distribute_Ref@tmp/cfa-cc-1.0.0.1765/_build/sub/libcfa/x64-debug'
23:27:23 Making dvi in prelude
23:27:23 make[3]: Entering directory '/var/lib/jenkins/workspace/Cforall_Distribute_Ref@tmp/cfa-cc-1.0.0.1765/_build/sub/libcfa/x64-debug/prelude'
23:27:23 make[3]: Nothing to be done for 'dvi'.
23:27:23 make[3]: Leaving directory '/var/lib/jenkins/workspace/Cforall_Distribute_Ref@tmp/cfa-cc-1.0.0.1765/_build/sub/libcfa/x64-debug/prelude'
23:27:23 Making dvi in src
23:27:23 make[3]: Entering directory '/var/lib/jenkins/workspace/Cforall_Distribute_Ref@tmp/cfa-cc-1.0.0.1765/_build/sub/libcfa/x64-debug/src'
23:27:24 make[3]: Nothing to be done for 'dvi'.
23:27:24 make[3]: Leaving directory '/var/lib/jenkins/workspace/Cforall_Distribute_Ref@tmp/cfa-cc-1.0.0.1765/_build/sub/libcfa/x64-debug/src'
23:27:24 make[3]: Entering directory '/var/lib/jenkins/workspace/Cforall_Distribute_Ref@tmp/cfa-cc-1.0.0.1765/_build/sub/libcfa/x64-debug'
23:27:24 make[3]: Nothing to be done for 'dvi-am'.
23:27:24 make[3]: Leaving directory '/var/lib/jenkins/workspace/Cforall_Distribute_Ref@tmp/cfa-cc-1.0.0.1765/_build/sub/libcfa/x64-debug'
23:27:24 make[2]: Leaving directory '/var/lib/jenkins/workspace/Cforall_Distribute_Ref@tmp/cfa-cc-1.0.0.1765/_build/sub/libcfa/x64-debug'
23:27:24 Making dvi in libcfa/x64-nodebug
23:27:24 make[2]: Entering directory '/var/lib/jenkins/workspace/Cforall_Distribute_Ref@tmp/cfa-cc-1.0.0.1765/_build/sub/libcfa/x64-nodebug'
23:27:24 Making dvi in prelude
23:27:24 make[3]: Entering directory '/var/lib/jenkins/workspace/Cforall_Distribute_Ref@tmp/cfa-cc-1.0.0.1765/_build/sub/libcfa/x64-nodebug/prelude'
23:27:24 make[3]: Nothing to be done for 'dvi'.
23:27:24 make[3]: Leaving directory '/var/lib/jenkins/workspace/Cforall_Distribute_Ref@tmp/cfa-cc-1.0.0.1765/_build/sub/libcfa/x64-nodebug/prelude'
23:27:24 Making dvi in src
23:27:24 make[3]: Entering directory '/var/lib/jenkins/workspace/Cforall_Distribute_Ref@tmp/cfa-cc-1.0.0.1765/_build/sub/libcfa/x64-nodebug/src'
23:27:24 make[3]: Nothing to be done for 'dvi'.
23:27:24 make[3]: Leaving directory '/var/lib/jenkins/workspace/Cforall_Distribute_Ref@tmp/cfa-cc-1.0.0.1765/_build/sub/libcfa/x64-nodebug/src'
23:27:24 make[3]: Entering directory '/var/lib/jenkins/workspace/Cforall_Distribute_Ref@tmp/cfa-cc-1.0.0.1765/_build/sub/libcfa/x64-nodebug'
23:27:24 make[3]: Nothing to be done for 'dvi-am'.
23:27:24 make[3]: Leaving directory '/var/lib/jenkins/workspace/Cforall_Distribute_Ref@tmp/cfa-cc-1.0.0.1765/_build/sub/libcfa/x64-nodebug'
23:27:24 make[2]: Leaving directory '/var/lib/jenkins/workspace/Cforall_Distribute_Ref@tmp/cfa-cc-1.0.0.1765/_build/sub/libcfa/x64-nodebug'
23:27:24 make[1]: Leaving directory '/var/lib/jenkins/workspace/Cforall_Distribute_Ref@tmp/cfa-cc-1.0.0.1765/_build/sub'
23:27:24 make[1]: Entering directory '/var/lib/jenkins/workspace/Cforall_Distribute_Ref@tmp/cfa-cc-1.0.0.1765/_build/sub'
23:27:24 Making check in driver
23:27:24 make[2]: Entering directory '/var/lib/jenkins/workspace/Cforall_Distribute_Ref@tmp/cfa-cc-1.0.0.1765/_build/sub/driver'
23:27:24 make[2]: Nothing to be done for 'check'.
23:27:24 make[2]: Leaving directory '/var/lib/jenkins/workspace/Cforall_Distribute_Ref@tmp/cfa-cc-1.0.0.1765/_build/sub/driver'
23:27:24 Making check in src
23:27:24 make[2]: Entering directory '/var/lib/jenkins/workspace/Cforall_Distribute_Ref@tmp/cfa-cc-1.0.0.1765/_build/sub/src'
23:27:24 make  check-am
23:27:24 make[3]: Entering directory '/var/lib/jenkins/workspace/Cforall_Distribute_Ref@tmp/cfa-cc-1.0.0.1765/_build/sub/src'
23:27:24 make[3]: Nothing to be done for 'check-am'.
23:27:24 make[3]: Leaving directory '/var/lib/jenkins/workspace/Cforall_Distribute_Ref@tmp/cfa-cc-1.0.0.1765/_build/sub/src'
23:27:24 make[2]: Leaving directory '/var/lib/jenkins/workspace/Cforall_Distribute_Ref@tmp/cfa-cc-1.0.0.1765/_build/sub/src'
23:27:24 Making check in .
23:27:24 make[2]: Entering directory '/var/lib/jenkins/workspace/Cforall_Distribute_Ref@tmp/cfa-cc-1.0.0.1765/_build/sub'
23:27:24 make[2]: Leaving directory '/var/lib/jenkins/workspace/Cforall_Distribute_Ref@tmp/cfa-cc-1.0.0.1765/_build/sub'
23:27:24 Making check in libcfa/x64-debug
23:27:24 make[2]: Entering directory '/var/lib/jenkins/workspace/Cforall_Distribute_Ref@tmp/cfa-cc-1.0.0.1765/_build/sub/libcfa/x64-debug'
23:27:24 Making check in prelude
23:27:24 make[3]: Entering directory '/var/lib/jenkins/workspace/Cforall_Distribute_Ref@tmp/cfa-cc-1.0.0.1765/_build/sub/libcfa/x64-debug/prelude'
23:27:24 make[3]: Leaving directory '/var/lib/jenkins/workspace/Cforall_Distribute_Ref@tmp/cfa-cc-1.0.0.1765/_build/sub/libcfa/x64-debug/prelude'
23:27:24 Making check in src
23:27:24 make[3]: Entering directory '/var/lib/jenkins/workspace/Cforall_Distribute_Ref@tmp/cfa-cc-1.0.0.1765/_build/sub/libcfa/x64-debug/src'
23:27:24 make[3]: Nothing to be done for 'check'.
23:27:24 make[3]: Leaving directory '/var/lib/jenkins/workspace/Cforall_Distribute_Ref@tmp/cfa-cc-1.0.0.1765/_build/sub/libcfa/x64-debug/src'
23:27:24 make[3]: Entering directory '/var/lib/jenkins/workspace/Cforall_Distribute_Ref@tmp/cfa-cc-1.0.0.1765/_build/sub/libcfa/x64-debug'
23:27:24 make[3]: Nothing to be done for 'check-am'.
23:27:24 make[3]: Leaving directory '/var/lib/jenkins/workspace/Cforall_Distribute_Ref@tmp/cfa-cc-1.0.0.1765/_build/sub/libcfa/x64-debug'
23:27:24 make[2]: Leaving directory '/var/lib/jenkins/workspace/Cforall_Distribute_Ref@tmp/cfa-cc-1.0.0.1765/_build/sub/libcfa/x64-debug'
23:27:24 Making check in libcfa/x64-nodebug
23:27:24 make[2]: Entering directory '/var/lib/jenkins/workspace/Cforall_Distribute_Ref@tmp/cfa-cc-1.0.0.1765/_build/sub/libcfa/x64-nodebug'
23:27:24 Making check in prelude
23:27:24 make[3]: Entering directory '/var/lib/jenkins/workspace/Cforall_Distribute_Ref@tmp/cfa-cc-1.0.0.1765/_build/sub/libcfa/x64-nodebug/prelude'
23:27:24 make[3]: Leaving directory '/var/lib/jenkins/workspace/Cforall_Distribute_Ref@tmp/cfa-cc-1.0.0.1765/_build/sub/libcfa/x64-nodebug/prelude'
23:27:24 Making check in src
23:27:24 make[3]: Entering directory '/var/lib/jenkins/workspace/Cforall_Distribute_Ref@tmp/cfa-cc-1.0.0.1765/_build/sub/libcfa/x64-nodebug/src'
23:27:24 make[3]: Nothing to be done for 'check'.
23:27:24 make[3]: Leaving directory '/var/lib/jenkins/workspace/Cforall_Distribute_Ref@tmp/cfa-cc-1.0.0.1765/_build/sub/libcfa/x64-nodebug/src'
23:27:24 make[3]: Entering directory '/var/lib/jenkins/workspace/Cforall_Distribute_Ref@tmp/cfa-cc-1.0.0.1765/_build/sub/libcfa/x64-nodebug'
23:27:24 make[3]: Nothing to be done for 'check-am'.
23:27:24 make[3]: Leaving directory '/var/lib/jenkins/workspace/Cforall_Distribute_Ref@tmp/cfa-cc-1.0.0.1765/_build/sub/libcfa/x64-nodebug'
23:27:24 make[2]: Leaving directory '/var/lib/jenkins/workspace/Cforall_Distribute_Ref@tmp/cfa-cc-1.0.0.1765/_build/sub/libcfa/x64-nodebug'
23:27:24 make -C tests all-tests installed=no debug=yes
23:27:24 make[2]: Entering directory '/var/lib/jenkins/workspace/Cforall_Distribute_Ref@tmp/cfa-cc-1.0.0.1765/_build/sub/tests'
23:27:25 Running 213 tests on 7 cores (Default AST (new):x64 - debug)
23:28:46        	array                                 PASSED     C 0:00.479 - R 0:00.001
23:28:46        	builtins/sync                         PASSED     C 0:00.613 - R 0:00.002
23:28:46        	castError                             PASSED     C 0:00.258 - R n/a
23:28:46        	cast                                  PASSED     C 0:00.476 - R 0:00.001
23:28:46        	array-container/array-basic           PASSED     C 0:01.298 - R 0:00.017
23:28:46        	avl_test                              PASSED     C 0:01.961 - R 0:00.016
23:28:46        	alloc-ERROR                           PASSED     C 0:03.465 - R n/a
23:28:46        	alloc                                 PASSED     C 0:06.761 - R 0:00.016
23:28:46        	collections/multi_list                PASSED     C 0:05.817 - R 0:00.016
23:28:46        	alloc2                                PASSED     C 0:09.063 - R 0:00.017
23:28:46        	concurrent/clib                       PASSED     C 0:02.782 - R 0:00.164
23:28:46        	collections/stack                     PASSED     C 0:06.471 - R 0:00.016
23:28:46        	collections/queue                     PASSED     C 0:09.384 - R 0:00.016
23:28:46        	complex                               PASSED     C 0:04.296 - R 0:00.016
23:28:46        	collections/sequence                  PASSED     C 0:09.675 - R 0:00.016
23:28:46        	concurrent/clib_tls                   PASSED     C 0:02.813 - R 0:00.215
23:28:46        	collections/atomic_mpsc               PASSED     C 0:08.025 - R 0:04.072
23:28:46        	concurrent/cluster                    PASSED     C 0:06.007 - R 0:00.164
23:28:46        	concurrent/coroutineYield             PASSED     C 0:08.248 - R 0:00.114
23:28:46        	concurrent/examples/datingService     PASSED     C 0:08.231 - R 0:00.114
23:28:46        	concurrent/examples/gortn             PASSED     C 0:08.157 - R 0:00.064
23:28:46        	concurrent/examples/matrixSum         PASSED     C 0:07.972 - R 0:00.164
23:28:46        	concurrent/examples/quickSort         PASSED     C 0:08.479 - R 0:00.064
23:28:46        	concurrent/futures/abandon            PASSED     C 0:06.379 - R 0:00.164
23:28:46        	concurrent/keywordErrors              PASSED     C 0:00.152 - R n/a
23:28:46        	concurrent/examples/boundedBufferEXT  PASSED     C 0:08.410 - R 0:06.574
23:28:46        	concurrent/examples/boundedBufferINT  PASSED     C 0:08.274 - R 0:06.373
23:28:46        	concurrent/futures/basic              PASSED     C 0:06.353 - R 0:00.165
23:28:46        	concurrent/futures/typed              PASSED     C 0:06.646 - R 0:00.114
23:28:46        	concurrent/futures/multi              PASSED     C 0:07.841 - R 0:00.115
23:28:46        	concurrent/park/contention            PASSED     C 0:06.176 - R 0:00.165
23:28:46        	concurrent/join                       PASSED     C 0:08.340 - R 0:00.064
23:28:46        	concurrent/park/start_parked          PASSED     C 0:06.134 - R 0:00.114
23:28:46        	concurrent/park/force_preempt         PASSED     C 0:08.354 - R 0:00.315
23:28:46        	concurrent/semaphore                  PASSED     C 0:08.741 - R 0:00.114
23:28:46        	concurrent/signal/block               PASSED     C 0:08.835 - R 0:01.467
23:28:46        	concurrent/signal/wait                PASSED     C 0:08.475 - R 0:00.214
23:28:46        	concurrent/signal/disjoint            FAILED with code 1    C 0:08.533 - R 0:02.418
23:28:46 		new lines : 
23:28:46 		1	ERROR Eager signal 2
23:28:46 
23:28:46        	concurrent/preempt                    PASSED     C 0:06.501 - R 0:14.085
23:28:46        	concurrent/sleep                      PASSED     C 0:08.232 - R 0:01.217
23:28:46        	concurrent/spinaphore                 PASSED     C 0:08.958 - R 0:00.415
23:28:46        	concurrent/suspend_then               PASSED     C 0:08.890 - R 0:00.114
23:28:46        	concurrent/monitor                    PASSED     C 0:07.883 - R 0:20.200
23:28:46        	concurrent/thread                     PASSED     C 0:08.821 - R 0:00.114
23:28:46        	concurrent/multi-monitor              PASSED     C 0:07.934 - R 0:22.405
23:28:46        	const-init                            PASSED     C 0:00.599 - R 0:00.016
23:28:46        	concurrent/waitfor/barge              PASSED     C 0:08.050 - R 0:00.315
23:28:46        	concurrent/waitfor/else               PASSED     C 0:06.445 - R 0:00.114
23:28:46        	concurrent/waitfor/dtor               PASSED     C 0:07.869 - R 0:01.317
23:28:46        	copyfile                              PASSED     C 0:04.394 - R 0:00.016
23:28:46        	concurrent/waitfor/statment           PASSED     C 0:09.194 - R 0:00.114
23:28:46        	concurrent/waitfor/when               PASSED     C 0:08.547 - R 0:00.164
23:28:46        	coroutine/devicedriver                PASSED     C 0:05.635 - R 0:00.115
23:28:46        	concurrent/waitfor/recurse            PASSED     C 0:09.391 - R 0:01.016
23:28:46        	counter                               PASSED     C 0:00.532 - R 0:00.016
23:28:46        	coroutine/fibonacci                   PASSED     C 0:05.163 - R 0:00.114
23:28:46        	designations                          PASSED     C 0:00.636 - R 0:00.016
23:28:46        	coroutine/fmtLines                    PASSED     C 0:05.193 - R 0:00.115
23:28:46        	enum                                  PASSED     C 0:00.521 - R 0:00.016
23:28:46        	errors/declaration                    PASSED     C 0:00.060 - R n/a
23:28:46        	errors/scope                          PASSED     C 0:00.106 - R n/a
23:28:46        	errors/signature                      PASSED     C 0:00.062 - R n/a
23:28:46        	coroutine/pingpong                    PASSED     C 0:05.089 - R 0:00.065
23:28:46        	coroutine/raii                        PASSED     C 0:05.087 - R 0:00.064
23:28:46        	coroutine/runningTotal                PASSED     C 0:05.105 - R 0:00.065
23:28:46        	exceptions/conditional                PASSED     C 0:00.613 - R 0:00.016
23:28:46        	coroutine/prodcons                    PASSED     C 0:06.554 - R 0:00.114
23:28:46        	exceptions/data-except                PASSED     C 0:00.596 - R 0:00.016
23:28:46        	exceptions/cancel/coroutine           PASSED     C 0:03.509 - R 0:00.064
23:28:46        	div                                   PASSED     C 0:05.285 - R 0:00.016
23:28:46        	exceptions/finally                    PASSED     C 0:00.607 - R 0:00.008
23:28:46        	exceptions/finally-error              PASSED     C 0:00.151 - R n/a
23:28:46        	exceptions/defaults                   PASSED     C 0:00.938 - R 0:00.016
23:28:46        	device/cpu                            PASSED     C 0:06.229 - R 0:00.016
23:28:46        	exceptions/interact                   PASSED     C 0:00.895 - R 0:00.016
23:28:46        	exceptions/polymorphic                PASSED     C 0:00.880 - R 0:00.016
23:28:46        	exceptions/resume                     PASSED     C 0:00.784 - R 0:00.016
23:28:46        	exceptions/conditional-threads        PASSED     C 0:03.455 - R 0:00.065
23:28:46        	exceptions/terminate                  PASSED     C 0:00.788 - R 0:00.016
23:28:46        	exceptions/type-check                 PASSED     C 0:00.148 - R n/a
23:28:46        	exceptions/trash                      PASSED     C 0:00.618 - R 0:00.016
23:28:46        	exceptions/cancel/thread              PASSED     C 0:06.157 - R 0:00.065
23:28:46        	expression                            PASSED     C 0:00.500 - R 0:00.001
23:28:46        	exceptions/virtual-poly               PASSED     C 0:00.690 - R 0:00.016
23:28:46        	exceptions/defaults-threads           PASSED     C 0:03.993 - R 0:00.064
23:28:46        	exceptions/virtual-cast               PASSED     C 0:01.481 - R 0:00.016
23:28:46        	exceptions/finally-threads            PASSED     C 0:03.609 - R 0:00.065
23:28:46        	forall                                PASSED     C 0:00.904 - R 0:00.001
23:28:46        	exceptions/resume-threads             PASSED     C 0:03.664 - R 0:00.065
23:28:46        	exceptions/terminate-threads          PASSED     C 0:03.783 - R 0:00.064
23:28:46        	genericUnion                          PASSED     C 0:00.606 - R 0:00.016
23:28:46        	global-monomorph                      PASSED     C 0:00.535 - R 0:00.016
23:28:46        	fallthrough                           PASSED     C 0:04.197 - R 0:00.017
23:28:46        	fstream_test                          PASSED     C 0:04.300 - R 0:00.016
23:28:46        	generator/fibonacci                   PASSED     C 0:04.109 - R 0:00.016
23:28:46        	identParamDeclarator                  PASSED     C 0:00.668 - R 0:00.112
23:28:46        	generator/fmtLines                    PASSED     C 0:04.495 - R 0:00.078
23:28:46        	identFuncDeclarator                   PASSED     C 0:00.953 - R 0:00.199
23:28:46        	generator/suspend_then                PASSED     C 0:04.444 - R 0:00.016
23:28:46        	function-operator                     PASSED     C 0:05.890 - R 0:00.016
23:28:46        	hello                                 PASSED     C 0:04.159 - R 0:00.016
23:29:54        	include/vector-containers             PASSED     C 0:02.596 - R 0:00.016
23:29:54        	include/vector-sequence               PASSED     C 0:00.995 - R 0:00.016
23:29:54        	ifwhileCtl                            PASSED     C 0:04.518 - R 0:00.016
23:29:54        	identity                              PASSED     C 0:04.663 - R 0:00.016
23:29:54        	init1-ERROR                           PASSED     C 0:00.256 - R n/a
23:29:54        	init1                                 PASSED     C 0:00.484 - R 0:00.001
23:29:54        	include/stdincludes                   PASSED     C 0:05.512 - R 0:00.001
23:29:54        	include/vector-fstream                PASSED     C 0:04.193 - R 0:00.016
23:29:54        	labelledExit                          PASSED     C 0:00.489 - R 0:00.001
23:29:54        	limits                                PASSED     C 0:00.487 - R 0:00.001
23:29:54        	linking/exception-nothreads           PASSED     C 0:01.462 - R 0:00.017
23:29:54        	io/manipulatorsOutput4                PASSED     C 0:06.985 - R 0:00.016
23:29:54        	linking/exception-withthreads         PASSED     C 0:04.548 - R 0:00.065
23:29:54        	io/io-acquire                         PASSED     C 0:09.341 - R 0:00.164
23:29:54        	linking/nostdlib                      PASSED     C 0:00.547 - R 0:00.016
23:29:54        	io/many_read                          PASSED     C 0:09.596 - R 0:00.114
23:29:54        	include/includes                      PASSED     C 0:16.079 - R 0:00.001
23:29:54        	linkonce                              PASSED     C 0:00.570 - R 0:00.008
23:29:54        	io/io                                 PASSED     C 0:12.402 - R 0:00.016
23:29:54        	linking/io-acquire                    PASSED     C 0:05.476 - R 0:00.016
23:29:54        	linking/nothreads                     PASSED     C 0:05.184 - R 0:00.016
23:29:54        	linking/weakso_nothd                  PASSED     C 0:05.127 - R 0:00.016
23:29:54        	heap                                  PASSED     C 0:06.806 - R 0:15.792
23:29:54        	maybe                                 PASSED     C 0:00.761 - R 0:00.016
23:29:54        	nested-types                          PASSED     C 0:00.497 - R 0:00.001
23:29:54        	nested-types-ERR1                     PASSED     C 0:00.065 - R n/a
23:29:54        	nested-types-ERR2                     PASSED     C 0:00.106 - R n/a
23:29:54        	literals                              PASSED     C 0:04.448 - R 0:00.016
23:29:54        	numericConstants                      PASSED     C 0:00.454 - R 0:00.001
23:29:54        	operators                             PASSED     C 0:00.528 - R 0:00.016
23:29:54        	poly-d-cycle                          PASSED     C 0:00.538 - R 0:00.016
23:29:54        	poly-o-cycle                          PASSED     C 0:00.572 - R 0:00.016
23:29:54        	poly-selection                        PASSED     C 0:00.596 - R 0:00.016
23:29:54        	loopctrl                              PASSED     C 0:06.073 - R 0:00.016
23:29:54        	quasiKeyword                          PASSED     C 0:00.509 - R 0:00.001
23:29:54        	linking/withthreads                   PASSED     C 0:07.982 - R 0:00.065
23:29:54        	raii/ctor-autogen                     PASSED     C 0:01.104 - R 0:00.016
23:29:54        	malloc                                PASSED     C 0:05.546 - R 0:00.016
23:29:54        	raii/ctor-autogen-ERR1                PASSED     C 0:00.300 - R n/a
23:29:54        	polymorphism                          PASSED     C 0:04.276 - R 0:00.016
23:29:54        	list/dlist-insert-remove              PASSED     C 0:10.315 - R 0:00.016
23:29:54        	minmax                                PASSED     C 0:06.963 - R 0:00.016
23:29:54        	quotedKeyword                         PASSED     C 0:04.085 - R 0:00.016
23:29:54        	raii/boxed-types                      PASSED     C 0:04.245 - R 0:00.008
23:29:54        	raii/memberCtors-ERR1                 PASSED     C 0:00.333 - R n/a
23:29:54        	raii/init_once                        PASSED     C 0:00.633 - R 0:00.016
23:29:54        	raii/memberCtors                      PASSED     C 0:00.619 - R 0:00.016
23:29:54        	raii/dtor-early-exit-ERR1             PASSED     C 0:03.245 - R n/a
23:29:54        	result                                PASSED     C 0:00.954 - R 0:00.016
23:29:54        	raii/dtor-early-exit-ERR2             PASSED     C 0:03.269 - R n/a
23:29:54        	raii/dtor-early-exit                  PASSED     C 0:05.752 - R 0:00.016
23:29:54        	simpleGenericTriple                   PASSED     C 0:00.667 - R 0:00.016
23:29:54        	raii/globals                          PASSED     C 0:04.342 - R 0:00.016
23:29:54        	smart-pointers                        PASSED     C 0:00.751 - R 0:00.016
23:29:54        	references                            PASSED     C 0:04.965 - R 0:00.016
23:29:54        	shortCircuit                          PASSED     C 0:04.274 - R 0:00.016
23:29:54        	switch                                PASSED     C 0:00.472 - R 0:00.001
23:29:54        	searchsort                            PASSED     C 0:06.826 - R 0:00.016
23:29:54        	strstream                             PASSED     C 0:04.479 - R 0:00.016
23:29:54        	tuple/tupleCast                       PASSED     C 0:00.519 - R 0:00.016
23:29:54        	tuple/tupleFunction                   PASSED     C 0:00.653 - R 0:00.016
23:29:54        	sum                                   PASSED     C 0:05.292 - R 0:00.086
23:29:54        	tuple/tupleMember                     PASSED     C 0:00.965 - R 0:00.043
23:29:54        	tuple/tuplePolymorphism               PASSED     C 0:00.960 - R 0:00.016
23:29:54        	typedefRedef-ERR1                     PASSED     C 0:00.062 - R n/a
23:29:54        	typedefRedef                          PASSED     C 0:00.464 - R 0:00.001
23:29:54        	typeof                                PASSED     C 0:00.521 - R 0:00.016
23:29:54        	swap                                  PASSED     C 0:06.781 - R 0:00.016
23:29:54        	tuple/tupleVariadic                   PASSED     C 0:01.593 - R 0:00.016
23:29:54        	rational                              PASSED     C 0:10.482 - R 0:00.016
23:29:54        	tuple/tupleAssign                     PASSED     C 0:05.513 - R 0:00.016
23:29:54        	time                                  PASSED     C 0:05.910 - R 0:00.016
23:29:54        	variableDeclarator                    PASSED     C 0:00.476 - R 0:00.001
23:29:54        	userLiterals                          PASSED     C 0:04.576 - R 0:00.016
23:29:54        	vector_math/vec2_double               PASSED     C 0:05.962 - R 0:00.016
23:29:54        	vector                                PASSED     C 0:06.488 - R 0:00.016
23:29:54        	unified_locking/fast                  PASSED     C 0:08.889 - R 0:00.114
23:29:54        	unified_locking/timeout_lock          PASSED     C 0:07.552 - R 0:01.116
23:29:54        	vector_math/vec2_uint                 PASSED     C 0:05.907 - R 0:00.016
23:29:54        	unified_locking/locks                 PASSED     C 0:08.027 - R 0:08.583
23:29:54        	vector_math/vec2_float                PASSED     C 0:11.121 - R 0:00.016
23:29:54        	unified_locking/mcs                   PASSED     C 0:08.763 - R 0:07.378
23:29:54        	voidPtr                               PASSED     C 0:00.556 - R 0:00.016
23:29:54        	warnings/self-assignment              PASSED     C 0:00.460 - R 0:00.001
23:29:54        	KRfunctions                           PASSED     C 0:00.418 - R 0:00.001
23:29:54        	vector_math/vec2_int                  PASSED     C 0:11.132 - R 0:00.016
23:29:54        	vector_math/vec3_int                  PASSED     C 0:09.621 - R 0:00.016
23:29:54        	attributes                            PASSED     C 0:00.532 - R 0:00.001
23:29:54        	vector_math/vec3_float                PASSED     C 0:10.978 - R 0:00.016
23:29:54        	abs                                   PASSED     C 0:05.864 - R 0:00.016
23:29:54        	ato                                   PASSED     C 0:05.615 - R 0:00.016
23:29:54        	declarationSpecifier                  PASSED     C 0:00.497 - R 0:00.001
23:29:54        	errors/completeType                   PASSED     C 0:00.259 - R n/a
23:29:54        	vector_math/vec4_float                PASSED     C 0:11.398 - R 0:00.016
23:29:54        	extension                             PASSED     C 0:00.456 - R 0:00.001
23:29:54        	functions                             PASSED     C 0:00.426 - R 0:00.001
23:29:54        	array-container/array-md-sbscr-cases  PASSED     C 0:08.694 - R 0:00.016
23:29:54        	gccExtensions                         PASSED     C 0:00.426 - R 0:00.001
23:29:54        	vector_math/vec4_int                  PASSED     C 0:10.085 - R 0:00.016
23:29:54        	bitmanip1                             PASSED     C 0:09.688 - R 0:00.016
23:29:54        	bitmanip3                             PASSED     C 0:07.195 - R 0:00.016
23:30:12        	bitmanip2                             PASSED     C 0:10.776 - R 0:00.016
23:30:12        	io/manipulatorsInput                  PASSED     C 0:06.276 - R 0:00.016
23:30:12        	gmp                                   PASSED     C 0:06.699 - R 0:00.016
23:30:12        	meta/archVast                         PASSED     C 0:00.249 - R n/a
23:30:12        	io/manipulatorsOutput2                PASSED     C 0:08.055 - R 0:00.016
23:30:12        	io/manipulatorsOutput1                PASSED     C 0:11.384 - R 0:00.016
23:30:12        	random                                PASSED     C 0:05.444 - R 0:00.016
23:30:12        	vector_math/vec2_ldouble              PASSED     C 0:05.922 - R 0:00.016
23:30:12        	io/manipulatorsOutput3                PASSED     C 0:12.621 - R 0:00.016
23:30:12        	math                                  PASSED     C 0:12.027 - R 0:00.017
23:30:12        	mathX                                 PASSED     C 0:18.714 - R 0:00.033
23:30:12 Tests took  2:46.208
23:30:12 make[2]: *** [Makefile:879: all-tests] Error 1
23:30:12 make[2]: Leaving directory '/var/lib/jenkins/workspace/Cforall_Distribute_Ref@tmp/cfa-cc-1.0.0.1765/_build/sub/tests'
23:30:12 make[1]: *** [Makefile:951: check] Error 2
23:30:12 make[1]: Leaving directory '/var/lib/jenkins/workspace/Cforall_Distribute_Ref@tmp/cfa-cc-1.0.0.1765/_build/sub'
23:30:12 make: *** [Makefile:734: distcheck] Error 1
[Pipeline] }
[Pipeline] // dir
[Pipeline] }
[Pipeline] // stage
[Pipeline] }
[Pipeline] // wrap
[Pipeline] }
[Pipeline] // node
[Pipeline] End of Pipeline
ERROR: script returned exit code 2
Finished: FAILURE